FailedConsole Output

Started by user patrick.baenziger@bsi-software.com
Checkout:workspace / /home/hudson/genie.scout/.hudson/jobs/org.eclipse.scout_maven-master_releaseBuild/workspace - hudson.remoting.LocalChannel@3b4d7a34
Using strategy: Default
Git Exe: git
Last Built Revision: Revision dbf13fc4c9b4f181f333e812bc1ce067ac36b003 (v2.0.8)
Checkout:workspace / /home/hudson/genie.scout/.hudson/jobs/org.eclipse.scout_maven-master_releaseBuild/workspace - hudson.remoting.LocalChannel@3b4d7a34
Pruning obsolete local branches
Fetching changes from the remote Git repository
Fetching upstream changes from git://git.eclipse.org/gitroot/scout/maven-master.git
Commencing build of Revision 835fa640a55385c667ab5d0fa3d5bdbc2bab3168 (v2.0.9)
Checking out Revision 835fa640a55385c667ab5d0fa3d5bdbc2bab3168 (v2.0.9)
Cleaning workspace
No change to record in branch v2.0.9
[INFO] Using Maven 3 installation: apache-maven-latest
[INFO] Checking Maven 3 installation environment
[workspace] $ /shared/common/apache-maven-latest/bin/mvn --help
[INFO] Checking Maven 3 installation version
[INFO] Detected Maven 3 installation version: 3.3.9
[workspace] $ /shared/common/apache-maven-latest/bin/mvn clean install -V -B -Dtag_or_branch=v2.0.9 -Dmaster_sanityCheck_skip=true -Dmaster_coverage_skip=true -Dmaster_flatten_skip=true -Dmaster_webTest_skip=true -Dmaster_unitTest_skip=true -Dmaven.ext.class.path=/home/hudson/genie.scout/.hudson/maven/slavebundle/resources:/home/hudson/genie.scout/.hudson/maven/slavebundle/lib/maven3-eventspy-3.1.jar:/home/hudson/genie.scout/.hudson/war/webapp/WEB-INF/lib/hudson-remoting-3.0.3.jar -Dhudson.eventspy.port=33820 -Dmaven.repo.local=/home/hudson/genie.scout/.hudson/jobs/org.eclipse.scout_maven-master_releaseBuild/workspace/.maven/repo -f pom.xml
[DEBUG] Waiting for connection on port: 33820
Apache Maven 3.3.9 (bb52d8502b132ec0a5a3f4c09453c07478323dc5; 2015-11-10T11:41:47-05:00)
Maven home: /shared/common/apache-maven-latest
Java version: 1.8.0_102, vendor: Oracle Corporation
Java home: /opt/public/common/jdk1.8.0_102.x64/jre
Default locale: en_US, platform encoding: UTF-8
OS name: "linux", version: "3.12.62-60.64.8-default", arch: "amd64", family: "unix"
SLF4J: Class path contains multiple SLF4J bindings.
SLF4J: Found binding in [jar:file:/home/hudson/genie.scout/.hudson/maven/slavebundle/lib/maven3-eventspy-runtime.jar!/org/slf4j/impl/StaticLoggerBinder.class]
SLF4J: Found binding in [jar:file:/shared/common/apache-maven-latest/lib/slf4j-simple-1.7.5.jar!/org/slf4j/impl/StaticLoggerBinder.class]
SLF4J: See http://www.slf4j.org/codes.html#multiple_bindings for an explanation.
[DEBUG] Connected to remote
[INFO] o.h.m.e.h.SettingsBuildingRequestHandler - Using settings document ID: e23a0b6a-ab36-4ea3-8d97-c6ce7ba3db90
[WARN] o.h.m.e.EventSpyProcessor - Unhandled event: org.apache.maven.toolchain.building.DefaultToolchainsBuildingRequest@3c5a54b7 (org.apache.maven.toolchain.building.DefaultToolchainsBuildingRequest)
[WARN] o.h.m.e.EventSpyProcessor - Unhandled event: org.apache.maven.toolchain.building.DefaultToolchainsBuildingRequest@3c5a54b7 (org.apache.maven.toolchain.building.DefaultToolchainsBuildingRequest)
[INFO] Scanning for projects...
[INFO] ------------------------------------------------------------------------
[INFO] Reactor Build Order:
[INFO] 
[INFO] Maven Master Plugin Version Configuration
[INFO] Maven Master Plugin Build Configuration - General
[INFO] Maven Master Plugin Build Configuration - RT
[INFO] Maven Master Plugin Build Configuration - SDK
[INFO] Maven Master Plugin Build Configuration - SDK-P2
[INFO] Maven Master Eclipse Settings
[INFO] Maven Master Eclipse Settings - APT Variant
[INFO] Maven Master Root Module
[INFO]                                                                         
[INFO] ------------------------------------------------------------------------
[INFO] Building Maven Master Plugin Version Configuration 2.0.9
[INFO] ------------------------------------------------------------------------
[INFO] 
[INFO] --- maven-clean-plugin:3.0.0:clean (default-clean) @ maven_plugin_version-master ---
[INFO] Deleting /jobs/genie.scout/org.eclipse.scout_maven-master_releaseBuild/workspace/maven_plugin_version-master/target
[INFO] 
[INFO] --- maven-site-plugin:3.4:attach-descriptor (attach-descriptor) @ maven_plugin_version-master ---
[INFO] 
[INFO] --- maven-install-plugin:2.5.2:install (default-install) @ maven_plugin_version-master ---
[INFO] Installing /jobs/genie.scout/org.eclipse.scout_maven-master_releaseBuild/workspace/maven_plugin_version-master/pom.xml to /home/hudson/genie.scout/.hudson/jobs/org.eclipse.scout_maven-master_releaseBuild/workspace/.maven/repo/org/eclipse/scout/maven_plugin_version-master/2.0.9/maven_plugin_version-master-2.0.9.pom
[INFO] Installing /jobs/genie.scout/org.eclipse.scout_maven-master_releaseBuild/workspace/maven_plugin_version-master/target/maven_plugin_version-master-2.0.9-site.xml to /home/hudson/genie.scout/.hudson/jobs/org.eclipse.scout_maven-master_releaseBuild/workspace/.maven/repo/org/eclipse/scout/maven_plugin_version-master/2.0.9/maven_plugin_version-master-2.0.9-site.xml
[INFO]                                                                         
[INFO] ------------------------------------------------------------------------
[INFO] Building Maven Master Plugin Build Configuration - General 2.0.9
[INFO] ------------------------------------------------------------------------
[INFO] 
[INFO] --- maven-clean-plugin:3.0.0:clean (default-clean) @ maven_plugin_config-master ---
[INFO] Deleting /jobs/genie.scout/org.eclipse.scout_maven-master_releaseBuild/workspace/maven_plugin_config-master/target
[INFO] 
[INFO] --- maven-enforcer-plugin:1.4.1:enforce (enforce-rules) @ maven_plugin_config-master ---
[INFO] Skipping Rule Enforcement.
[INFO] 
[INFO] --- git-commit-id-plugin:2.2.0:revision (default) @ maven_plugin_config-master ---
[INFO] 
[INFO] --- jacoco-maven-plugin:0.7.5.201505241946:prepare-agent (default) @ maven_plugin_config-master ---
[INFO] Skipping JaCoCo execution because property jacoco.skip is set.
[INFO] master_test_jacocoArgLine set to empty
[INFO] 
[INFO] --- maven-site-plugin:3.4:attach-descriptor (attach-descriptor) @ maven_plugin_config-master ---
[INFO] 
[INFO] --- maven-jar-plugin:2.6:test-jar (attach-tests) @ maven_plugin_config-master ---
[INFO] Skipping packaging of the test-jar
[INFO] 
[INFO] --- maven-source-plugin:2.4:jar-no-fork (attach-sources) @ maven_plugin_config-master ---
[INFO] 
[INFO] --- maven-source-plugin:2.4:test-jar-no-fork (attach-test-sources) @ maven_plugin_config-master ---
[INFO] 
[INFO] --- duplicate-finder-maven-plugin:1.2.1:check (default) @ maven_plugin_config-master ---
[INFO] o.b.m.d.DuplicateFinderMojo - Skipping duplicate-finder execution!
[INFO] 
[INFO] --- animal-sniffer-maven-plugin:1.15:check (enforce-java-api-compatibility) @ maven_plugin_config-master ---
[INFO] Signature checking is skipped.
[INFO] 
[INFO] --- maven-install-plugin:2.5.2:install (default-install) @ maven_plugin_config-master ---
[INFO] Installing /jobs/genie.scout/org.eclipse.scout_maven-master_releaseBuild/workspace/maven_plugin_config-master/pom.xml to /home/hudson/genie.scout/.hudson/jobs/org.eclipse.scout_maven-master_releaseBuild/workspace/.maven/repo/org/eclipse/scout/maven_plugin_config-master/2.0.9/maven_plugin_config-master-2.0.9.pom
[INFO] Installing /jobs/genie.scout/org.eclipse.scout_maven-master_releaseBuild/workspace/maven_plugin_config-master/target/maven_plugin_config-master-2.0.9-site.xml to /home/hudson/genie.scout/.hudson/jobs/org.eclipse.scout_maven-master_releaseBuild/workspace/.maven/repo/org/eclipse/scout/maven_plugin_config-master/2.0.9/maven_plugin_config-master-2.0.9-site.xml
[INFO]                                                                         
[INFO] ------------------------------------------------------------------------
[INFO] Building Maven Master Plugin Build Configuration - RT 2.0.9
[INFO] ------------------------------------------------------------------------
[INFO] 
[INFO] --- maven-clean-plugin:3.0.0:clean (default-clean) @ maven_rt_plugin_config-master ---
[INFO] Deleting /jobs/genie.scout/org.eclipse.scout_maven-master_releaseBuild/workspace/maven_rt_plugin_config-master/target
[INFO] 
[INFO] --- maven-enforcer-plugin:1.4.1:enforce (enforce-rules) @ maven_rt_plugin_config-master ---
[INFO] Skipping Rule Enforcement.
[INFO] 
[INFO] --- git-commit-id-plugin:2.2.0:revision (default) @ maven_rt_plugin_config-master ---
[INFO] 
[INFO] --- jacoco-maven-plugin:0.7.5.201505241946:prepare-agent (default) @ maven_rt_plugin_config-master ---
[INFO] Skipping JaCoCo execution because property jacoco.skip is set.
[INFO] master_test_jacocoArgLine set to empty
[INFO] 
[INFO] --- maven-site-plugin:3.4:attach-descriptor (attach-descriptor) @ maven_rt_plugin_config-master ---
[INFO] 
[INFO] --- maven-jar-plugin:2.6:test-jar (attach-tests) @ maven_rt_plugin_config-master ---
[INFO] Skipping packaging of the test-jar
[INFO] 
[INFO] --- maven-source-plugin:2.4:jar-no-fork (attach-sources) @ maven_rt_plugin_config-master ---
[INFO] 
[INFO] --- maven-source-plugin:2.4:test-jar-no-fork (attach-test-sources) @ maven_rt_plugin_config-master ---
[INFO] 
[INFO] --- duplicate-finder-maven-plugin:1.2.1:check (default) @ maven_rt_plugin_config-master ---
[INFO] o.b.m.d.DuplicateFinderMojo - Skipping duplicate-finder execution!
[INFO] 
[INFO] --- animal-sniffer-maven-plugin:1.15:check (enforce-java-api-compatibility) @ maven_rt_plugin_config-master ---
[INFO] Signature checking is skipped.
[INFO] 
[INFO] --- maven-install-plugin:2.5.2:install (default-install) @ maven_rt_plugin_config-master ---
[INFO] Installing /jobs/genie.scout/org.eclipse.scout_maven-master_releaseBuild/workspace/maven_rt_plugin_config-master/pom.xml to /home/hudson/genie.scout/.hudson/jobs/org.eclipse.scout_maven-master_releaseBuild/workspace/.maven/repo/org/eclipse/scout/maven_rt_plugin_config-master/2.0.9/maven_rt_plugin_config-master-2.0.9.pom
[INFO] Installing /jobs/genie.scout/org.eclipse.scout_maven-master_releaseBuild/workspace/maven_rt_plugin_config-master/target/maven_rt_plugin_config-master-2.0.9-site.xml to /home/hudson/genie.scout/.hudson/jobs/org.eclipse.scout_maven-master_releaseBuild/workspace/.maven/repo/org/eclipse/scout/maven_rt_plugin_config-master/2.0.9/maven_rt_plugin_config-master-2.0.9-site.xml
[INFO]                                                                         
[INFO] ------------------------------------------------------------------------
[INFO] Building Maven Master Plugin Build Configuration - SDK 2.0.9
[INFO] ------------------------------------------------------------------------
[INFO] 
[INFO] --- maven-clean-plugin:3.0.0:clean (default-clean) @ maven_sdk_plugin_config-master ---
[INFO] Deleting /jobs/genie.scout/org.eclipse.scout_maven-master_releaseBuild/workspace/maven_sdk_plugin_config-master/target
[INFO] 
[INFO] --- maven-enforcer-plugin:1.4.1:enforce (enforce-rules) @ maven_sdk_plugin_config-master ---
[INFO] Skipping Rule Enforcement.
[INFO] 
[INFO] --- git-commit-id-plugin:2.2.0:revision (default) @ maven_sdk_plugin_config-master ---
[INFO] 
[INFO] --- jacoco-maven-plugin:0.7.5.201505241946:prepare-agent (default) @ maven_sdk_plugin_config-master ---
[INFO] Skipping JaCoCo execution because property jacoco.skip is set.
[INFO] master_test_jacocoArgLine set to empty
[INFO] 
[INFO] --- build-helper-maven-plugin:1.9.1:parse-version (initialize-parse-version) @ maven_sdk_plugin_config-master ---
[INFO] 
[INFO] --- build-helper-maven-plugin:1.9.1:regex-property (initialize-regex) @ maven_sdk_plugin_config-master ---
[INFO] No match to regex 'SNAPSHOT' found in '2.0.9'. The initial value '2.0.9' is left as-is...
[INFO] 
[INFO] --- maven-site-plugin:3.4:attach-descriptor (attach-descriptor) @ maven_sdk_plugin_config-master ---
[INFO] 
[INFO] --- maven-jar-plugin:2.6:test-jar (attach-tests) @ maven_sdk_plugin_config-master ---
[INFO] Skipping packaging of the test-jar
[INFO] 
[INFO] --- maven-source-plugin:2.4:test-jar-no-fork (attach-test-sources) @ maven_sdk_plugin_config-master ---
[INFO] 
[INFO] --- duplicate-finder-maven-plugin:1.2.1:check (default) @ maven_sdk_plugin_config-master ---
[INFO] o.b.m.d.DuplicateFinderMojo - Skipping duplicate-finder execution!
[INFO] 
[INFO] --- animal-sniffer-maven-plugin:1.15:check (enforce-java-api-compatibility) @ maven_sdk_plugin_config-master ---
[INFO] Signature checking is skipped.
[INFO] 
[INFO] --- maven-source-plugin:2.4:jar-no-fork (attach-sources) @ maven_sdk_plugin_config-master ---
[INFO] 
[INFO] --- maven-install-plugin:2.5.2:install (default-install) @ maven_sdk_plugin_config-master ---
[INFO] Installing /jobs/genie.scout/org.eclipse.scout_maven-master_releaseBuild/workspace/maven_sdk_plugin_config-master/pom.xml to /home/hudson/genie.scout/.hudson/jobs/org.eclipse.scout_maven-master_releaseBuild/workspace/.maven/repo/org/eclipse/scout/maven_sdk_plugin_config-master/2.0.9/maven_sdk_plugin_config-master-2.0.9.pom
[INFO] Installing /jobs/genie.scout/org.eclipse.scout_maven-master_releaseBuild/workspace/maven_sdk_plugin_config-master/target/maven_sdk_plugin_config-master-2.0.9-site.xml to /home/hudson/genie.scout/.hudson/jobs/org.eclipse.scout_maven-master_releaseBuild/workspace/.maven/repo/org/eclipse/scout/maven_sdk_plugin_config-master/2.0.9/maven_sdk_plugin_config-master-2.0.9-site.xml
[INFO]                                                                         
[INFO] ------------------------------------------------------------------------
[INFO] Building Maven Master Plugin Build Configuration - SDK-P2 2.0.9
[INFO] ------------------------------------------------------------------------
[INFO] 
[INFO] --- maven-clean-plugin:3.0.0:clean (default-clean) @ maven_sdk_p2_plugin_config-master ---
[INFO] Deleting /jobs/genie.scout/org.eclipse.scout_maven-master_releaseBuild/workspace/maven_sdk_p2_plugin_config-master/target
[INFO] 
[INFO] --- maven-enforcer-plugin:1.4.1:enforce (enforce-rules) @ maven_sdk_p2_plugin_config-master ---
[INFO] Skipping Rule Enforcement.
[INFO] 
[INFO] --- git-commit-id-plugin:2.2.0:revision (default) @ maven_sdk_p2_plugin_config-master ---
[INFO] 
[INFO] --- jacoco-maven-plugin:0.7.5.201505241946:prepare-agent (default) @ maven_sdk_p2_plugin_config-master ---
[INFO] Skipping JaCoCo execution because property jacoco.skip is set.
[INFO] master_test_jacocoArgLine set to empty
[INFO] 
[INFO] --- build-helper-maven-plugin:1.9.1:parse-version (initialize-parse-version) @ maven_sdk_p2_plugin_config-master ---
[INFO] 
[INFO] --- build-helper-maven-plugin:1.9.1:regex-property (initialize-regex) @ maven_sdk_p2_plugin_config-master ---
[INFO] No match to regex 'SNAPSHOT' found in '2.0.9'. The initial value '2.0.9' is left as-is...
[INFO] 
[INFO] --- maven-site-plugin:3.4:attach-descriptor (attach-descriptor) @ maven_sdk_p2_plugin_config-master ---
[INFO] 
[INFO] --- maven-jar-plugin:2.6:test-jar (attach-tests) @ maven_sdk_p2_plugin_config-master ---
[INFO] Skipping packaging of the test-jar
[INFO] 
[INFO] --- maven-source-plugin:2.4:test-jar-no-fork (attach-test-sources) @ maven_sdk_p2_plugin_config-master ---
[INFO] 
[INFO] --- duplicate-finder-maven-plugin:1.2.1:check (default) @ maven_sdk_p2_plugin_config-master ---
[INFO] o.b.m.d.DuplicateFinderMojo - Skipping duplicate-finder execution!
[INFO] 
[INFO] --- animal-sniffer-maven-plugin:1.15:check (enforce-java-api-compatibility) @ maven_sdk_p2_plugin_config-master ---
[INFO] Signature checking is skipped.
[INFO] 
[INFO] --- maven-source-plugin:2.4:jar-no-fork (attach-sources) @ maven_sdk_p2_plugin_config-master ---
[INFO] 
[INFO] --- maven-install-plugin:2.5.2:install (default-install) @ maven_sdk_p2_plugin_config-master ---
[INFO] Installing /jobs/genie.scout/org.eclipse.scout_maven-master_releaseBuild/workspace/maven_sdk_p2_plugin_config-master/pom.xml to /home/hudson/genie.scout/.hudson/jobs/org.eclipse.scout_maven-master_releaseBuild/workspace/.maven/repo/org/eclipse/scout/maven_sdk_p2_plugin_config-master/2.0.9/maven_sdk_p2_plugin_config-master-2.0.9.pom
[INFO] Installing /jobs/genie.scout/org.eclipse.scout_maven-master_releaseBuild/workspace/maven_sdk_p2_plugin_config-master/target/maven_sdk_p2_plugin_config-master-2.0.9-site.xml to /home/hudson/genie.scout/.hudson/jobs/org.eclipse.scout_maven-master_releaseBuild/workspace/.maven/repo/org/eclipse/scout/maven_sdk_p2_plugin_config-master/2.0.9/maven_sdk_p2_plugin_config-master-2.0.9-site.xml
[INFO]                                                                         
[INFO] ------------------------------------------------------------------------
[INFO] Building Maven Master Eclipse Settings 2.0.9
[INFO] ------------------------------------------------------------------------
[INFO] 
[INFO] --- maven-clean-plugin:3.0.0:clean (default-clean) @ eclipse-settings_master ---
[INFO] Deleting /jobs/genie.scout/org.eclipse.scout_maven-master_releaseBuild/workspace/eclipse-settings_master/target
[INFO] 
[INFO] --- maven-enforcer-plugin:1.4.1:enforce (enforce-rules) @ eclipse-settings_master ---
[INFO] Skipping Rule Enforcement.
[INFO] 
[INFO] --- git-commit-id-plugin:2.2.0:revision (default) @ eclipse-settings_master ---
[INFO] 
[INFO] --- jacoco-maven-plugin:0.7.5.201505241946:prepare-agent (default) @ eclipse-settings_master ---
[INFO] Skipping JaCoCo execution because property jacoco.skip is set.
[INFO] master_test_jacocoArgLine set to empty
[INFO] 
[INFO] --- maven-resources-plugin:2.7:resources (default-resources) @ eclipse-settings_master ---
[INFO] Using 'UTF-8' encoding to copy filtered resources.
[INFO] Copying 12 resources
[INFO] 
[INFO] --- maven-compiler-plugin:3.3:compile (default-compile) @ eclipse-settings_master ---
[INFO] No sources to compile
[INFO] 
[INFO] --- maven-resources-plugin:2.7:testResources (default-testResources) @ eclipse-settings_master ---
[INFO] Using 'UTF-8' encoding to copy filtered resources.
[INFO] skip non existing resourceDirectory /jobs/genie.scout/org.eclipse.scout_maven-master_releaseBuild/workspace/eclipse-settings_master/src/test/resources
[INFO] 
[INFO] --- maven-compiler-plugin:3.3:testCompile (default-testCompile) @ eclipse-settings_master ---
[INFO] No sources to compile
[INFO] 
[INFO] --- maven-surefire-plugin:2.18.1:test (default-test) @ eclipse-settings_master ---
[INFO] Tests are skipped.
[INFO] 
[INFO] --- maven-jar-plugin:2.6:jar (default-jar) @ eclipse-settings_master ---
[INFO] Building jar: /jobs/genie.scout/org.eclipse.scout_maven-master_releaseBuild/workspace/eclipse-settings_master/target/eclipse-settings_master-2.0.9.jar
[INFO] 
[INFO] --- maven-site-plugin:3.4:attach-descriptor (attach-descriptor) @ eclipse-settings_master ---
[INFO] 
[INFO] --- maven-jar-plugin:2.6:test-jar (attach-tests) @ eclipse-settings_master ---
[INFO] Skipping packaging of the test-jar
[INFO] 
[INFO] --- maven-source-plugin:2.4:jar-no-fork (attach-sources) @ eclipse-settings_master ---
[INFO] Building jar: /jobs/genie.scout/org.eclipse.scout_maven-master_releaseBuild/workspace/eclipse-settings_master/target/eclipse-settings_master-2.0.9-sources.jar
[INFO] 
[INFO] --- maven-source-plugin:2.4:test-jar-no-fork (attach-test-sources) @ eclipse-settings_master ---
[INFO] No sources in project. Archive not created.
[INFO] 
[INFO] --- duplicate-finder-maven-plugin:1.2.1:check (default) @ eclipse-settings_master ---
[INFO] o.b.m.d.DuplicateFinderMojo - Skipping duplicate-finder execution!
[INFO] 
[INFO] --- animal-sniffer-maven-plugin:1.15:check (enforce-java-api-compatibility) @ eclipse-settings_master ---
[INFO] Signature checking is skipped.
[INFO] 
[INFO] --- maven-install-plugin:2.5.2:install (default-install) @ eclipse-settings_master ---
[INFO] Installing /jobs/genie.scout/org.eclipse.scout_maven-master_releaseBuild/workspace/eclipse-settings_master/target/eclipse-settings_master-2.0.9.jar to /home/hudson/genie.scout/.hudson/jobs/org.eclipse.scout_maven-master_releaseBuild/workspace/.maven/repo/org/eclipse/scout/eclipse-settings_master/2.0.9/eclipse-settings_master-2.0.9.jar
[INFO] Installing /jobs/genie.scout/org.eclipse.scout_maven-master_releaseBuild/workspace/eclipse-settings_master/pom.xml to /home/hudson/genie.scout/.hudson/jobs/org.eclipse.scout_maven-master_releaseBuild/workspace/.maven/repo/org/eclipse/scout/eclipse-settings_master/2.0.9/eclipse-settings_master-2.0.9.pom
[INFO] Installing /jobs/genie.scout/org.eclipse.scout_maven-master_releaseBuild/workspace/eclipse-settings_master/target/eclipse-settings_master-2.0.9-sources.jar to /home/hudson/genie.scout/.hudson/jobs/org.eclipse.scout_maven-master_releaseBuild/workspace/.maven/repo/org/eclipse/scout/eclipse-settings_master/2.0.9/eclipse-settings_master-2.0.9-sources.jar
[INFO]                                                                         
[INFO] ------------------------------------------------------------------------
[INFO] Building Maven Master Eclipse Settings - APT Variant 2.0.9
[INFO] ------------------------------------------------------------------------
[INFO] 
[INFO] --- maven-clean-plugin:3.0.0:clean (default-clean) @ eclipse-settings_aptEnabled_master ---
[INFO] Deleting /jobs/genie.scout/org.eclipse.scout_maven-master_releaseBuild/workspace/eclipse-settings_aptEnabled_master/target
[INFO] 
[INFO] --- maven-enforcer-plugin:1.4.1:enforce (enforce-rules) @ eclipse-settings_aptEnabled_master ---
[INFO] Skipping Rule Enforcement.
[INFO] 
[INFO] --- git-commit-id-plugin:2.2.0:revision (default) @ eclipse-settings_aptEnabled_master ---
[INFO] 
[INFO] --- jacoco-maven-plugin:0.7.5.201505241946:prepare-agent (default) @ eclipse-settings_aptEnabled_master ---
[INFO] Skipping JaCoCo execution because property jacoco.skip is set.
[INFO] master_test_jacocoArgLine set to empty
[INFO] 
[INFO] --- maven-resources-plugin:2.7:resources (default-resources) @ eclipse-settings_aptEnabled_master ---
[INFO] Using 'UTF-8' encoding to copy filtered resources.
[INFO] Copying 1 resource to aptEnabled
[INFO] 
[INFO] --- maven-compiler-plugin:3.3:compile (default-compile) @ eclipse-settings_aptEnabled_master ---
[INFO] No sources to compile
[INFO] 
[INFO] --- maven-resources-plugin:2.7:testResources (default-testResources) @ eclipse-settings_aptEnabled_master ---
[INFO] Using 'UTF-8' encoding to copy filtered resources.
[INFO] skip non existing resourceDirectory /jobs/genie.scout/org.eclipse.scout_maven-master_releaseBuild/workspace/eclipse-settings_aptEnabled_master/src/test/resources
[INFO] 
[INFO] --- maven-compiler-plugin:3.3:testCompile (default-testCompile) @ eclipse-settings_aptEnabled_master ---
[INFO] No sources to compile
[INFO] 
[INFO] --- maven-surefire-plugin:2.18.1:test (default-test) @ eclipse-settings_aptEnabled_master ---
[INFO] Tests are skipped.
[INFO] 
[INFO] --- maven-jar-plugin:2.6:jar (default-jar) @ eclipse-settings_aptEnabled_master ---
[INFO] Building jar: /jobs/genie.scout/org.eclipse.scout_maven-master_releaseBuild/workspace/eclipse-settings_aptEnabled_master/target/eclipse-settings_aptEnabled_master-2.0.9.jar
[INFO] 
[INFO] --- maven-site-plugin:3.4:attach-descriptor (attach-descriptor) @ eclipse-settings_aptEnabled_master ---
[INFO] 
[INFO] --- maven-jar-plugin:2.6:test-jar (attach-tests) @ eclipse-settings_aptEnabled_master ---
[INFO] Skipping packaging of the test-jar
[INFO] 
[INFO] --- maven-source-plugin:2.4:jar-no-fork (attach-sources) @ eclipse-settings_aptEnabled_master ---
[INFO] Building jar: /jobs/genie.scout/org.eclipse.scout_maven-master_releaseBuild/workspace/eclipse-settings_aptEnabled_master/target/eclipse-settings_aptEnabled_master-2.0.9-sources.jar
[INFO] 
[INFO] --- maven-source-plugin:2.4:test-jar-no-fork (attach-test-sources) @ eclipse-settings_aptEnabled_master ---
[INFO] No sources in project. Archive not created.
[INFO] 
[INFO] --- duplicate-finder-maven-plugin:1.2.1:check (default) @ eclipse-settings_aptEnabled_master ---
[INFO] o.b.m.d.DuplicateFinderMojo - Skipping duplicate-finder execution!
[INFO] 
[INFO] --- animal-sniffer-maven-plugin:1.15:check (enforce-java-api-compatibility) @ eclipse-settings_aptEnabled_master ---
[INFO] Signature checking is skipped.
[INFO] 
[INFO] --- maven-install-plugin:2.5.2:install (default-install) @ eclipse-settings_aptEnabled_master ---
[INFO] Installing /jobs/genie.scout/org.eclipse.scout_maven-master_releaseBuild/workspace/eclipse-settings_aptEnabled_master/target/eclipse-settings_aptEnabled_master-2.0.9.jar to /home/hudson/genie.scout/.hudson/jobs/org.eclipse.scout_maven-master_releaseBuild/workspace/.maven/repo/org/eclipse/scout/eclipse-settings_aptEnabled_master/2.0.9/eclipse-settings_aptEnabled_master-2.0.9.jar
[INFO] Installing /jobs/genie.scout/org.eclipse.scout_maven-master_releaseBuild/workspace/eclipse-settings_aptEnabled_master/pom.xml to /home/hudson/genie.scout/.hudson/jobs/org.eclipse.scout_maven-master_releaseBuild/workspace/.maven/repo/org/eclipse/scout/eclipse-settings_aptEnabled_master/2.0.9/eclipse-settings_aptEnabled_master-2.0.9.pom
[INFO] Installing /jobs/genie.scout/org.eclipse.scout_maven-master_releaseBuild/workspace/eclipse-settings_aptEnabled_master/target/eclipse-settings_aptEnabled_master-2.0.9-sources.jar to /home/hudson/genie.scout/.hudson/jobs/org.eclipse.scout_maven-master_releaseBuild/workspace/.maven/repo/org/eclipse/scout/eclipse-settings_aptEnabled_master/2.0.9/eclipse-settings_aptEnabled_master-2.0.9-sources.jar
[INFO]                                                                         
[INFO] ------------------------------------------------------------------------
[INFO] Building Maven Master Root Module 2.0.9
[INFO] ------------------------------------------------------------------------
[INFO] 
[INFO] --- maven-clean-plugin:3.0.0:clean (default-clean) @ maven-master ---
[INFO] Deleting /jobs/genie.scout/org.eclipse.scout_maven-master_releaseBuild/workspace/target
[INFO] 
[INFO] --- maven-enforcer-plugin:1.4.1:enforce (enforce-rules) @ maven-master ---
[INFO] Skipping Rule Enforcement.
[INFO] 
[INFO] --- git-commit-id-plugin:2.2.0:revision (default) @ maven-master ---
[INFO] 
[INFO] --- jacoco-maven-plugin:0.7.5.201505241946:prepare-agent (default) @ maven-master ---
[INFO] Skipping JaCoCo execution because property jacoco.skip is set.
[INFO] master_test_jacocoArgLine set to empty
[INFO] 
[INFO] --- maven-site-plugin:3.4:attach-descriptor (attach-descriptor) @ maven-master ---
[INFO] 
[INFO] --- maven-jar-plugin:2.6:test-jar (attach-tests) @ maven-master ---
[INFO] Skipping packaging of the test-jar
[INFO] 
[INFO] --- maven-source-plugin:2.4:jar-no-fork (attach-sources) @ maven-master ---
[INFO] 
[INFO] --- maven-source-plugin:2.4:test-jar-no-fork (attach-test-sources) @ maven-master ---
[INFO] 
[INFO] --- duplicate-finder-maven-plugin:1.2.1:check (default) @ maven-master ---
[INFO] o.b.m.d.DuplicateFinderMojo - Skipping duplicate-finder execution!
[INFO] 
[INFO] --- animal-sniffer-maven-plugin:1.15:check (enforce-java-api-compatibility) @ maven-master ---
[INFO] Signature checking is skipped.
[INFO] 
[INFO] --- maven-install-plugin:2.5.2:install (default-install) @ maven-master ---
[INFO] Skipping artifact installation
[INFO] ------------------------------------------------------------------------
[INFO] Reactor Summary:
[INFO] 
[INFO] Maven Master Plugin Version Configuration .......... SUCCESS [  1.709 s]
[INFO] Maven Master Plugin Build Configuration - General .. SUCCESS [  4.990 s]
[INFO] Maven Master Plugin Build Configuration - RT ....... SUCCESS [  0.088 s]
[INFO] Maven Master Plugin Build Configuration - SDK ...... SUCCESS [  0.144 s]
[INFO] Maven Master Plugin Build Configuration - SDK-P2 ... SUCCESS [  1.377 s]
[INFO] Maven Master Eclipse Settings ...................... SUCCESS [  1.232 s]
[INFO] Maven Master Eclipse Settings - APT Variant ........ SUCCESS [  0.208 s]
[INFO] Maven Master Root Module ........................... SUCCESS [  0.060 s]
[INFO] ------------------------------------------------------------------------
[INFO] BUILD SUCCESS
[INFO] ------------------------------------------------------------------------
[INFO] Total time: 12.134 s
[INFO] Finished at: 2017-01-26T04:17:32-05:00
[INFO] Final Memory: 53M/2313M
[INFO] ------------------------------------------------------------------------
[DEBUG] Closing connection to remote
[DEBUG] Waiting for process to finish
[DEBUG] Result: 0
[INFO] Using Maven 3 installation: apache-maven-latest
[INFO] Checking Maven 3 installation environment
[workspace] $ /shared/common/apache-maven-latest/bin/mvn --help
[INFO] Checking Maven 3 installation version
[INFO] Detected Maven 3 installation version: 3.3.9
[workspace] $ /shared/common/apache-maven-latest/bin/mvn deploy -V -B -Dtag_or_branch=v2.0.9 -Dmaster_sanityCheck_skip=true -Dmaster_coverage_skip=true -Dmaster_deployAtEnd=false -Dmaster_flatten_skip=true -Dmaster_webTest_skip=true -Dmaster_unitTest_skip=true -Dmaven.ext.class.path=/home/hudson/genie.scout/.hudson/maven/slavebundle/resources:/home/hudson/genie.scout/.hudson/maven/slavebundle/lib/maven3-eventspy-3.1.jar:/home/hudson/genie.scout/.hudson/war/webapp/WEB-INF/lib/hudson-remoting-3.0.3.jar -Dhudson.eventspy.port=40489 -Dmaven.repo.local=/home/hudson/genie.scout/.hudson/jobs/org.eclipse.scout_maven-master_releaseBuild/workspace/.maven/repo -f pom.xml -P deploy
[DEBUG] Waiting for connection on port: 40489
Apache Maven 3.3.9 (bb52d8502b132ec0a5a3f4c09453c07478323dc5; 2015-11-10T11:41:47-05:00)
Maven home: /shared/common/apache-maven-latest
Java version: 1.8.0_102, vendor: Oracle Corporation
Java home: /opt/public/common/jdk1.8.0_102.x64/jre
Default locale: en_US, platform encoding: UTF-8
OS name: "linux", version: "3.12.62-60.64.8-default", arch: "amd64", family: "unix"
SLF4J: Class path contains multiple SLF4J bindings.
SLF4J: Found binding in [jar:file:/home/hudson/genie.scout/.hudson/maven/slavebundle/lib/maven3-eventspy-runtime.jar!/org/slf4j/impl/StaticLoggerBinder.class]
SLF4J: Found binding in [jar:file:/shared/common/apache-maven-latest/lib/slf4j-simple-1.7.5.jar!/org/slf4j/impl/StaticLoggerBinder.class]
SLF4J: See http://www.slf4j.org/codes.html#multiple_bindings for an explanation.
[DEBUG] Connected to remote
[INFO] o.h.m.e.h.SettingsBuildingRequestHandler - Using settings document ID: e23a0b6a-ab36-4ea3-8d97-c6ce7ba3db90
[WARN] o.h.m.e.EventSpyProcessor - Unhandled event: org.apache.maven.toolchain.building.DefaultToolchainsBuildingRequest@2f6bcf87 (org.apache.maven.toolchain.building.DefaultToolchainsBuildingRequest)
[WARN] o.h.m.e.EventSpyProcessor - Unhandled event: org.apache.maven.toolchain.building.DefaultToolchainsBuildingRequest@2f6bcf87 (org.apache.maven.toolchain.building.DefaultToolchainsBuildingRequest)
[INFO] Scanning for projects...
[INFO] ------------------------------------------------------------------------
[INFO] Reactor Build Order:
[INFO] 
[INFO] Maven Master Plugin Version Configuration
[INFO] Maven Master Plugin Build Configuration - General
[INFO] Maven Master Plugin Build Configuration - RT
[INFO] Maven Master Plugin Build Configuration - SDK
[INFO] Maven Master Plugin Build Configuration - SDK-P2
[INFO] Maven Master Eclipse Settings
[INFO] Maven Master Eclipse Settings - APT Variant
[INFO] Maven Master Root Module
[INFO]                                                                         
[INFO] ------------------------------------------------------------------------
[INFO] Building Maven Master Plugin Version Configuration 2.0.9
[INFO] ------------------------------------------------------------------------
[INFO] 
[INFO] --- maven-site-plugin:3.4:attach-descriptor (attach-descriptor) @ maven_plugin_version-master ---
[INFO] 
[INFO] --- maven-install-plugin:2.5.2:install (default-install) @ maven_plugin_version-master ---
[INFO] Installing /jobs/genie.scout/org.eclipse.scout_maven-master_releaseBuild/workspace/maven_plugin_version-master/pom.xml to /home/hudson/genie.scout/.hudson/jobs/org.eclipse.scout_maven-master_releaseBuild/workspace/.maven/repo/org/eclipse/scout/maven_plugin_version-master/2.0.9/maven_plugin_version-master-2.0.9.pom
[INFO] Installing /jobs/genie.scout/org.eclipse.scout_maven-master_releaseBuild/workspace/maven_plugin_version-master/target/maven_plugin_version-master-2.0.9-site.xml to /home/hudson/genie.scout/.hudson/jobs/org.eclipse.scout_maven-master_releaseBuild/workspace/.maven/repo/org/eclipse/scout/maven_plugin_version-master/2.0.9/maven_plugin_version-master-2.0.9-site.xml
[INFO] 
[INFO] --- maven-deploy-plugin:2.8.2:deploy (default-deploy) @ maven_plugin_version-master ---
Uploading: https://repo.eclipse.org/content/repositories/scout-releases/org/eclipse/scout/maven_plugin_version-master/2.0.9/maven_plugin_version-master-2.0.9.pom
[INFO] ------------------------------------------------------------------------
[INFO] Reactor Summary:
[INFO] 
[INFO] Maven Master Plugin Version Configuration .......... FAILURE [  1.209 s]
[INFO] Maven Master Plugin Build Configuration - General .. SKIPPED
[INFO] Maven Master Plugin Build Configuration - RT ....... SKIPPED
[INFO] Maven Master Plugin Build Configuration - SDK ...... SKIPPED
[INFO] Maven Master Plugin Build Configuration - SDK-P2 ... SKIPPED
[INFO] Maven Master Eclipse Settings ...................... SKIPPED
[INFO] Maven Master Eclipse Settings - APT Variant ........ SKIPPED
[INFO] Maven Master Root Module ........................... SKIPPED
[INFO] ------------------------------------------------------------------------
[INFO] BUILD FAILURE
[INFO] ------------------------------------------------------------------------
[INFO] Total time: 2.572 s
[INFO] Finished at: 2017-01-26T04:17:37-05:00
[INFO] Final Memory: 36M/1553M
[INFO] ------------------------------------------------------------------------
[WARNING] The requested profile "deploy" could not be activated because it does not exist.
[INFO] o.h.m.e.h.MavenExecutionResultHandler - Build failed with exception(s)
[INFO] o.h.m.e.h.MavenExecutionResultHandler - [1] org.apache.maven.lifecycle.LifecycleExecutionException: Failed to execute goal org.apache.maven.plugins:maven-deploy-plugin:2.8.2:deploy (default-deploy) on project maven_plugin_version-master: Failed to deploy artifacts: Could not transfer artifact org.eclipse.scout:maven_plugin_version-master:pom:2.0.9 from/to repo.eclipse.org (https://repo.eclipse.org/content/repositories/scout-releases/): Failed to transfer file: https://repo.eclipse.org/content/repositories/scout-releases/org/eclipse/scout/maven_plugin_version-master/2.0.9/maven_plugin_version-master-2.0.9.pom. Return code is: 503, ReasonPhrase: Service Temporarily Unavailable.
[DEBUG] Closing connection to remote
[ERROR] Failed to execute goal org.apache.maven.plugins:maven-deploy-plugin:2.8.2:deploy (default-deploy) on project maven_plugin_version-master: Failed to deploy artifacts: Could not transfer artifact org.eclipse.scout:maven_plugin_version-master:pom:2.0.9 from/to repo.eclipse.org (https://repo.eclipse.org/content/repositories/scout-releases/): Failed to transfer file: https://repo.eclipse.org/content/repositories/scout-releases/org/eclipse/scout/maven_plugin_version-master/2.0.9/maven_plugin_version-master-2.0.9.pom. Return code is: 503, ReasonPhrase: Service Temporarily Unavailable. -> [Help 1]
[ERROR] 
[ERROR] To see the full stack trace of the errors, re-run Maven with the -e switch.
[ERROR] Re-run Maven using the -X switch to enable full debug logging.
[ERROR] 
[ERROR] For more information about the errors and possible solutions, please read the following articles:
[ERROR] [Help 1] http://cwiki.apache.org/confluence/display/MAVEN/MojoExecutionException
[DEBUG] Waiting for process to finish
[DEBUG] Result: 1
Sending e-mails to: Stephan.LeichtVogt@bsi-software.com
Finished: FAILURE