FailedConsole Output

Retriggered by user Arthur.vanDorp@bsi-software.com for Gerrit: https://git.eclipse.org/r/70111
Checkout:workspace / /home/hudson/genie.scout/.hudson/jobs/org.eclipse.scout.sdk_gerrit_OSGI/workspace - hudson.remoting.LocalChannel@621045f8
Using strategy: Gerrit Trigger
Git Exe: git
Last Built Revision: Revision c7c6f3373e749ec4be4f267662a53dfaf0e97e62 (null)
Checkout:workspace / /home/hudson/genie.scout/.hudson/jobs/org.eclipse.scout.sdk_gerrit_OSGI/workspace - hudson.remoting.LocalChannel@621045f8
Pruning obsolete local branches
Fetching changes from the remote Git repository
Fetching upstream changes from git://git.eclipse.org/gitroot/scout/org.eclipse.scout.sdk.git
Commencing build of Revision c7c6f3373e749ec4be4f267662a53dfaf0e97e62 (null)
Checking out Revision c7c6f3373e749ec4be4f267662a53dfaf0e97e62 (null)
[INFO] Using Maven 3 installation: apache-maven-latest
[INFO] Checking Maven 3 installation environment
[workspace] $ /shared/common/apache-maven-latest/bin/mvn --help
[INFO] Checking Maven 3 installation version
[INFO] Detected Maven 3 installation version: 3.3.9
[workspace] $ /shared/common/apache-maven-latest/bin/mvn clean install -V -B "-DGERRIT_EVENT_ACCOUNT_NAME=Arthur van Dorp" '-DGERRIT_PATCHSET_UPLOADER=\"Arthur van Dorp\" <Arthur.vanDorp@bsi-software.com>' -DGERRIT_CHANGE_URL=https://git.eclipse.org/r/70111 -DGERRIT_CHANGE_ID=I5d2db446c0c97ec330c5cf8a30b0863f91018c19 -DGERRIT_CHANGE_NUMBER=70111 "-DGERRIT_PATCHSET_UPLOADER_NAME=Arthur van Dorp" "-DGERRIT_CHANGE_SUBJECT=Update version to 5.0.300 from 5.0.200." -DGERRIT_PATCHSET_UPLOADER_EMAIL=Arthur.vanDorp@bsi-software.com -DGERRIT_EVENT_HASH=611842479 -DGERRIT_BRANCH=releases/5.0.x -DGERRIT_REFSPEC=refs/changes/11/70111/1 -DGERRIT_PATCHSET_NUMBER=1 "-DGERRIT_CHANGE_OWNER_NAME=Arthur van Dorp" '-DGERRIT_EVENT_ACCOUNT=\"Arthur van Dorp\" <Arthur.vanDorp@bsi-software.com>' -DGERRIT_EVENT_ACCOUNT_EMAIL=Arthur.vanDorp@bsi-software.com -DGERRIT_PATCHSET_REVISION=c7c6f3373e749ec4be4f267662a53dfaf0e97e62 -DGERRIT_PROJECT=scout/org.eclipse.scout.sdk '-DGERRIT_CHANGE_OWNER=\"Arthur van Dorp\" <Arthur.vanDorp@bsi-software.com>' -DGERRIT_CHANGE_OWNER_EMAIL=Arthur.vanDorp@bsi-software.com -Dcbi.jarsigner.skip=true -Dmaven.ext.class.path=/home/hudson/genie.scout/.hudson/maven/slavebundle/resources:/home/hudson/genie.scout/.hudson/maven/slavebundle/lib/maven3-eventspy-3.1.jar:/home/hudson/genie.scout/.hudson/war/webapp/WEB-INF/lib/hudson-remoting-3.0.3.jar -Dhudson.eventspy.port=47350 -f pom.xml -P eclipse-sign -P useScoutRTTarget
[DEBUG] Waiting for connection on port: 47350
Apache Maven 3.3.9 (bb52d8502b132ec0a5a3f4c09453c07478323dc5; 2015-11-10T11:41:47-05:00)
Maven home: /shared/common/apache-maven-latest
Java version: 1.7.0_80, vendor: Oracle Corporation
Java home: /opt/public/common/jdk1.7.0_80/jre
Default locale: en_US, platform encoding: UTF-8
OS name: "linux", version: "3.0.101-0.47.71-default", arch: "amd64", family: "unix"
SLF4J: Class path contains multiple SLF4J bindings.
SLF4J: Found binding in [jar:file:/home/hudson/genie.scout/.hudson/maven/slavebundle/lib/maven3-eventspy-runtime.jar!/org/slf4j/impl/StaticLoggerBinder.class]
SLF4J: Found binding in [jar:file:/shared/common/apache-maven-latest/lib/slf4j-simple-1.7.5.jar!/org/slf4j/impl/StaticLoggerBinder.class]
SLF4J: See http://www.slf4j.org/codes.html#multiple_bindings for an explanation.
[DEBUG] Connected to remote
[INFO] o.h.m.e.h.SettingsBuildingRequestHandler - Using settings document ID: e23a0b6a-ab36-4ea3-8d97-c6ce7ba3db90
[WARN] o.h.m.e.EventSpyProcessor - Unhandled event: org.apache.maven.toolchain.building.DefaultToolchainsBuildingRequest@39addae4 (org.apache.maven.toolchain.building.DefaultToolchainsBuildingRequest)
[WARN] o.h.m.e.EventSpyProcessor - Unhandled event: org.apache.maven.toolchain.building.DefaultToolchainsBuildingRequest@39addae4 (org.apache.maven.toolchain.building.DefaultToolchainsBuildingRequest)
[INFO] Scanning for projects...
[ERROR] [ERROR] Some problems were encountered while processing the POMs:
[FATAL] Non-resolvable parent POM for org.eclipse.scout:org.eclipse.scout.sdk:5.0.300-SNAPSHOT: Failure to find org.eclipse.scout:org.eclipse.scout.parent:pom:5.0.300-SNAPSHOT in https://repo.eclipse.org/content/groups/snapshots/ was cached in the local repository, resolution will not be reattempted until the update interval of eclipse.snapshot has elapsed or updates are forced and 'parent.relativePath' points at wrong local POM @ line 16, column 11
 @ 
[INFO] o.h.m.e.h.MavenExecutionResultHandler - Build failed with exception(s)
[INFO] o.h.m.e.h.MavenExecutionResultHandler - [1] org.apache.maven.project.ProjectBuildingException: Some problems were encountered while processing the POMs:
[FATAL] Non-resolvable parent POM for org.eclipse.scout:org.eclipse.scout.sdk:5.0.300-SNAPSHOT: Failure to find org.eclipse.scout:org.eclipse.scout.parent:pom:5.0.300-SNAPSHOT in https://repo.eclipse.org/content/groups/snapshots/ was cached in the local repository, resolution will not be reattempted until the update interval of eclipse.snapshot has elapsed or updates are forced and 'parent.relativePath' points at wrong local POM @ line 16, column 11

[DEBUG] Closing connection to remote
[ERROR] The build could not read 1 project -> [Help 1]
[ERROR]   
[ERROR]   The project org.eclipse.scout:org.eclipse.scout.sdk:5.0.300-SNAPSHOT (/jobs/genie.scout/org.eclipse.scout.sdk_gerrit_OSGI/workspace/pom.xml) has 1 error
[ERROR]     Non-resolvable parent POM for org.eclipse.scout:org.eclipse.scout.sdk:5.0.300-SNAPSHOT: Failure to find org.eclipse.scout:org.eclipse.scout.parent:pom:5.0.300-SNAPSHOT in https://repo.eclipse.org/content/groups/snapshots/ was cached in the local repository, resolution will not be reattempted until the update interval of eclipse.snapshot has elapsed or updates are forced and 'parent.relativePath' points at wrong local POM @ line 16, column 11 -> [Help 2]
[ERROR] 
[ERROR] To see the full stack trace of the errors, re-run Maven with the -e switch.
[ERROR] Re-run Maven using the -X switch to enable full debug logging.
[ERROR] 
[ERROR] For more information about the errors and possible solutions, please read the following articles:
[ERROR] [Help 1] http://cwiki.apache.org/confluence/display/MAVEN/ProjectBuildingException
[ERROR] [Help 2] http://cwiki.apache.org/confluence/display/MAVEN/UnresolvableModelException
[DEBUG] Waiting for process to finish
[DEBUG] Result: 1
Finished: FAILURE