FailedConsole Output

06:38:25 Started by user Arthur.vanDorp@bsi-software.com
06:38:25 Building in workspace /home/hudson/genie.scout/.jenkins/jobs/org.eclipse.scout.sdk_deploy_from_tag/workspace
06:38:25 No credentials specified
06:38:25  > /usr/local/bin/git rev-parse --is-inside-work-tree # timeout=10
06:38:25 Fetching changes from the remote Git repository
06:38:25  > /usr/local/bin/git config remote.origin.url git://git.eclipse.org/gitroot/scout/org.eclipse.scout.sdk.git # timeout=10
06:38:25 Fetching upstream changes from git://git.eclipse.org/gitroot/scout/org.eclipse.scout.sdk.git
06:38:25  > /usr/local/bin/git --version # timeout=10
06:38:25  > /usr/local/bin/git fetch --tags --progress git://git.eclipse.org/gitroot/scout/org.eclipse.scout.sdk.git +refs/heads/*:refs/remotes/origin/*
06:38:25  > /usr/local/bin/git rev-parse origin/9.0.0.025_Simrel_2019_09^{commit} # timeout=10
06:38:25  > /usr/local/bin/git rev-parse 9.0.0.025_Simrel_2019_09^{commit} # timeout=10
06:38:25 Checking out Revision 7919e5eedbdf0b418849a469e5c8b60cf92f4243 (9.0.0.025_Simrel_2019_09)
06:38:25  > /usr/local/bin/git config core.sparsecheckout # timeout=10
06:38:25  > /usr/local/bin/git checkout -f 7919e5eedbdf0b418849a469e5c8b60cf92f4243
06:38:25 Commit message: "[release] version updated to 9.0.0.025_Simrel_2019_09"
06:38:25  > /usr/local/bin/git rev-list --no-walk 7919e5eedbdf0b418849a469e5c8b60cf92f4243 # timeout=10
06:38:25 [workspace] $ /shared/common/apache-maven-latest/bin/mvn -f org.eclipse.scout.sdk/pom.xml -DbuildId=025_Simrel_2019_09 -Dtag=9.0.0.025_Simrel_2019_09 -DstageTargetDir=releases/9.0/9.0.0/ -Dmaven.repo.local=/home/hudson/genie.scout/.jenkins/jobs/org.eclipse.scout.sdk_deploy_from_tag/workspace/.repository clean install
06:38:25 Picked up JAVA_TOOL_OPTIONS: -Xmx2G -Djava.io.tmpdir=/tmp/genie.scout -DforkCount=1
06:38:27 [INFO] Scanning for projects...
06:38:28 [INFO] ------------------------------------------------------------------------
06:38:28 [INFO] Reactor Build Order:
06:38:28 [INFO] 
06:38:28 [INFO] Scout Hello World Sample Application                   [maven-archetype]
06:38:28 [INFO] Scout JaxWs Module                                     [maven-archetype]
06:38:28 [INFO] ScoutJS Sample Application                             [maven-archetype]
06:38:28 [INFO] Eclipse Scout SDK                                                  [pom]
06:38:28 [INFO] org.eclipse.scout.sdk:org.eclipse.scout.sdk.core                   [jar]
06:38:28 [INFO] org.eclipse.scout.sdk:org.eclipse.scout.sdk.core.test              [jar]
06:38:28 [INFO] org.eclipse.scout.sdk:org.eclipse.scout.sdk.core.s                 [jar]
06:38:28 [INFO] org.eclipse.scout.sdk:org.eclipse.scout.sdk.core.s.test            [jar]
06:38:28 [INFO] org.eclipse.scout.sdk.s2e:org.eclipse.scout.sdk.s2e             [bundle]
06:38:28 [INFO] org.eclipse.scout.sdk.s2e:org.eclipse.scout.sdk.s2e.test           [jar]
06:38:28 [INFO] org.eclipse.scout.sdk.s2e:org.eclipse.scout.sdk.s2e.doc         [bundle]
06:38:28 [INFO] org.eclipse.scout.sdk.s2e:org.eclipse.scout.sdk.s2e.nls         [bundle]
06:38:28 [INFO] org.eclipse.scout.sdk.s2e:org.eclipse.scout.sdk.s2e.ui          [bundle]
06:38:28 [INFO] org.eclipse.scout.sdk-settings                                     [jar]
06:38:28 [INFO] 
06:38:28 [INFO] ---------< org.eclipse.scout.archetypes:scout-helloworld-app >----------
06:38:28 [INFO] Building Scout Hello World Sample Application 9.0.0.025_Simrel_2019_09 [1/14]
06:38:28 [INFO] --------------------------[ maven-archetype ]---------------------------
06:38:28 [INFO] 
06:38:28 [INFO] --- maven-clean-plugin:3.1.0:clean (default-clean) @ scout-helloworld-app ---
06:38:28 [INFO] Deleting /jobs/genie.scout/org.eclipse.scout.sdk_deploy_from_tag/workspace/scout-helloworld-app/target
06:38:28 [INFO] 
06:38:28 [INFO] --- flatten-maven-plugin:1.0.1:clean (flatten.clean) @ scout-helloworld-app ---
06:38:28 [INFO] Deleting /jobs/genie.scout/org.eclipse.scout.sdk_deploy_from_tag/workspace/scout-helloworld-app/.flattened-pom.xml
06:38:28 [INFO] 
06:38:28 [INFO] --- maven-enforcer-plugin:1.4.1:enforce (enforce-rules) @ scout-helloworld-app ---
06:38:29 [INFO] 
06:38:29 [INFO] --- git-commit-id-plugin:2.2.5:revision (default) @ scout-helloworld-app ---
06:38:32 [INFO] 
06:38:32 [INFO] --- jacoco-maven-plugin:0.8.2:prepare-agent (default) @ scout-helloworld-app ---
06:38:32 [INFO] master_test_jacocoArgLine set to -javaagent:/home/hudson/genie.scout/.jenkins/jobs/org.eclipse.scout.sdk_deploy_from_tag/workspace/.repository/org/jacoco/org.jacoco.agent/0.8.2/org.jacoco.agent-0.8.2-runtime.jar=destfile=/jobs/genie.scout/org.eclipse.scout.sdk_deploy_from_tag/workspace/scout-helloworld-app/../target/jacoco-all.exec
06:38:32 [INFO] 
06:38:32 [INFO] --- build-helper-maven-plugin:3.0.0:parse-version (initialize-parse-version) @ scout-helloworld-app ---
06:38:32 [INFO] 
06:38:32 [INFO] --- build-helper-maven-plugin:3.0.0:regex-property (initialize-regex) @ scout-helloworld-app ---
06:38:32 [INFO] No match to regex 'SNAPSHOT' found in '9.0.0.025_Simrel_2019_09'. The initial value '9.0.0.025_Simrel_2019_09' is left as-is...
06:38:32 [INFO] 
06:38:32 [INFO] --- maven-resources-plugin:3.1.0:resources (default-resources) @ scout-helloworld-app ---
06:38:32 [INFO] Using 'UTF-8' encoding to copy filtered resources.
06:38:32 [INFO] Copying 105 resources
06:38:32 [INFO] Copying 2 resources
06:38:32 [INFO] 
06:38:32 [INFO] --- flatten-maven-plugin:1.0.1:flatten (flatten) @ scout-helloworld-app ---
06:38:32 [INFO] Generating flattened POM of project org.eclipse.scout.archetypes:scout-helloworld-app:maven-archetype:9.0.0.025_Simrel_2019_09...
06:38:32 [INFO] 
06:38:32 [INFO] --- maven-resources-plugin:3.1.0:testResources (default-testResources) @ scout-helloworld-app ---
06:38:32 [INFO] Using 'UTF-8' encoding to copy filtered resources.
06:38:32 [INFO] Copying 2 resources
06:38:32 [INFO] 
06:38:32 [INFO] --- maven-archetype-plugin:3.0.1:jar (default-jar) @ scout-helloworld-app ---
06:38:32 [INFO] Building archetype jar: /jobs/genie.scout/org.eclipse.scout.sdk_deploy_from_tag/workspace/scout-helloworld-app/target/scout-helloworld-app-9.0.0.025_Simrel_2019_09
06:38:33 [INFO] 
06:38:33 [INFO] --- maven-site-plugin:3.7.1:attach-descriptor (attach-descriptor) @ scout-helloworld-app ---
06:38:33 [INFO] Skipping because packaging 'maven-archetype' is not pom.
06:38:33 [INFO] 
06:38:33 [INFO] --- maven-jar-plugin:3.1.1:test-jar (attach-tests) @ scout-helloworld-app ---
06:38:33 [INFO] Building jar: /jobs/genie.scout/org.eclipse.scout.sdk_deploy_from_tag/workspace/scout-helloworld-app/target/scout-helloworld-app-9.0.0.025_Simrel_2019_09-tests.jar
06:38:33 [INFO] 
06:38:33 [INFO] --- maven-source-plugin:3.0.1:test-jar-no-fork (attach-test-sources) @ scout-helloworld-app ---
06:38:33 [INFO] No sources in project. Archive not created.
06:38:33 [INFO] 
06:38:33 [INFO] --- maven-archetype-plugin:3.0.1:integration-test (default-integration-test) @ scout-helloworld-app ---
06:38:33 [INFO] Processing Archetype IT project: basic
06:38:33 [INFO] ----------------------------------------------------------------------------
06:38:33 [INFO] Using following parameters for creating project from Archetype: scout-helloworld-app:9.0.0.025_Simrel_2019_09
06:38:33 [INFO] ----------------------------------------------------------------------------
06:38:33 [INFO] Parameter: groupId, Value: org.eclipse.scout.apps
06:38:33 [INFO] Parameter: artifactId, Value: helloworld
06:38:33 [INFO] Parameter: version, Value: 1.0.0-SNAPSHOT
06:38:33 [INFO] Parameter: package, Value: org.eclipse.scout.apps.helloworld
06:38:33 [INFO] Parameter: packageInPathFormat, Value: org/eclipse/scout/apps/helloworld
06:38:33 [INFO] Parameter: scoutAuthPublicKeyDev, Value: TODO (use org.eclipse.scout.rt.platform.security.SecurityUtility.generateKeyPair())
06:38:33 [INFO] Parameter: groupId, Value: org.eclipse.scout.apps
06:38:33 [INFO] Parameter: scoutAuthPrivateKeyDev, Value: TODO (use org.eclipse.scout.rt.platform.security.SecurityUtility.generateKeyPair())
06:38:33 [INFO] Parameter: scoutAuthPublicKey, Value: TODO (use org.eclipse.scout.rt.platform.security.SecurityUtility.generateKeyPair())
06:38:33 [INFO] Parameter: version, Value: 1.0.0-SNAPSHOT
06:38:33 [INFO] Parameter: userName, Value: Scout Robot
06:38:33 [INFO] Parameter: displayName, Value: My Application
06:38:33 [INFO] Parameter: javaVersion, Value: 1.8
06:38:33 [INFO] Parameter: package, Value: org.eclipse.scout.apps.helloworld
06:38:33 [INFO] Parameter: artifactId, Value: helloworld
06:38:33 [INFO] Parameter: scoutAuthPrivateKey, Value: TODO (use org.eclipse.scout.rt.platform.security.SecurityUtility.generateKeyPair())
06:38:34 [INFO] Parent element not overwritten in /jobs/genie.scout/org.eclipse.scout.sdk_deploy_from_tag/workspace/scout-helloworld-app/target/test-classes/projects/basic/project/helloworld/helloworld/pom.xml
06:38:34 [WARNING] Don't override file /jobs/genie.scout/org.eclipse.scout.sdk_deploy_from_tag/workspace/scout-helloworld-app/target/test-classes/projects/basic/project/helloworld/helloworld/pom.xml
06:38:34 [INFO] Parent element not overwritten in /jobs/genie.scout/org.eclipse.scout.sdk_deploy_from_tag/workspace/scout-helloworld-app/target/test-classes/projects/basic/project/helloworld/helloworld.shared/pom.xml
06:38:34 [INFO] Parent element not overwritten in /jobs/genie.scout/org.eclipse.scout.sdk_deploy_from_tag/workspace/scout-helloworld-app/target/test-classes/projects/basic/project/helloworld/helloworld.server/pom.xml
06:38:34 [INFO] Parent element not overwritten in /jobs/genie.scout/org.eclipse.scout.sdk_deploy_from_tag/workspace/scout-helloworld-app/target/test-classes/projects/basic/project/helloworld/helloworld.client/pom.xml
06:38:34 [INFO] Parent element not overwritten in /jobs/genie.scout/org.eclipse.scout.sdk_deploy_from_tag/workspace/scout-helloworld-app/target/test-classes/projects/basic/project/helloworld/helloworld.server.app.war/pom.xml
06:38:34 [INFO] Parent element not overwritten in /jobs/genie.scout/org.eclipse.scout.sdk_deploy_from_tag/workspace/scout-helloworld-app/target/test-classes/projects/basic/project/helloworld/helloworld.server.app.dev/pom.xml
06:38:34 [INFO] Parent element not overwritten in /jobs/genie.scout/org.eclipse.scout.sdk_deploy_from_tag/workspace/scout-helloworld-app/target/test-classes/projects/basic/project/helloworld/helloworld.ui.html/pom.xml
06:38:34 [INFO] Parent element not overwritten in /jobs/genie.scout/org.eclipse.scout.sdk_deploy_from_tag/workspace/scout-helloworld-app/target/test-classes/projects/basic/project/helloworld/helloworld.ui.html.app.war/pom.xml
06:38:34 [INFO] Parent element not overwritten in /jobs/genie.scout/org.eclipse.scout.sdk_deploy_from_tag/workspace/scout-helloworld-app/target/test-classes/projects/basic/project/helloworld/helloworld.ui.html.app.dev/pom.xml
06:38:34 [INFO] Project created from Archetype in dir: /jobs/genie.scout/org.eclipse.scout.sdk_deploy_from_tag/workspace/scout-helloworld-app/target/test-classes/projects/basic/project/helloworld
06:38:34 [INFO] 
06:38:34 [INFO] --- duplicate-finder-maven-plugin:1.3.0:check (default) @ scout-helloworld-app ---
06:38:34 [INFO] Checking compile classpath
06:38:34 [INFO] Checking runtime classpath
06:38:34 [INFO] Checking test classpath
06:38:34 [INFO] 
06:38:34 [INFO] --- animal-sniffer-maven-plugin:1.17:check (enforce-java-api-compatibility) @ scout-helloworld-app ---
06:38:34 [INFO] Checking unresolved references to org.codehaus.mojo.signature:java18:1.0
06:38:35 [INFO] 
06:38:35 [INFO] --- maven-source-plugin:3.0.1:jar-no-fork (attach-sources) @ scout-helloworld-app ---
06:38:35 [INFO] No sources in project. Archive not created.
06:38:35 [INFO] 
06:38:35 [INFO] --- maven-install-plugin:2.5.2:install (default-install) @ scout-helloworld-app ---
06:38:35 [INFO] Installing /jobs/genie.scout/org.eclipse.scout.sdk_deploy_from_tag/workspace/scout-helloworld-app/target/scout-helloworld-app-9.0.0.025_Simrel_2019_09.jar to /home/hudson/genie.scout/.jenkins/jobs/org.eclipse.scout.sdk_deploy_from_tag/workspace/.repository/org/eclipse/scout/archetypes/scout-helloworld-app/9.0.0.025_Simrel_2019_09/scout-helloworld-app-9.0.0.025_Simrel_2019_09.jar
06:38:35 [INFO] Installing /jobs/genie.scout/org.eclipse.scout.sdk_deploy_from_tag/workspace/scout-helloworld-app/.flattened-pom.xml to /home/hudson/genie.scout/.jenkins/jobs/org.eclipse.scout.sdk_deploy_from_tag/workspace/.repository/org/eclipse/scout/archetypes/scout-helloworld-app/9.0.0.025_Simrel_2019_09/scout-helloworld-app-9.0.0.025_Simrel_2019_09.pom
06:38:35 [INFO] Installing /jobs/genie.scout/org.eclipse.scout.sdk_deploy_from_tag/workspace/scout-helloworld-app/target/scout-helloworld-app-9.0.0.025_Simrel_2019_09-tests.jar to /home/hudson/genie.scout/.jenkins/jobs/org.eclipse.scout.sdk_deploy_from_tag/workspace/.repository/org/eclipse/scout/archetypes/scout-helloworld-app/9.0.0.025_Simrel_2019_09/scout-helloworld-app-9.0.0.025_Simrel_2019_09-tests.jar
06:38:35 [INFO] 
06:38:35 [INFO] --- maven-archetype-plugin:3.0.1:update-local-catalog (default-update-local-catalog) @ scout-helloworld-app ---
06:38:35 [INFO] 
06:38:35 [INFO] ----------< org.eclipse.scout.archetypes:scout-jaxws-module >-----------
06:38:35 [INFO] Building Scout JaxWs Module 9.0.0.025_Simrel_2019_09              [2/14]
06:38:35 [INFO] --------------------------[ maven-archetype ]---------------------------
06:38:35 [INFO] 
06:38:35 [INFO] --- maven-clean-plugin:3.1.0:clean (default-clean) @ scout-jaxws-module ---
06:38:35 [INFO] Deleting /jobs/genie.scout/org.eclipse.scout.sdk_deploy_from_tag/workspace/scout-jaxws-module/target
06:38:35 [INFO] 
06:38:35 [INFO] --- flatten-maven-plugin:1.0.1:clean (flatten.clean) @ scout-jaxws-module ---
06:38:35 [INFO] Deleting /jobs/genie.scout/org.eclipse.scout.sdk_deploy_from_tag/workspace/scout-jaxws-module/.flattened-pom.xml
06:38:35 [INFO] 
06:38:35 [INFO] --- maven-enforcer-plugin:1.4.1:enforce (enforce-rules) @ scout-jaxws-module ---
06:38:35 [INFO] 
06:38:35 [INFO] --- git-commit-id-plugin:2.2.5:revision (default) @ scout-jaxws-module ---
06:38:37 [INFO] 
06:38:37 [INFO] --- jacoco-maven-plugin:0.8.2:prepare-agent (default) @ scout-jaxws-module ---
06:38:37 [INFO] master_test_jacocoArgLine set to -javaagent:/home/hudson/genie.scout/.jenkins/jobs/org.eclipse.scout.sdk_deploy_from_tag/workspace/.repository/org/jacoco/org.jacoco.agent/0.8.2/org.jacoco.agent-0.8.2-runtime.jar=destfile=/jobs/genie.scout/org.eclipse.scout.sdk_deploy_from_tag/workspace/scout-jaxws-module/../target/jacoco-all.exec
06:38:37 [INFO] 
06:38:37 [INFO] --- build-helper-maven-plugin:3.0.0:parse-version (initialize-parse-version) @ scout-jaxws-module ---
06:38:37 [INFO] 
06:38:37 [INFO] --- build-helper-maven-plugin:3.0.0:regex-property (initialize-regex) @ scout-jaxws-module ---
06:38:37 [INFO] No match to regex 'SNAPSHOT' found in '9.0.0.025_Simrel_2019_09'. The initial value '9.0.0.025_Simrel_2019_09' is left as-is...
06:38:37 [INFO] 
06:38:37 [INFO] --- maven-resources-plugin:3.1.0:resources (default-resources) @ scout-jaxws-module ---
06:38:37 [INFO] Using 'UTF-8' encoding to copy filtered resources.
06:38:37 [INFO] Copying 7 resources
06:38:37 [INFO] Copying 2 resources
06:38:37 [INFO] 
06:38:37 [INFO] --- flatten-maven-plugin:1.0.1:flatten (flatten) @ scout-jaxws-module ---
06:38:37 [INFO] Generating flattened POM of project org.eclipse.scout.archetypes:scout-jaxws-module:maven-archetype:9.0.0.025_Simrel_2019_09...
06:38:37 [INFO] 
06:38:37 [INFO] --- maven-resources-plugin:3.1.0:testResources (default-testResources) @ scout-jaxws-module ---
06:38:37 [INFO] Using 'UTF-8' encoding to copy filtered resources.
06:38:37 [INFO] Copying 2 resources
06:38:37 [INFO] 
06:38:37 [INFO] --- maven-archetype-plugin:3.0.1:jar (default-jar) @ scout-jaxws-module ---
06:38:37 [INFO] Building archetype jar: /jobs/genie.scout/org.eclipse.scout.sdk_deploy_from_tag/workspace/scout-jaxws-module/target/scout-jaxws-module-9.0.0.025_Simrel_2019_09
06:38:37 [INFO] 
06:38:37 [INFO] --- maven-site-plugin:3.7.1:attach-descriptor (attach-descriptor) @ scout-jaxws-module ---
06:38:37 [INFO] Skipping because packaging 'maven-archetype' is not pom.
06:38:37 [INFO] 
06:38:37 [INFO] --- maven-jar-plugin:3.1.1:test-jar (attach-tests) @ scout-jaxws-module ---
06:38:37 [INFO] Building jar: /jobs/genie.scout/org.eclipse.scout.sdk_deploy_from_tag/workspace/scout-jaxws-module/target/scout-jaxws-module-9.0.0.025_Simrel_2019_09-tests.jar
06:38:37 [INFO] 
06:38:37 [INFO] --- maven-source-plugin:3.0.1:test-jar-no-fork (attach-test-sources) @ scout-jaxws-module ---
06:38:37 [INFO] No sources in project. Archive not created.
06:38:37 [INFO] 
06:38:37 [INFO] --- maven-archetype-plugin:3.0.1:integration-test (default-integration-test) @ scout-jaxws-module ---
06:38:37 [INFO] Processing Archetype IT project: basic
06:38:37 [INFO] ----------------------------------------------------------------------------
06:38:37 [INFO] Using following parameters for creating project from Archetype: scout-jaxws-module:9.0.0.025_Simrel_2019_09
06:38:37 [INFO] ----------------------------------------------------------------------------
06:38:37 [INFO] Parameter: groupId, Value: org.eclipse.scout.apps
06:38:37 [INFO] Parameter: artifactId, Value: helloworld.server.jaxws
06:38:37 [INFO] Parameter: version, Value: 1.0.0-SNAPSHOT
06:38:37 [INFO] Parameter: package, Value: org.eclipse.scout.apps.helloworld
06:38:37 [INFO] Parameter: packageInPathFormat, Value: org/eclipse/scout/apps/helloworld
06:38:37 [INFO] Parameter: displayName, Value: My Application
06:38:37 [INFO] Parameter: version, Value: 1.0.0-SNAPSHOT
06:38:37 [INFO] Parameter: package, Value: org.eclipse.scout.apps.helloworld
06:38:37 [INFO] Parameter: groupId, Value: org.eclipse.scout.apps
06:38:37 [INFO] Parameter: parentArtifactId, Value: helloworld
06:38:37 [INFO] Parameter: artifactId, Value: helloworld.server.jaxws
06:38:37 [WARNING] CP Don't override file /jobs/genie.scout/org.eclipse.scout.sdk_deploy_from_tag/workspace/scout-jaxws-module/target/test-classes/projects/basic/project/helloworld.server.jaxws/src/main/resources/META-INF/scout.xml
06:38:37 [INFO] Project created from Archetype in dir: /jobs/genie.scout/org.eclipse.scout.sdk_deploy_from_tag/workspace/scout-jaxws-module/target/test-classes/projects/basic/project/helloworld.server.jaxws
06:38:37 [INFO] 
06:38:37 [INFO] --- duplicate-finder-maven-plugin:1.3.0:check (default) @ scout-jaxws-module ---
06:38:37 [INFO] Checking compile classpath
06:38:37 [INFO] Checking runtime classpath
06:38:37 [INFO] Checking test classpath
06:38:37 [INFO] 
06:38:37 [INFO] --- animal-sniffer-maven-plugin:1.17:check (enforce-java-api-compatibility) @ scout-jaxws-module ---
06:38:37 [INFO] Checking unresolved references to org.codehaus.mojo.signature:java18:1.0
06:38:38 [INFO] 
06:38:38 [INFO] --- maven-source-plugin:3.0.1:jar-no-fork (attach-sources) @ scout-jaxws-module ---
06:38:38 [INFO] No sources in project. Archive not created.
06:38:38 [INFO] 
06:38:38 [INFO] --- maven-install-plugin:2.5.2:install (default-install) @ scout-jaxws-module ---
06:38:38 [INFO] Installing /jobs/genie.scout/org.eclipse.scout.sdk_deploy_from_tag/workspace/scout-jaxws-module/target/scout-jaxws-module-9.0.0.025_Simrel_2019_09.jar to /home/hudson/genie.scout/.jenkins/jobs/org.eclipse.scout.sdk_deploy_from_tag/workspace/.repository/org/eclipse/scout/archetypes/scout-jaxws-module/9.0.0.025_Simrel_2019_09/scout-jaxws-module-9.0.0.025_Simrel_2019_09.jar
06:38:38 [INFO] Installing /jobs/genie.scout/org.eclipse.scout.sdk_deploy_from_tag/workspace/scout-jaxws-module/.flattened-pom.xml to /home/hudson/genie.scout/.jenkins/jobs/org.eclipse.scout.sdk_deploy_from_tag/workspace/.repository/org/eclipse/scout/archetypes/scout-jaxws-module/9.0.0.025_Simrel_2019_09/scout-jaxws-module-9.0.0.025_Simrel_2019_09.pom
06:38:38 [INFO] Installing /jobs/genie.scout/org.eclipse.scout.sdk_deploy_from_tag/workspace/scout-jaxws-module/target/scout-jaxws-module-9.0.0.025_Simrel_2019_09-tests.jar to /home/hudson/genie.scout/.jenkins/jobs/org.eclipse.scout.sdk_deploy_from_tag/workspace/.repository/org/eclipse/scout/archetypes/scout-jaxws-module/9.0.0.025_Simrel_2019_09/scout-jaxws-module-9.0.0.025_Simrel_2019_09-tests.jar
06:38:38 [INFO] 
06:38:38 [INFO] --- maven-archetype-plugin:3.0.1:update-local-catalog (default-update-local-catalog) @ scout-jaxws-module ---
06:38:38 [INFO] 
06:38:38 [INFO] -----------< org.eclipse.scout.archetypes:scout-hellojs-app >-----------
06:38:38 [INFO] Building ScoutJS Sample Application 9.0.0.025_Simrel_2019_09      [3/14]
06:38:38 [INFO] --------------------------[ maven-archetype ]---------------------------
06:38:38 [INFO] 
06:38:38 [INFO] --- maven-clean-plugin:3.1.0:clean (default-clean) @ scout-hellojs-app ---
06:38:38 [INFO] Deleting /jobs/genie.scout/org.eclipse.scout.sdk_deploy_from_tag/workspace/scout-hellojs-app/target
06:38:38 [INFO] 
06:38:38 [INFO] --- flatten-maven-plugin:1.0.1:clean (flatten.clean) @ scout-hellojs-app ---
06:38:38 [INFO] Deleting /jobs/genie.scout/org.eclipse.scout.sdk_deploy_from_tag/workspace/scout-hellojs-app/.flattened-pom.xml
06:38:38 [INFO] 
06:38:38 [INFO] --- maven-enforcer-plugin:1.4.1:enforce (enforce-rules) @ scout-hellojs-app ---
06:38:38 [INFO] 
06:38:38 [INFO] --- git-commit-id-plugin:2.2.5:revision (default) @ scout-hellojs-app ---
06:38:40 [INFO] 
06:38:40 [INFO] --- jacoco-maven-plugin:0.8.2:prepare-agent (default) @ scout-hellojs-app ---
06:38:40 [INFO] master_test_jacocoArgLine set to -javaagent:/home/hudson/genie.scout/.jenkins/jobs/org.eclipse.scout.sdk_deploy_from_tag/workspace/.repository/org/jacoco/org.jacoco.agent/0.8.2/org.jacoco.agent-0.8.2-runtime.jar=destfile=/jobs/genie.scout/org.eclipse.scout.sdk_deploy_from_tag/workspace/scout-hellojs-app/../target/jacoco-all.exec
06:38:40 [INFO] 
06:38:40 [INFO] --- build-helper-maven-plugin:3.0.0:parse-version (initialize-parse-version) @ scout-hellojs-app ---
06:38:40 [INFO] 
06:38:40 [INFO] --- build-helper-maven-plugin:3.0.0:regex-property (initialize-regex) @ scout-hellojs-app ---
06:38:40 [INFO] No match to regex 'SNAPSHOT' found in '9.0.0.025_Simrel_2019_09'. The initial value '9.0.0.025_Simrel_2019_09' is left as-is...
06:38:40 [INFO] 
06:38:40 [INFO] --- maven-resources-plugin:3.1.0:resources (default-resources) @ scout-hellojs-app ---
06:38:40 [INFO] Using 'UTF-8' encoding to copy filtered resources.
06:38:40 [INFO] Copying 146 resources
06:38:40 [INFO] Copying 2 resources
06:38:40 [INFO] 
06:38:40 [INFO] --- flatten-maven-plugin:1.0.1:flatten (flatten) @ scout-hellojs-app ---
06:38:40 [INFO] Generating flattened POM of project org.eclipse.scout.archetypes:scout-hellojs-app:maven-archetype:9.0.0.025_Simrel_2019_09...
06:38:40 [INFO] 
06:38:40 [INFO] --- maven-resources-plugin:3.1.0:testResources (default-testResources) @ scout-hellojs-app ---
06:38:40 [INFO] Using 'UTF-8' encoding to copy filtered resources.
06:38:40 [INFO] Copying 2 resources
06:38:40 [INFO] 
06:38:40 [INFO] --- maven-archetype-plugin:3.0.1:jar (default-jar) @ scout-hellojs-app ---
06:38:40 [INFO] Building archetype jar: /jobs/genie.scout/org.eclipse.scout.sdk_deploy_from_tag/workspace/scout-hellojs-app/target/scout-hellojs-app-9.0.0.025_Simrel_2019_09
06:38:40 [INFO] 
06:38:40 [INFO] --- maven-site-plugin:3.7.1:attach-descriptor (attach-descriptor) @ scout-hellojs-app ---
06:38:40 [INFO] Skipping because packaging 'maven-archetype' is not pom.
06:38:40 [INFO] 
06:38:40 [INFO] --- maven-jar-plugin:3.1.1:test-jar (attach-tests) @ scout-hellojs-app ---
06:38:40 [INFO] Building jar: /jobs/genie.scout/org.eclipse.scout.sdk_deploy_from_tag/workspace/scout-hellojs-app/target/scout-hellojs-app-9.0.0.025_Simrel_2019_09-tests.jar
06:38:40 [INFO] 
06:38:40 [INFO] --- maven-source-plugin:3.0.1:test-jar-no-fork (attach-test-sources) @ scout-hellojs-app ---
06:38:40 [INFO] No sources in project. Archive not created.
06:38:40 [INFO] 
06:38:40 [INFO] --- maven-archetype-plugin:3.0.1:integration-test (default-integration-test) @ scout-hellojs-app ---
06:38:40 [INFO] Processing Archetype IT project: basic
06:38:40 [INFO] ----------------------------------------------------------------------------
06:38:40 [INFO] Using following parameters for creating project from Archetype: scout-hellojs-app:9.0.0.025_Simrel_2019_09
06:38:40 [INFO] ----------------------------------------------------------------------------
06:38:40 [INFO] Parameter: groupId, Value: org.eclipse.scout.apps
06:38:40 [INFO] Parameter: artifactId, Value: hellojs
06:38:40 [INFO] Parameter: version, Value: 1.0.0-SNAPSHOT
06:38:40 [INFO] Parameter: package, Value: org.eclipse.scout.apps.hellojs
06:38:40 [INFO] Parameter: packageInPathFormat, Value: org/eclipse/scout/apps/hellojs
06:38:40 [INFO] Parameter: displayName, Value: My Application
06:38:40 [INFO] Parameter: version, Value: 1.0.0-SNAPSHOT
06:38:40 [INFO] Parameter: package, Value: org.eclipse.scout.apps.hellojs
06:38:40 [INFO] Parameter: simpleArtifactName, Value: hellojs
06:38:40 [INFO] Parameter: javaVersion, Value: 1.8
06:38:40 [INFO] Parameter: groupId, Value: org.eclipse.scout.apps
06:38:40 [INFO] Parameter: scoutAuthPublicKeyDev, Value: changeme_database_password
06:38:40 [INFO] Parameter: artifactId, Value: hellojs
06:38:40 [INFO] Parent element not overwritten in /jobs/genie.scout/org.eclipse.scout.sdk_deploy_from_tag/workspace/scout-hellojs-app/target/test-classes/projects/basic/project/hellojs/hellojs/pom.xml
06:38:40 [WARNING] Don't override file /jobs/genie.scout/org.eclipse.scout.sdk_deploy_from_tag/workspace/scout-hellojs-app/target/test-classes/projects/basic/project/hellojs/hellojs/pom.xml
06:38:40 [INFO] Parent element not overwritten in /jobs/genie.scout/org.eclipse.scout.sdk_deploy_from_tag/workspace/scout-hellojs-app/target/test-classes/projects/basic/project/hellojs/hellojs.api/pom.xml
06:38:40 [INFO] Parent element not overwritten in /jobs/genie.scout/org.eclipse.scout.sdk_deploy_from_tag/workspace/scout-hellojs-app/target/test-classes/projects/basic/project/hellojs/hellojs.app/pom.xml
06:38:40 [INFO] Parent element not overwritten in /jobs/genie.scout/org.eclipse.scout.sdk_deploy_from_tag/workspace/scout-hellojs-app/target/test-classes/projects/basic/project/hellojs/hellojs.app.dev/pom.xml
06:38:40 [INFO] Parent element not overwritten in /jobs/genie.scout/org.eclipse.scout.sdk_deploy_from_tag/workspace/scout-hellojs-app/target/test-classes/projects/basic/project/hellojs/hellojs.app.war/pom.xml
06:38:40 [INFO] Parent element not overwritten in /jobs/genie.scout/org.eclipse.scout.sdk_deploy_from_tag/workspace/scout-hellojs-app/target/test-classes/projects/basic/project/hellojs/hellojs.core/pom.xml
06:38:40 [INFO] Parent element not overwritten in /jobs/genie.scout/org.eclipse.scout.sdk_deploy_from_tag/workspace/scout-hellojs-app/target/test-classes/projects/basic/project/hellojs/hellojs.core.test/pom.xml
06:38:40 [INFO] Parent element not overwritten in /jobs/genie.scout/org.eclipse.scout.sdk_deploy_from_tag/workspace/scout-hellojs-app/target/test-classes/projects/basic/project/hellojs/hellojs.data/pom.xml
06:38:40 [INFO] Parent element not overwritten in /jobs/genie.scout/org.eclipse.scout.sdk_deploy_from_tag/workspace/scout-hellojs-app/target/test-classes/projects/basic/project/hellojs/hellojs.db/pom.xml
06:38:40 [INFO] Parent element not overwritten in /jobs/genie.scout/org.eclipse.scout.sdk_deploy_from_tag/workspace/scout-hellojs-app/target/test-classes/projects/basic/project/hellojs/hellojs.persistence/pom.xml
06:38:40 [INFO] Parent element not overwritten in /jobs/genie.scout/org.eclipse.scout.sdk_deploy_from_tag/workspace/scout-hellojs-app/target/test-classes/projects/basic/project/hellojs/hellojs.persistence.test/pom.xml
06:38:40 [INFO] Parent element not overwritten in /jobs/genie.scout/org.eclipse.scout.sdk_deploy_from_tag/workspace/scout-hellojs-app/target/test-classes/projects/basic/project/hellojs/hellojs.ui/pom.xml
06:38:40 [INFO] Project created from Archetype in dir: /jobs/genie.scout/org.eclipse.scout.sdk_deploy_from_tag/workspace/scout-hellojs-app/target/test-classes/projects/basic/project/hellojs
06:38:40 [INFO] 
06:38:40 [INFO] --- duplicate-finder-maven-plugin:1.3.0:check (default) @ scout-hellojs-app ---
06:38:40 [INFO] Checking compile classpath
06:38:40 [INFO] Checking runtime classpath
06:38:40 [INFO] Checking test classpath
06:38:40 [INFO] 
06:38:40 [INFO] --- animal-sniffer-maven-plugin:1.17:check (enforce-java-api-compatibility) @ scout-hellojs-app ---
06:38:40 [INFO] Checking unresolved references to org.codehaus.mojo.signature:java18:1.0
06:38:40 [INFO] 
06:38:40 [INFO] --- maven-source-plugin:3.0.1:jar-no-fork (attach-sources) @ scout-hellojs-app ---
06:38:40 [INFO] No sources in project. Archive not created.
06:38:40 [INFO] 
06:38:40 [INFO] --- maven-install-plugin:2.5.2:install (default-install) @ scout-hellojs-app ---
06:38:40 [INFO] Installing /jobs/genie.scout/org.eclipse.scout.sdk_deploy_from_tag/workspace/scout-hellojs-app/target/scout-hellojs-app-9.0.0.025_Simrel_2019_09.jar to /home/hudson/genie.scout/.jenkins/jobs/org.eclipse.scout.sdk_deploy_from_tag/workspace/.repository/org/eclipse/scout/archetypes/scout-hellojs-app/9.0.0.025_Simrel_2019_09/scout-hellojs-app-9.0.0.025_Simrel_2019_09.jar
06:38:40 [INFO] Installing /jobs/genie.scout/org.eclipse.scout.sdk_deploy_from_tag/workspace/scout-hellojs-app/.flattened-pom.xml to /home/hudson/genie.scout/.jenkins/jobs/org.eclipse.scout.sdk_deploy_from_tag/workspace/.repository/org/eclipse/scout/archetypes/scout-hellojs-app/9.0.0.025_Simrel_2019_09/scout-hellojs-app-9.0.0.025_Simrel_2019_09.pom
06:38:40 [INFO] Installing /jobs/genie.scout/org.eclipse.scout.sdk_deploy_from_tag/workspace/scout-hellojs-app/target/scout-hellojs-app-9.0.0.025_Simrel_2019_09-tests.jar to /home/hudson/genie.scout/.jenkins/jobs/org.eclipse.scout.sdk_deploy_from_tag/workspace/.repository/org/eclipse/scout/archetypes/scout-hellojs-app/9.0.0.025_Simrel_2019_09/scout-hellojs-app-9.0.0.025_Simrel_2019_09-tests.jar
06:38:40 [INFO] 
06:38:40 [INFO] --- maven-archetype-plugin:3.0.1:update-local-catalog (default-update-local-catalog) @ scout-hellojs-app ---
06:38:40 [INFO] 
06:38:40 [INFO] ------------< org.eclipse.scout.sdk:org.eclipse.scout.sdk >-------------
06:38:40 [INFO] Building Eclipse Scout SDK 9.0.0.025_Simrel_2019_09               [4/14]
06:38:40 [INFO] --------------------------------[ pom ]---------------------------------
06:38:40 [INFO] 
06:38:40 [INFO] --- maven-clean-plugin:3.1.0:clean (default-clean) @ org.eclipse.scout.sdk ---
06:38:40 [INFO] Deleting /jobs/genie.scout/org.eclipse.scout.sdk_deploy_from_tag/workspace/org.eclipse.scout.sdk/target
06:38:40 [INFO] 
06:38:40 [INFO] --- flatten-maven-plugin:1.0.1:clean (flatten.clean) @ org.eclipse.scout.sdk ---
06:38:41 [INFO] Deleting /jobs/genie.scout/org.eclipse.scout.sdk_deploy_from_tag/workspace/org.eclipse.scout.sdk/.flattened-pom.xml
06:38:41 [INFO] 
06:38:41 [INFO] --- maven-enforcer-plugin:1.4.1:enforce (enforce-rules) @ org.eclipse.scout.sdk ---
06:38:41 [INFO] 
06:38:41 [INFO] --- git-commit-id-plugin:2.2.5:revision (default) @ org.eclipse.scout.sdk ---
06:38:41 [INFO] 
06:38:41 [INFO] --- jacoco-maven-plugin:0.8.2:prepare-agent (default) @ org.eclipse.scout.sdk ---
06:38:41 [INFO] master_test_jacocoArgLine set to -javaagent:/home/hudson/genie.scout/.jenkins/jobs/org.eclipse.scout.sdk_deploy_from_tag/workspace/.repository/org/jacoco/org.jacoco.agent/0.8.2/org.jacoco.agent-0.8.2-runtime.jar=destfile=/jobs/genie.scout/org.eclipse.scout.sdk_deploy_from_tag/workspace/org.eclipse.scout.sdk/../org.eclipse.scout.sdk/target/jacoco-all.exec
06:38:41 [INFO] 
06:38:41 [INFO] --- build-helper-maven-plugin:3.0.0:parse-version (initialize-parse-version) @ org.eclipse.scout.sdk ---
06:38:41 [INFO] 
06:38:41 [INFO] --- build-helper-maven-plugin:3.0.0:regex-property (initialize-regex) @ org.eclipse.scout.sdk ---
06:38:41 [INFO] No match to regex 'SNAPSHOT' found in '9.0.0.025_Simrel_2019_09'. The initial value '9.0.0.025_Simrel_2019_09' is left as-is...
06:38:41 [INFO] 
06:38:41 [INFO] --- flatten-maven-plugin:1.0.1:flatten (flatten) @ org.eclipse.scout.sdk ---
06:38:41 [INFO] Generating flattened POM of project org.eclipse.scout.sdk:org.eclipse.scout.sdk:pom:9.0.0.025_Simrel_2019_09...
06:38:41 [INFO] 
06:38:41 [INFO] --- maven-site-plugin:3.7.1:attach-descriptor (attach-descriptor) @ org.eclipse.scout.sdk ---
06:38:41 [INFO] No site descriptor found: nothing to attach.
06:38:41 [INFO] 
06:38:41 [INFO] --- maven-jar-plugin:3.1.1:test-jar (attach-tests) @ org.eclipse.scout.sdk ---
06:38:41 [INFO] Skipping packaging of the test-jar
06:38:41 [INFO] 
06:38:41 [INFO] --- maven-source-plugin:3.0.1:test-jar-no-fork (attach-test-sources) @ org.eclipse.scout.sdk ---
06:38:41 [INFO] 
06:38:41 [INFO] --- duplicate-finder-maven-plugin:1.3.0:check (default) @ org.eclipse.scout.sdk ---
06:38:41 [INFO] Checking compile classpath
06:38:41 [INFO] Checking runtime classpath
06:38:41 [INFO] Checking test classpath
06:38:41 [INFO] 
06:38:41 [INFO] --- animal-sniffer-maven-plugin:1.17:check (enforce-java-api-compatibility) @ org.eclipse.scout.sdk ---
06:38:41 [INFO] Checking unresolved references to org.codehaus.mojo.signature:java18:1.0
06:38:42 [INFO] 
06:38:42 [INFO] --- maven-source-plugin:3.0.1:jar-no-fork (attach-sources) @ org.eclipse.scout.sdk ---
06:38:42 [INFO] 
06:38:42 [INFO] --- maven-install-plugin:2.5.2:install (default-install) @ org.eclipse.scout.sdk ---
06:38:42 [INFO] Installing /jobs/genie.scout/org.eclipse.scout.sdk_deploy_from_tag/workspace/org.eclipse.scout.sdk/.flattened-pom.xml to /home/hudson/genie.scout/.jenkins/jobs/org.eclipse.scout.sdk_deploy_from_tag/workspace/.repository/org/eclipse/scout/sdk/org.eclipse.scout.sdk/9.0.0.025_Simrel_2019_09/org.eclipse.scout.sdk-9.0.0.025_Simrel_2019_09.pom
06:38:42 [INFO] 
06:38:42 [INFO] ----------< org.eclipse.scout.sdk:org.eclipse.scout.sdk.core >----------
06:38:42 [INFO] Building org.eclipse.scout.sdk:org.eclipse.scout.sdk.core 9.0.0.025_Simrel_2019_09 [5/14]
06:38:42 [INFO] --------------------------------[ jar ]---------------------------------
06:38:42 [INFO] 
06:38:42 [INFO] --- maven-clean-plugin:3.1.0:clean (default-clean) @ org.eclipse.scout.sdk.core ---
06:38:42 [INFO] Deleting /jobs/genie.scout/org.eclipse.scout.sdk_deploy_from_tag/workspace/org.eclipse.scout.sdk.core/target
06:38:42 [INFO] 
06:38:42 [INFO] --- maven-enforcer-plugin:1.4.1:enforce (enforce-rules) @ org.eclipse.scout.sdk.core ---
06:38:42 [INFO] 
06:38:42 [INFO] --- git-commit-id-plugin:2.2.5:revision (default) @ org.eclipse.scout.sdk.core ---
06:38:45 [INFO] 
06:38:45 [INFO] --- jacoco-maven-plugin:0.8.2:prepare-agent (default) @ org.eclipse.scout.sdk.core ---
06:38:45 [INFO] master_test_jacocoArgLine set to -javaagent:/home/hudson/genie.scout/.jenkins/jobs/org.eclipse.scout.sdk_deploy_from_tag/workspace/.repository/org/jacoco/org.jacoco.agent/0.8.2/org.jacoco.agent-0.8.2-runtime.jar=destfile=/jobs/genie.scout/org.eclipse.scout.sdk_deploy_from_tag/workspace/org.eclipse.scout.sdk.core/../org.eclipse.scout.sdk/target/jacoco-all.exec
06:38:45 [INFO] 
06:38:45 [INFO] --- build-helper-maven-plugin:3.0.0:parse-version (initialize-parse-version) @ org.eclipse.scout.sdk.core ---
06:38:45 [INFO] 
06:38:45 [INFO] --- build-helper-maven-plugin:3.0.0:regex-property (initialize-regex) @ org.eclipse.scout.sdk.core ---
06:38:45 [INFO] No match to regex 'SNAPSHOT' found in '9.0.0.025_Simrel_2019_09'. The initial value '9.0.0.025_Simrel_2019_09' is left as-is...
06:38:45 [INFO] 
06:38:45 [INFO] --- maven-resources-plugin:3.1.0:resources (default-resources) @ org.eclipse.scout.sdk.core ---
06:38:45 [INFO] Using 'UTF-8' encoding to copy filtered resources.
06:38:45 [INFO] skip non existing resourceDirectory /jobs/genie.scout/org.eclipse.scout.sdk_deploy_from_tag/workspace/org.eclipse.scout.sdk.core/src/main/resources
06:38:45 [INFO] Copying 2 resources
06:38:45 [INFO] 
06:38:45 [INFO] --- maven-compiler-plugin:3.8.0:compile (default-compile) @ org.eclipse.scout.sdk.core ---
06:38:45 [INFO] Changes detected - recompiling the module!
06:38:45 [INFO] Compiling 165 source files to /jobs/genie.scout/org.eclipse.scout.sdk_deploy_from_tag/workspace/org.eclipse.scout.sdk.core/target/classes
06:38:47 [INFO] 
06:38:47 [INFO] --- maven-resources-plugin:3.1.0:testResources (default-testResources) @ org.eclipse.scout.sdk.core ---
06:38:47 [INFO] Using 'UTF-8' encoding to copy filtered resources.
06:38:47 [INFO] skip non existing resourceDirectory /jobs/genie.scout/org.eclipse.scout.sdk_deploy_from_tag/workspace/org.eclipse.scout.sdk.core/src/test/resources
06:38:47 [INFO] 
06:38:47 [INFO] --- maven-compiler-plugin:3.8.0:testCompile (default-testCompile) @ org.eclipse.scout.sdk.core ---
06:38:47 [INFO] No sources to compile
06:38:47 [INFO] 
06:38:47 [INFO] --- maven-surefire-plugin:2.22.1:test (default-test) @ org.eclipse.scout.sdk.core ---
06:38:48 [INFO] No tests to run.
06:38:48 [INFO] 
06:38:48 [INFO] --- maven-jar-plugin:3.1.1:jar (default-jar) @ org.eclipse.scout.sdk.core ---
06:38:48 [INFO] Building jar: /jobs/genie.scout/org.eclipse.scout.sdk_deploy_from_tag/workspace/org.eclipse.scout.sdk.core/target/org.eclipse.scout.sdk.core-9.0.0.025_Simrel_2019_09.jar
06:38:48 [INFO] 
06:38:48 [INFO] --- maven-site-plugin:3.7.1:attach-descriptor (attach-descriptor) @ org.eclipse.scout.sdk.core ---
06:38:48 [INFO] Skipping because packaging 'jar' is not pom.
06:38:48 [INFO] 
06:38:48 [INFO] --- maven-jar-plugin:3.1.1:test-jar (attach-tests) @ org.eclipse.scout.sdk.core ---
06:38:48 [INFO] Skipping packaging of the test-jar
06:38:48 [INFO] 
06:38:48 [INFO] --- maven-source-plugin:3.0.1:test-jar-no-fork (attach-test-sources) @ org.eclipse.scout.sdk.core ---
06:38:48 [INFO] No sources in project. Archive not created.
06:38:48 [INFO] 
06:38:48 [INFO] --- duplicate-finder-maven-plugin:1.3.0:check (default) @ org.eclipse.scout.sdk.core ---
06:38:48 [INFO] Checking compile classpath
06:38:48 [INFO] Checking runtime classpath
06:38:48 [INFO] Checking test classpath
06:38:48 [INFO] 
06:38:48 [INFO] --- animal-sniffer-maven-plugin:1.17:check (enforce-java-api-compatibility) @ org.eclipse.scout.sdk.core ---
06:38:48 [INFO] Checking unresolved references to org.codehaus.mojo.signature:java18:1.0
06:38:49 [INFO] 
06:38:49 [INFO] --- maven-source-plugin:3.0.1:jar-no-fork (attach-sources) @ org.eclipse.scout.sdk.core ---
06:38:49 [INFO] Building jar: /jobs/genie.scout/org.eclipse.scout.sdk_deploy_from_tag/workspace/org.eclipse.scout.sdk.core/target/org.eclipse.scout.sdk.core-9.0.0.025_Simrel_2019_09-sources.jar
06:38:49 [INFO] 
06:38:49 [INFO] --- maven-install-plugin:2.5.2:install (default-install) @ org.eclipse.scout.sdk.core ---
06:38:49 [INFO] Installing /jobs/genie.scout/org.eclipse.scout.sdk_deploy_from_tag/workspace/org.eclipse.scout.sdk.core/target/org.eclipse.scout.sdk.core-9.0.0.025_Simrel_2019_09.jar to /home/hudson/genie.scout/.jenkins/jobs/org.eclipse.scout.sdk_deploy_from_tag/workspace/.repository/org/eclipse/scout/sdk/org.eclipse.scout.sdk.core/9.0.0.025_Simrel_2019_09/org.eclipse.scout.sdk.core-9.0.0.025_Simrel_2019_09.jar
06:38:49 [INFO] Installing /jobs/genie.scout/org.eclipse.scout.sdk_deploy_from_tag/workspace/org.eclipse.scout.sdk.core/pom.xml to /home/hudson/genie.scout/.jenkins/jobs/org.eclipse.scout.sdk_deploy_from_tag/workspace/.repository/org/eclipse/scout/sdk/org.eclipse.scout.sdk.core/9.0.0.025_Simrel_2019_09/org.eclipse.scout.sdk.core-9.0.0.025_Simrel_2019_09.pom
06:38:49 [INFO] Installing /jobs/genie.scout/org.eclipse.scout.sdk_deploy_from_tag/workspace/org.eclipse.scout.sdk.core/target/org.eclipse.scout.sdk.core-9.0.0.025_Simrel_2019_09-sources.jar to /home/hudson/genie.scout/.jenkins/jobs/org.eclipse.scout.sdk_deploy_from_tag/workspace/.repository/org/eclipse/scout/sdk/org.eclipse.scout.sdk.core/9.0.0.025_Simrel_2019_09/org.eclipse.scout.sdk.core-9.0.0.025_Simrel_2019_09-sources.jar
06:38:49 [INFO] 
06:38:49 [INFO] -------< org.eclipse.scout.sdk:org.eclipse.scout.sdk.core.test >--------
06:38:49 [INFO] Building org.eclipse.scout.sdk:org.eclipse.scout.sdk.core.test 9.0.0.025_Simrel_2019_09 [6/14]
06:38:49 [INFO] --------------------------------[ jar ]---------------------------------
06:38:49 [INFO] 
06:38:49 [INFO] --- maven-clean-plugin:3.1.0:clean (default-clean) @ org.eclipse.scout.sdk.core.test ---
06:38:49 [INFO] Deleting /jobs/genie.scout/org.eclipse.scout.sdk_deploy_from_tag/workspace/org.eclipse.scout.sdk.core.test/target
06:38:49 [INFO] 
06:38:49 [INFO] --- maven-enforcer-plugin:1.4.1:enforce (enforce-rules) @ org.eclipse.scout.sdk.core.test ---
06:38:49 [INFO] 
06:38:49 [INFO] --- git-commit-id-plugin:2.2.5:revision (default) @ org.eclipse.scout.sdk.core.test ---
06:38:51 [INFO] 
06:38:51 [INFO] --- jacoco-maven-plugin:0.8.2:prepare-agent (default) @ org.eclipse.scout.sdk.core.test ---
06:38:51 [INFO] master_test_jacocoArgLine set to -javaagent:/home/hudson/genie.scout/.jenkins/jobs/org.eclipse.scout.sdk_deploy_from_tag/workspace/.repository/org/jacoco/org.jacoco.agent/0.8.2/org.jacoco.agent-0.8.2-runtime.jar=destfile=/jobs/genie.scout/org.eclipse.scout.sdk_deploy_from_tag/workspace/org.eclipse.scout.sdk.core.test/../org.eclipse.scout.sdk/target/jacoco-all.exec
06:38:51 [INFO] 
06:38:51 [INFO] --- build-helper-maven-plugin:3.0.0:parse-version (initialize-parse-version) @ org.eclipse.scout.sdk.core.test ---
06:38:51 [INFO] 
06:38:51 [INFO] --- build-helper-maven-plugin:3.0.0:regex-property (initialize-regex) @ org.eclipse.scout.sdk.core.test ---
06:38:51 [INFO] No match to regex 'SNAPSHOT' found in '9.0.0.025_Simrel_2019_09'. The initial value '9.0.0.025_Simrel_2019_09' is left as-is...
06:38:51 [INFO] 
06:38:51 [INFO] --- build-helper-maven-plugin:3.0.0:add-source (add-source) @ org.eclipse.scout.sdk.core.test ---
06:38:51 [INFO] Source directory: /jobs/genie.scout/org.eclipse.scout.sdk_deploy_from_tag/workspace/org.eclipse.scout.sdk.core.test/src/main/fixture added.
06:38:51 [INFO] 
06:38:51 [INFO] --- maven-resources-plugin:3.1.0:resources (default-resources) @ org.eclipse.scout.sdk.core.test ---
06:38:51 [INFO] Using 'UTF-8' encoding to copy filtered resources.
06:38:51 [INFO] Copying 2 resources
06:38:51 [INFO] Copying 2 resources
06:38:51 [INFO] 
06:38:51 [INFO] --- maven-compiler-plugin:3.8.0:compile (default-compile) @ org.eclipse.scout.sdk.core.test ---
06:38:51 [INFO] Changes detected - recompiling the module!
06:38:51 [INFO] Compiling 38 source files to /jobs/genie.scout/org.eclipse.scout.sdk_deploy_from_tag/workspace/org.eclipse.scout.sdk.core.test/target/classes
06:38:51 [INFO] 
06:38:51 [INFO] --- maven-resources-plugin:3.1.0:testResources (default-testResources) @ org.eclipse.scout.sdk.core.test ---
06:38:51 [INFO] Using 'UTF-8' encoding to copy filtered resources.
06:38:51 [INFO] skip non existing resourceDirectory /jobs/genie.scout/org.eclipse.scout.sdk_deploy_from_tag/workspace/org.eclipse.scout.sdk.core.test/src/test/resources
06:38:51 [INFO] 
06:38:51 [INFO] --- maven-compiler-plugin:3.8.0:testCompile (default-testCompile) @ org.eclipse.scout.sdk.core.test ---
06:38:51 [INFO] Changes detected - recompiling the module!
06:38:51 [INFO] Compiling 29 source files to /jobs/genie.scout/org.eclipse.scout.sdk_deploy_from_tag/workspace/org.eclipse.scout.sdk.core.test/target/test-classes
06:38:52 [INFO] 
06:38:52 [INFO] --- maven-surefire-plugin:2.22.1:test (default-test) @ org.eclipse.scout.sdk.core.test ---
06:38:52 [INFO] 
06:38:52 [INFO] -------------------------------------------------------
06:38:52 [INFO]  T E S T S
06:38:52 [INFO] -------------------------------------------------------
06:38:53 [INFO] Running org.eclipse.scout.sdk.core.importvalidator.ImportValidatorTest
06:38:54 [INFO] Tests run: 15, Failures: 0, Errors: 0, Skipped: 0, Time elapsed: 1.481 s - in org.eclipse.scout.sdk.core.importvalidator.ImportValidatorTest
06:38:54 [INFO] Running org.eclipse.scout.sdk.core.model.AnnotationElementTest
06:38:54 [INFO] Tests run: 3, Failures: 0, Errors: 0, Skipped: 0, Time elapsed: 0.327 s - in org.eclipse.scout.sdk.core.model.AnnotationElementTest
06:38:54 [INFO] Running org.eclipse.scout.sdk.core.model.AnnotationQueryTest
06:38:55 [INFO] Tests run: 4, Failures: 0, Errors: 0, Skipped: 0, Time elapsed: 0.53 s - in org.eclipse.scout.sdk.core.model.AnnotationQueryTest
06:38:55 [INFO] Running org.eclipse.scout.sdk.core.model.AnnotationSourceTest
06:38:56 [INFO] Tests run: 6, Failures: 0, Errors: 0, Skipped: 0, Time elapsed: 0.643 s - in org.eclipse.scout.sdk.core.model.AnnotationSourceTest
06:38:56 [INFO] Running org.eclipse.scout.sdk.core.model.AnnotationTest
06:38:56 [INFO] Tests run: 5, Failures: 0, Errors: 0, Skipped: 0, Time elapsed: 0.179 s - in org.eclipse.scout.sdk.core.model.AnnotationTest
06:38:56 [INFO] Running org.eclipse.scout.sdk.core.model.ArrayTypeTest
06:38:56 [INFO] Tests run: 1, Failures: 0, Errors: 0, Skipped: 0, Time elapsed: 0.112 s - in org.eclipse.scout.sdk.core.model.ArrayTypeTest
06:38:56 [INFO] Running org.eclipse.scout.sdk.core.model.CompilationUnitTest
06:38:56 [INFO] Tests run: 3, Failures: 0, Errors: 0, Skipped: 0, Time elapsed: 0 s - in org.eclipse.scout.sdk.core.model.CompilationUnitTest
06:38:56 [INFO] Running org.eclipse.scout.sdk.core.model.CreateAndOverrideNewCompilationUnitTest
06:38:56 [INFO] Tests run: 4, Failures: 0, Errors: 0, Skipped: 0, Time elapsed: 0.421 s - in org.eclipse.scout.sdk.core.model.CreateAndOverrideNewCompilationUnitTest
06:38:56 [INFO] Running org.eclipse.scout.sdk.core.model.FieldTest
06:38:56 [INFO] Tests run: 8, Failures: 0, Errors: 0, Skipped: 0, Time elapsed: 0.092 s - in org.eclipse.scout.sdk.core.model.FieldTest
06:38:56 [INFO] Running org.eclipse.scout.sdk.core.model.GenericMethodTest
06:38:57 [INFO] Tests run: 7, Failures: 0, Errors: 0, Skipped: 0, Time elapsed: 0.387 s - in org.eclipse.scout.sdk.core.model.GenericMethodTest
06:38:57 [INFO] Running org.eclipse.scout.sdk.core.model.ImportDeclarationTest
06:38:57 [INFO] Tests run: 2, Failures: 0, Errors: 0, Skipped: 0, Time elapsed: 0 s - in org.eclipse.scout.sdk.core.model.ImportDeclarationTest
06:38:57 [INFO] Running org.eclipse.scout.sdk.core.model.ManagedAnnotationTest
06:38:58 [INFO] Tests run: 9, Failures: 0, Errors: 0, Skipped: 0, Time elapsed: 0.719 s - in org.eclipse.scout.sdk.core.model.ManagedAnnotationTest
06:38:58 [INFO] Running org.eclipse.scout.sdk.core.model.MethodParameterTest
06:38:58 [INFO] Tests run: 3, Failures: 0, Errors: 0, Skipped: 0, Time elapsed: 0 s - in org.eclipse.scout.sdk.core.model.MethodParameterTest
06:38:58 [INFO] Running org.eclipse.scout.sdk.core.model.MethodTest
06:38:58 [INFO] Tests run: 3, Failures: 0, Errors: 0, Skipped: 0, Time elapsed: 0.022 s - in org.eclipse.scout.sdk.core.model.MethodTest
06:38:58 [INFO] Running org.eclipse.scout.sdk.core.model.PackageTest
06:38:58 [INFO] Tests run: 4, Failures: 0, Errors: 0, Skipped: 0, Time elapsed: 0.002 s - in org.eclipse.scout.sdk.core.model.PackageTest
06:38:58 [INFO] Running org.eclipse.scout.sdk.core.model.PrimitiveTypeTest
06:38:58 [INFO] Tests run: 1, Failures: 0, Errors: 0, Skipped: 0, Time elapsed: 0.066 s - in org.eclipse.scout.sdk.core.model.PrimitiveTypeTest
06:38:58 [INFO] Running org.eclipse.scout.sdk.core.model.SourceRangeTest
06:38:58 [INFO] Tests run: 1, Failures: 0, Errors: 0, Skipped: 0, Time elapsed: 0.001 s - in org.eclipse.scout.sdk.core.model.SourceRangeTest
06:38:58 [INFO] Running org.eclipse.scout.sdk.core.model.TypeParameterTest
06:38:58 [INFO] Tests run: 3, Failures: 0, Errors: 0, Skipped: 0, Time elapsed: 0.001 s - in org.eclipse.scout.sdk.core.model.TypeParameterTest
06:38:58 [INFO] Running org.eclipse.scout.sdk.core.model.TypeTest
06:38:58 [INFO] Tests run: 6, Failures: 0, Errors: 0, Skipped: 0, Time elapsed: 0.235 s - in org.eclipse.scout.sdk.core.model.TypeTest
06:38:58 [INFO] Running org.eclipse.scout.sdk.core.model.spi.internal.ClasspathBuilderTest
06:38:58 [INFO] Tests run: 2, Failures: 0, Errors: 0, Skipped: 0, Time elapsed: 0.001 s - in org.eclipse.scout.sdk.core.model.spi.internal.ClasspathBuilderTest
06:38:58 [INFO] Running org.eclipse.scout.sdk.core.model.spi.internal.CompositeObjectTest
06:38:58 [INFO] Tests run: 2, Failures: 0, Errors: 0, Skipped: 0, Time elapsed: 0.001 s - in org.eclipse.scout.sdk.core.model.spi.internal.CompositeObjectTest
06:38:58 [INFO] Running org.eclipse.scout.sdk.core.model.spi.internal.metavalue.MetaValueFactoryTest
06:38:58 [INFO] Tests run: 17, Failures: 0, Errors: 0, Skipped: 0, Time elapsed: 0.088 s - in org.eclipse.scout.sdk.core.model.spi.internal.metavalue.MetaValueFactoryTest
06:38:58 [INFO] Running org.eclipse.scout.sdk.core.model.sugar.QueryTest
06:38:58 [INFO] Tests run: 7, Failures: 0, Errors: 0, Skipped: 0, Time elapsed: 0.358 s - in org.eclipse.scout.sdk.core.model.sugar.QueryTest
06:38:58 [INFO] Running org.eclipse.scout.sdk.core.signature.SignatureTest
06:38:59 [INFO] Tests run: 189, Failures: 0, Errors: 0, Skipped: 0, Time elapsed: 0.059 s - in org.eclipse.scout.sdk.core.signature.SignatureTest
06:38:59 [INFO] Running org.eclipse.scout.sdk.core.signature.SignatureUtilsTest
06:38:59 [INFO] Tests run: 12, Failures: 0, Errors: 0, Skipped: 0, Time elapsed: 0 s - in org.eclipse.scout.sdk.core.signature.SignatureUtilsTest
06:38:59 [INFO] Running org.eclipse.scout.sdk.core.sourcebuilder.SourceModelRoundtripTest
06:38:59 [INFO] Tests run: 2, Failures: 0, Errors: 0, Skipped: 0, Time elapsed: 0.141 s - in org.eclipse.scout.sdk.core.sourcebuilder.SourceModelRoundtripTest
06:38:59 [INFO] Running org.eclipse.scout.sdk.core.util.CoreUtilsTest
06:38:59 [INFO] Tests run: 39, Failures: 0, Errors: 0, Skipped: 0, Time elapsed: 0.388 s - in org.eclipse.scout.sdk.core.util.CoreUtilsTest
06:38:59 [INFO] Running org.eclipse.scout.sdk.core.util.JavaEnvironmentImportExportTest
06:38:59 [INFO] Tests run: 1, Failures: 0, Errors: 0, Skipped: 0, Time elapsed: 0.009 s - in org.eclipse.scout.sdk.core.util.JavaEnvironmentImportExportTest
06:38:59 [INFO] Running org.eclipse.scout.sdk.core.util.SdkLogTest
06:38:59 Unable to parse log level 'aa'. Fallback to default: 'WARNING'.
06:38:59 java.lang.IllegalArgumentException: Bad level "aa"
06:38:59 	at java.util.logging.Level.parse(Level.java:488)
06:38:59 	at org.eclipse.scout.sdk.core.util.SdkLog.parseLevel(SdkLog.java:424)
06:38:59 	at org.eclipse.scout.sdk.core.util.SdkLogTest.testParseLevel(SdkLogTest.java:96)
06:38:59 	at sun.reflect.NativeMethodAccessorImpl.invoke0(Native Method)
06:38:59 	at sun.reflect.NativeMethodAccessorImpl.invoke(NativeMethodAccessorImpl.java:62)
06:38:59 	at sun.reflect.DelegatingMethodAccessorImpl.invoke(DelegatingMethodAccessorImpl.java:43)
06:38:59 	at java.lang.reflect.Method.invoke(Method.java:498)
06:38:59 	at org.junit.runners.model.FrameworkMethod$1.runReflectiveCall(FrameworkMethod.java:50)
06:38:59 	at org.junit.internal.runners.model.ReflectiveCallable.run(ReflectiveCallable.java:12)
06:38:59 	at org.junit.runners.model.FrameworkMethod.invokeExplosively(FrameworkMethod.java:47)
06:38:59 	at org.junit.internal.runners.statements.InvokeMethod.evaluate(InvokeMethod.java:17)
06:38:59 	at org.junit.runners.ParentRunner.runLeaf(ParentRunner.java:325)
06:38:59 	at org.junit.runners.BlockJUnit4ClassRunner.runChild(BlockJUnit4ClassRunner.java:78)
06:38:59 	at org.junit.runners.BlockJUnit4ClassRunner.runChild(BlockJUnit4ClassRunner.java:57)
06:38:59 	at org.junit.runners.ParentRunner$3.run(ParentRunner.java:290)
06:38:59 	at org.junit.runners.ParentRunner$1.schedule(ParentRunner.java:71)
06:38:59 	at org.junit.runners.ParentRunner.runChildren(ParentRunner.java:288)
06:38:59 	at org.junit.runners.ParentRunner.access$000(ParentRunner.java:58)
06:38:59 	at org.junit.runners.ParentRunner$2.evaluate(ParentRunner.java:268)
06:38:59 	at org.junit.runners.ParentRunner.run(ParentRunner.java:363)
06:38:59 	at org.apache.maven.surefire.junit4.JUnit4Provider.execute(JUnit4Provider.java:365)
06:38:59 	at org.apache.maven.surefire.junit4.JUnit4Provider.executeWithRerun(JUnit4Provider.java:273)
06:38:59 	at org.apache.maven.surefire.junit4.JUnit4Provider.executeTestSet(JUnit4Provider.java:238)
06:38:59 	at org.apache.maven.surefire.junit4.JUnit4Provider.invoke(JUnit4Provider.java:159)
06:38:59 	at org.apache.maven.surefire.booter.ForkedBooter.invokeProviderInSameClassLoader(ForkedBooter.java:384)
06:38:59 	at org.apache.maven.surefire.booter.ForkedBooter.runSuitesInProcess(ForkedBooter.java:345)
06:38:59 	at org.apache.maven.surefire.booter.ForkedBooter.execute(ForkedBooter.java:126)
06:38:59 	at org.apache.maven.surefire.booter.ForkedBooter.main(ForkedBooter.java:418)
06:38:59 Scout SdkLog: Failed toString() invocation on an object of type [org.eclipse.scout.sdk.core.util.SdkLogTest$ClassWithToStringThrowingNpeFixture]
06:38:59 java.lang.NullPointerException: NPE of test class org.eclipse.scout.sdk.core.util.SdkLogTest
06:38:59 	at org.eclipse.scout.sdk.core.util.SdkLogTest$ClassWithToStringThrowingNpeFixture.toString(SdkLogTest.java:156)
06:38:59 	at org.eclipse.scout.sdk.core.util.SdkLog.safeObjectToString(SdkLog.java:223)
06:38:59 	at org.eclipse.scout.sdk.core.util.SdkLog.toString(SdkLog.java:159)
06:38:59 	at org.eclipse.scout.sdk.core.util.SdkLog.handlePlaceholders(SdkLog.java:149)
06:38:59 	at org.eclipse.scout.sdk.core.util.SdkLog.log(SdkLog.java:93)
06:38:59 	at org.eclipse.scout.sdk.core.util.SdkLog.error(SdkLog.java:317)
06:38:59 	at org.eclipse.scout.sdk.core.util.SdkLogTest$1.run(SdkLogTest.java:104)
06:38:59 	at org.eclipse.scout.sdk.core.util.SdkLogTest.runWithPrivateLogger(SdkLogTest.java:193)
06:38:59 	at org.eclipse.scout.sdk.core.util.SdkLogTest.testLogOfObjectWithToStringThrowingException(SdkLogTest.java:101)
06:38:59 	at sun.reflect.NativeMethodAccessorImpl.invoke0(Native Method)
06:38:59 	at sun.reflect.NativeMethodAccessorImpl.invoke(NativeMethodAccessorImpl.java:62)
06:38:59 	at sun.reflect.DelegatingMethodAccessorImpl.invoke(DelegatingMethodAccessorImpl.java:43)
06:38:59 	at java.lang.reflect.Method.invoke(Method.java:498)
06:38:59 	at org.junit.runners.model.FrameworkMethod$1.runReflectiveCall(FrameworkMethod.java:50)
06:38:59 	at org.junit.internal.runners.model.ReflectiveCallable.run(ReflectiveCallable.java:12)
06:38:59 	at org.junit.runners.model.FrameworkMethod.invokeExplosively(FrameworkMethod.java:47)
06:38:59 	at org.junit.internal.runners.statements.InvokeMethod.evaluate(InvokeMethod.java:17)
06:38:59 	at org.junit.runners.ParentRunner.runLeaf(ParentRunner.java:325)
06:38:59 	at org.junit.runners.BlockJUnit4ClassRunner.runChild(BlockJUnit4ClassRunner.java:78)
06:38:59 	at org.junit.runners.BlockJUnit4ClassRunner.runChild(BlockJUnit4ClassRunner.java:57)
06:38:59 	at org.junit.runners.ParentRunner$3.run(ParentRunner.java:290)
06:38:59 	at org.junit.runners.ParentRunner$1.schedule(ParentRunner.java:71)
06:38:59 	at org.junit.runners.ParentRunner.runChildren(ParentRunner.java:288)
06:38:59 	at org.junit.runners.ParentRunner.access$000(ParentRunner.java:58)
06:38:59 	at org.junit.runners.ParentRunner$2.evaluate(ParentRunner.java:268)
06:38:59 	at org.junit.runners.ParentRunner.run(ParentRunner.java:363)
06:38:59 	at org.apache.maven.surefire.junit4.JUnit4Provider.execute(JUnit4Provider.java:365)
06:38:59 	at org.apache.maven.surefire.junit4.JUnit4Provider.executeWithRerun(JUnit4Provider.java:273)
06:38:59 	at org.apache.maven.surefire.junit4.JUnit4Provider.executeTestSet(JUnit4Provider.java:238)
06:38:59 	at org.apache.maven.surefire.junit4.JUnit4Provider.invoke(JUnit4Provider.java:159)
06:38:59 	at org.apache.maven.surefire.booter.ForkedBooter.invokeProviderInSameClassLoader(ForkedBooter.java:384)
06:38:59 	at org.apache.maven.surefire.booter.ForkedBooter.runSuitesInProcess(ForkedBooter.java:345)
06:38:59 	at org.apache.maven.surefire.booter.ForkedBooter.execute(ForkedBooter.java:126)
06:38:59 	at org.apache.maven.surefire.booter.ForkedBooter.main(ForkedBooter.java:418)
06:38:59 [INFO] Tests run: 5, Failures: 0, Errors: 0, Skipped: 0, Time elapsed: 0.013 s - in org.eclipse.scout.sdk.core.util.SdkLogTest
06:39:00 [INFO] 
06:39:00 [INFO] Results:
06:39:00 [INFO] 
06:39:00 [INFO] Tests run: 364, Failures: 0, Errors: 0, Skipped: 0
06:39:00 [INFO] 
06:39:00 [INFO] 
06:39:00 [INFO] --- maven-jar-plugin:3.1.1:jar (default-jar) @ org.eclipse.scout.sdk.core.test ---
06:39:00 [INFO] Building jar: /jobs/genie.scout/org.eclipse.scout.sdk_deploy_from_tag/workspace/org.eclipse.scout.sdk.core.test/target/org.eclipse.scout.sdk.core.test-9.0.0.025_Simrel_2019_09.jar
06:39:00 [INFO] 
06:39:00 [INFO] --- maven-site-plugin:3.7.1:attach-descriptor (attach-descriptor) @ org.eclipse.scout.sdk.core.test ---
06:39:00 [INFO] Skipping because packaging 'jar' is not pom.
06:39:00 [INFO] 
06:39:00 [INFO] --- maven-jar-plugin:3.1.1:test-jar (attach-tests) @ org.eclipse.scout.sdk.core.test ---
06:39:00 [INFO] Building jar: /jobs/genie.scout/org.eclipse.scout.sdk_deploy_from_tag/workspace/org.eclipse.scout.sdk.core.test/target/org.eclipse.scout.sdk.core.test-9.0.0.025_Simrel_2019_09-tests.jar
06:39:00 [INFO] 
06:39:00 [INFO] --- maven-source-plugin:3.0.1:test-jar-no-fork (attach-test-sources) @ org.eclipse.scout.sdk.core.test ---
06:39:00 [INFO] Building jar: /jobs/genie.scout/org.eclipse.scout.sdk_deploy_from_tag/workspace/org.eclipse.scout.sdk.core.test/target/org.eclipse.scout.sdk.core.test-9.0.0.025_Simrel_2019_09-test-sources.jar
06:39:00 [INFO] 
06:39:00 [INFO] --- duplicate-finder-maven-plugin:1.3.0:check (default) @ org.eclipse.scout.sdk.core.test ---
06:39:00 [INFO] Checking compile classpath
06:39:00 [INFO] Checking runtime classpath
06:39:00 [INFO] Checking test classpath
06:39:00 [INFO] 
06:39:00 [INFO] --- animal-sniffer-maven-plugin:1.17:check (enforce-java-api-compatibility) @ org.eclipse.scout.sdk.core.test ---
06:39:00 [INFO] Checking unresolved references to org.codehaus.mojo.signature:java18:1.0
06:39:00 [INFO] 
06:39:00 [INFO] --- maven-source-plugin:3.0.1:jar-no-fork (attach-sources) @ org.eclipse.scout.sdk.core.test ---
06:39:00 [INFO] Building jar: /jobs/genie.scout/org.eclipse.scout.sdk_deploy_from_tag/workspace/org.eclipse.scout.sdk.core.test/target/org.eclipse.scout.sdk.core.test-9.0.0.025_Simrel_2019_09-sources.jar
06:39:00 [INFO] 
06:39:00 [INFO] --- maven-install-plugin:2.5.2:install (default-install) @ org.eclipse.scout.sdk.core.test ---
06:39:00 [INFO] Installing /jobs/genie.scout/org.eclipse.scout.sdk_deploy_from_tag/workspace/org.eclipse.scout.sdk.core.test/target/org.eclipse.scout.sdk.core.test-9.0.0.025_Simrel_2019_09.jar to /home/hudson/genie.scout/.jenkins/jobs/org.eclipse.scout.sdk_deploy_from_tag/workspace/.repository/org/eclipse/scout/sdk/org.eclipse.scout.sdk.core.test/9.0.0.025_Simrel_2019_09/org.eclipse.scout.sdk.core.test-9.0.0.025_Simrel_2019_09.jar
06:39:00 [INFO] Installing /jobs/genie.scout/org.eclipse.scout.sdk_deploy_from_tag/workspace/org.eclipse.scout.sdk.core.test/pom.xml to /home/hudson/genie.scout/.jenkins/jobs/org.eclipse.scout.sdk_deploy_from_tag/workspace/.repository/org/eclipse/scout/sdk/org.eclipse.scout.sdk.core.test/9.0.0.025_Simrel_2019_09/org.eclipse.scout.sdk.core.test-9.0.0.025_Simrel_2019_09.pom
06:39:00 [INFO] Installing /jobs/genie.scout/org.eclipse.scout.sdk_deploy_from_tag/workspace/org.eclipse.scout.sdk.core.test/target/org.eclipse.scout.sdk.core.test-9.0.0.025_Simrel_2019_09-tests.jar to /home/hudson/genie.scout/.jenkins/jobs/org.eclipse.scout.sdk_deploy_from_tag/workspace/.repository/org/eclipse/scout/sdk/org.eclipse.scout.sdk.core.test/9.0.0.025_Simrel_2019_09/org.eclipse.scout.sdk.core.test-9.0.0.025_Simrel_2019_09-tests.jar
06:39:00 [INFO] Installing /jobs/genie.scout/org.eclipse.scout.sdk_deploy_from_tag/workspace/org.eclipse.scout.sdk.core.test/target/org.eclipse.scout.sdk.core.test-9.0.0.025_Simrel_2019_09-test-sources.jar to /home/hudson/genie.scout/.jenkins/jobs/org.eclipse.scout.sdk_deploy_from_tag/workspace/.repository/org/eclipse/scout/sdk/org.eclipse.scout.sdk.core.test/9.0.0.025_Simrel_2019_09/org.eclipse.scout.sdk.core.test-9.0.0.025_Simrel_2019_09-test-sources.jar
06:39:00 [INFO] Installing /jobs/genie.scout/org.eclipse.scout.sdk_deploy_from_tag/workspace/org.eclipse.scout.sdk.core.test/target/org.eclipse.scout.sdk.core.test-9.0.0.025_Simrel_2019_09-sources.jar to /home/hudson/genie.scout/.jenkins/jobs/org.eclipse.scout.sdk_deploy_from_tag/workspace/.repository/org/eclipse/scout/sdk/org.eclipse.scout.sdk.core.test/9.0.0.025_Simrel_2019_09/org.eclipse.scout.sdk.core.test-9.0.0.025_Simrel_2019_09-sources.jar
06:39:00 [INFO] 
06:39:00 [INFO] ---------< org.eclipse.scout.sdk:org.eclipse.scout.sdk.core.s >---------
06:39:00 [INFO] Building org.eclipse.scout.sdk:org.eclipse.scout.sdk.core.s 9.0.0.025_Simrel_2019_09 [7/14]
06:39:00 [INFO] --------------------------------[ jar ]---------------------------------
06:39:01 [INFO] 
06:39:01 [INFO] --- maven-clean-plugin:3.1.0:clean (default-clean) @ org.eclipse.scout.sdk.core.s ---
06:39:01 [INFO] Deleting /jobs/genie.scout/org.eclipse.scout.sdk_deploy_from_tag/workspace/org.eclipse.scout.sdk.core.s/target
06:39:01 [INFO] 
06:39:01 [INFO] --- maven-enforcer-plugin:1.4.1:enforce (enforce-rules) @ org.eclipse.scout.sdk.core.s ---
06:39:01 [INFO] 
06:39:01 [INFO] --- git-commit-id-plugin:2.2.5:revision (default) @ org.eclipse.scout.sdk.core.s ---
06:39:03 [INFO] 
06:39:03 [INFO] --- jacoco-maven-plugin:0.8.2:prepare-agent (default) @ org.eclipse.scout.sdk.core.s ---
06:39:03 [INFO] master_test_jacocoArgLine set to -javaagent:/home/hudson/genie.scout/.jenkins/jobs/org.eclipse.scout.sdk_deploy_from_tag/workspace/.repository/org/jacoco/org.jacoco.agent/0.8.2/org.jacoco.agent-0.8.2-runtime.jar=destfile=/jobs/genie.scout/org.eclipse.scout.sdk_deploy_from_tag/workspace/org.eclipse.scout.sdk.core.s/../org.eclipse.scout.sdk/target/jacoco-all.exec
06:39:03 [INFO] 
06:39:03 [INFO] --- build-helper-maven-plugin:3.0.0:parse-version (initialize-parse-version) @ org.eclipse.scout.sdk.core.s ---
06:39:03 [INFO] 
06:39:03 [INFO] --- build-helper-maven-plugin:3.0.0:regex-property (initialize-regex) @ org.eclipse.scout.sdk.core.s ---
06:39:03 [INFO] No match to regex 'SNAPSHOT' found in '9.0.0.025_Simrel_2019_09'. The initial value '9.0.0.025_Simrel_2019_09' is left as-is...
06:39:03 [INFO] 
06:39:03 [INFO] --- maven-resources-plugin:3.1.0:resources (default-resources) @ org.eclipse.scout.sdk.core.s ---
06:39:03 [INFO] Using 'UTF-8' encoding to copy filtered resources.
06:39:03 [INFO] skip non existing resourceDirectory /jobs/genie.scout/org.eclipse.scout.sdk_deploy_from_tag/workspace/org.eclipse.scout.sdk.core.s/src/main/resources
06:39:03 [INFO] Copying 2 resources
06:39:03 [INFO] 
06:39:03 [INFO] --- maven-compiler-plugin:3.8.0:compile (default-compile) @ org.eclipse.scout.sdk.core.s ---
06:39:03 [INFO] Changes detected - recompiling the module!
06:39:03 [INFO] Compiling 50 source files to /jobs/genie.scout/org.eclipse.scout.sdk_deploy_from_tag/workspace/org.eclipse.scout.sdk.core.s/target/classes
06:39:03 [INFO] 
06:39:03 [INFO] --- maven-resources-plugin:3.1.0:testResources (default-testResources) @ org.eclipse.scout.sdk.core.s ---
06:39:03 [INFO] Using 'UTF-8' encoding to copy filtered resources.
06:39:03 [INFO] skip non existing resourceDirectory /jobs/genie.scout/org.eclipse.scout.sdk_deploy_from_tag/workspace/org.eclipse.scout.sdk.core.s/src/test/resources
06:39:03 [INFO] 
06:39:03 [INFO] --- maven-compiler-plugin:3.8.0:testCompile (default-testCompile) @ org.eclipse.scout.sdk.core.s ---
06:39:03 [INFO] No sources to compile
06:39:03 [INFO] 
06:39:03 [INFO] --- maven-surefire-plugin:2.22.1:test (default-test) @ org.eclipse.scout.sdk.core.s ---
06:39:03 [INFO] No tests to run.
06:39:03 [INFO] 
06:39:03 [INFO] --- maven-jar-plugin:3.1.1:jar (default-jar) @ org.eclipse.scout.sdk.core.s ---
06:39:03 [INFO] Building jar: /jobs/genie.scout/org.eclipse.scout.sdk_deploy_from_tag/workspace/org.eclipse.scout.sdk.core.s/target/org.eclipse.scout.sdk.core.s-9.0.0.025_Simrel_2019_09.jar
06:39:03 [INFO] 
06:39:03 [INFO] --- maven-site-plugin:3.7.1:attach-descriptor (attach-descriptor) @ org.eclipse.scout.sdk.core.s ---
06:39:03 [INFO] Skipping because packaging 'jar' is not pom.
06:39:03 [INFO] 
06:39:03 [INFO] --- maven-jar-plugin:3.1.1:test-jar (attach-tests) @ org.eclipse.scout.sdk.core.s ---
06:39:03 [INFO] Skipping packaging of the test-jar
06:39:03 [INFO] 
06:39:03 [INFO] --- maven-source-plugin:3.0.1:test-jar-no-fork (attach-test-sources) @ org.eclipse.scout.sdk.core.s ---
06:39:03 [INFO] No sources in project. Archive not created.
06:39:03 [INFO] 
06:39:03 [INFO] --- duplicate-finder-maven-plugin:1.3.0:check (default) @ org.eclipse.scout.sdk.core.s ---
06:39:03 [INFO] Checking compile classpath
06:39:04 [INFO] Checking runtime classpath
06:39:04 [INFO] Checking test classpath
06:39:04 [INFO] 
06:39:04 [INFO] --- animal-sniffer-maven-plugin:1.17:check (enforce-java-api-compatibility) @ org.eclipse.scout.sdk.core.s ---
06:39:04 [INFO] Checking unresolved references to org.codehaus.mojo.signature:java18:1.0
06:39:05 [INFO] 
06:39:05 [INFO] --- maven-source-plugin:3.0.1:jar-no-fork (attach-sources) @ org.eclipse.scout.sdk.core.s ---
06:39:05 [INFO] Building jar: /jobs/genie.scout/org.eclipse.scout.sdk_deploy_from_tag/workspace/org.eclipse.scout.sdk.core.s/target/org.eclipse.scout.sdk.core.s-9.0.0.025_Simrel_2019_09-sources.jar
06:39:05 [INFO] 
06:39:05 [INFO] --- maven-install-plugin:2.5.2:install (default-install) @ org.eclipse.scout.sdk.core.s ---
06:39:05 [INFO] Installing /jobs/genie.scout/org.eclipse.scout.sdk_deploy_from_tag/workspace/org.eclipse.scout.sdk.core.s/target/org.eclipse.scout.sdk.core.s-9.0.0.025_Simrel_2019_09.jar to /home/hudson/genie.scout/.jenkins/jobs/org.eclipse.scout.sdk_deploy_from_tag/workspace/.repository/org/eclipse/scout/sdk/org.eclipse.scout.sdk.core.s/9.0.0.025_Simrel_2019_09/org.eclipse.scout.sdk.core.s-9.0.0.025_Simrel_2019_09.jar
06:39:05 [INFO] Installing /jobs/genie.scout/org.eclipse.scout.sdk_deploy_from_tag/workspace/org.eclipse.scout.sdk.core.s/pom.xml to /home/hudson/genie.scout/.jenkins/jobs/org.eclipse.scout.sdk_deploy_from_tag/workspace/.repository/org/eclipse/scout/sdk/org.eclipse.scout.sdk.core.s/9.0.0.025_Simrel_2019_09/org.eclipse.scout.sdk.core.s-9.0.0.025_Simrel_2019_09.pom
06:39:05 [INFO] Installing /jobs/genie.scout/org.eclipse.scout.sdk_deploy_from_tag/workspace/org.eclipse.scout.sdk.core.s/target/org.eclipse.scout.sdk.core.s-9.0.0.025_Simrel_2019_09-sources.jar to /home/hudson/genie.scout/.jenkins/jobs/org.eclipse.scout.sdk_deploy_from_tag/workspace/.repository/org/eclipse/scout/sdk/org.eclipse.scout.sdk.core.s/9.0.0.025_Simrel_2019_09/org.eclipse.scout.sdk.core.s-9.0.0.025_Simrel_2019_09-sources.jar
06:39:05 [INFO] 
06:39:05 [INFO] ------< org.eclipse.scout.sdk:org.eclipse.scout.sdk.core.s.test >-------
06:39:05 [INFO] Building org.eclipse.scout.sdk:org.eclipse.scout.sdk.core.s.test 9.0.0.025_Simrel_2019_09 [8/14]
06:39:05 [INFO] --------------------------------[ jar ]---------------------------------
06:39:05 [WARNING] The POM for org.eclipse.scout.rt:org.eclipse.scout.rt.ui.html.test:jar:9.0.0.025_Simrel_2019_09 is missing, no dependency information available
06:39:05 [WARNING] The POM for org.eclipse.scout.rt:org.eclipse.scout.rt.server.test:jar:9.0.0.025_Simrel_2019_09 is missing, no dependency information available
06:39:05 [WARNING] The POM for org.eclipse.scout.rt:org.eclipse.scout.rt.shared:jar:9.0.0.025_Simrel_2019_09 is missing, no dependency information available
06:39:05 [INFO] ------------------------------------------------------------------------
06:39:05 [INFO] Reactor Summary for Eclipse Scout SDK 9.0.0.025_Simrel_2019_09:
06:39:05 [INFO] 
06:39:05 [INFO] Scout Hello World Sample Application ............... SUCCESS [  6.634 s]
06:39:05 [INFO] Scout JaxWs Module ................................. SUCCESS [  2.849 s]
06:39:05 [INFO] ScoutJS Sample Application ......................... SUCCESS [  2.891 s]
06:39:05 [INFO] Eclipse Scout SDK .................................. SUCCESS [  1.669 s]
06:39:05 [INFO] org.eclipse.scout.sdk:org.eclipse.scout.sdk.core ... SUCCESS [  6.776 s]
06:39:05 [INFO] org.eclipse.scout.sdk:org.eclipse.scout.sdk.core.test SUCCESS [ 11.598 s]
06:39:05 [INFO] org.eclipse.scout.sdk:org.eclipse.scout.sdk.core.s . SUCCESS [  4.189 s]
06:39:05 [INFO] org.eclipse.scout.sdk:org.eclipse.scout.sdk.core.s.test FAILURE [  0.061 s]
06:39:05 [INFO] org.eclipse.scout.sdk.s2e:org.eclipse.scout.sdk.s2e  SKIPPED
06:39:05 [INFO] org.eclipse.scout.sdk.s2e:org.eclipse.scout.sdk.s2e.test SKIPPED
06:39:05 [INFO] org.eclipse.scout.sdk.s2e:org.eclipse.scout.sdk.s2e.doc SKIPPED
06:39:05 [INFO] org.eclipse.scout.sdk.s2e:org.eclipse.scout.sdk.s2e.nls SKIPPED
06:39:05 [INFO] org.eclipse.scout.sdk.s2e:org.eclipse.scout.sdk.s2e.ui SKIPPED
06:39:05 [INFO] org.eclipse.scout.sdk-settings ..................... SKIPPED
06:39:05 [INFO] ------------------------------------------------------------------------
06:39:05 [INFO] BUILD FAILURE
06:39:05 [INFO] ------------------------------------------------------------------------
06:39:05 [INFO] Total time:  38.341 s
06:39:05 [INFO] Finished at: 2019-09-10T06:39:05-04:00
06:39:05 [INFO] ------------------------------------------------------------------------
06:39:05 [ERROR] Failed to execute goal on project org.eclipse.scout.sdk.core.s.test: Could not resolve dependencies for project org.eclipse.scout.sdk:org.eclipse.scout.sdk.core.s.test:jar:9.0.0.025_Simrel_2019_09: The following artifacts could not be resolved: org.eclipse.scout.rt:org.eclipse.scout.rt.ui.html.test:jar:9.0.0.025_Simrel_2019_09, org.eclipse.scout.rt:org.eclipse.scout.rt.shared:jar:9.0.0.025_Simrel_2019_09: Failure to find org.eclipse.scout.rt:org.eclipse.scout.rt.ui.html.test:jar:9.0.0.025_Simrel_2019_09 in https://repo.eclipse.org/content/groups/releases/ was cached in the local repository, resolution will not be reattempted until the update interval of eclipse.release has elapsed or updates are forced -> [Help 1]
06:39:05 [ERROR] 
06:39:05 [ERROR] To see the full stack trace of the errors, re-run Maven with the -e switch.
06:39:05 [ERROR] Re-run Maven using the -X switch to enable full debug logging.
06:39:05 [ERROR] 
06:39:05 [ERROR] For more information about the errors and possible solutions, please read the following articles:
06:39:05 [ERROR] [Help 1] http://cwiki.apache.org/confluence/display/MAVEN/DependencyResolutionException
06:39:05 [ERROR] 
06:39:05 [ERROR] After correcting the problems, you can resume the build with the command
06:39:05 [ERROR]   mvn <goals> -rf :org.eclipse.scout.sdk.core.s.test
06:39:05 Build step 'Invoke top-level Maven targets' marked build as failure
06:39:05 Sending e-mails to: patrick.baenziger@bsi-software.com arthur.vandorp@bsi-software.com
06:39:05 Recording test results
06:39:06 Started calculate disk usage of build
06:39:06 Finished Calculation of disk usage of build in 0 seconds
06:39:07 Started calculate disk usage of workspace
06:39:08 Finished Calculation of disk usage of workspace in  1 second
06:39:09 Triggering a new build of publish_staged_builds
06:39:09 Finished: FAILURE