FailedConsole Output

06:33:11 Started by user Arthur.vanDorp@bsi-software.com
06:33:11 Building in workspace /home/hudson/genie.scout/.jenkins/jobs/org.eclipse.scout.sdk_deploy_from_tag/workspace
06:33:11 No credentials specified
06:33:11  > /usr/local/bin/git rev-parse --is-inside-work-tree # timeout=10
06:33:11 Fetching changes from the remote Git repository
06:33:11  > /usr/local/bin/git config remote.origin.url git://git.eclipse.org/gitroot/scout/org.eclipse.scout.sdk.git # timeout=10
06:33:11 Fetching upstream changes from git://git.eclipse.org/gitroot/scout/org.eclipse.scout.sdk.git
06:33:11  > /usr/local/bin/git --version # timeout=10
06:33:12  > /usr/local/bin/git fetch --tags --progress git://git.eclipse.org/gitroot/scout/org.eclipse.scout.sdk.git +refs/heads/*:refs/remotes/origin/*
06:33:12  > /usr/local/bin/git rev-parse origin/9.0.0.025_Simrel_2019_09^{commit} # timeout=10
06:33:12  > /usr/local/bin/git rev-parse 9.0.0.025_Simrel_2019_09^{commit} # timeout=10
06:33:12 Checking out Revision 7919e5eedbdf0b418849a469e5c8b60cf92f4243 (9.0.0.025_Simrel_2019_09)
06:33:12  > /usr/local/bin/git config core.sparsecheckout # timeout=10
06:33:12  > /usr/local/bin/git checkout -f 7919e5eedbdf0b418849a469e5c8b60cf92f4243
06:33:12 Commit message: "[release] version updated to 9.0.0.025_Simrel_2019_09"
06:33:12 First time build. Skipping changelog.
06:33:12 [workspace] $ /shared/common/apache-maven-latest/bin/mvn -f org.eclipse.scout.sdk/pom.xml -DbuildId=025_Simrel_2019_09 -Dtag=9.0.0.025_Simrel_2019_09 -DstageTargetDir=releases/9.0/9.0.0/ -Dmaven.repo.local=/home/hudson/genie.scout/.jenkins/jobs/org.eclipse.scout.sdk_deploy_from_tag/workspace/.repository clean install
06:33:12 Picked up JAVA_TOOL_OPTIONS: -Xmx2G -Djava.io.tmpdir=/tmp/genie.scout -DforkCount=1
06:33:14 [INFO] Scanning for projects...
06:33:14 Downloading from eclipse.release: https://repo.eclipse.org/content/groups/releases/org/eclipse/scout/rt/org.eclipse.scout.rt/9.0.0.025_Simrel_2019_09/org.eclipse.scout.rt-9.0.0.025_Simrel_2019_09.pom
06:33:15 Downloading from eclipse.maven.central.mirror: https://repo.eclipse.org/content/repositories/maven_central/org/eclipse/scout/rt/org.eclipse.scout.rt/9.0.0.025_Simrel_2019_09/org.eclipse.scout.rt-9.0.0.025_Simrel_2019_09.pom
06:33:15 Progress (1): 4.1/33 kB
Progress (1): 7.7/33 kB
Progress (1): 12/33 kB 
Progress (1): 16/33 kB
Progress (1): 20/33 kB
Progress (1): 24/33 kB
Progress (1): 28/33 kB
Progress (1): 32/33 kB
Progress (1): 33 kB   
                   
Downloaded from eclipse.maven.central.mirror: https://repo.eclipse.org/content/repositories/maven_central/org/eclipse/scout/rt/org.eclipse.scout.rt/9.0.0.025_Simrel_2019_09/org.eclipse.scout.rt-9.0.0.025_Simrel_2019_09.pom (33 kB at 95 kB/s)
06:33:16 [INFO] ------------------------------------------------------------------------
06:33:16 [INFO] Reactor Build Order:
06:33:16 [INFO] 
06:33:16 [INFO] Scout Hello World Sample Application                   [maven-archetype]
06:33:16 [INFO] Scout JaxWs Module                                     [maven-archetype]
06:33:16 [INFO] ScoutJS Sample Application                             [maven-archetype]
06:33:16 [INFO] Eclipse Scout SDK                                                  [pom]
06:33:16 [INFO] org.eclipse.scout.sdk:org.eclipse.scout.sdk.core                   [jar]
06:33:16 [INFO] org.eclipse.scout.sdk:org.eclipse.scout.sdk.core.test              [jar]
06:33:16 [INFO] org.eclipse.scout.sdk:org.eclipse.scout.sdk.core.s                 [jar]
06:33:16 [INFO] org.eclipse.scout.sdk:org.eclipse.scout.sdk.core.s.test            [jar]
06:33:16 [INFO] org.eclipse.scout.sdk.s2e:org.eclipse.scout.sdk.s2e             [bundle]
06:33:16 [INFO] org.eclipse.scout.sdk.s2e:org.eclipse.scout.sdk.s2e.test           [jar]
06:33:16 [INFO] org.eclipse.scout.sdk.s2e:org.eclipse.scout.sdk.s2e.doc         [bundle]
06:33:16 [INFO] org.eclipse.scout.sdk.s2e:org.eclipse.scout.sdk.s2e.nls         [bundle]
06:33:16 [INFO] org.eclipse.scout.sdk.s2e:org.eclipse.scout.sdk.s2e.ui          [bundle]
06:33:16 [INFO] org.eclipse.scout.sdk-settings                                     [jar]
06:33:16 [INFO] 
06:33:16 [INFO] ---------< org.eclipse.scout.archetypes:scout-helloworld-app >----------
06:33:16 [INFO] Building Scout Hello World Sample Application 9.0.0.025_Simrel_2019_09 [1/14]
06:33:16 [INFO] --------------------------[ maven-archetype ]---------------------------
06:33:16 [INFO] 
06:33:16 [INFO] --- maven-clean-plugin:3.1.0:clean (default-clean) @ scout-helloworld-app ---
06:33:16 [INFO] Deleting /jobs/genie.scout/org.eclipse.scout.sdk_deploy_from_tag/workspace/scout-helloworld-app/target
06:33:17 [INFO] 
06:33:17 [INFO] --- flatten-maven-plugin:1.0.1:clean (flatten.clean) @ scout-helloworld-app ---
06:33:17 [INFO] Deleting /jobs/genie.scout/org.eclipse.scout.sdk_deploy_from_tag/workspace/scout-helloworld-app/.flattened-pom.xml
06:33:17 [INFO] 
06:33:17 [INFO] --- maven-enforcer-plugin:1.4.1:enforce (enforce-rules) @ scout-helloworld-app ---
06:33:17 [INFO] 
06:33:17 [INFO] --- git-commit-id-plugin:2.2.5:revision (default) @ scout-helloworld-app ---
06:33:20 [INFO] 
06:33:20 [INFO] --- jacoco-maven-plugin:0.8.2:prepare-agent (default) @ scout-helloworld-app ---
06:33:20 [INFO] master_test_jacocoArgLine set to -javaagent:/home/hudson/genie.scout/.jenkins/jobs/org.eclipse.scout.sdk_deploy_from_tag/workspace/.repository/org/jacoco/org.jacoco.agent/0.8.2/org.jacoco.agent-0.8.2-runtime.jar=destfile=/jobs/genie.scout/org.eclipse.scout.sdk_deploy_from_tag/workspace/scout-helloworld-app/../target/jacoco-all.exec
06:33:20 [INFO] 
06:33:20 [INFO] --- build-helper-maven-plugin:3.0.0:parse-version (initialize-parse-version) @ scout-helloworld-app ---
06:33:21 [INFO] 
06:33:21 [INFO] --- build-helper-maven-plugin:3.0.0:regex-property (initialize-regex) @ scout-helloworld-app ---
06:33:21 [INFO] No match to regex 'SNAPSHOT' found in '9.0.0.025_Simrel_2019_09'. The initial value '9.0.0.025_Simrel_2019_09' is left as-is...
06:33:21 [INFO] 
06:33:21 [INFO] --- maven-resources-plugin:3.1.0:resources (default-resources) @ scout-helloworld-app ---
06:33:21 [INFO] Using 'UTF-8' encoding to copy filtered resources.
06:33:21 [INFO] Copying 105 resources
06:33:21 [INFO] Copying 2 resources
06:33:21 [INFO] 
06:33:21 [INFO] --- flatten-maven-plugin:1.0.1:flatten (flatten) @ scout-helloworld-app ---
06:33:21 [INFO] Generating flattened POM of project org.eclipse.scout.archetypes:scout-helloworld-app:maven-archetype:9.0.0.025_Simrel_2019_09...
06:33:21 [INFO] 
06:33:21 [INFO] --- maven-resources-plugin:3.1.0:testResources (default-testResources) @ scout-helloworld-app ---
06:33:21 [INFO] Using 'UTF-8' encoding to copy filtered resources.
06:33:21 [INFO] Copying 2 resources
06:33:21 [INFO] 
06:33:21 [INFO] --- maven-archetype-plugin:3.0.1:jar (default-jar) @ scout-helloworld-app ---
06:33:21 [INFO] Building archetype jar: /jobs/genie.scout/org.eclipse.scout.sdk_deploy_from_tag/workspace/scout-helloworld-app/target/scout-helloworld-app-9.0.0.025_Simrel_2019_09
06:33:21 [INFO] 
06:33:21 [INFO] --- maven-site-plugin:3.7.1:attach-descriptor (attach-descriptor) @ scout-helloworld-app ---
06:33:22 [INFO] Skipping because packaging 'maven-archetype' is not pom.
06:33:22 [INFO] 
06:33:22 [INFO] --- maven-jar-plugin:3.1.1:test-jar (attach-tests) @ scout-helloworld-app ---
06:33:22 [INFO] Building jar: /jobs/genie.scout/org.eclipse.scout.sdk_deploy_from_tag/workspace/scout-helloworld-app/target/scout-helloworld-app-9.0.0.025_Simrel_2019_09-tests.jar
06:33:22 [INFO] 
06:33:22 [INFO] --- maven-source-plugin:3.0.1:test-jar-no-fork (attach-test-sources) @ scout-helloworld-app ---
06:33:22 [INFO] No sources in project. Archive not created.
06:33:22 [INFO] 
06:33:22 [INFO] --- maven-archetype-plugin:3.0.1:integration-test (default-integration-test) @ scout-helloworld-app ---
06:33:22 [INFO] Processing Archetype IT project: basic
06:33:22 [INFO] ----------------------------------------------------------------------------
06:33:22 [INFO] Using following parameters for creating project from Archetype: scout-helloworld-app:9.0.0.025_Simrel_2019_09
06:33:22 [INFO] ----------------------------------------------------------------------------
06:33:22 [INFO] Parameter: groupId, Value: org.eclipse.scout.apps
06:33:22 [INFO] Parameter: artifactId, Value: helloworld
06:33:22 [INFO] Parameter: version, Value: 1.0.0-SNAPSHOT
06:33:22 [INFO] Parameter: package, Value: org.eclipse.scout.apps.helloworld
06:33:22 [INFO] Parameter: packageInPathFormat, Value: org/eclipse/scout/apps/helloworld
06:33:22 [INFO] Parameter: scoutAuthPublicKeyDev, Value: TODO (use org.eclipse.scout.rt.platform.security.SecurityUtility.generateKeyPair())
06:33:22 [INFO] Parameter: groupId, Value: org.eclipse.scout.apps
06:33:22 [INFO] Parameter: scoutAuthPrivateKeyDev, Value: TODO (use org.eclipse.scout.rt.platform.security.SecurityUtility.generateKeyPair())
06:33:22 [INFO] Parameter: scoutAuthPublicKey, Value: TODO (use org.eclipse.scout.rt.platform.security.SecurityUtility.generateKeyPair())
06:33:22 [INFO] Parameter: version, Value: 1.0.0-SNAPSHOT
06:33:22 [INFO] Parameter: userName, Value: Scout Robot
06:33:22 [INFO] Parameter: displayName, Value: My Application
06:33:22 [INFO] Parameter: javaVersion, Value: 1.8
06:33:22 [INFO] Parameter: package, Value: org.eclipse.scout.apps.helloworld
06:33:22 [INFO] Parameter: artifactId, Value: helloworld
06:33:22 [INFO] Parameter: scoutAuthPrivateKey, Value: TODO (use org.eclipse.scout.rt.platform.security.SecurityUtility.generateKeyPair())
06:33:22 [INFO] Parent element not overwritten in /jobs/genie.scout/org.eclipse.scout.sdk_deploy_from_tag/workspace/scout-helloworld-app/target/test-classes/projects/basic/project/helloworld/helloworld/pom.xml
06:33:22 [WARNING] Don't override file /jobs/genie.scout/org.eclipse.scout.sdk_deploy_from_tag/workspace/scout-helloworld-app/target/test-classes/projects/basic/project/helloworld/helloworld/pom.xml
06:33:22 [INFO] Parent element not overwritten in /jobs/genie.scout/org.eclipse.scout.sdk_deploy_from_tag/workspace/scout-helloworld-app/target/test-classes/projects/basic/project/helloworld/helloworld.shared/pom.xml
06:33:22 [INFO] Parent element not overwritten in /jobs/genie.scout/org.eclipse.scout.sdk_deploy_from_tag/workspace/scout-helloworld-app/target/test-classes/projects/basic/project/helloworld/helloworld.server/pom.xml
06:33:22 [INFO] Parent element not overwritten in /jobs/genie.scout/org.eclipse.scout.sdk_deploy_from_tag/workspace/scout-helloworld-app/target/test-classes/projects/basic/project/helloworld/helloworld.client/pom.xml
06:33:22 [INFO] Parent element not overwritten in /jobs/genie.scout/org.eclipse.scout.sdk_deploy_from_tag/workspace/scout-helloworld-app/target/test-classes/projects/basic/project/helloworld/helloworld.server.app.war/pom.xml
06:33:22 [INFO] Parent element not overwritten in /jobs/genie.scout/org.eclipse.scout.sdk_deploy_from_tag/workspace/scout-helloworld-app/target/test-classes/projects/basic/project/helloworld/helloworld.server.app.dev/pom.xml
06:33:22 [INFO] Parent element not overwritten in /jobs/genie.scout/org.eclipse.scout.sdk_deploy_from_tag/workspace/scout-helloworld-app/target/test-classes/projects/basic/project/helloworld/helloworld.ui.html/pom.xml
06:33:22 [INFO] Parent element not overwritten in /jobs/genie.scout/org.eclipse.scout.sdk_deploy_from_tag/workspace/scout-helloworld-app/target/test-classes/projects/basic/project/helloworld/helloworld.ui.html.app.war/pom.xml
06:33:22 [INFO] Parent element not overwritten in /jobs/genie.scout/org.eclipse.scout.sdk_deploy_from_tag/workspace/scout-helloworld-app/target/test-classes/projects/basic/project/helloworld/helloworld.ui.html.app.dev/pom.xml
06:33:22 [INFO] Project created from Archetype in dir: /jobs/genie.scout/org.eclipse.scout.sdk_deploy_from_tag/workspace/scout-helloworld-app/target/test-classes/projects/basic/project/helloworld
06:33:22 [INFO] 
06:33:22 [INFO] --- duplicate-finder-maven-plugin:1.3.0:check (default) @ scout-helloworld-app ---
06:33:22 [INFO] Checking compile classpath
06:33:22 [INFO] Checking runtime classpath
06:33:22 [INFO] Checking test classpath
06:33:22 [INFO] 
06:33:22 [INFO] --- animal-sniffer-maven-plugin:1.17:check (enforce-java-api-compatibility) @ scout-helloworld-app ---
06:33:22 [INFO] Checking unresolved references to org.codehaus.mojo.signature:java18:1.0
06:33:23 [INFO] 
06:33:23 [INFO] --- maven-source-plugin:3.0.1:jar-no-fork (attach-sources) @ scout-helloworld-app ---
06:33:23 [INFO] No sources in project. Archive not created.
06:33:23 [INFO] 
06:33:23 [INFO] --- maven-install-plugin:2.5.2:install (default-install) @ scout-helloworld-app ---
06:33:23 [INFO] Installing /jobs/genie.scout/org.eclipse.scout.sdk_deploy_from_tag/workspace/scout-helloworld-app/target/scout-helloworld-app-9.0.0.025_Simrel_2019_09.jar to /home/hudson/genie.scout/.jenkins/jobs/org.eclipse.scout.sdk_deploy_from_tag/workspace/.repository/org/eclipse/scout/archetypes/scout-helloworld-app/9.0.0.025_Simrel_2019_09/scout-helloworld-app-9.0.0.025_Simrel_2019_09.jar
06:33:23 [INFO] Installing /jobs/genie.scout/org.eclipse.scout.sdk_deploy_from_tag/workspace/scout-helloworld-app/.flattened-pom.xml to /home/hudson/genie.scout/.jenkins/jobs/org.eclipse.scout.sdk_deploy_from_tag/workspace/.repository/org/eclipse/scout/archetypes/scout-helloworld-app/9.0.0.025_Simrel_2019_09/scout-helloworld-app-9.0.0.025_Simrel_2019_09.pom
06:33:23 [INFO] Installing /jobs/genie.scout/org.eclipse.scout.sdk_deploy_from_tag/workspace/scout-helloworld-app/target/scout-helloworld-app-9.0.0.025_Simrel_2019_09-tests.jar to /home/hudson/genie.scout/.jenkins/jobs/org.eclipse.scout.sdk_deploy_from_tag/workspace/.repository/org/eclipse/scout/archetypes/scout-helloworld-app/9.0.0.025_Simrel_2019_09/scout-helloworld-app-9.0.0.025_Simrel_2019_09-tests.jar
06:33:23 [INFO] 
06:33:23 [INFO] --- maven-archetype-plugin:3.0.1:update-local-catalog (default-update-local-catalog) @ scout-helloworld-app ---
06:33:23 [INFO] 
06:33:23 [INFO] ----------< org.eclipse.scout.archetypes:scout-jaxws-module >-----------
06:33:23 [INFO] Building Scout JaxWs Module 9.0.0.025_Simrel_2019_09              [2/14]
06:33:23 [INFO] --------------------------[ maven-archetype ]---------------------------
06:33:23 [INFO] 
06:33:23 [INFO] --- maven-clean-plugin:3.1.0:clean (default-clean) @ scout-jaxws-module ---
06:33:23 [INFO] Deleting /jobs/genie.scout/org.eclipse.scout.sdk_deploy_from_tag/workspace/scout-jaxws-module/target
06:33:23 [INFO] 
06:33:23 [INFO] --- flatten-maven-plugin:1.0.1:clean (flatten.clean) @ scout-jaxws-module ---
06:33:23 [INFO] Deleting /jobs/genie.scout/org.eclipse.scout.sdk_deploy_from_tag/workspace/scout-jaxws-module/.flattened-pom.xml
06:33:23 [INFO] 
06:33:23 [INFO] --- maven-enforcer-plugin:1.4.1:enforce (enforce-rules) @ scout-jaxws-module ---
06:33:23 [INFO] 
06:33:23 [INFO] --- git-commit-id-plugin:2.2.5:revision (default) @ scout-jaxws-module ---
06:33:25 [INFO] 
06:33:25 [INFO] --- jacoco-maven-plugin:0.8.2:prepare-agent (default) @ scout-jaxws-module ---
06:33:25 [INFO] master_test_jacocoArgLine set to -javaagent:/home/hudson/genie.scout/.jenkins/jobs/org.eclipse.scout.sdk_deploy_from_tag/workspace/.repository/org/jacoco/org.jacoco.agent/0.8.2/org.jacoco.agent-0.8.2-runtime.jar=destfile=/jobs/genie.scout/org.eclipse.scout.sdk_deploy_from_tag/workspace/scout-jaxws-module/../target/jacoco-all.exec
06:33:25 [INFO] 
06:33:25 [INFO] --- build-helper-maven-plugin:3.0.0:parse-version (initialize-parse-version) @ scout-jaxws-module ---
06:33:25 [INFO] 
06:33:25 [INFO] --- build-helper-maven-plugin:3.0.0:regex-property (initialize-regex) @ scout-jaxws-module ---
06:33:25 [INFO] No match to regex 'SNAPSHOT' found in '9.0.0.025_Simrel_2019_09'. The initial value '9.0.0.025_Simrel_2019_09' is left as-is...
06:33:25 [INFO] 
06:33:25 [INFO] --- maven-resources-plugin:3.1.0:resources (default-resources) @ scout-jaxws-module ---
06:33:25 [INFO] Using 'UTF-8' encoding to copy filtered resources.
06:33:25 [INFO] Copying 7 resources
06:33:25 [INFO] Copying 2 resources
06:33:25 [INFO] 
06:33:25 [INFO] --- flatten-maven-plugin:1.0.1:flatten (flatten) @ scout-jaxws-module ---
06:33:25 [INFO] Generating flattened POM of project org.eclipse.scout.archetypes:scout-jaxws-module:maven-archetype:9.0.0.025_Simrel_2019_09...
06:33:25 [INFO] 
06:33:25 [INFO] --- maven-resources-plugin:3.1.0:testResources (default-testResources) @ scout-jaxws-module ---
06:33:25 [INFO] Using 'UTF-8' encoding to copy filtered resources.
06:33:25 [INFO] Copying 2 resources
06:33:25 [INFO] 
06:33:25 [INFO] --- maven-archetype-plugin:3.0.1:jar (default-jar) @ scout-jaxws-module ---
06:33:25 [INFO] Building archetype jar: /jobs/genie.scout/org.eclipse.scout.sdk_deploy_from_tag/workspace/scout-jaxws-module/target/scout-jaxws-module-9.0.0.025_Simrel_2019_09
06:33:25 [INFO] 
06:33:25 [INFO] --- maven-site-plugin:3.7.1:attach-descriptor (attach-descriptor) @ scout-jaxws-module ---
06:33:25 [INFO] Skipping because packaging 'maven-archetype' is not pom.
06:33:25 [INFO] 
06:33:25 [INFO] --- maven-jar-plugin:3.1.1:test-jar (attach-tests) @ scout-jaxws-module ---
06:33:25 [INFO] Building jar: /jobs/genie.scout/org.eclipse.scout.sdk_deploy_from_tag/workspace/scout-jaxws-module/target/scout-jaxws-module-9.0.0.025_Simrel_2019_09-tests.jar
06:33:26 [INFO] 
06:33:26 [INFO] --- maven-source-plugin:3.0.1:test-jar-no-fork (attach-test-sources) @ scout-jaxws-module ---
06:33:26 [INFO] No sources in project. Archive not created.
06:33:26 [INFO] 
06:33:26 [INFO] --- maven-archetype-plugin:3.0.1:integration-test (default-integration-test) @ scout-jaxws-module ---
06:33:26 [INFO] Processing Archetype IT project: basic
06:33:26 [INFO] ----------------------------------------------------------------------------
06:33:26 [INFO] Using following parameters for creating project from Archetype: scout-jaxws-module:9.0.0.025_Simrel_2019_09
06:33:26 [INFO] ----------------------------------------------------------------------------
06:33:26 [INFO] Parameter: groupId, Value: org.eclipse.scout.apps
06:33:26 [INFO] Parameter: artifactId, Value: helloworld.server.jaxws
06:33:26 [INFO] Parameter: version, Value: 1.0.0-SNAPSHOT
06:33:26 [INFO] Parameter: package, Value: org.eclipse.scout.apps.helloworld
06:33:26 [INFO] Parameter: packageInPathFormat, Value: org/eclipse/scout/apps/helloworld
06:33:26 [INFO] Parameter: displayName, Value: My Application
06:33:26 [INFO] Parameter: version, Value: 1.0.0-SNAPSHOT
06:33:26 [INFO] Parameter: package, Value: org.eclipse.scout.apps.helloworld
06:33:26 [INFO] Parameter: groupId, Value: org.eclipse.scout.apps
06:33:26 [INFO] Parameter: parentArtifactId, Value: helloworld
06:33:26 [INFO] Parameter: artifactId, Value: helloworld.server.jaxws
06:33:26 [WARNING] CP Don't override file /jobs/genie.scout/org.eclipse.scout.sdk_deploy_from_tag/workspace/scout-jaxws-module/target/test-classes/projects/basic/project/helloworld.server.jaxws/src/main/resources/META-INF/scout.xml
06:33:26 [INFO] Project created from Archetype in dir: /jobs/genie.scout/org.eclipse.scout.sdk_deploy_from_tag/workspace/scout-jaxws-module/target/test-classes/projects/basic/project/helloworld.server.jaxws
06:33:26 [INFO] 
06:33:26 [INFO] --- duplicate-finder-maven-plugin:1.3.0:check (default) @ scout-jaxws-module ---
06:33:26 [INFO] Checking compile classpath
06:33:26 [INFO] Checking runtime classpath
06:33:26 [INFO] Checking test classpath
06:33:26 [INFO] 
06:33:26 [INFO] --- animal-sniffer-maven-plugin:1.17:check (enforce-java-api-compatibility) @ scout-jaxws-module ---
06:33:26 [INFO] Checking unresolved references to org.codehaus.mojo.signature:java18:1.0
06:33:26 [INFO] 
06:33:26 [INFO] --- maven-source-plugin:3.0.1:jar-no-fork (attach-sources) @ scout-jaxws-module ---
06:33:26 [INFO] No sources in project. Archive not created.
06:33:26 [INFO] 
06:33:26 [INFO] --- maven-install-plugin:2.5.2:install (default-install) @ scout-jaxws-module ---
06:33:26 [INFO] Installing /jobs/genie.scout/org.eclipse.scout.sdk_deploy_from_tag/workspace/scout-jaxws-module/target/scout-jaxws-module-9.0.0.025_Simrel_2019_09.jar to /home/hudson/genie.scout/.jenkins/jobs/org.eclipse.scout.sdk_deploy_from_tag/workspace/.repository/org/eclipse/scout/archetypes/scout-jaxws-module/9.0.0.025_Simrel_2019_09/scout-jaxws-module-9.0.0.025_Simrel_2019_09.jar
06:33:26 [INFO] Installing /jobs/genie.scout/org.eclipse.scout.sdk_deploy_from_tag/workspace/scout-jaxws-module/.flattened-pom.xml to /home/hudson/genie.scout/.jenkins/jobs/org.eclipse.scout.sdk_deploy_from_tag/workspace/.repository/org/eclipse/scout/archetypes/scout-jaxws-module/9.0.0.025_Simrel_2019_09/scout-jaxws-module-9.0.0.025_Simrel_2019_09.pom
06:33:26 [INFO] Installing /jobs/genie.scout/org.eclipse.scout.sdk_deploy_from_tag/workspace/scout-jaxws-module/target/scout-jaxws-module-9.0.0.025_Simrel_2019_09-tests.jar to /home/hudson/genie.scout/.jenkins/jobs/org.eclipse.scout.sdk_deploy_from_tag/workspace/.repository/org/eclipse/scout/archetypes/scout-jaxws-module/9.0.0.025_Simrel_2019_09/scout-jaxws-module-9.0.0.025_Simrel_2019_09-tests.jar
06:33:26 [INFO] 
06:33:26 [INFO] --- maven-archetype-plugin:3.0.1:update-local-catalog (default-update-local-catalog) @ scout-jaxws-module ---
06:33:26 [INFO] 
06:33:26 [INFO] -----------< org.eclipse.scout.archetypes:scout-hellojs-app >-----------
06:33:26 [INFO] Building ScoutJS Sample Application 9.0.0.025_Simrel_2019_09      [3/14]
06:33:26 [INFO] --------------------------[ maven-archetype ]---------------------------
06:33:26 [INFO] 
06:33:26 [INFO] --- maven-clean-plugin:3.1.0:clean (default-clean) @ scout-hellojs-app ---
06:33:26 [INFO] Deleting /jobs/genie.scout/org.eclipse.scout.sdk_deploy_from_tag/workspace/scout-hellojs-app/target
06:33:26 [INFO] 
06:33:26 [INFO] --- flatten-maven-plugin:1.0.1:clean (flatten.clean) @ scout-hellojs-app ---
06:33:26 [INFO] Deleting /jobs/genie.scout/org.eclipse.scout.sdk_deploy_from_tag/workspace/scout-hellojs-app/.flattened-pom.xml
06:33:26 [INFO] 
06:33:26 [INFO] --- maven-enforcer-plugin:1.4.1:enforce (enforce-rules) @ scout-hellojs-app ---
06:33:26 [INFO] 
06:33:26 [INFO] --- git-commit-id-plugin:2.2.5:revision (default) @ scout-hellojs-app ---
06:33:28 [INFO] 
06:33:28 [INFO] --- jacoco-maven-plugin:0.8.2:prepare-agent (default) @ scout-hellojs-app ---
06:33:28 [INFO] master_test_jacocoArgLine set to -javaagent:/home/hudson/genie.scout/.jenkins/jobs/org.eclipse.scout.sdk_deploy_from_tag/workspace/.repository/org/jacoco/org.jacoco.agent/0.8.2/org.jacoco.agent-0.8.2-runtime.jar=destfile=/jobs/genie.scout/org.eclipse.scout.sdk_deploy_from_tag/workspace/scout-hellojs-app/../target/jacoco-all.exec
06:33:28 [INFO] 
06:33:28 [INFO] --- build-helper-maven-plugin:3.0.0:parse-version (initialize-parse-version) @ scout-hellojs-app ---
06:33:28 [INFO] 
06:33:28 [INFO] --- build-helper-maven-plugin:3.0.0:regex-property (initialize-regex) @ scout-hellojs-app ---
06:33:28 [INFO] No match to regex 'SNAPSHOT' found in '9.0.0.025_Simrel_2019_09'. The initial value '9.0.0.025_Simrel_2019_09' is left as-is...
06:33:28 [INFO] 
06:33:28 [INFO] --- maven-resources-plugin:3.1.0:resources (default-resources) @ scout-hellojs-app ---
06:33:28 [INFO] Using 'UTF-8' encoding to copy filtered resources.
06:33:28 [INFO] Copying 146 resources
06:33:28 [INFO] Copying 2 resources
06:33:28 [INFO] 
06:33:28 [INFO] --- flatten-maven-plugin:1.0.1:flatten (flatten) @ scout-hellojs-app ---
06:33:28 [INFO] Generating flattened POM of project org.eclipse.scout.archetypes:scout-hellojs-app:maven-archetype:9.0.0.025_Simrel_2019_09...
06:33:29 [INFO] 
06:33:29 [INFO] --- maven-resources-plugin:3.1.0:testResources (default-testResources) @ scout-hellojs-app ---
06:33:29 [INFO] Using 'UTF-8' encoding to copy filtered resources.
06:33:29 [INFO] Copying 2 resources
06:33:29 [INFO] 
06:33:29 [INFO] --- maven-archetype-plugin:3.0.1:jar (default-jar) @ scout-hellojs-app ---
06:33:29 [INFO] Building archetype jar: /jobs/genie.scout/org.eclipse.scout.sdk_deploy_from_tag/workspace/scout-hellojs-app/target/scout-hellojs-app-9.0.0.025_Simrel_2019_09
06:33:29 [INFO] 
06:33:29 [INFO] --- maven-site-plugin:3.7.1:attach-descriptor (attach-descriptor) @ scout-hellojs-app ---
06:33:29 [INFO] Skipping because packaging 'maven-archetype' is not pom.
06:33:29 [INFO] 
06:33:29 [INFO] --- maven-jar-plugin:3.1.1:test-jar (attach-tests) @ scout-hellojs-app ---
06:33:29 [INFO] Building jar: /jobs/genie.scout/org.eclipse.scout.sdk_deploy_from_tag/workspace/scout-hellojs-app/target/scout-hellojs-app-9.0.0.025_Simrel_2019_09-tests.jar
06:33:29 [INFO] 
06:33:29 [INFO] --- maven-source-plugin:3.0.1:test-jar-no-fork (attach-test-sources) @ scout-hellojs-app ---
06:33:29 [INFO] No sources in project. Archive not created.
06:33:29 [INFO] 
06:33:29 [INFO] --- maven-archetype-plugin:3.0.1:integration-test (default-integration-test) @ scout-hellojs-app ---
06:33:29 [INFO] Processing Archetype IT project: basic
06:33:29 [INFO] ----------------------------------------------------------------------------
06:33:29 [INFO] Using following parameters for creating project from Archetype: scout-hellojs-app:9.0.0.025_Simrel_2019_09
06:33:29 [INFO] ----------------------------------------------------------------------------
06:33:29 [INFO] Parameter: groupId, Value: org.eclipse.scout.apps
06:33:29 [INFO] Parameter: artifactId, Value: hellojs
06:33:29 [INFO] Parameter: version, Value: 1.0.0-SNAPSHOT
06:33:29 [INFO] Parameter: package, Value: org.eclipse.scout.apps.hellojs
06:33:29 [INFO] Parameter: packageInPathFormat, Value: org/eclipse/scout/apps/hellojs
06:33:29 [INFO] Parameter: displayName, Value: My Application
06:33:29 [INFO] Parameter: version, Value: 1.0.0-SNAPSHOT
06:33:29 [INFO] Parameter: package, Value: org.eclipse.scout.apps.hellojs
06:33:29 [INFO] Parameter: simpleArtifactName, Value: hellojs
06:33:29 [INFO] Parameter: javaVersion, Value: 1.8
06:33:29 [INFO] Parameter: groupId, Value: org.eclipse.scout.apps
06:33:29 [INFO] Parameter: scoutAuthPublicKeyDev, Value: changeme_database_password
06:33:29 [INFO] Parameter: artifactId, Value: hellojs
06:33:29 [INFO] Parent element not overwritten in /jobs/genie.scout/org.eclipse.scout.sdk_deploy_from_tag/workspace/scout-hellojs-app/target/test-classes/projects/basic/project/hellojs/hellojs/pom.xml
06:33:29 [WARNING] Don't override file /jobs/genie.scout/org.eclipse.scout.sdk_deploy_from_tag/workspace/scout-hellojs-app/target/test-classes/projects/basic/project/hellojs/hellojs/pom.xml
06:33:29 [INFO] Parent element not overwritten in /jobs/genie.scout/org.eclipse.scout.sdk_deploy_from_tag/workspace/scout-hellojs-app/target/test-classes/projects/basic/project/hellojs/hellojs.api/pom.xml
06:33:29 [INFO] Parent element not overwritten in /jobs/genie.scout/org.eclipse.scout.sdk_deploy_from_tag/workspace/scout-hellojs-app/target/test-classes/projects/basic/project/hellojs/hellojs.app/pom.xml
06:33:29 [INFO] Parent element not overwritten in /jobs/genie.scout/org.eclipse.scout.sdk_deploy_from_tag/workspace/scout-hellojs-app/target/test-classes/projects/basic/project/hellojs/hellojs.app.dev/pom.xml
06:33:29 [INFO] Parent element not overwritten in /jobs/genie.scout/org.eclipse.scout.sdk_deploy_from_tag/workspace/scout-hellojs-app/target/test-classes/projects/basic/project/hellojs/hellojs.app.war/pom.xml
06:33:29 [INFO] Parent element not overwritten in /jobs/genie.scout/org.eclipse.scout.sdk_deploy_from_tag/workspace/scout-hellojs-app/target/test-classes/projects/basic/project/hellojs/hellojs.core/pom.xml
06:33:29 [INFO] Parent element not overwritten in /jobs/genie.scout/org.eclipse.scout.sdk_deploy_from_tag/workspace/scout-hellojs-app/target/test-classes/projects/basic/project/hellojs/hellojs.core.test/pom.xml
06:33:29 [INFO] Parent element not overwritten in /jobs/genie.scout/org.eclipse.scout.sdk_deploy_from_tag/workspace/scout-hellojs-app/target/test-classes/projects/basic/project/hellojs/hellojs.data/pom.xml
06:33:29 [INFO] Parent element not overwritten in /jobs/genie.scout/org.eclipse.scout.sdk_deploy_from_tag/workspace/scout-hellojs-app/target/test-classes/projects/basic/project/hellojs/hellojs.db/pom.xml
06:33:29 [INFO] Parent element not overwritten in /jobs/genie.scout/org.eclipse.scout.sdk_deploy_from_tag/workspace/scout-hellojs-app/target/test-classes/projects/basic/project/hellojs/hellojs.persistence/pom.xml
06:33:29 [INFO] Parent element not overwritten in /jobs/genie.scout/org.eclipse.scout.sdk_deploy_from_tag/workspace/scout-hellojs-app/target/test-classes/projects/basic/project/hellojs/hellojs.persistence.test/pom.xml
06:33:29 [INFO] Parent element not overwritten in /jobs/genie.scout/org.eclipse.scout.sdk_deploy_from_tag/workspace/scout-hellojs-app/target/test-classes/projects/basic/project/hellojs/hellojs.ui/pom.xml
06:33:29 [INFO] Project created from Archetype in dir: /jobs/genie.scout/org.eclipse.scout.sdk_deploy_from_tag/workspace/scout-hellojs-app/target/test-classes/projects/basic/project/hellojs
06:33:29 [INFO] 
06:33:29 [INFO] --- duplicate-finder-maven-plugin:1.3.0:check (default) @ scout-hellojs-app ---
06:33:29 [INFO] Checking compile classpath
06:33:29 [INFO] Checking runtime classpath
06:33:29 [INFO] Checking test classpath
06:33:29 [INFO] 
06:33:29 [INFO] --- animal-sniffer-maven-plugin:1.17:check (enforce-java-api-compatibility) @ scout-hellojs-app ---
06:33:29 [INFO] Checking unresolved references to org.codehaus.mojo.signature:java18:1.0
06:33:29 [INFO] 
06:33:29 [INFO] --- maven-source-plugin:3.0.1:jar-no-fork (attach-sources) @ scout-hellojs-app ---
06:33:29 [INFO] No sources in project. Archive not created.
06:33:29 [INFO] 
06:33:29 [INFO] --- maven-install-plugin:2.5.2:install (default-install) @ scout-hellojs-app ---
06:33:29 [INFO] Installing /jobs/genie.scout/org.eclipse.scout.sdk_deploy_from_tag/workspace/scout-hellojs-app/target/scout-hellojs-app-9.0.0.025_Simrel_2019_09.jar to /home/hudson/genie.scout/.jenkins/jobs/org.eclipse.scout.sdk_deploy_from_tag/workspace/.repository/org/eclipse/scout/archetypes/scout-hellojs-app/9.0.0.025_Simrel_2019_09/scout-hellojs-app-9.0.0.025_Simrel_2019_09.jar
06:33:29 [INFO] Installing /jobs/genie.scout/org.eclipse.scout.sdk_deploy_from_tag/workspace/scout-hellojs-app/.flattened-pom.xml to /home/hudson/genie.scout/.jenkins/jobs/org.eclipse.scout.sdk_deploy_from_tag/workspace/.repository/org/eclipse/scout/archetypes/scout-hellojs-app/9.0.0.025_Simrel_2019_09/scout-hellojs-app-9.0.0.025_Simrel_2019_09.pom
06:33:29 [INFO] Installing /jobs/genie.scout/org.eclipse.scout.sdk_deploy_from_tag/workspace/scout-hellojs-app/target/scout-hellojs-app-9.0.0.025_Simrel_2019_09-tests.jar to /home/hudson/genie.scout/.jenkins/jobs/org.eclipse.scout.sdk_deploy_from_tag/workspace/.repository/org/eclipse/scout/archetypes/scout-hellojs-app/9.0.0.025_Simrel_2019_09/scout-hellojs-app-9.0.0.025_Simrel_2019_09-tests.jar
06:33:29 [INFO] 
06:33:29 [INFO] --- maven-archetype-plugin:3.0.1:update-local-catalog (default-update-local-catalog) @ scout-hellojs-app ---
06:33:29 [INFO] 
06:33:29 [INFO] ------------< org.eclipse.scout.sdk:org.eclipse.scout.sdk >-------------
06:33:29 [INFO] Building Eclipse Scout SDK 9.0.0.025_Simrel_2019_09               [4/14]
06:33:29 [INFO] --------------------------------[ pom ]---------------------------------
06:33:29 [INFO] 
06:33:29 [INFO] --- maven-clean-plugin:3.1.0:clean (default-clean) @ org.eclipse.scout.sdk ---
06:33:29 [INFO] Deleting /jobs/genie.scout/org.eclipse.scout.sdk_deploy_from_tag/workspace/org.eclipse.scout.sdk/target
06:33:29 [INFO] 
06:33:29 [INFO] --- flatten-maven-plugin:1.0.1:clean (flatten.clean) @ org.eclipse.scout.sdk ---
06:33:29 [INFO] Deleting /jobs/genie.scout/org.eclipse.scout.sdk_deploy_from_tag/workspace/org.eclipse.scout.sdk/.flattened-pom.xml
06:33:29 [INFO] 
06:33:29 [INFO] --- maven-enforcer-plugin:1.4.1:enforce (enforce-rules) @ org.eclipse.scout.sdk ---
06:33:30 [INFO] 
06:33:30 [INFO] --- git-commit-id-plugin:2.2.5:revision (default) @ org.eclipse.scout.sdk ---
06:33:30 [INFO] 
06:33:30 [INFO] --- jacoco-maven-plugin:0.8.2:prepare-agent (default) @ org.eclipse.scout.sdk ---
06:33:30 [INFO] master_test_jacocoArgLine set to -javaagent:/home/hudson/genie.scout/.jenkins/jobs/org.eclipse.scout.sdk_deploy_from_tag/workspace/.repository/org/jacoco/org.jacoco.agent/0.8.2/org.jacoco.agent-0.8.2-runtime.jar=destfile=/jobs/genie.scout/org.eclipse.scout.sdk_deploy_from_tag/workspace/org.eclipse.scout.sdk/../org.eclipse.scout.sdk/target/jacoco-all.exec
06:33:30 [INFO] 
06:33:30 [INFO] --- build-helper-maven-plugin:3.0.0:parse-version (initialize-parse-version) @ org.eclipse.scout.sdk ---
06:33:30 [INFO] 
06:33:30 [INFO] --- build-helper-maven-plugin:3.0.0:regex-property (initialize-regex) @ org.eclipse.scout.sdk ---
06:33:30 [INFO] No match to regex 'SNAPSHOT' found in '9.0.0.025_Simrel_2019_09'. The initial value '9.0.0.025_Simrel_2019_09' is left as-is...
06:33:30 [INFO] 
06:33:30 [INFO] --- flatten-maven-plugin:1.0.1:flatten (flatten) @ org.eclipse.scout.sdk ---
06:33:30 [INFO] Generating flattened POM of project org.eclipse.scout.sdk:org.eclipse.scout.sdk:pom:9.0.0.025_Simrel_2019_09...
06:33:30 [INFO] 
06:33:30 [INFO] --- maven-site-plugin:3.7.1:attach-descriptor (attach-descriptor) @ org.eclipse.scout.sdk ---
06:33:30 [INFO] No site descriptor found: nothing to attach.
06:33:30 [INFO] 
06:33:30 [INFO] --- maven-jar-plugin:3.1.1:test-jar (attach-tests) @ org.eclipse.scout.sdk ---
06:33:30 [INFO] Skipping packaging of the test-jar
06:33:30 [INFO] 
06:33:30 [INFO] --- maven-source-plugin:3.0.1:test-jar-no-fork (attach-test-sources) @ org.eclipse.scout.sdk ---
06:33:30 [INFO] 
06:33:30 [INFO] --- duplicate-finder-maven-plugin:1.3.0:check (default) @ org.eclipse.scout.sdk ---
06:33:30 [INFO] Checking compile classpath
06:33:30 [INFO] Checking runtime classpath
06:33:30 [INFO] Checking test classpath
06:33:30 [INFO] 
06:33:30 [INFO] --- animal-sniffer-maven-plugin:1.17:check (enforce-java-api-compatibility) @ org.eclipse.scout.sdk ---
06:33:30 [INFO] Checking unresolved references to org.codehaus.mojo.signature:java18:1.0
06:33:31 [INFO] 
06:33:31 [INFO] --- maven-source-plugin:3.0.1:jar-no-fork (attach-sources) @ org.eclipse.scout.sdk ---
06:33:31 [INFO] 
06:33:31 [INFO] --- maven-install-plugin:2.5.2:install (default-install) @ org.eclipse.scout.sdk ---
06:33:31 [INFO] Installing /jobs/genie.scout/org.eclipse.scout.sdk_deploy_from_tag/workspace/org.eclipse.scout.sdk/.flattened-pom.xml to /home/hudson/genie.scout/.jenkins/jobs/org.eclipse.scout.sdk_deploy_from_tag/workspace/.repository/org/eclipse/scout/sdk/org.eclipse.scout.sdk/9.0.0.025_Simrel_2019_09/org.eclipse.scout.sdk-9.0.0.025_Simrel_2019_09.pom
06:33:31 [INFO] 
06:33:31 [INFO] ----------< org.eclipse.scout.sdk:org.eclipse.scout.sdk.core >----------
06:33:31 [INFO] Building org.eclipse.scout.sdk:org.eclipse.scout.sdk.core 9.0.0.025_Simrel_2019_09 [5/14]
06:33:31 [INFO] --------------------------------[ jar ]---------------------------------
06:33:31 [INFO] 
06:33:31 [INFO] --- maven-clean-plugin:3.1.0:clean (default-clean) @ org.eclipse.scout.sdk.core ---
06:33:31 [INFO] Deleting /jobs/genie.scout/org.eclipse.scout.sdk_deploy_from_tag/workspace/org.eclipse.scout.sdk.core/target
06:33:31 [INFO] 
06:33:31 [INFO] --- maven-enforcer-plugin:1.4.1:enforce (enforce-rules) @ org.eclipse.scout.sdk.core ---
06:33:31 [INFO] 
06:33:31 [INFO] --- git-commit-id-plugin:2.2.5:revision (default) @ org.eclipse.scout.sdk.core ---
06:33:34 [INFO] 
06:33:34 [INFO] --- jacoco-maven-plugin:0.8.2:prepare-agent (default) @ org.eclipse.scout.sdk.core ---
06:33:34 [INFO] master_test_jacocoArgLine set to -javaagent:/home/hudson/genie.scout/.jenkins/jobs/org.eclipse.scout.sdk_deploy_from_tag/workspace/.repository/org/jacoco/org.jacoco.agent/0.8.2/org.jacoco.agent-0.8.2-runtime.jar=destfile=/jobs/genie.scout/org.eclipse.scout.sdk_deploy_from_tag/workspace/org.eclipse.scout.sdk.core/../org.eclipse.scout.sdk/target/jacoco-all.exec
06:33:34 [INFO] 
06:33:34 [INFO] --- build-helper-maven-plugin:3.0.0:parse-version (initialize-parse-version) @ org.eclipse.scout.sdk.core ---
06:33:34 [INFO] 
06:33:34 [INFO] --- build-helper-maven-plugin:3.0.0:regex-property (initialize-regex) @ org.eclipse.scout.sdk.core ---
06:33:34 [INFO] No match to regex 'SNAPSHOT' found in '9.0.0.025_Simrel_2019_09'. The initial value '9.0.0.025_Simrel_2019_09' is left as-is...
06:33:34 [INFO] 
06:33:34 [INFO] --- maven-resources-plugin:3.1.0:resources (default-resources) @ org.eclipse.scout.sdk.core ---
06:33:35 [INFO] Using 'UTF-8' encoding to copy filtered resources.
06:33:35 [INFO] skip non existing resourceDirectory /jobs/genie.scout/org.eclipse.scout.sdk_deploy_from_tag/workspace/org.eclipse.scout.sdk.core/src/main/resources
06:33:35 [INFO] Copying 2 resources
06:33:35 [INFO] 
06:33:35 [INFO] --- maven-compiler-plugin:3.8.0:compile (default-compile) @ org.eclipse.scout.sdk.core ---
06:33:35 [INFO] Changes detected - recompiling the module!
06:33:35 [INFO] Compiling 165 source files to /jobs/genie.scout/org.eclipse.scout.sdk_deploy_from_tag/workspace/org.eclipse.scout.sdk.core/target/classes
06:33:37 [INFO] 
06:33:37 [INFO] --- maven-resources-plugin:3.1.0:testResources (default-testResources) @ org.eclipse.scout.sdk.core ---
06:33:37 [INFO] Using 'UTF-8' encoding to copy filtered resources.
06:33:37 [INFO] skip non existing resourceDirectory /jobs/genie.scout/org.eclipse.scout.sdk_deploy_from_tag/workspace/org.eclipse.scout.sdk.core/src/test/resources
06:33:37 [INFO] 
06:33:37 [INFO] --- maven-compiler-plugin:3.8.0:testCompile (default-testCompile) @ org.eclipse.scout.sdk.core ---
06:33:37 [INFO] No sources to compile
06:33:37 [INFO] 
06:33:37 [INFO] --- maven-surefire-plugin:2.22.1:test (default-test) @ org.eclipse.scout.sdk.core ---
06:33:37 [INFO] No tests to run.
06:33:37 [INFO] 
06:33:37 [INFO] --- maven-jar-plugin:3.1.1:jar (default-jar) @ org.eclipse.scout.sdk.core ---
06:33:37 [INFO] Building jar: /jobs/genie.scout/org.eclipse.scout.sdk_deploy_from_tag/workspace/org.eclipse.scout.sdk.core/target/org.eclipse.scout.sdk.core-9.0.0.025_Simrel_2019_09.jar
06:33:38 [INFO] 
06:33:38 [INFO] --- maven-site-plugin:3.7.1:attach-descriptor (attach-descriptor) @ org.eclipse.scout.sdk.core ---
06:33:38 [INFO] Skipping because packaging 'jar' is not pom.
06:33:38 [INFO] 
06:33:38 [INFO] --- maven-jar-plugin:3.1.1:test-jar (attach-tests) @ org.eclipse.scout.sdk.core ---
06:33:38 [INFO] Skipping packaging of the test-jar
06:33:38 [INFO] 
06:33:38 [INFO] --- maven-source-plugin:3.0.1:test-jar-no-fork (attach-test-sources) @ org.eclipse.scout.sdk.core ---
06:33:38 [INFO] No sources in project. Archive not created.
06:33:38 [INFO] 
06:33:38 [INFO] --- duplicate-finder-maven-plugin:1.3.0:check (default) @ org.eclipse.scout.sdk.core ---
06:33:38 [INFO] Checking compile classpath
06:33:38 [INFO] Checking runtime classpath
06:33:38 [INFO] Checking test classpath
06:33:38 [INFO] 
06:33:38 [INFO] --- animal-sniffer-maven-plugin:1.17:check (enforce-java-api-compatibility) @ org.eclipse.scout.sdk.core ---
06:33:38 [INFO] Checking unresolved references to org.codehaus.mojo.signature:java18:1.0
06:33:39 [INFO] 
06:33:39 [INFO] --- maven-source-plugin:3.0.1:jar-no-fork (attach-sources) @ org.eclipse.scout.sdk.core ---
06:33:39 [INFO] Building jar: /jobs/genie.scout/org.eclipse.scout.sdk_deploy_from_tag/workspace/org.eclipse.scout.sdk.core/target/org.eclipse.scout.sdk.core-9.0.0.025_Simrel_2019_09-sources.jar
06:33:39 [INFO] 
06:33:39 [INFO] --- maven-install-plugin:2.5.2:install (default-install) @ org.eclipse.scout.sdk.core ---
06:33:39 [INFO] Installing /jobs/genie.scout/org.eclipse.scout.sdk_deploy_from_tag/workspace/org.eclipse.scout.sdk.core/target/org.eclipse.scout.sdk.core-9.0.0.025_Simrel_2019_09.jar to /home/hudson/genie.scout/.jenkins/jobs/org.eclipse.scout.sdk_deploy_from_tag/workspace/.repository/org/eclipse/scout/sdk/org.eclipse.scout.sdk.core/9.0.0.025_Simrel_2019_09/org.eclipse.scout.sdk.core-9.0.0.025_Simrel_2019_09.jar
06:33:39 [INFO] Installing /jobs/genie.scout/org.eclipse.scout.sdk_deploy_from_tag/workspace/org.eclipse.scout.sdk.core/pom.xml to /home/hudson/genie.scout/.jenkins/jobs/org.eclipse.scout.sdk_deploy_from_tag/workspace/.repository/org/eclipse/scout/sdk/org.eclipse.scout.sdk.core/9.0.0.025_Simrel_2019_09/org.eclipse.scout.sdk.core-9.0.0.025_Simrel_2019_09.pom
06:33:39 [INFO] Installing /jobs/genie.scout/org.eclipse.scout.sdk_deploy_from_tag/workspace/org.eclipse.scout.sdk.core/target/org.eclipse.scout.sdk.core-9.0.0.025_Simrel_2019_09-sources.jar to /home/hudson/genie.scout/.jenkins/jobs/org.eclipse.scout.sdk_deploy_from_tag/workspace/.repository/org/eclipse/scout/sdk/org.eclipse.scout.sdk.core/9.0.0.025_Simrel_2019_09/org.eclipse.scout.sdk.core-9.0.0.025_Simrel_2019_09-sources.jar
06:33:39 [INFO] 
06:33:39 [INFO] -------< org.eclipse.scout.sdk:org.eclipse.scout.sdk.core.test >--------
06:33:39 [INFO] Building org.eclipse.scout.sdk:org.eclipse.scout.sdk.core.test 9.0.0.025_Simrel_2019_09 [6/14]
06:33:39 [INFO] --------------------------------[ jar ]---------------------------------
06:33:39 [INFO] 
06:33:39 [INFO] --- maven-clean-plugin:3.1.0:clean (default-clean) @ org.eclipse.scout.sdk.core.test ---
06:33:39 [INFO] Deleting /jobs/genie.scout/org.eclipse.scout.sdk_deploy_from_tag/workspace/org.eclipse.scout.sdk.core.test/target
06:33:39 [INFO] 
06:33:39 [INFO] --- maven-enforcer-plugin:1.4.1:enforce (enforce-rules) @ org.eclipse.scout.sdk.core.test ---
06:33:39 [INFO] 
06:33:39 [INFO] --- git-commit-id-plugin:2.2.5:revision (default) @ org.eclipse.scout.sdk.core.test ---
06:33:41 [INFO] 
06:33:41 [INFO] --- jacoco-maven-plugin:0.8.2:prepare-agent (default) @ org.eclipse.scout.sdk.core.test ---
06:33:41 [INFO] master_test_jacocoArgLine set to -javaagent:/home/hudson/genie.scout/.jenkins/jobs/org.eclipse.scout.sdk_deploy_from_tag/workspace/.repository/org/jacoco/org.jacoco.agent/0.8.2/org.jacoco.agent-0.8.2-runtime.jar=destfile=/jobs/genie.scout/org.eclipse.scout.sdk_deploy_from_tag/workspace/org.eclipse.scout.sdk.core.test/../org.eclipse.scout.sdk/target/jacoco-all.exec
06:33:41 [INFO] 
06:33:41 [INFO] --- build-helper-maven-plugin:3.0.0:parse-version (initialize-parse-version) @ org.eclipse.scout.sdk.core.test ---
06:33:41 [INFO] 
06:33:41 [INFO] --- build-helper-maven-plugin:3.0.0:regex-property (initialize-regex) @ org.eclipse.scout.sdk.core.test ---
06:33:41 [INFO] No match to regex 'SNAPSHOT' found in '9.0.0.025_Simrel_2019_09'. The initial value '9.0.0.025_Simrel_2019_09' is left as-is...
06:33:41 [INFO] 
06:33:41 [INFO] --- build-helper-maven-plugin:3.0.0:add-source (add-source) @ org.eclipse.scout.sdk.core.test ---
06:33:41 [INFO] Source directory: /jobs/genie.scout/org.eclipse.scout.sdk_deploy_from_tag/workspace/org.eclipse.scout.sdk.core.test/src/main/fixture added.
06:33:41 [INFO] 
06:33:41 [INFO] --- maven-resources-plugin:3.1.0:resources (default-resources) @ org.eclipse.scout.sdk.core.test ---
06:33:41 [INFO] Using 'UTF-8' encoding to copy filtered resources.
06:33:41 [INFO] Copying 2 resources
06:33:41 [INFO] Copying 2 resources
06:33:41 [INFO] 
06:33:41 [INFO] --- maven-compiler-plugin:3.8.0:compile (default-compile) @ org.eclipse.scout.sdk.core.test ---
06:33:41 [INFO] Changes detected - recompiling the module!
06:33:41 [INFO] Compiling 38 source files to /jobs/genie.scout/org.eclipse.scout.sdk_deploy_from_tag/workspace/org.eclipse.scout.sdk.core.test/target/classes
06:33:41 [INFO] 
06:33:41 [INFO] --- maven-resources-plugin:3.1.0:testResources (default-testResources) @ org.eclipse.scout.sdk.core.test ---
06:33:41 [INFO] Using 'UTF-8' encoding to copy filtered resources.
06:33:41 [INFO] skip non existing resourceDirectory /jobs/genie.scout/org.eclipse.scout.sdk_deploy_from_tag/workspace/org.eclipse.scout.sdk.core.test/src/test/resources
06:33:41 [INFO] 
06:33:41 [INFO] --- maven-compiler-plugin:3.8.0:testCompile (default-testCompile) @ org.eclipse.scout.sdk.core.test ---
06:33:41 [INFO] Changes detected - recompiling the module!
06:33:41 [INFO] Compiling 29 source files to /jobs/genie.scout/org.eclipse.scout.sdk_deploy_from_tag/workspace/org.eclipse.scout.sdk.core.test/target/test-classes
06:33:42 [INFO] 
06:33:42 [INFO] --- maven-surefire-plugin:2.22.1:test (default-test) @ org.eclipse.scout.sdk.core.test ---
06:33:42 [INFO] 
06:33:42 [INFO] -------------------------------------------------------
06:33:42 [INFO]  T E S T S
06:33:42 [INFO] -------------------------------------------------------
06:33:42 [INFO] Running org.eclipse.scout.sdk.core.importvalidator.ImportValidatorTest
06:33:44 [INFO] Tests run: 15, Failures: 0, Errors: 0, Skipped: 0, Time elapsed: 1.733 s - in org.eclipse.scout.sdk.core.importvalidator.ImportValidatorTest
06:33:44 [INFO] Running org.eclipse.scout.sdk.core.model.AnnotationElementTest
06:33:44 [INFO] Tests run: 3, Failures: 0, Errors: 0, Skipped: 0, Time elapsed: 0.25 s - in org.eclipse.scout.sdk.core.model.AnnotationElementTest
06:33:44 [INFO] Running org.eclipse.scout.sdk.core.model.AnnotationQueryTest
06:33:45 [INFO] Tests run: 4, Failures: 0, Errors: 0, Skipped: 0, Time elapsed: 0.412 s - in org.eclipse.scout.sdk.core.model.AnnotationQueryTest
06:33:45 [INFO] Running org.eclipse.scout.sdk.core.model.AnnotationSourceTest
06:33:45 [INFO] Tests run: 6, Failures: 0, Errors: 0, Skipped: 0, Time elapsed: 0.575 s - in org.eclipse.scout.sdk.core.model.AnnotationSourceTest
06:33:45 [INFO] Running org.eclipse.scout.sdk.core.model.AnnotationTest
06:33:46 [INFO] Tests run: 5, Failures: 0, Errors: 0, Skipped: 0, Time elapsed: 0.151 s - in org.eclipse.scout.sdk.core.model.AnnotationTest
06:33:46 [INFO] Running org.eclipse.scout.sdk.core.model.ArrayTypeTest
06:33:46 [INFO] Tests run: 1, Failures: 0, Errors: 0, Skipped: 0, Time elapsed: 0.109 s - in org.eclipse.scout.sdk.core.model.ArrayTypeTest
06:33:46 [INFO] Running org.eclipse.scout.sdk.core.model.CompilationUnitTest
06:33:46 [INFO] Tests run: 3, Failures: 0, Errors: 0, Skipped: 0, Time elapsed: 0.001 s - in org.eclipse.scout.sdk.core.model.CompilationUnitTest
06:33:46 [INFO] Running org.eclipse.scout.sdk.core.model.CreateAndOverrideNewCompilationUnitTest
06:33:46 [INFO] Tests run: 4, Failures: 0, Errors: 0, Skipped: 0, Time elapsed: 0.393 s - in org.eclipse.scout.sdk.core.model.CreateAndOverrideNewCompilationUnitTest
06:33:46 [INFO] Running org.eclipse.scout.sdk.core.model.FieldTest
06:33:46 [INFO] Tests run: 8, Failures: 0, Errors: 0, Skipped: 0, Time elapsed: 0.082 s - in org.eclipse.scout.sdk.core.model.FieldTest
06:33:46 [INFO] Running org.eclipse.scout.sdk.core.model.GenericMethodTest
06:33:47 [INFO] Tests run: 7, Failures: 0, Errors: 0, Skipped: 0, Time elapsed: 0.452 s - in org.eclipse.scout.sdk.core.model.GenericMethodTest
06:33:47 [INFO] Running org.eclipse.scout.sdk.core.model.ImportDeclarationTest
06:33:47 [INFO] Tests run: 2, Failures: 0, Errors: 0, Skipped: 0, Time elapsed: 0 s - in org.eclipse.scout.sdk.core.model.ImportDeclarationTest
06:33:47 [INFO] Running org.eclipse.scout.sdk.core.model.ManagedAnnotationTest
06:33:48 [INFO] Tests run: 9, Failures: 0, Errors: 0, Skipped: 0, Time elapsed: 0.817 s - in org.eclipse.scout.sdk.core.model.ManagedAnnotationTest
06:33:48 [INFO] Running org.eclipse.scout.sdk.core.model.MethodParameterTest
06:33:48 [INFO] Tests run: 3, Failures: 0, Errors: 0, Skipped: 0, Time elapsed: 0 s - in org.eclipse.scout.sdk.core.model.MethodParameterTest
06:33:48 [INFO] Running org.eclipse.scout.sdk.core.model.MethodTest
06:33:48 [INFO] Tests run: 3, Failures: 0, Errors: 0, Skipped: 0, Time elapsed: 0.025 s - in org.eclipse.scout.sdk.core.model.MethodTest
06:33:48 [INFO] Running org.eclipse.scout.sdk.core.model.PackageTest
06:33:48 [INFO] Tests run: 4, Failures: 0, Errors: 0, Skipped: 0, Time elapsed: 0.001 s - in org.eclipse.scout.sdk.core.model.PackageTest
06:33:48 [INFO] Running org.eclipse.scout.sdk.core.model.PrimitiveTypeTest
06:33:48 [INFO] Tests run: 1, Failures: 0, Errors: 0, Skipped: 0, Time elapsed: 0.045 s - in org.eclipse.scout.sdk.core.model.PrimitiveTypeTest
06:33:48 [INFO] Running org.eclipse.scout.sdk.core.model.SourceRangeTest
06:33:48 [INFO] Tests run: 1, Failures: 0, Errors: 0, Skipped: 0, Time elapsed: 0.001 s - in org.eclipse.scout.sdk.core.model.SourceRangeTest
06:33:48 [INFO] Running org.eclipse.scout.sdk.core.model.TypeParameterTest
06:33:48 [INFO] Tests run: 3, Failures: 0, Errors: 0, Skipped: 0, Time elapsed: 0.001 s - in org.eclipse.scout.sdk.core.model.TypeParameterTest
06:33:48 [INFO] Running org.eclipse.scout.sdk.core.model.TypeTest
06:33:48 [INFO] Tests run: 6, Failures: 0, Errors: 0, Skipped: 0, Time elapsed: 0.196 s - in org.eclipse.scout.sdk.core.model.TypeTest
06:33:48 [INFO] Running org.eclipse.scout.sdk.core.model.spi.internal.ClasspathBuilderTest
06:33:48 [INFO] Tests run: 2, Failures: 0, Errors: 0, Skipped: 0, Time elapsed: 0 s - in org.eclipse.scout.sdk.core.model.spi.internal.ClasspathBuilderTest
06:33:48 [INFO] Running org.eclipse.scout.sdk.core.model.spi.internal.CompositeObjectTest
06:33:48 [INFO] Tests run: 2, Failures: 0, Errors: 0, Skipped: 0, Time elapsed: 0.001 s - in org.eclipse.scout.sdk.core.model.spi.internal.CompositeObjectTest
06:33:48 [INFO] Running org.eclipse.scout.sdk.core.model.spi.internal.metavalue.MetaValueFactoryTest
06:33:48 [INFO] Tests run: 17, Failures: 0, Errors: 0, Skipped: 0, Time elapsed: 0.072 s - in org.eclipse.scout.sdk.core.model.spi.internal.metavalue.MetaValueFactoryTest
06:33:48 [INFO] Running org.eclipse.scout.sdk.core.model.sugar.QueryTest
06:33:48 [INFO] Tests run: 7, Failures: 0, Errors: 0, Skipped: 0, Time elapsed: 0.388 s - in org.eclipse.scout.sdk.core.model.sugar.QueryTest
06:33:48 [INFO] Running org.eclipse.scout.sdk.core.signature.SignatureTest
06:33:48 [INFO] Tests run: 189, Failures: 0, Errors: 0, Skipped: 0, Time elapsed: 0.056 s - in org.eclipse.scout.sdk.core.signature.SignatureTest
06:33:48 [INFO] Running org.eclipse.scout.sdk.core.signature.SignatureUtilsTest
06:33:48 [INFO] Tests run: 12, Failures: 0, Errors: 0, Skipped: 0, Time elapsed: 0 s - in org.eclipse.scout.sdk.core.signature.SignatureUtilsTest
06:33:48 [INFO] Running org.eclipse.scout.sdk.core.sourcebuilder.SourceModelRoundtripTest
06:33:48 [INFO] Tests run: 2, Failures: 0, Errors: 0, Skipped: 0, Time elapsed: 0.15 s - in org.eclipse.scout.sdk.core.sourcebuilder.SourceModelRoundtripTest
06:33:48 [INFO] Running org.eclipse.scout.sdk.core.util.CoreUtilsTest
06:33:49 [INFO] Tests run: 39, Failures: 0, Errors: 0, Skipped: 0, Time elapsed: 0.369 s - in org.eclipse.scout.sdk.core.util.CoreUtilsTest
06:33:49 [INFO] Running org.eclipse.scout.sdk.core.util.JavaEnvironmentImportExportTest
06:33:49 [INFO] Tests run: 1, Failures: 0, Errors: 0, Skipped: 0, Time elapsed: 0.01 s - in org.eclipse.scout.sdk.core.util.JavaEnvironmentImportExportTest
06:33:49 [INFO] Running org.eclipse.scout.sdk.core.util.SdkLogTest
06:33:49 Unable to parse log level 'aa'. Fallback to default: 'WARNING'.
06:33:49 java.lang.IllegalArgumentException: Bad level "aa"
06:33:49 	at java.util.logging.Level.parse(Level.java:488)
06:33:49 	at org.eclipse.scout.sdk.core.util.SdkLog.parseLevel(SdkLog.java:424)
06:33:49 	at org.eclipse.scout.sdk.core.util.SdkLogTest.testParseLevel(SdkLogTest.java:96)
06:33:49 	at sun.reflect.NativeMethodAccessorImpl.invoke0(Native Method)
06:33:49 	at sun.reflect.NativeMethodAccessorImpl.invoke(NativeMethodAccessorImpl.java:62)
06:33:49 	at sun.reflect.DelegatingMethodAccessorImpl.invoke(DelegatingMethodAccessorImpl.java:43)
06:33:49 	at java.lang.reflect.Method.invoke(Method.java:498)
06:33:49 	at org.junit.runners.model.FrameworkMethod$1.runReflectiveCall(FrameworkMethod.java:50)
06:33:49 	at org.junit.internal.runners.model.ReflectiveCallable.run(ReflectiveCallable.java:12)
06:33:49 	at org.junit.runners.model.FrameworkMethod.invokeExplosively(FrameworkMethod.java:47)
06:33:49 	at org.junit.internal.runners.statements.InvokeMethod.evaluate(InvokeMethod.java:17)
06:33:49 	at org.junit.runners.ParentRunner.runLeaf(ParentRunner.java:325)
06:33:49 	at org.junit.runners.BlockJUnit4ClassRunner.runChild(BlockJUnit4ClassRunner.java:78)
06:33:49 	at org.junit.runners.BlockJUnit4ClassRunner.runChild(BlockJUnit4ClassRunner.java:57)
06:33:49 	at org.junit.runners.ParentRunner$3.run(ParentRunner.java:290)
06:33:49 	at org.junit.runners.ParentRunner$1.schedule(ParentRunner.java:71)
06:33:49 	at org.junit.runners.ParentRunner.runChildren(ParentRunner.java:288)
06:33:49 	at org.junit.runners.ParentRunner.access$000(ParentRunner.java:58)
06:33:49 	at org.junit.runners.ParentRunner$2.evaluate(ParentRunner.java:268)
06:33:49 	at org.junit.runners.ParentRunner.run(ParentRunner.java:363)
06:33:49 	at org.apache.maven.surefire.junit4.JUnit4Provider.execute(JUnit4Provider.java:365)
06:33:49 	at org.apache.maven.surefire.junit4.JUnit4Provider.executeWithRerun(JUnit4Provider.java:273)
06:33:49 	at org.apache.maven.surefire.junit4.JUnit4Provider.executeTestSet(JUnit4Provider.java:238)
06:33:49 	at org.apache.maven.surefire.junit4.JUnit4Provider.invoke(JUnit4Provider.java:159)
06:33:49 	at org.apache.maven.surefire.booter.ForkedBooter.invokeProviderInSameClassLoader(ForkedBooter.java:384)
06:33:49 	at org.apache.maven.surefire.booter.ForkedBooter.runSuitesInProcess(ForkedBooter.java:345)
06:33:49 	at org.apache.maven.surefire.booter.ForkedBooter.execute(ForkedBooter.java:126)
06:33:49 	at org.apache.maven.surefire.booter.ForkedBooter.main(ForkedBooter.java:418)
06:33:49 Scout SdkLog: Failed toString() invocation on an object of type [org.eclipse.scout.sdk.core.util.SdkLogTest$ClassWithToStringThrowingNpeFixture]
06:33:49 java.lang.NullPointerException: NPE of test class org.eclipse.scout.sdk.core.util.SdkLogTest
06:33:49 	at org.eclipse.scout.sdk.core.util.SdkLogTest$ClassWithToStringThrowingNpeFixture.toString(SdkLogTest.java:156)
06:33:49 	at org.eclipse.scout.sdk.core.util.SdkLog.safeObjectToString(SdkLog.java:223)
06:33:49 	at org.eclipse.scout.sdk.core.util.SdkLog.toString(SdkLog.java:159)
06:33:49 	at org.eclipse.scout.sdk.core.util.SdkLog.handlePlaceholders(SdkLog.java:149)
06:33:49 	at org.eclipse.scout.sdk.core.util.SdkLog.log(SdkLog.java:93)
06:33:49 	at org.eclipse.scout.sdk.core.util.SdkLog.error(SdkLog.java:317)
06:33:49 	at org.eclipse.scout.sdk.core.util.SdkLogTest$1.run(SdkLogTest.java:104)
06:33:49 	at org.eclipse.scout.sdk.core.util.SdkLogTest.runWithPrivateLogger(SdkLogTest.java:193)
06:33:49 	at org.eclipse.scout.sdk.core.util.SdkLogTest.testLogOfObjectWithToStringThrowingException(SdkLogTest.java:101)
06:33:49 	at sun.reflect.NativeMethodAccessorImpl.invoke0(Native Method)
06:33:49 	at sun.reflect.NativeMethodAccessorImpl.invoke(NativeMethodAccessorImpl.java:62)
06:33:49 	at sun.reflect.DelegatingMethodAccessorImpl.invoke(DelegatingMethodAccessorImpl.java:43)
06:33:49 	at java.lang.reflect.Method.invoke(Method.java:498)
06:33:49 	at org.junit.runners.model.FrameworkMethod$1.runReflectiveCall(FrameworkMethod.java:50)
06:33:49 	at org.junit.internal.runners.model.ReflectiveCallable.run(ReflectiveCallable.java:12)
06:33:49 	at org.junit.runners.model.FrameworkMethod.invokeExplosively(FrameworkMethod.java:47)
06:33:49 	at org.junit.internal.runners.statements.InvokeMethod.evaluate(InvokeMethod.java:17)
06:33:49 	at org.junit.runners.ParentRunner.runLeaf(ParentRunner.java:325)
06:33:49 	at org.junit.runners.BlockJUnit4ClassRunner.runChild(BlockJUnit4ClassRunner.java:78)
06:33:49 	at org.junit.runners.BlockJUnit4ClassRunner.runChild(BlockJUnit4ClassRunner.java:57)
06:33:49 	at org.junit.runners.ParentRunner$3.run(ParentRunner.java:290)
06:33:49 	at org.junit.runners.ParentRunner$1.schedule(ParentRunner.java:71)
06:33:49 	at org.junit.runners.ParentRunner.runChildren(ParentRunner.java:288)
06:33:49 	at org.junit.runners.ParentRunner.access$000(ParentRunner.java:58)
06:33:49 	at org.junit.runners.ParentRunner$2.evaluate(ParentRunner.java:268)
06:33:49 	at org.junit.runners.ParentRunner.run(ParentRunner.java:363)
06:33:49 	at org.apache.maven.surefire.junit4.JUnit4Provider.execute(JUnit4Provider.java:365)
06:33:49 	at org.apache.maven.surefire.junit4.JUnit4Provider.executeWithRerun(JUnit4Provider.java:273)
06:33:49 	at org.apache.maven.surefire.junit4.JUnit4Provider.executeTestSet(JUnit4Provider.java:238)
06:33:49 	at org.apache.maven.surefire.junit4.JUnit4Provider.invoke(JUnit4Provider.java:159)
06:33:49 	at org.apache.maven.surefire.booter.ForkedBooter.invokeProviderInSameClassLoader(ForkedBooter.java:384)
06:33:49 	at org.apache.maven.surefire.booter.ForkedBooter.runSuitesInProcess(ForkedBooter.java:345)
06:33:49 	at org.apache.maven.surefire.booter.ForkedBooter.execute(ForkedBooter.java:126)
06:33:49 	at org.apache.maven.surefire.booter.ForkedBooter.main(ForkedBooter.java:418)
06:33:49 [INFO] Tests run: 5, Failures: 0, Errors: 0, Skipped: 0, Time elapsed: 0.014 s - in org.eclipse.scout.sdk.core.util.SdkLogTest
06:33:49 [INFO] 
06:33:49 [INFO] Results:
06:33:49 [INFO] 
06:33:49 [INFO] Tests run: 364, Failures: 0, Errors: 0, Skipped: 0
06:33:49 [INFO] 
06:33:49 [INFO] 
06:33:49 [INFO] --- maven-jar-plugin:3.1.1:jar (default-jar) @ org.eclipse.scout.sdk.core.test ---
06:33:49 [INFO] Building jar: /jobs/genie.scout/org.eclipse.scout.sdk_deploy_from_tag/workspace/org.eclipse.scout.sdk.core.test/target/org.eclipse.scout.sdk.core.test-9.0.0.025_Simrel_2019_09.jar
06:33:49 [INFO] 
06:33:49 [INFO] --- maven-site-plugin:3.7.1:attach-descriptor (attach-descriptor) @ org.eclipse.scout.sdk.core.test ---
06:33:49 [INFO] Skipping because packaging 'jar' is not pom.
06:33:49 [INFO] 
06:33:49 [INFO] --- maven-jar-plugin:3.1.1:test-jar (attach-tests) @ org.eclipse.scout.sdk.core.test ---
06:33:49 [INFO] Building jar: /jobs/genie.scout/org.eclipse.scout.sdk_deploy_from_tag/workspace/org.eclipse.scout.sdk.core.test/target/org.eclipse.scout.sdk.core.test-9.0.0.025_Simrel_2019_09-tests.jar
06:33:49 [INFO] 
06:33:49 [INFO] --- maven-source-plugin:3.0.1:test-jar-no-fork (attach-test-sources) @ org.eclipse.scout.sdk.core.test ---
06:33:49 [INFO] Building jar: /jobs/genie.scout/org.eclipse.scout.sdk_deploy_from_tag/workspace/org.eclipse.scout.sdk.core.test/target/org.eclipse.scout.sdk.core.test-9.0.0.025_Simrel_2019_09-test-sources.jar
06:33:49 [INFO] 
06:33:49 [INFO] --- duplicate-finder-maven-plugin:1.3.0:check (default) @ org.eclipse.scout.sdk.core.test ---
06:33:49 [INFO] Checking compile classpath
06:33:49 [INFO] Checking runtime classpath
06:33:49 [INFO] Checking test classpath
06:33:50 [INFO] 
06:33:50 [INFO] --- animal-sniffer-maven-plugin:1.17:check (enforce-java-api-compatibility) @ org.eclipse.scout.sdk.core.test ---
06:33:50 [INFO] Checking unresolved references to org.codehaus.mojo.signature:java18:1.0
06:33:50 [INFO] 
06:33:50 [INFO] --- maven-source-plugin:3.0.1:jar-no-fork (attach-sources) @ org.eclipse.scout.sdk.core.test ---
06:33:50 [INFO] Building jar: /jobs/genie.scout/org.eclipse.scout.sdk_deploy_from_tag/workspace/org.eclipse.scout.sdk.core.test/target/org.eclipse.scout.sdk.core.test-9.0.0.025_Simrel_2019_09-sources.jar
06:33:50 [INFO] 
06:33:50 [INFO] --- maven-install-plugin:2.5.2:install (default-install) @ org.eclipse.scout.sdk.core.test ---
06:33:50 [INFO] Installing /jobs/genie.scout/org.eclipse.scout.sdk_deploy_from_tag/workspace/org.eclipse.scout.sdk.core.test/target/org.eclipse.scout.sdk.core.test-9.0.0.025_Simrel_2019_09.jar to /home/hudson/genie.scout/.jenkins/jobs/org.eclipse.scout.sdk_deploy_from_tag/workspace/.repository/org/eclipse/scout/sdk/org.eclipse.scout.sdk.core.test/9.0.0.025_Simrel_2019_09/org.eclipse.scout.sdk.core.test-9.0.0.025_Simrel_2019_09.jar
06:33:50 [INFO] Installing /jobs/genie.scout/org.eclipse.scout.sdk_deploy_from_tag/workspace/org.eclipse.scout.sdk.core.test/pom.xml to /home/hudson/genie.scout/.jenkins/jobs/org.eclipse.scout.sdk_deploy_from_tag/workspace/.repository/org/eclipse/scout/sdk/org.eclipse.scout.sdk.core.test/9.0.0.025_Simrel_2019_09/org.eclipse.scout.sdk.core.test-9.0.0.025_Simrel_2019_09.pom
06:33:50 [INFO] Installing /jobs/genie.scout/org.eclipse.scout.sdk_deploy_from_tag/workspace/org.eclipse.scout.sdk.core.test/target/org.eclipse.scout.sdk.core.test-9.0.0.025_Simrel_2019_09-tests.jar to /home/hudson/genie.scout/.jenkins/jobs/org.eclipse.scout.sdk_deploy_from_tag/workspace/.repository/org/eclipse/scout/sdk/org.eclipse.scout.sdk.core.test/9.0.0.025_Simrel_2019_09/org.eclipse.scout.sdk.core.test-9.0.0.025_Simrel_2019_09-tests.jar
06:33:50 [INFO] Installing /jobs/genie.scout/org.eclipse.scout.sdk_deploy_from_tag/workspace/org.eclipse.scout.sdk.core.test/target/org.eclipse.scout.sdk.core.test-9.0.0.025_Simrel_2019_09-test-sources.jar to /home/hudson/genie.scout/.jenkins/jobs/org.eclipse.scout.sdk_deploy_from_tag/workspace/.repository/org/eclipse/scout/sdk/org.eclipse.scout.sdk.core.test/9.0.0.025_Simrel_2019_09/org.eclipse.scout.sdk.core.test-9.0.0.025_Simrel_2019_09-test-sources.jar
06:33:50 [INFO] Installing /jobs/genie.scout/org.eclipse.scout.sdk_deploy_from_tag/workspace/org.eclipse.scout.sdk.core.test/target/org.eclipse.scout.sdk.core.test-9.0.0.025_Simrel_2019_09-sources.jar to /home/hudson/genie.scout/.jenkins/jobs/org.eclipse.scout.sdk_deploy_from_tag/workspace/.repository/org/eclipse/scout/sdk/org.eclipse.scout.sdk.core.test/9.0.0.025_Simrel_2019_09/org.eclipse.scout.sdk.core.test-9.0.0.025_Simrel_2019_09-sources.jar
06:33:50 [INFO] 
06:33:50 [INFO] ---------< org.eclipse.scout.sdk:org.eclipse.scout.sdk.core.s >---------
06:33:50 [INFO] Building org.eclipse.scout.sdk:org.eclipse.scout.sdk.core.s 9.0.0.025_Simrel_2019_09 [7/14]
06:33:50 [INFO] --------------------------------[ jar ]---------------------------------
06:33:50 [INFO] 
06:33:50 [INFO] --- maven-clean-plugin:3.1.0:clean (default-clean) @ org.eclipse.scout.sdk.core.s ---
06:33:50 [INFO] Deleting /jobs/genie.scout/org.eclipse.scout.sdk_deploy_from_tag/workspace/org.eclipse.scout.sdk.core.s/target
06:33:50 [INFO] 
06:33:50 [INFO] --- maven-enforcer-plugin:1.4.1:enforce (enforce-rules) @ org.eclipse.scout.sdk.core.s ---
06:33:51 [INFO] 
06:33:51 [INFO] --- git-commit-id-plugin:2.2.5:revision (default) @ org.eclipse.scout.sdk.core.s ---
06:33:53 [INFO] 
06:33:53 [INFO] --- jacoco-maven-plugin:0.8.2:prepare-agent (default) @ org.eclipse.scout.sdk.core.s ---
06:33:53 [INFO] master_test_jacocoArgLine set to -javaagent:/home/hudson/genie.scout/.jenkins/jobs/org.eclipse.scout.sdk_deploy_from_tag/workspace/.repository/org/jacoco/org.jacoco.agent/0.8.2/org.jacoco.agent-0.8.2-runtime.jar=destfile=/jobs/genie.scout/org.eclipse.scout.sdk_deploy_from_tag/workspace/org.eclipse.scout.sdk.core.s/../org.eclipse.scout.sdk/target/jacoco-all.exec
06:33:53 [INFO] 
06:33:53 [INFO] --- build-helper-maven-plugin:3.0.0:parse-version (initialize-parse-version) @ org.eclipse.scout.sdk.core.s ---
06:33:53 [INFO] 
06:33:53 [INFO] --- build-helper-maven-plugin:3.0.0:regex-property (initialize-regex) @ org.eclipse.scout.sdk.core.s ---
06:33:53 [INFO] No match to regex 'SNAPSHOT' found in '9.0.0.025_Simrel_2019_09'. The initial value '9.0.0.025_Simrel_2019_09' is left as-is...
06:33:53 [INFO] 
06:33:53 [INFO] --- maven-resources-plugin:3.1.0:resources (default-resources) @ org.eclipse.scout.sdk.core.s ---
06:33:53 [INFO] Using 'UTF-8' encoding to copy filtered resources.
06:33:53 [INFO] skip non existing resourceDirectory /jobs/genie.scout/org.eclipse.scout.sdk_deploy_from_tag/workspace/org.eclipse.scout.sdk.core.s/src/main/resources
06:33:53 [INFO] Copying 2 resources
06:33:53 [INFO] 
06:33:53 [INFO] --- maven-compiler-plugin:3.8.0:compile (default-compile) @ org.eclipse.scout.sdk.core.s ---
06:33:53 [INFO] Changes detected - recompiling the module!
06:33:53 [INFO] Compiling 50 source files to /jobs/genie.scout/org.eclipse.scout.sdk_deploy_from_tag/workspace/org.eclipse.scout.sdk.core.s/target/classes
06:33:53 [INFO] 
06:33:53 [INFO] --- maven-resources-plugin:3.1.0:testResources (default-testResources) @ org.eclipse.scout.sdk.core.s ---
06:33:53 [INFO] Using 'UTF-8' encoding to copy filtered resources.
06:33:53 [INFO] skip non existing resourceDirectory /jobs/genie.scout/org.eclipse.scout.sdk_deploy_from_tag/workspace/org.eclipse.scout.sdk.core.s/src/test/resources
06:33:53 [INFO] 
06:33:53 [INFO] --- maven-compiler-plugin:3.8.0:testCompile (default-testCompile) @ org.eclipse.scout.sdk.core.s ---
06:33:53 [INFO] No sources to compile
06:33:53 [INFO] 
06:33:53 [INFO] --- maven-surefire-plugin:2.22.1:test (default-test) @ org.eclipse.scout.sdk.core.s ---
06:33:53 [INFO] No tests to run.
06:33:53 [INFO] 
06:33:53 [INFO] --- maven-jar-plugin:3.1.1:jar (default-jar) @ org.eclipse.scout.sdk.core.s ---
06:33:53 [INFO] Building jar: /jobs/genie.scout/org.eclipse.scout.sdk_deploy_from_tag/workspace/org.eclipse.scout.sdk.core.s/target/org.eclipse.scout.sdk.core.s-9.0.0.025_Simrel_2019_09.jar
06:33:53 [INFO] 
06:33:53 [INFO] --- maven-site-plugin:3.7.1:attach-descriptor (attach-descriptor) @ org.eclipse.scout.sdk.core.s ---
06:33:53 [INFO] Skipping because packaging 'jar' is not pom.
06:33:53 [INFO] 
06:33:53 [INFO] --- maven-jar-plugin:3.1.1:test-jar (attach-tests) @ org.eclipse.scout.sdk.core.s ---
06:33:53 [INFO] Skipping packaging of the test-jar
06:33:53 [INFO] 
06:33:53 [INFO] --- maven-source-plugin:3.0.1:test-jar-no-fork (attach-test-sources) @ org.eclipse.scout.sdk.core.s ---
06:33:53 [INFO] No sources in project. Archive not created.
06:33:53 [INFO] 
06:33:53 [INFO] --- duplicate-finder-maven-plugin:1.3.0:check (default) @ org.eclipse.scout.sdk.core.s ---
06:33:53 [INFO] Checking compile classpath
06:33:53 [INFO] Checking runtime classpath
06:33:54 [INFO] Checking test classpath
06:33:54 [INFO] 
06:33:54 [INFO] --- animal-sniffer-maven-plugin:1.17:check (enforce-java-api-compatibility) @ org.eclipse.scout.sdk.core.s ---
06:33:54 [INFO] Checking unresolved references to org.codehaus.mojo.signature:java18:1.0
06:33:55 [INFO] 
06:33:55 [INFO] --- maven-source-plugin:3.0.1:jar-no-fork (attach-sources) @ org.eclipse.scout.sdk.core.s ---
06:33:55 [INFO] Building jar: /jobs/genie.scout/org.eclipse.scout.sdk_deploy_from_tag/workspace/org.eclipse.scout.sdk.core.s/target/org.eclipse.scout.sdk.core.s-9.0.0.025_Simrel_2019_09-sources.jar
06:33:55 [INFO] 
06:33:55 [INFO] --- maven-install-plugin:2.5.2:install (default-install) @ org.eclipse.scout.sdk.core.s ---
06:33:55 [INFO] Installing /jobs/genie.scout/org.eclipse.scout.sdk_deploy_from_tag/workspace/org.eclipse.scout.sdk.core.s/target/org.eclipse.scout.sdk.core.s-9.0.0.025_Simrel_2019_09.jar to /home/hudson/genie.scout/.jenkins/jobs/org.eclipse.scout.sdk_deploy_from_tag/workspace/.repository/org/eclipse/scout/sdk/org.eclipse.scout.sdk.core.s/9.0.0.025_Simrel_2019_09/org.eclipse.scout.sdk.core.s-9.0.0.025_Simrel_2019_09.jar
06:33:55 [INFO] Installing /jobs/genie.scout/org.eclipse.scout.sdk_deploy_from_tag/workspace/org.eclipse.scout.sdk.core.s/pom.xml to /home/hudson/genie.scout/.jenkins/jobs/org.eclipse.scout.sdk_deploy_from_tag/workspace/.repository/org/eclipse/scout/sdk/org.eclipse.scout.sdk.core.s/9.0.0.025_Simrel_2019_09/org.eclipse.scout.sdk.core.s-9.0.0.025_Simrel_2019_09.pom
06:33:55 [INFO] Installing /jobs/genie.scout/org.eclipse.scout.sdk_deploy_from_tag/workspace/org.eclipse.scout.sdk.core.s/target/org.eclipse.scout.sdk.core.s-9.0.0.025_Simrel_2019_09-sources.jar to /home/hudson/genie.scout/.jenkins/jobs/org.eclipse.scout.sdk_deploy_from_tag/workspace/.repository/org/eclipse/scout/sdk/org.eclipse.scout.sdk.core.s/9.0.0.025_Simrel_2019_09/org.eclipse.scout.sdk.core.s-9.0.0.025_Simrel_2019_09-sources.jar
06:33:55 [INFO] 
06:33:55 [INFO] ------< org.eclipse.scout.sdk:org.eclipse.scout.sdk.core.s.test >-------
06:33:55 [INFO] Building org.eclipse.scout.sdk:org.eclipse.scout.sdk.core.s.test 9.0.0.025_Simrel_2019_09 [8/14]
06:33:55 [INFO] --------------------------------[ jar ]---------------------------------
06:33:55 Downloading from eclipse.release: https://repo.eclipse.org/content/groups/releases/org/eclipse/scout/rt/org.eclipse.scout.rt.ui.html.test/9.0.0.025_Simrel_2019_09/org.eclipse.scout.rt.ui.html.test-9.0.0.025_Simrel_2019_09.pom
06:33:55 Downloading from eclipse.maven.central.mirror: https://repo.eclipse.org/content/repositories/maven_central/org/eclipse/scout/rt/org.eclipse.scout.rt.ui.html.test/9.0.0.025_Simrel_2019_09/org.eclipse.scout.rt.ui.html.test-9.0.0.025_Simrel_2019_09.pom
06:33:55 [WARNING] The POM for org.eclipse.scout.rt:org.eclipse.scout.rt.ui.html.test:jar:9.0.0.025_Simrel_2019_09 is missing, no dependency information available
06:33:55 Downloading from eclipse.release: https://repo.eclipse.org/content/groups/releases/org/eclipse/scout/rt/org.eclipse.scout.rt.server.test/9.0.0.025_Simrel_2019_09/org.eclipse.scout.rt.server.test-9.0.0.025_Simrel_2019_09.pom
06:33:55 Downloading from eclipse.maven.central.mirror: https://repo.eclipse.org/content/repositories/maven_central/org/eclipse/scout/rt/org.eclipse.scout.rt.server.test/9.0.0.025_Simrel_2019_09/org.eclipse.scout.rt.server.test-9.0.0.025_Simrel_2019_09.pom
06:33:55 [WARNING] The POM for org.eclipse.scout.rt:org.eclipse.scout.rt.server.test:jar:9.0.0.025_Simrel_2019_09 is missing, no dependency information available
06:33:55 Downloading from eclipse.release: https://repo.eclipse.org/content/groups/releases/org/eclipse/scout/rt/org.eclipse.scout.rt.server.jaxws/9.0.0.025_Simrel_2019_09/org.eclipse.scout.rt.server.jaxws-9.0.0.025_Simrel_2019_09.pom
06:33:55 Downloading from eclipse.maven.central.mirror: https://repo.eclipse.org/content/repositories/maven_central/org/eclipse/scout/rt/org.eclipse.scout.rt.server.jaxws/9.0.0.025_Simrel_2019_09/org.eclipse.scout.rt.server.jaxws-9.0.0.025_Simrel_2019_09.pom
06:33:55 Progress (1): 1.5 kB
                    
Downloaded from eclipse.maven.central.mirror: https://repo.eclipse.org/content/repositories/maven_central/org/eclipse/scout/rt/org.eclipse.scout.rt.server.jaxws/9.0.0.025_Simrel_2019_09/org.eclipse.scout.rt.server.jaxws-9.0.0.025_Simrel_2019_09.pom (1.5 kB at 5.6 kB/s)
06:33:55 Downloading from eclipse.release: https://repo.eclipse.org/content/groups/releases/org/eclipse/scout/rt/org.eclipse.scout.rt.server/9.0.0.025_Simrel_2019_09/org.eclipse.scout.rt.server-9.0.0.025_Simrel_2019_09.pom
06:33:55 Downloading from eclipse.maven.central.mirror: https://repo.eclipse.org/content/repositories/maven_central/org/eclipse/scout/rt/org.eclipse.scout.rt.server/9.0.0.025_Simrel_2019_09/org.eclipse.scout.rt.server-9.0.0.025_Simrel_2019_09.pom
06:33:56 Progress (1): 1.6 kB
                    
Downloaded from eclipse.maven.central.mirror: https://repo.eclipse.org/content/repositories/maven_central/org/eclipse/scout/rt/org.eclipse.scout.rt.server/9.0.0.025_Simrel_2019_09/org.eclipse.scout.rt.server-9.0.0.025_Simrel_2019_09.pom (1.6 kB at 5.5 kB/s)
06:33:56 Downloading from eclipse.release: https://repo.eclipse.org/content/groups/releases/org/eclipse/scout/rt/org.eclipse.scout.rt.shared/9.0.0.025_Simrel_2019_09/org.eclipse.scout.rt.shared-9.0.0.025_Simrel_2019_09.pom
06:33:56 Downloading from eclipse.maven.central.mirror: https://repo.eclipse.org/content/repositories/maven_central/org/eclipse/scout/rt/org.eclipse.scout.rt.shared/9.0.0.025_Simrel_2019_09/org.eclipse.scout.rt.shared-9.0.0.025_Simrel_2019_09.pom
06:33:56 Downloading from bintray-bsi-business-systems-integration-ag-scout-eclipse-org: http://dl.bintray.com/bsi-business-systems-integration-ag/scout-eclipse-org/org/eclipse/scout/rt/org.eclipse.scout.rt.shared/9.0.0.025_Simrel_2019_09/org.eclipse.scout.rt.shared-9.0.0.025_Simrel_2019_09.pom
06:33:56 [WARNING] The POM for org.eclipse.scout.rt:org.eclipse.scout.rt.shared:jar:9.0.0.025_Simrel_2019_09 is missing, no dependency information available
06:33:56 Downloading from eclipse.release: https://repo.eclipse.org/content/groups/releases/org/eclipse/scout/rt/org.eclipse.scout.rt.server.commons/9.0.0.025_Simrel_2019_09/org.eclipse.scout.rt.server.commons-9.0.0.025_Simrel_2019_09.pom
06:33:56 Downloading from eclipse.maven.central.mirror: https://repo.eclipse.org/content/repositories/maven_central/org/eclipse/scout/rt/org.eclipse.scout.rt.server.commons/9.0.0.025_Simrel_2019_09/org.eclipse.scout.rt.server.commons-9.0.0.025_Simrel_2019_09.pom
06:33:56 Progress (1): 1.4 kB
                    
Downloaded from eclipse.maven.central.mirror: https://repo.eclipse.org/content/repositories/maven_central/org/eclipse/scout/rt/org.eclipse.scout.rt.server.commons/9.0.0.025_Simrel_2019_09/org.eclipse.scout.rt.server.commons-9.0.0.025_Simrel_2019_09.pom (1.4 kB at 5.8 kB/s)
06:33:56 Downloading from eclipse.release: https://repo.eclipse.org/content/groups/releases/org/eclipse/scout/rt/org.eclipse.scout.rt.mom.api/9.0.0.025_Simrel_2019_09/org.eclipse.scout.rt.mom.api-9.0.0.025_Simrel_2019_09.pom
06:33:56 Downloading from eclipse.maven.central.mirror: https://repo.eclipse.org/content/repositories/maven_central/org/eclipse/scout/rt/org.eclipse.scout.rt.mom.api/9.0.0.025_Simrel_2019_09/org.eclipse.scout.rt.mom.api-9.0.0.025_Simrel_2019_09.pom
06:33:56 Progress (1): 1.3 kB
                    
Downloaded from eclipse.maven.central.mirror: https://repo.eclipse.org/content/repositories/maven_central/org/eclipse/scout/rt/org.eclipse.scout.rt.mom.api/9.0.0.025_Simrel_2019_09/org.eclipse.scout.rt.mom.api-9.0.0.025_Simrel_2019_09.pom (1.3 kB at 5.3 kB/s)
06:33:56 Downloading from eclipse.release: https://repo.eclipse.org/content/groups/releases/org/eclipse/scout/rt/org.eclipse.scout.rt.platform/9.0.0.025_Simrel_2019_09/org.eclipse.scout.rt.platform-9.0.0.025_Simrel_2019_09.pom
06:33:57 Downloading from eclipse.maven.central.mirror: https://repo.eclipse.org/content/repositories/maven_central/org/eclipse/scout/rt/org.eclipse.scout.rt.platform/9.0.0.025_Simrel_2019_09/org.eclipse.scout.rt.platform-9.0.0.025_Simrel_2019_09.pom
06:33:57 Progress (1): 3.7 kB
                    
Downloaded from eclipse.maven.central.mirror: https://repo.eclipse.org/content/repositories/maven_central/org/eclipse/scout/rt/org.eclipse.scout.rt.platform/9.0.0.025_Simrel_2019_09/org.eclipse.scout.rt.platform-9.0.0.025_Simrel_2019_09.pom (3.7 kB at 12 kB/s)
06:33:57 Downloading from eclipse.release: https://repo.eclipse.org/content/groups/releases/org/eclipse/scout/rt/org.eclipse.scout.rt.dataobject/9.0.0.025_Simrel_2019_09/org.eclipse.scout.rt.dataobject-9.0.0.025_Simrel_2019_09.pom
06:33:57 Downloading from eclipse.maven.central.mirror: https://repo.eclipse.org/content/repositories/maven_central/org/eclipse/scout/rt/org.eclipse.scout.rt.dataobject/9.0.0.025_Simrel_2019_09/org.eclipse.scout.rt.dataobject-9.0.0.025_Simrel_2019_09.pom
06:33:57 Progress (1): 1.3 kB
                    
Downloaded from eclipse.maven.central.mirror: https://repo.eclipse.org/content/repositories/maven_central/org/eclipse/scout/rt/org.eclipse.scout.rt.dataobject/9.0.0.025_Simrel_2019_09/org.eclipse.scout.rt.dataobject-9.0.0.025_Simrel_2019_09.pom (1.3 kB at 4.5 kB/s)
06:33:57 Downloading from eclipse.release: https://repo.eclipse.org/content/groups/releases/org/eclipse/scout/rt/org.eclipse.scout.rt.ui.html.test/9.0.0.025_Simrel_2019_09/org.eclipse.scout.rt.ui.html.test-9.0.0.025_Simrel_2019_09.jar
06:33:57 Downloading from eclipse.release: https://repo.eclipse.org/content/groups/releases/org/eclipse/scout/rt/org.eclipse.scout.rt.server.jaxws/9.0.0.025_Simrel_2019_09/org.eclipse.scout.rt.server.jaxws-9.0.0.025_Simrel_2019_09.jar
06:33:57 Downloading from eclipse.release: https://repo.eclipse.org/content/groups/releases/org/eclipse/scout/rt/org.eclipse.scout.rt.server.test/9.0.0.025_Simrel_2019_09/org.eclipse.scout.rt.server.test-9.0.0.025_Simrel_2019_09.jar
06:33:57 Downloading from eclipse.release: https://repo.eclipse.org/content/groups/releases/org/eclipse/scout/rt/org.eclipse.scout.rt.shared/9.0.0.025_Simrel_2019_09/org.eclipse.scout.rt.shared-9.0.0.025_Simrel_2019_09.jar
06:33:57 Downloading from eclipse.release: https://repo.eclipse.org/content/groups/releases/org/eclipse/scout/rt/org.eclipse.scout.rt.server/9.0.0.025_Simrel_2019_09/org.eclipse.scout.rt.server-9.0.0.025_Simrel_2019_09.jar
06:33:57 Downloading from eclipse.release: https://repo.eclipse.org/content/groups/releases/org/eclipse/scout/rt/org.eclipse.scout.rt.server.commons/9.0.0.025_Simrel_2019_09/org.eclipse.scout.rt.server.commons-9.0.0.025_Simrel_2019_09.jar
06:33:57 Downloading from eclipse.release: https://repo.eclipse.org/content/groups/releases/org/eclipse/scout/rt/org.eclipse.scout.rt.mom.api/9.0.0.025_Simrel_2019_09/org.eclipse.scout.rt.mom.api-9.0.0.025_Simrel_2019_09.jar
06:33:57 Downloading from eclipse.release: https://repo.eclipse.org/content/groups/releases/org/eclipse/scout/rt/org.eclipse.scout.rt.dataobject/9.0.0.025_Simrel_2019_09/org.eclipse.scout.rt.dataobject-9.0.0.025_Simrel_2019_09.jar
06:33:57 Downloading from eclipse.release: https://repo.eclipse.org/content/groups/releases/org/eclipse/scout/rt/org.eclipse.scout.rt.platform/9.0.0.025_Simrel_2019_09/org.eclipse.scout.rt.platform-9.0.0.025_Simrel_2019_09.jar
06:33:57 Downloading from eclipse.maven.central.mirror: https://repo.eclipse.org/content/repositories/maven_central/org/eclipse/scout/rt/org.eclipse.scout.rt.ui.html.test/9.0.0.025_Simrel_2019_09/org.eclipse.scout.rt.ui.html.test-9.0.0.025_Simrel_2019_09.jar
06:33:57 Downloading from eclipse.maven.central.mirror: https://repo.eclipse.org/content/repositories/maven_central/org/eclipse/scout/rt/org.eclipse.scout.rt.server/9.0.0.025_Simrel_2019_09/org.eclipse.scout.rt.server-9.0.0.025_Simrel_2019_09.jar
06:33:57 Downloading from eclipse.maven.central.mirror: https://repo.eclipse.org/content/repositories/maven_central/org/eclipse/scout/rt/org.eclipse.scout.rt.shared/9.0.0.025_Simrel_2019_09/org.eclipse.scout.rt.shared-9.0.0.025_Simrel_2019_09.jar
06:33:57 Downloading from eclipse.maven.central.mirror: https://repo.eclipse.org/content/repositories/maven_central/org/eclipse/scout/rt/org.eclipse.scout.rt.server.jaxws/9.0.0.025_Simrel_2019_09/org.eclipse.scout.rt.server.jaxws-9.0.0.025_Simrel_2019_09.jar
06:33:57 Downloading from eclipse.maven.central.mirror: https://repo.eclipse.org/content/repositories/maven_central/org/eclipse/scout/rt/org.eclipse.scout.rt.server.test/9.0.0.025_Simrel_2019_09/org.eclipse.scout.rt.server.test-9.0.0.025_Simrel_2019_09.jar
06:33:57 Downloading from eclipse.maven.central.mirror: https://repo.eclipse.org/content/repositories/maven_central/org/eclipse/scout/rt/org.eclipse.scout.rt.server.commons/9.0.0.025_Simrel_2019_09/org.eclipse.scout.rt.server.commons-9.0.0.025_Simrel_2019_09.jar
06:33:57 Downloading from eclipse.maven.central.mirror: https://repo.eclipse.org/content/repositories/maven_central/org/eclipse/scout/rt/org.eclipse.scout.rt.mom.api/9.0.0.025_Simrel_2019_09/org.eclipse.scout.rt.mom.api-9.0.0.025_Simrel_2019_09.jar
06:33:58 Progress (1): 4.1/23 kB
Progress (1): 7.7/23 kB
Progress (1): 12/23 kB 
Progress (1): 16/23 kB
Progress (1): 20/23 kB
Progress (1): 23 kB   
Progress (2): 23 kB | 4.1/140 kB
Progress (2): 23 kB | 7.7/140 kB
Progress (2): 23 kB | 12/140 kB 
Progress (2): 23 kB | 16/140 kB
Progress (2): 23 kB | 20/140 kB
Progress (2): 23 kB | 24/140 kB
Progress (2): 23 kB | 28/140 kB
Progress (2): 23 kB | 32/140 kB
Progress (2): 23 kB | 36/140 kB
Progress (2): 23 kB | 40/140 kB
Progress (2): 23 kB | 44/140 kB
Progress (2): 23 kB | 48/140 kB
Progress (2): 23 kB | 52/140 kB
Progress (2): 23 kB | 56/140 kB
Progress (2): 23 kB | 60/140 kB
Progress (2): 23 kB | 64/140 kB
Progress (2): 23 kB | 68/140 kB
Progress (2): 23 kB | 72/140 kB
Progress (2): 23 kB | 76/140 kB
Progress (2): 23 kB | 80/140 kB
Progress (2): 23 kB | 84/140 kB
Progress (2): 23 kB | 88/140 kB
Progress (2): 23 kB | 92/140 kB
Progress (2): 23 kB | 96/140 kB
Progress (2): 23 kB | 100/140 kB
Progress (2): 23 kB | 104/140 kB
Progress (2): 23 kB | 108/140 kB
Progress (2): 23 kB | 112/140 kB
Progress (2): 23 kB | 116/140 kB
Progress (2): 23 kB | 120/140 kB
Progress (2): 23 kB | 124/140 kB
Progress (2): 23 kB | 128/140 kB
Progress (2): 23 kB | 132/140 kB
Progress (2): 23 kB | 136/140 kB
Progress (2): 23 kB | 140/140 kB
Progress (2): 23 kB | 140 kB    
Progress (3): 23 kB | 140 kB | 4.1/59 kB
Progress (3): 23 kB | 140 kB | 7.7/59 kB
Progress (3): 23 kB | 140 kB | 12/59 kB 
Progress (4): 23 kB | 140 kB | 12/59 kB | 4.1/157 kB
Progress (4): 23 kB | 140 kB | 16/59 kB | 4.1/157 kB
Progress (4): 23 kB | 140 kB | 16/59 kB | 7.7/157 kB
Progress (4): 23 kB | 140 kB | 20/59 kB | 7.7/157 kB
Progress (4): 23 kB | 140 kB | 20/59 kB | 12/157 kB 
Progress (4): 23 kB | 140 kB | 24/59 kB | 12/157 kB
Progress (4): 23 kB | 140 kB | 24/59 kB | 16/157 kB
Progress (4): 23 kB | 140 kB | 28/59 kB | 16/157 kB
Progress (4): 23 kB | 140 kB | 28/59 kB | 20/157 kB
Progress (4): 23 kB | 140 kB | 32/59 kB | 20/157 kB
Progress (4): 23 kB | 140 kB | 32/59 kB | 24/157 kB
Progress (4): 23 kB | 140 kB | 36/59 kB | 24/157 kB
Progress (4): 23 kB | 140 kB | 36/59 kB | 28/157 kB
Progress (4): 23 kB | 140 kB | 40/59 kB | 28/157 kB
Progress (4): 23 kB | 140 kB | 40/59 kB | 32/157 kB
Progress (4): 23 kB | 140 kB | 44/59 kB | 32/157 kB
Progress (4): 23 kB | 140 kB | 44/59 kB | 36/157 kB
Progress (4): 23 kB | 140 kB | 48/59 kB | 36/157 kB
Progress (4): 23 kB | 140 kB | 48/59 kB | 40/157 kB
Progress (4): 23 kB | 140 kB | 52/59 kB | 40/157 kB
Progress (4): 23 kB | 140 kB | 52/59 kB | 44/157 kB
Progress (4): 23 kB | 140 kB | 56/59 kB | 44/157 kB
Progress (4): 23 kB | 140 kB | 56/59 kB | 48/157 kB
Progress (4): 23 kB | 140 kB | 59 kB | 48/157 kB   
Progress (4): 23 kB | 140 kB | 59 kB | 52/157 kB
Progress (4): 23 kB | 140 kB | 59 kB | 56/157 kB
Progress (4): 23 kB | 140 kB | 59 kB | 60/157 kB
Progress (4): 23 kB | 140 kB | 59 kB | 64/157 kB
Progress (4): 23 kB | 140 kB | 59 kB | 68/157 kB
Progress (4): 23 kB | 140 kB | 59 kB | 72/157 kB
Progress (4): 23 kB | 140 kB | 59 kB | 76/157 kB
Progress (4): 23 kB | 140 kB | 59 kB | 80/157 kB
Progress (4): 23 kB | 140 kB | 59 kB | 84/157 kB
Progress (4): 23 kB | 140 kB | 59 kB | 88/157 kB
Progress (4): 23 kB | 140 kB | 59 kB | 92/157 kB
Progress (4): 23 kB | 140 kB | 59 kB | 96/157 kB
Progress (4): 23 kB | 140 kB | 59 kB | 100/157 kB
Progress (4): 23 kB | 140 kB | 59 kB | 104/157 kB
Progress (4): 23 kB | 140 kB | 59 kB | 108/157 kB
Progress (4): 23 kB | 140 kB | 59 kB | 112/157 kB
Progress (4): 23 kB | 140 kB | 59 kB | 116/157 kB
Progress (4): 23 kB | 140 kB | 59 kB | 120/157 kB
Progress (4): 23 kB | 140 kB | 59 kB | 124/157 kB
Progress (4): 23 kB | 140 kB | 59 kB | 128/157 kB
Progress (4): 23 kB | 140 kB | 59 kB | 132/157 kB
Progress (4): 23 kB | 140 kB | 59 kB | 136/157 kB
Progress (4): 23 kB | 140 kB | 59 kB | 140/157 kB
Progress (4): 23 kB | 140 kB | 59 kB | 144/157 kB
Progress (4): 23 kB | 140 kB | 59 kB | 148/157 kB
Progress (4): 23 kB | 140 kB | 59 kB | 152/157 kB
Progress (4): 23 kB | 140 kB | 59 kB | 156/157 kB
Progress (4): 23 kB | 140 kB | 59 kB | 157 kB    
Progress (5): 23 kB | 140 kB | 59 kB | 157 kB | 4.1/290 kB
Progress (5): 23 kB | 140 kB | 59 kB | 157 kB | 7.7/290 kB
Progress (5): 23 kB | 140 kB | 59 kB | 157 kB | 12/290 kB 
Progress (5): 23 kB | 140 kB | 59 kB | 157 kB | 16/290 kB
Progress (5): 23 kB | 140 kB | 59 kB | 157 kB | 20/290 kB
Progress (5): 23 kB | 140 kB | 59 kB | 157 kB | 24/290 kB
Progress (5): 23 kB | 140 kB | 59 kB | 157 kB | 28/290 kB
Progress (5): 23 kB | 140 kB | 59 kB | 157 kB | 32/290 kB
Progress (5): 23 kB | 140 kB | 59 kB | 157 kB | 36/290 kB
Progress (5): 23 kB | 140 kB | 59 kB | 157 kB | 40/290 kB
Progress (5): 23 kB | 140 kB | 59 kB | 157 kB | 44/290 kB
Progress (5): 23 kB | 140 kB | 59 kB | 157 kB | 48/290 kB
Progress (5): 23 kB | 140 kB | 59 kB | 157 kB | 52/290 kB
Progress (5): 23 kB | 140 kB | 59 kB | 157 kB | 56/290 kB
Progress (5): 23 kB | 140 kB | 59 kB | 157 kB | 60/290 kB
Progress (5): 23 kB | 140 kB | 59 kB | 157 kB | 64/290 kB
Progress (5): 23 kB | 140 kB | 59 kB | 157 kB | 68/290 kB
Progress (5): 23 kB | 140 kB | 59 kB | 157 kB | 72/290 kB
Progress (5): 23 kB | 140 kB | 59 kB | 157 kB | 76/290 kB
Progress (5): 23 kB | 140 kB | 59 kB | 157 kB | 80/290 kB
Progress (5): 23 kB | 140 kB | 59 kB | 157 kB | 84/290 kB
Progress (5): 23 kB | 140 kB | 59 kB | 157 kB | 88/290 kB
Progress (5): 23 kB | 140 kB | 59 kB | 157 kB | 92/290 kB
Progress (5): 23 kB | 140 kB | 59 kB | 157 kB | 96/290 kB
Progress (5): 23 kB | 140 kB | 59 kB | 157 kB | 100/290 kB
Progress (5): 23 kB | 140 kB | 59 kB | 157 kB | 104/290 kB
Progress (5): 23 kB | 140 kB | 59 kB | 157 kB | 108/290 kB
Progress (5): 23 kB | 140 kB | 59 kB | 157 kB | 112/290 kB
Progress (5): 23 kB | 140 kB | 59 kB | 157 kB | 116/290 kB
Progress (5): 23 kB | 140 kB | 59 kB | 157 kB | 120/290 kB
Progress (5): 23 kB | 140 kB | 59 kB | 157 kB | 124/290 kB
Progress (5): 23 kB | 140 kB | 59 kB | 157 kB | 128/290 kB
Progress (5): 23 kB | 140 kB | 59 kB | 157 kB | 132/290 kB
Progress (5): 23 kB | 140 kB | 59 kB | 157 kB | 136/290 kB
Progress (5): 23 kB | 140 kB | 59 kB | 157 kB | 140/290 kB
Progress (5): 23 kB | 140 kB | 59 kB | 157 kB | 144/290 kB
Progress (5): 23 kB | 140 kB | 59 kB | 157 kB | 148/290 kB
Progress (5): 23 kB | 140 kB | 59 kB | 157 kB | 152/290 kB
Progress (5): 23 kB | 140 kB | 59 kB | 157 kB | 156/290 kB
Progress (5): 23 kB | 140 kB | 59 kB | 157 kB | 160/290 kB
Progress (5): 23 kB | 140 kB | 59 kB | 157 kB | 164/290 kB
Progress (5): 23 kB | 140 kB | 59 kB | 157 kB | 168/290 kB
Progress (5): 23 kB | 140 kB | 59 kB | 157 kB | 172/290 kB
Progress (5): 23 kB | 140 kB | 59 kB | 157 kB | 176/290 kB
Progress (5): 23 kB | 140 kB | 59 kB | 157 kB | 180/290 kB
Progress (5): 23 kB | 140 kB | 59 kB | 157 kB | 184/290 kB
Progress (5): 23 kB | 140 kB | 59 kB | 157 kB | 188/290 kB
Progress (5): 23 kB | 140 kB | 59 kB | 157 kB | 192/290 kB
Progress (5): 23 kB | 140 kB | 59 kB | 157 kB | 196/290 kB
Progress (5): 23 kB | 140 kB | 59 kB | 157 kB | 200/290 kB
Progress (5): 23 kB | 140 kB | 59 kB | 157 kB | 204/290 kB
Progress (5): 23 kB | 140 kB | 59 kB | 157 kB | 208/290 kB
Progress (5): 23 kB | 140 kB | 59 kB | 157 kB | 212/290 kB
Progress (5): 23 kB | 140 kB | 59 kB | 157 kB | 216/290 kB
Progress (5): 23 kB | 140 kB | 59 kB | 157 kB | 220/290 kB
Progress (5): 23 kB | 140 kB | 59 kB | 157 kB | 224/290 kB
Progress (5): 23 kB | 140 kB | 59 kB | 157 kB | 228/290 kB
Progress (5): 23 kB | 140 kB | 59 kB | 157 kB | 232/290 kB
Progress (5): 23 kB | 140 kB | 59 kB | 157 kB | 236/290 kB
Progress (5): 23 kB | 140 kB | 59 kB | 157 kB | 240/290 kB
Progress (5): 23 kB | 140 kB | 59 kB | 157 kB | 244/290 kB
Progress (5): 23 kB | 140 kB | 59 kB | 157 kB | 248/290 kB
Progress (5): 23 kB | 140 kB | 59 kB | 157 kB | 252/290 kB
Progress (5): 23 kB | 140 kB | 59 kB | 157 kB | 256/290 kB
Progress (5): 23 kB | 140 kB | 59 kB | 157 kB | 260/290 kB
Progress (5): 23 kB | 140 kB | 59 kB | 157 kB | 264/290 kB
Progress (5): 23 kB | 140 kB | 59 kB | 157 kB | 268/290 kB
Progress (5): 23 kB | 140 kB | 59 kB | 157 kB | 272/290 kB
Progress (5): 23 kB | 140 kB | 59 kB | 157 kB | 276/290 kB
Progress (5): 23 kB | 140 kB | 59 kB | 157 kB | 280/290 kB
Progress (5): 23 kB | 140 kB | 59 kB | 157 kB | 284/290 kB
Progress (5): 23 kB | 140 kB | 59 kB | 157 kB | 288/290 kB
Progress (5): 23 kB | 140 kB | 59 kB | 157 kB | 290 kB    
[WARNING] Could not validate integrity of download from https://repo.eclipse.org/content/repositories/maven_central/org/eclipse/scout/rt/org.eclipse.scout.rt.server.test/9.0.0.025_Simrel_2019_09/org.eclipse.scout.rt.server.test-9.0.0.025_Simrel_2019_09.jar: Checksum validation failed, no checksums available
06:33:58                                                       
[WARNING] Checksum validation failed, no checksums available from eclipse.maven.central.mirror for https://repo.eclipse.org/content/repositories/maven_central/org/eclipse/scout/rt/org.eclipse.scout.rt.server.test/9.0.0.025_Simrel_2019_09/org.eclipse.scout.rt.server.test-9.0.0.025_Simrel_2019_09.jar
06:33:58 Downloaded from eclipse.maven.central.mirror: https://repo.eclipse.org/content/repositories/maven_central/org/eclipse/scout/rt/org.eclipse.scout.rt.server.test/9.0.0.025_Simrel_2019_09/org.eclipse.scout.rt.server.test-9.0.0.025_Simrel_2019_09.jar (23 kB at 37 kB/s)
06:33:58 Downloading from eclipse.maven.central.mirror: https://repo.eclipse.org/content/repositories/maven_central/org/eclipse/scout/rt/org.eclipse.scout.rt.dataobject/9.0.0.025_Simrel_2019_09/org.eclipse.scout.rt.dataobject-9.0.0.025_Simrel_2019_09.jar
06:33:58 Downloaded from eclipse.maven.central.mirror: https://repo.eclipse.org/content/repositories/maven_central/org/eclipse/scout/rt/org.eclipse.scout.rt.server.jaxws/9.0.0.025_Simrel_2019_09/org.eclipse.scout.rt.server.jaxws-9.0.0.025_Simrel_2019_09.jar (140 kB at 222 kB/s)
06:33:58 Downloading from eclipse.maven.central.mirror: https://repo.eclipse.org/content/repositories/maven_central/org/eclipse/scout/rt/org.eclipse.scout.rt.platform/9.0.0.025_Simrel_2019_09/org.eclipse.scout.rt.platform-9.0.0.025_Simrel_2019_09.jar
06:33:58 Downloaded from eclipse.maven.central.mirror: https://repo.eclipse.org/content/repositories/maven_central/org/eclipse/scout/rt/org.eclipse.scout.rt.server/9.0.0.025_Simrel_2019_09/org.eclipse.scout.rt.server-9.0.0.025_Simrel_2019_09.jar (290 kB at 456 kB/s)
06:33:58 Downloaded from eclipse.maven.central.mirror: https://repo.eclipse.org/content/repositories/maven_central/org/eclipse/scout/rt/org.eclipse.scout.rt.mom.api/9.0.0.025_Simrel_2019_09/org.eclipse.scout.rt.mom.api-9.0.0.025_Simrel_2019_09.jar (59 kB at 93 kB/s)
06:33:58 Downloaded from eclipse.maven.central.mirror: https://repo.eclipse.org/content/repositories/maven_central/org/eclipse/scout/rt/org.eclipse.scout.rt.server.commons/9.0.0.025_Simrel_2019_09/org.eclipse.scout.rt.server.commons-9.0.0.025_Simrel_2019_09.jar (157 kB at 246 kB/s)
06:33:58 Progress (1): 4.1/31 kB
Progress (1): 7.7/31 kB
Progress (1): 12/31 kB 
Progress (1): 16/31 kB
Progress (1): 20/31 kB
Progress (1): 24/31 kB
Progress (1): 28/31 kB
Progress (1): 31 kB   
                   
Downloaded from eclipse.maven.central.mirror: https://repo.eclipse.org/content/repositories/maven_central/org/eclipse/scout/rt/org.eclipse.scout.rt.dataobject/9.0.0.025_Simrel_2019_09/org.eclipse.scout.rt.dataobject-9.0.0.025_Simrel_2019_09.jar (31 kB at 34 kB/s)
06:33:59 Progress (1): 4.1/908 kB
Progress (1): 7.7/908 kB
Progress (1): 12/908 kB 
Progress (1): 16/908 kB
Progress (1): 20/908 kB
Progress (1): 24/908 kB
Progress (1): 28/908 kB
Progress (1): 32/908 kB
Progress (1): 33/908 kB
Progress (1): 37/908 kB
Progress (1): 41/908 kB
Progress (1): 45/908 kB
Progress (1): 49/908 kB
Progress (1): 53/908 kB
Progress (1): 57/908 kB
Progress (1): 61/908 kB
Progress (1): 65/908 kB
Progress (1): 69/908 kB
Progress (1): 73/908 kB
Progress (1): 77/908 kB
Progress (1): 81/908 kB
Progress (1): 85/908 kB
Progress (1): 89/908 kB
Progress (1): 93/908 kB
Progress (1): 97/908 kB
Progress (1): 101/908 kB
Progress (1): 105/908 kB
Progress (1): 109/908 kB
Progress (1): 113/908 kB
Progress (1): 117/908 kB
Progress (1): 121/908 kB
Progress (1): 125/908 kB
Progress (1): 129/908 kB
Progress (1): 133/908 kB
Progress (1): 137/908 kB
Progress (1): 141/908 kB
Progress (1): 145/908 kB
Progress (1): 149/908 kB
Progress (1): 153/908 kB
Progress (1): 157/908 kB
Progress (1): 161/908 kB
Progress (1): 165/908 kB
Progress (1): 169/908 kB
Progress (1): 173/908 kB
Progress (1): 177/908 kB
Progress (1): 181/908 kB
Progress (1): 185/908 kB
Progress (1): 189/908 kB
Progress (1): 193/908 kB
Progress (1): 197/908 kB
Progress (1): 201/908 kB
Progress (1): 205/908 kB
Progress (1): 209/908 kB
Progress (1): 213/908 kB
Progress (1): 217/908 kB
Progress (1): 221/908 kB
Progress (1): 225/908 kB
Progress (1): 229/908 kB
Progress (1): 233/908 kB
Progress (1): 237/908 kB
Progress (1): 241/908 kB
Progress (1): 245/908 kB
Progress (1): 249/908 kB
Progress (1): 253/908 kB
Progress (1): 257/908 kB
Progress (1): 261/908 kB
Progress (1): 265/908 kB
Progress (1): 269/908 kB
Progress (1): 273/908 kB
Progress (1): 277/908 kB
Progress (1): 281/908 kB
Progress (1): 285/908 kB
Progress (1): 289/908 kB
Progress (1): 293/908 kB
Progress (1): 297/908 kB
Progress (1): 301/908 kB
Progress (1): 305/908 kB
Progress (1): 309/908 kB
Progress (1): 313/908 kB
Progress (1): 317/908 kB
Progress (1): 321/908 kB
Progress (1): 325/908 kB
Progress (1): 329/908 kB
Progress (1): 333/908 kB
Progress (1): 337/908 kB
Progress (1): 341/908 kB
Progress (1): 345/908 kB
Progress (1): 349/908 kB
Progress (1): 353/908 kB
Progress (1): 357/908 kB
Progress (1): 361/908 kB
Progress (1): 365/908 kB
Progress (1): 369/908 kB
Progress (1): 373/908 kB
Progress (1): 377/908 kB
Progress (1): 381/908 kB
Progress (1): 385/908 kB
Progress (1): 389/908 kB
Progress (1): 393/908 kB
Progress (1): 397/908 kB
Progress (1): 401/908 kB
Progress (1): 405/908 kB
Progress (1): 409/908 kB
Progress (1): 413/908 kB
Progress (1): 417/908 kB
Progress (1): 421/908 kB
Progress (1): 425/908 kB
Progress (1): 429/908 kB
Progress (1): 433/908 kB
Progress (1): 437/908 kB
Progress (1): 441/908 kB
Progress (1): 445/908 kB
Progress (1): 449/908 kB
Progress (1): 453/908 kB
Progress (1): 457/908 kB
Progress (1): 461/908 kB
Progress (1): 465/908 kB
Progress (1): 469/908 kB
Progress (1): 473/908 kB
Progress (1): 477/908 kB
Progress (1): 481/908 kB
Progress (1): 485/908 kB
Progress (1): 489/908 kB
Progress (1): 493/908 kB
Progress (1): 497/908 kB
Progress (1): 501/908 kB
Progress (1): 505/908 kB
Progress (1): 509/908 kB
Progress (1): 513/908 kB
Progress (1): 517/908 kB
Progress (1): 521/908 kB
Progress (1): 525/908 kB
Progress (1): 529/908 kB
Progress (1): 533/908 kB
Progress (1): 537/908 kB
Progress (1): 541/908 kB
Progress (1): 545/908 kB
Progress (1): 549/908 kB
Progress (1): 553/908 kB
Progress (1): 557/908 kB
Progress (1): 561/908 kB
Progress (1): 565/908 kB
Progress (1): 569/908 kB
Progress (1): 573/908 kB
Progress (1): 577/908 kB
Progress (1): 581/908 kB
Progress (1): 585/908 kB
Progress (1): 589/908 kB
Progress (1): 593/908 kB
Progress (1): 597/908 kB
Progress (1): 601/908 kB
Progress (1): 605/908 kB
Progress (1): 609/908 kB
Progress (1): 613/908 kB
Progress (1): 617/908 kB
Progress (1): 621/908 kB
Progress (1): 625/908 kB
Progress (1): 629/908 kB
Progress (1): 633/908 kB
Progress (1): 637/908 kB
Progress (1): 641/908 kB
Progress (1): 645/908 kB
Progress (1): 649/908 kB
Progress (1): 653/908 kB
Progress (1): 657/908 kB
Progress (1): 661/908 kB
Progress (1): 665/908 kB
Progress (1): 669/908 kB
Progress (1): 673/908 kB
Progress (1): 677/908 kB
Progress (1): 681/908 kB
Progress (1): 685/908 kB
Progress (1): 689/908 kB
Progress (1): 693/908 kB
Progress (1): 697/908 kB
Progress (1): 701/908 kB
Progress (1): 705/908 kB
Progress (1): 709/908 kB
Progress (1): 713/908 kB
Progress (1): 717/908 kB
Progress (1): 721/908 kB
Progress (1): 725/908 kB
Progress (1): 729/908 kB
Progress (1): 733/908 kB
Progress (1): 737/908 kB
Progress (1): 741/908 kB
Progress (1): 745/908 kB
Progress (1): 749/908 kB
Progress (1): 753/908 kB
Progress (1): 757/908 kB
Progress (1): 761/908 kB
Progress (1): 765/908 kB
Progress (1): 769/908 kB
Progress (1): 773/908 kB
Progress (1): 777/908 kB
Progress (1): 781/908 kB
Progress (1): 785/908 kB
Progress (1): 789/908 kB
Progress (1): 793/908 kB
Progress (1): 797/908 kB
Progress (1): 801/908 kB
Progress (1): 805/908 kB
Progress (1): 809/908 kB
Progress (1): 813/908 kB
Progress (1): 817/908 kB
Progress (1): 821/908 kB
Progress (1): 825/908 kB
Progress (1): 829/908 kB
Progress (1): 833/908 kB
Progress (1): 837/908 kB
Progress (1): 841/908 kB
Progress (1): 845/908 kB
Progress (1): 849/908 kB
Progress (1): 853/908 kB
Progress (1): 857/908 kB
Progress (1): 861/908 kB
Progress (1): 865/908 kB
Progress (1): 869/908 kB
Progress (1): 873/908 kB
Progress (1): 877/908 kB
Progress (1): 881/908 kB
Progress (1): 885/908 kB
Progress (1): 889/908 kB
Progress (1): 893/908 kB
Progress (1): 897/908 kB
Progress (1): 901/908 kB
Progress (1): 905/908 kB
Progress (1): 908 kB    
                    
Downloaded from eclipse.maven.central.mirror: https://repo.eclipse.org/content/repositories/maven_central/org/eclipse/scout/rt/org.eclipse.scout.rt.platform/9.0.0.025_Simrel_2019_09/org.eclipse.scout.rt.platform-9.0.0.025_Simrel_2019_09.jar (908 kB at 687 kB/s)
06:33:59 Downloading from bintray-bsi-business-systems-integration-ag-scout-eclipse-org: http://dl.bintray.com/bsi-business-systems-integration-ag/scout-eclipse-org/org/eclipse/scout/rt/org.eclipse.scout.rt.shared/9.0.0.025_Simrel_2019_09/org.eclipse.scout.rt.shared-9.0.0.025_Simrel_2019_09.jar
06:33:59 [INFO] ------------------------------------------------------------------------
06:33:59 [INFO] Reactor Summary for Eclipse Scout SDK 9.0.0.025_Simrel_2019_09:
06:33:59 [INFO] 
06:33:59 [INFO] Scout Hello World Sample Application ............... SUCCESS [  7.423 s]
06:33:59 [INFO] Scout JaxWs Module ................................. SUCCESS [  2.906 s]
06:33:59 [INFO] ScoutJS Sample Application ......................... SUCCESS [  3.175 s]
06:33:59 [INFO] Eclipse Scout SDK .................................. SUCCESS [  1.603 s]
06:33:59 [INFO] org.eclipse.scout.sdk:org.eclipse.scout.sdk.core ... SUCCESS [  7.842 s]
06:33:59 [INFO] org.eclipse.scout.sdk:org.eclipse.scout.sdk.core.test SUCCESS [ 11.538 s]
06:33:59 [INFO] org.eclipse.scout.sdk:org.eclipse.scout.sdk.core.s . SUCCESS [  4.226 s]
06:33:59 [INFO] org.eclipse.scout.sdk:org.eclipse.scout.sdk.core.s.test FAILURE [  4.155 s]
06:33:59 [INFO] org.eclipse.scout.sdk.s2e:org.eclipse.scout.sdk.s2e  SKIPPED
06:33:59 [INFO] org.eclipse.scout.sdk.s2e:org.eclipse.scout.sdk.s2e.test SKIPPED
06:33:59 [INFO] org.eclipse.scout.sdk.s2e:org.eclipse.scout.sdk.s2e.doc SKIPPED
06:33:59 [INFO] org.eclipse.scout.sdk.s2e:org.eclipse.scout.sdk.s2e.nls SKIPPED
06:33:59 [INFO] org.eclipse.scout.sdk.s2e:org.eclipse.scout.sdk.s2e.ui SKIPPED
06:33:59 [INFO] org.eclipse.scout.sdk-settings ..................... SKIPPED
06:33:59 [INFO] ------------------------------------------------------------------------
06:33:59 [INFO] BUILD FAILURE
06:33:59 [INFO] ------------------------------------------------------------------------
06:33:59 [INFO] Total time:  45.245 s
06:33:59 [INFO] Finished at: 2019-09-10T06:33:59-04:00
06:33:59 [INFO] ------------------------------------------------------------------------
06:33:59 [ERROR] Failed to execute goal on project org.eclipse.scout.sdk.core.s.test: Could not resolve dependencies for project org.eclipse.scout.sdk:org.eclipse.scout.sdk.core.s.test:jar:9.0.0.025_Simrel_2019_09: The following artifacts could not be resolved: org.eclipse.scout.rt:org.eclipse.scout.rt.ui.html.test:jar:9.0.0.025_Simrel_2019_09, org.eclipse.scout.rt:org.eclipse.scout.rt.shared:jar:9.0.0.025_Simrel_2019_09: Could not find artifact org.eclipse.scout.rt:org.eclipse.scout.rt.ui.html.test:jar:9.0.0.025_Simrel_2019_09 in eclipse.release (https://repo.eclipse.org/content/groups/releases/) -> [Help 1]
06:33:59 [ERROR] 
06:33:59 [ERROR] To see the full stack trace of the errors, re-run Maven with the -e switch.
06:33:59 [ERROR] Re-run Maven using the -X switch to enable full debug logging.
06:33:59 [ERROR] 
06:33:59 [ERROR] For more information about the errors and possible solutions, please read the following articles:
06:33:59 [ERROR] [Help 1] http://cwiki.apache.org/confluence/display/MAVEN/DependencyResolutionException
06:33:59 [ERROR] 
06:33:59 [ERROR] After correcting the problems, you can resume the build with the command
06:33:59 [ERROR]   mvn <goals> -rf :org.eclipse.scout.sdk.core.s.test
06:33:59 Build step 'Invoke top-level Maven targets' marked build as failure
06:33:59 Sending e-mails to: patrick.baenziger@bsi-software.com arthur.vandorp@bsi-software.com
06:34:04 Recording test results
06:34:05 Started calculate disk usage of build
06:34:05 Finished Calculation of disk usage of build in 0 seconds
06:34:07 Started calculate disk usage of workspace
06:34:08 Finished Calculation of disk usage of workspace in  1 second
06:34:10 Triggering a new build of publish_staged_builds
06:34:10 Finished: FAILURE