AbortedConsole Output

Skipping 63 KB.. Full Log
 org.junit.runners.ParentRunner$2.evaluate(ParentRunner.java:268)
09:01:33 	at org.junit.runners.ParentRunner.run(ParentRunner.java:363)
09:01:33 	at org.apache.maven.surefire.junit4.JUnit4Provider.execute(JUnit4Provider.java:365)
09:01:33 	at org.apache.maven.surefire.junit4.JUnit4Provider.executeWithRerun(JUnit4Provider.java:273)
09:01:33 	at org.apache.maven.surefire.junit4.JUnit4Provider.executeTestSet(JUnit4Provider.java:238)
09:01:33 	at org.apache.maven.surefire.junit4.JUnit4Provider.invoke(JUnit4Provider.java:159)
09:01:33 	at org.apache.maven.surefire.booter.ForkedBooter.invokeProviderInSameClassLoader(ForkedBooter.java:384)
09:01:33 	at org.apache.maven.surefire.booter.ForkedBooter.runSuitesInProcess(ForkedBooter.java:345)
09:01:33 	at org.apache.maven.surefire.booter.ForkedBooter.execute(ForkedBooter.java:126)
09:01:33 	at org.apache.maven.surefire.booter.ForkedBooter.main(ForkedBooter.java:418)
09:01:33 Scout SdkLog: Failed toString() invocation on an object of type [org.eclipse.scout.sdk.core.util.SdkLogTest$ClassWithToStringThrowingNpeFixture]
09:01:33 java.lang.NullPointerException: NPE of test class org.eclipse.scout.sdk.core.util.SdkLogTest
09:01:33 	at org.eclipse.scout.sdk.core.util.SdkLogTest$ClassWithToStringThrowingNpeFixture.toString(SdkLogTest.java:156)
09:01:33 	at org.eclipse.scout.sdk.core.util.SdkLog.safeObjectToString(SdkLog.java:223)
09:01:33 	at org.eclipse.scout.sdk.core.util.SdkLog.toString(SdkLog.java:159)
09:01:33 	at org.eclipse.scout.sdk.core.util.SdkLog.handlePlaceholders(SdkLog.java:149)
09:01:33 	at org.eclipse.scout.sdk.core.util.SdkLog.log(SdkLog.java:93)
09:01:33 	at org.eclipse.scout.sdk.core.util.SdkLog.error(SdkLog.java:317)
09:01:33 	at org.eclipse.scout.sdk.core.util.SdkLogTest$1.run(SdkLogTest.java:104)
09:01:33 	at org.eclipse.scout.sdk.core.util.SdkLogTest.runWithPrivateLogger(SdkLogTest.java:193)
09:01:33 	at org.eclipse.scout.sdk.core.util.SdkLogTest.testLogOfObjectWithToStringThrowingException(SdkLogTest.java:101)
09:01:33 	at java.base/jdk.internal.reflect.NativeMethodAccessorImpl.invoke0(Native Method)
09:01:33 	at java.base/jdk.internal.reflect.NativeMethodAccessorImpl.invoke(NativeMethodAccessorImpl.java:62)
09:01:33 	at java.base/jdk.internal.reflect.DelegatingMethodAccessorImpl.invoke(DelegatingMethodAccessorImpl.java:43)
09:01:33 	at java.base/java.lang.reflect.Method.invoke(Method.java:566)
09:01:33 	at org.junit.runners.model.FrameworkMethod$1.runReflectiveCall(FrameworkMethod.java:50)
09:01:33 	at org.junit.internal.runners.model.ReflectiveCallable.run(ReflectiveCallable.java:12)
09:01:33 	at org.junit.runners.model.FrameworkMethod.invokeExplosively(FrameworkMethod.java:47)
09:01:33 	at org.junit.internal.runners.statements.InvokeMethod.evaluate(InvokeMethod.java:17)
09:01:33 	at org.junit.runners.ParentRunner.runLeaf(ParentRunner.java:325)
09:01:33 	at org.junit.runners.BlockJUnit4ClassRunner.runChild(BlockJUnit4ClassRunner.java:78)
09:01:33 	at org.junit.runners.BlockJUnit4ClassRunner.runChild(BlockJUnit4ClassRunner.java:57)
09:01:33 	at org.junit.runners.ParentRunner$3.run(ParentRunner.java:290)
09:01:33 	at org.junit.runners.ParentRunner$1.schedule(ParentRunner.java:71)
09:01:33 	at org.junit.runners.ParentRunner.runChildren(ParentRunner.java:288)
09:01:33 	at org.junit.runners.ParentRunner.access$000(ParentRunner.java:58)
09:01:33 	at org.junit.runners.ParentRunner$2.evaluate(ParentRunner.java:268)
09:01:33 	at org.junit.runners.ParentRunner.run(ParentRunner.java:363)
09:01:33 	at org.apache.maven.surefire.junit4.JUnit4Provider.execute(JUnit4Provider.java:365)
09:01:33 	at org.apache.maven.surefire.junit4.JUnit4Provider.executeWithRerun(JUnit4Provider.java:273)
09:01:33 	at org.apache.maven.surefire.junit4.JUnit4Provider.executeTestSet(JUnit4Provider.java:238)
09:01:33 	at org.apache.maven.surefire.junit4.JUnit4Provider.invoke(JUnit4Provider.java:159)
09:01:33 	at org.apache.maven.surefire.booter.ForkedBooter.invokeProviderInSameClassLoader(ForkedBooter.java:384)
09:01:33 	at org.apache.maven.surefire.booter.ForkedBooter.runSuitesInProcess(ForkedBooter.java:345)
09:01:33 	at org.apache.maven.surefire.booter.ForkedBooter.execute(ForkedBooter.java:126)
09:01:33 	at org.apache.maven.surefire.booter.ForkedBooter.main(ForkedBooter.java:418)
09:01:33 [INFO] Tests run: 5, Failures: 0, Errors: 0, Skipped: 0, Time elapsed: 0.169 s - in org.eclipse.scout.sdk.core.util.SdkLogTest
09:01:33 [INFO] Running org.eclipse.scout.sdk.core.util.JavaEnvironmentImportExportTest
09:01:34 [INFO] Tests run: 1, Failures: 0, Errors: 0, Skipped: 0, Time elapsed: 1.163 s - in org.eclipse.scout.sdk.core.util.JavaEnvironmentImportExportTest
09:01:34 [INFO] Running org.eclipse.scout.sdk.core.util.CoreUtilsTest
09:01:35 [INFO] Tests run: 39, Failures: 0, Errors: 0, Skipped: 0, Time elapsed: 0.774 s - in org.eclipse.scout.sdk.core.util.CoreUtilsTest
09:01:35 [INFO] Running org.eclipse.scout.sdk.core.sourcebuilder.SourceModelRoundtripTest
09:01:35 [INFO] Tests run: 2, Failures: 0, Errors: 0, Skipped: 0, Time elapsed: 0.13 s - in org.eclipse.scout.sdk.core.sourcebuilder.SourceModelRoundtripTest
09:01:35 [INFO] Running org.eclipse.scout.sdk.core.signature.SignatureUtilsTest
09:01:35 [INFO] Tests run: 12, Failures: 0, Errors: 0, Skipped: 0, Time elapsed: 0.017 s - in org.eclipse.scout.sdk.core.signature.SignatureUtilsTest
09:01:35 [INFO] Running org.eclipse.scout.sdk.core.signature.SignatureTest
09:01:35 [INFO] Tests run: 189, Failures: 0, Errors: 0, Skipped: 0, Time elapsed: 0.06 s - in org.eclipse.scout.sdk.core.signature.SignatureTest
09:01:35 [INFO] Running org.eclipse.scout.sdk.core.model.sugar.QueryTest
09:01:36 [INFO] Tests run: 7, Failures: 0, Errors: 0, Skipped: 0, Time elapsed: 0.174 s - in org.eclipse.scout.sdk.core.model.sugar.QueryTest
09:01:36 [INFO] Running org.eclipse.scout.sdk.core.model.spi.internal.metavalue.MetaValueFactoryTest
09:01:36 [INFO] Tests run: 17, Failures: 0, Errors: 0, Skipped: 0, Time elapsed: 0.028 s - in org.eclipse.scout.sdk.core.model.spi.internal.metavalue.MetaValueFactoryTest
09:01:36 [INFO] Running org.eclipse.scout.sdk.core.model.spi.internal.CompositeObjectTest
09:01:36 [INFO] Tests run: 2, Failures: 0, Errors: 0, Skipped: 0, Time elapsed: 0 s - in org.eclipse.scout.sdk.core.model.spi.internal.CompositeObjectTest
09:01:36 [INFO] Running org.eclipse.scout.sdk.core.model.spi.internal.ClasspathBuilderTest
09:01:36 [INFO] Tests run: 2, Failures: 0, Errors: 0, Skipped: 0, Time elapsed: 0.001 s - in org.eclipse.scout.sdk.core.model.spi.internal.ClasspathBuilderTest
09:01:36 [INFO] Running org.eclipse.scout.sdk.core.model.TypeTest
09:01:36 [INFO] Tests run: 6, Failures: 0, Errors: 0, Skipped: 0, Time elapsed: 0.051 s - in org.eclipse.scout.sdk.core.model.TypeTest
09:01:36 [INFO] Running org.eclipse.scout.sdk.core.model.TypeParameterTest
09:01:36 [INFO] Tests run: 3, Failures: 0, Errors: 0, Skipped: 0, Time elapsed: 0 s - in org.eclipse.scout.sdk.core.model.TypeParameterTest
09:01:36 [INFO] Running org.eclipse.scout.sdk.core.model.SourceRangeTest
09:01:36 [INFO] Tests run: 1, Failures: 0, Errors: 0, Skipped: 0, Time elapsed: 0 s - in org.eclipse.scout.sdk.core.model.SourceRangeTest
09:01:36 [INFO] Running org.eclipse.scout.sdk.core.model.PrimitiveTypeTest
09:01:36 [INFO] Tests run: 1, Failures: 0, Errors: 0, Skipped: 0, Time elapsed: 0.008 s - in org.eclipse.scout.sdk.core.model.PrimitiveTypeTest
09:01:36 [INFO] Running org.eclipse.scout.sdk.core.model.PackageTest
09:01:36 [INFO] Tests run: 4, Failures: 0, Errors: 0, Skipped: 0, Time elapsed: 0 s - in org.eclipse.scout.sdk.core.model.PackageTest
09:01:36 [INFO] Running org.eclipse.scout.sdk.core.model.MethodTest
09:01:36 [INFO] Tests run: 3, Failures: 0, Errors: 0, Skipped: 0, Time elapsed: 0 s - in org.eclipse.scout.sdk.core.model.MethodTest
09:01:36 [INFO] Running org.eclipse.scout.sdk.core.model.MethodParameterTest
09:01:36 [INFO] Tests run: 3, Failures: 0, Errors: 0, Skipped: 0, Time elapsed: 0 s - in org.eclipse.scout.sdk.core.model.MethodParameterTest
09:01:36 [INFO] Running org.eclipse.scout.sdk.core.model.ManagedAnnotationTest
09:01:36 [INFO] Tests run: 9, Failures: 0, Errors: 0, Skipped: 0, Time elapsed: 0.233 s - in org.eclipse.scout.sdk.core.model.ManagedAnnotationTest
09:01:36 [INFO] Running org.eclipse.scout.sdk.core.model.ImportDeclarationTest
09:01:36 [INFO] Tests run: 2, Failures: 0, Errors: 0, Skipped: 0, Time elapsed: 0 s - in org.eclipse.scout.sdk.core.model.ImportDeclarationTest
09:01:36 [INFO] Running org.eclipse.scout.sdk.core.model.GenericMethodTest
09:01:36 [INFO] Tests run: 7, Failures: 0, Errors: 0, Skipped: 0, Time elapsed: 0.142 s - in org.eclipse.scout.sdk.core.model.GenericMethodTest
09:01:36 [INFO] Running org.eclipse.scout.sdk.core.model.FieldTest
09:01:36 [INFO] Tests run: 8, Failures: 0, Errors: 0, Skipped: 0, Time elapsed: 0.027 s - in org.eclipse.scout.sdk.core.model.FieldTest
09:01:36 [INFO] Running org.eclipse.scout.sdk.core.model.CreateAndOverrideNewCompilationUnitTest
09:01:36 [INFO] Tests run: 4, Failures: 0, Errors: 0, Skipped: 0, Time elapsed: 0.088 s - in org.eclipse.scout.sdk.core.model.CreateAndOverrideNewCompilationUnitTest
09:01:36 [INFO] Running org.eclipse.scout.sdk.core.model.CompilationUnitTest
09:01:36 [INFO] Tests run: 3, Failures: 0, Errors: 0, Skipped: 0, Time elapsed: 0.024 s - in org.eclipse.scout.sdk.core.model.CompilationUnitTest
09:01:36 [INFO] Running org.eclipse.scout.sdk.core.model.ArrayTypeTest
09:01:36 [INFO] Tests run: 1, Failures: 0, Errors: 0, Skipped: 0, Time elapsed: 0.025 s - in org.eclipse.scout.sdk.core.model.ArrayTypeTest
09:01:36 [INFO] Running org.eclipse.scout.sdk.core.model.AnnotationTest
09:01:36 [INFO] Tests run: 5, Failures: 0, Errors: 0, Skipped: 0, Time elapsed: 0.047 s - in org.eclipse.scout.sdk.core.model.AnnotationTest
09:01:36 [INFO] Running org.eclipse.scout.sdk.core.model.AnnotationSourceTest
09:01:36 [INFO] Tests run: 6, Failures: 0, Errors: 0, Skipped: 0, Time elapsed: 0.16 s - in org.eclipse.scout.sdk.core.model.AnnotationSourceTest
09:01:36 [INFO] Running org.eclipse.scout.sdk.core.model.AnnotationQueryTest
09:01:36 [INFO] Tests run: 4, Failures: 0, Errors: 0, Skipped: 0, Time elapsed: 0.102 s - in org.eclipse.scout.sdk.core.model.AnnotationQueryTest
09:01:36 [INFO] Running org.eclipse.scout.sdk.core.model.AnnotationElementTest
09:01:36 [INFO] Tests run: 3, Failures: 0, Errors: 0, Skipped: 0, Time elapsed: 0.001 s - in org.eclipse.scout.sdk.core.model.AnnotationElementTest
09:01:36 [INFO] Running org.eclipse.scout.sdk.core.importvalidator.ImportValidatorTest
09:01:37 [INFO] Tests run: 15, Failures: 0, Errors: 0, Skipped: 0, Time elapsed: 0.035 s - in org.eclipse.scout.sdk.core.importvalidator.ImportValidatorTest
09:01:37 [INFO] 
09:01:37 [INFO] Results:
09:01:37 [INFO] 
09:01:37 [INFO] Tests run: 364, Failures: 0, Errors: 0, Skipped: 0
09:01:37 [INFO] 
09:01:37 [INFO] 
09:01:37 [INFO] --- maven-jar-plugin:3.1.1:jar (default-jar) @ org.eclipse.scout.sdk.core.test ---
09:01:37 [INFO] Building jar: /jobs/genie.scout/org.eclipse.scout.sdk.branch-9.0_continuous/workspace/org.eclipse.scout.sdk.core.test/target/org.eclipse.scout.sdk.core.test-9.0.0-SNAPSHOT.jar
09:01:37 [INFO] 
09:01:37 [INFO] --- maven-site-plugin:3.7.1:attach-descriptor (attach-descriptor) @ org.eclipse.scout.sdk.core.test ---
09:01:37 [INFO] Skipping because packaging 'jar' is not pom.
09:01:37 [INFO] 
09:01:37 [INFO] --- maven-jar-plugin:3.1.1:test-jar (attach-tests) @ org.eclipse.scout.sdk.core.test ---
09:01:37 [INFO] Building jar: /jobs/genie.scout/org.eclipse.scout.sdk.branch-9.0_continuous/workspace/org.eclipse.scout.sdk.core.test/target/org.eclipse.scout.sdk.core.test-9.0.0-SNAPSHOT-tests.jar
09:01:37 [INFO] 
09:01:37 [INFO] --- maven-source-plugin:3.0.1:test-jar-no-fork (attach-test-sources) @ org.eclipse.scout.sdk.core.test ---
09:01:37 [INFO] Building jar: /jobs/genie.scout/org.eclipse.scout.sdk.branch-9.0_continuous/workspace/org.eclipse.scout.sdk.core.test/target/org.eclipse.scout.sdk.core.test-9.0.0-SNAPSHOT-test-sources.jar
09:01:37 [INFO] 
09:01:37 [INFO] --- duplicate-finder-maven-plugin:1.3.0:check (default) @ org.eclipse.scout.sdk.core.test ---
09:01:37 [INFO] Checking compile classpath
09:01:37 [INFO] Checking runtime classpath
09:01:37 [INFO] Checking test classpath
09:01:37 [INFO] 
09:01:37 [INFO] --- animal-sniffer-maven-plugin:1.17:check (enforce-java-api-compatibility) @ org.eclipse.scout.sdk.core.test ---
09:01:37 [INFO] Checking unresolved references to org.codehaus.mojo.signature:java18:1.0
09:01:38 [INFO] 
09:01:38 [INFO] --- maven-source-plugin:3.0.1:jar-no-fork (attach-sources) @ org.eclipse.scout.sdk.core.test ---
09:01:38 [INFO] Building jar: /jobs/genie.scout/org.eclipse.scout.sdk.branch-9.0_continuous/workspace/org.eclipse.scout.sdk.core.test/target/org.eclipse.scout.sdk.core.test-9.0.0-SNAPSHOT-sources.jar
09:01:38 [INFO] 
09:01:38 [INFO] --- eclipse-jarsigner-plugin:1.1.5:sign (sign) @ org.eclipse.scout.sdk.core.test ---
09:01:38 [INFO] Skip jar signing
09:01:38 [INFO] 
09:01:38 [INFO] --- maven-install-plugin:2.5.2:install (default-install) @ org.eclipse.scout.sdk.core.test ---
09:01:38 [INFO] Installing /jobs/genie.scout/org.eclipse.scout.sdk.branch-9.0_continuous/workspace/org.eclipse.scout.sdk.core.test/target/org.eclipse.scout.sdk.core.test-9.0.0-SNAPSHOT.jar to /home/hudson/genie.scout/.jenkins/jobs/org.eclipse.scout.sdk.branch-9.0_continuous/workspace/.repository/org/eclipse/scout/sdk/org.eclipse.scout.sdk.core.test/9.0.0-SNAPSHOT/org.eclipse.scout.sdk.core.test-9.0.0-SNAPSHOT.jar
09:01:38 [INFO] Installing /jobs/genie.scout/org.eclipse.scout.sdk.branch-9.0_continuous/workspace/org.eclipse.scout.sdk.core.test/pom.xml to /home/hudson/genie.scout/.jenkins/jobs/org.eclipse.scout.sdk.branch-9.0_continuous/workspace/.repository/org/eclipse/scout/sdk/org.eclipse.scout.sdk.core.test/9.0.0-SNAPSHOT/org.eclipse.scout.sdk.core.test-9.0.0-SNAPSHOT.pom
09:01:38 [INFO] Installing /jobs/genie.scout/org.eclipse.scout.sdk.branch-9.0_continuous/workspace/org.eclipse.scout.sdk.core.test/target/org.eclipse.scout.sdk.core.test-9.0.0-SNAPSHOT-tests.jar to /home/hudson/genie.scout/.jenkins/jobs/org.eclipse.scout.sdk.branch-9.0_continuous/workspace/.repository/org/eclipse/scout/sdk/org.eclipse.scout.sdk.core.test/9.0.0-SNAPSHOT/org.eclipse.scout.sdk.core.test-9.0.0-SNAPSHOT-tests.jar
09:01:38 [INFO] Installing /jobs/genie.scout/org.eclipse.scout.sdk.branch-9.0_continuous/workspace/org.eclipse.scout.sdk.core.test/target/org.eclipse.scout.sdk.core.test-9.0.0-SNAPSHOT-test-sources.jar to /home/hudson/genie.scout/.jenkins/jobs/org.eclipse.scout.sdk.branch-9.0_continuous/workspace/.repository/org/eclipse/scout/sdk/org.eclipse.scout.sdk.core.test/9.0.0-SNAPSHOT/org.eclipse.scout.sdk.core.test-9.0.0-SNAPSHOT-test-sources.jar
09:01:38 [INFO] Installing /jobs/genie.scout/org.eclipse.scout.sdk.branch-9.0_continuous/workspace/org.eclipse.scout.sdk.core.test/target/org.eclipse.scout.sdk.core.test-9.0.0-SNAPSHOT-sources.jar to /home/hudson/genie.scout/.jenkins/jobs/org.eclipse.scout.sdk.branch-9.0_continuous/workspace/.repository/org/eclipse/scout/sdk/org.eclipse.scout.sdk.core.test/9.0.0-SNAPSHOT/org.eclipse.scout.sdk.core.test-9.0.0-SNAPSHOT-sources.jar
09:01:38 [INFO] 
09:01:38 [INFO] ---------< org.eclipse.scout.sdk:org.eclipse.scout.sdk.core.s >---------
09:01:38 [INFO] Building org.eclipse.scout.sdk:org.eclipse.scout.sdk.core.s 9.0.0-SNAPSHOT [7/15]
09:01:38 [INFO] --------------------------------[ jar ]---------------------------------
09:01:38 [INFO] 
09:01:38 [INFO] --- maven-clean-plugin:3.1.0:clean (default-clean) @ org.eclipse.scout.sdk.core.s ---
09:01:38 [INFO] Deleting /jobs/genie.scout/org.eclipse.scout.sdk.branch-9.0_continuous/workspace/org.eclipse.scout.sdk.core.s/target
09:01:38 [INFO] 
09:01:38 [INFO] --- maven-enforcer-plugin:1.4.1:enforce (enforce-rules) @ org.eclipse.scout.sdk.core.s ---
09:01:38 [INFO] Skipping Rule Enforcement.
09:01:38 [INFO] 
09:01:38 [INFO] --- git-commit-id-plugin:2.2.5:revision (default) @ org.eclipse.scout.sdk.core.s ---
09:01:39 [INFO] 
09:01:39 [INFO] --- jacoco-maven-plugin:0.8.2:prepare-agent (default) @ org.eclipse.scout.sdk.core.s ---
09:01:39 [INFO] master_test_jacocoArgLine set to -javaagent:/home/hudson/genie.scout/.jenkins/jobs/org.eclipse.scout.sdk.branch-9.0_continuous/workspace/.repository/org/jacoco/org.jacoco.agent/0.8.2/org.jacoco.agent-0.8.2-runtime.jar=destfile=/jobs/genie.scout/org.eclipse.scout.sdk.branch-9.0_continuous/workspace/org.eclipse.scout.sdk.core.s/../org.eclipse.scout.sdk/target/jacoco-all.exec
09:01:39 [INFO] 
09:01:39 [INFO] --- build-helper-maven-plugin:3.0.0:parse-version (initialize-parse-version) @ org.eclipse.scout.sdk.core.s ---
09:01:39 [INFO] 
09:01:39 [INFO] --- build-helper-maven-plugin:3.0.0:regex-property (initialize-regex) @ org.eclipse.scout.sdk.core.s ---
09:01:39 [INFO] 
09:01:39 [INFO] --- maven-resources-plugin:3.1.0:resources (default-resources) @ org.eclipse.scout.sdk.core.s ---
09:01:39 [INFO] Using 'UTF-8' encoding to copy filtered resources.
09:01:39 [INFO] skip non existing resourceDirectory /jobs/genie.scout/org.eclipse.scout.sdk.branch-9.0_continuous/workspace/org.eclipse.scout.sdk.core.s/src/main/resources
09:01:39 [INFO] Copying 2 resources
09:01:39 [INFO] 
09:01:39 [INFO] --- maven-compiler-plugin:3.8.0:compile (default-compile) @ org.eclipse.scout.sdk.core.s ---
09:01:39 [INFO] Changes detected - recompiling the module!
09:01:39 [INFO] Compiling 50 source files to /jobs/genie.scout/org.eclipse.scout.sdk.branch-9.0_continuous/workspace/org.eclipse.scout.sdk.core.s/target/classes
09:01:40 [INFO] 
09:01:40 [INFO] --- maven-resources-plugin:3.1.0:testResources (default-testResources) @ org.eclipse.scout.sdk.core.s ---
09:01:40 [INFO] Using 'UTF-8' encoding to copy filtered resources.
09:01:40 [INFO] skip non existing resourceDirectory /jobs/genie.scout/org.eclipse.scout.sdk.branch-9.0_continuous/workspace/org.eclipse.scout.sdk.core.s/src/test/resources
09:01:40 [INFO] 
09:01:40 [INFO] --- maven-compiler-plugin:3.8.0:testCompile (default-testCompile) @ org.eclipse.scout.sdk.core.s ---
09:01:40 [INFO] No sources to compile
09:01:40 [INFO] 
09:01:40 [INFO] --- maven-surefire-plugin:2.22.1:test (default-test) @ org.eclipse.scout.sdk.core.s ---
09:01:40 [INFO] No tests to run.
09:01:40 [INFO] 
09:01:40 [INFO] --- maven-jar-plugin:3.1.1:jar (default-jar) @ org.eclipse.scout.sdk.core.s ---
09:01:40 [INFO] Building jar: /jobs/genie.scout/org.eclipse.scout.sdk.branch-9.0_continuous/workspace/org.eclipse.scout.sdk.core.s/target/org.eclipse.scout.sdk.core.s-9.0.0-SNAPSHOT.jar
09:01:40 [INFO] 
09:01:40 [INFO] --- maven-site-plugin:3.7.1:attach-descriptor (attach-descriptor) @ org.eclipse.scout.sdk.core.s ---
09:01:40 [INFO] Skipping because packaging 'jar' is not pom.
09:01:40 [INFO] 
09:01:40 [INFO] --- maven-jar-plugin:3.1.1:test-jar (attach-tests) @ org.eclipse.scout.sdk.core.s ---
09:01:40 [INFO] Skipping packaging of the test-jar
09:01:40 [INFO] 
09:01:40 [INFO] --- maven-source-plugin:3.0.1:test-jar-no-fork (attach-test-sources) @ org.eclipse.scout.sdk.core.s ---
09:01:40 [INFO] No sources in project. Archive not created.
09:01:40 [INFO] 
09:01:40 [INFO] --- duplicate-finder-maven-plugin:1.3.0:check (default) @ org.eclipse.scout.sdk.core.s ---
09:01:40 [INFO] Checking compile classpath
09:01:40 [INFO] Checking runtime classpath
09:01:40 [INFO] Checking test classpath
09:01:40 [INFO] 
09:01:40 [INFO] --- animal-sniffer-maven-plugin:1.17:check (enforce-java-api-compatibility) @ org.eclipse.scout.sdk.core.s ---
09:01:40 [INFO] Checking unresolved references to org.codehaus.mojo.signature:java18:1.0
09:01:41 [INFO] 
09:01:41 [INFO] --- maven-source-plugin:3.0.1:jar-no-fork (attach-sources) @ org.eclipse.scout.sdk.core.s ---
09:01:41 [INFO] Building jar: /jobs/genie.scout/org.eclipse.scout.sdk.branch-9.0_continuous/workspace/org.eclipse.scout.sdk.core.s/target/org.eclipse.scout.sdk.core.s-9.0.0-SNAPSHOT-sources.jar
09:01:41 [INFO] 
09:01:41 [INFO] --- eclipse-jarsigner-plugin:1.1.5:sign (sign) @ org.eclipse.scout.sdk.core.s ---
09:01:41 [INFO] Skip jar signing
09:01:41 [INFO] 
09:01:41 [INFO] --- maven-install-plugin:2.5.2:install (default-install) @ org.eclipse.scout.sdk.core.s ---
09:01:41 [INFO] Installing /jobs/genie.scout/org.eclipse.scout.sdk.branch-9.0_continuous/workspace/org.eclipse.scout.sdk.core.s/target/org.eclipse.scout.sdk.core.s-9.0.0-SNAPSHOT.jar to /home/hudson/genie.scout/.jenkins/jobs/org.eclipse.scout.sdk.branch-9.0_continuous/workspace/.repository/org/eclipse/scout/sdk/org.eclipse.scout.sdk.core.s/9.0.0-SNAPSHOT/org.eclipse.scout.sdk.core.s-9.0.0-SNAPSHOT.jar
09:01:41 [INFO] Installing /jobs/genie.scout/org.eclipse.scout.sdk.branch-9.0_continuous/workspace/org.eclipse.scout.sdk.core.s/pom.xml to /home/hudson/genie.scout/.jenkins/jobs/org.eclipse.scout.sdk.branch-9.0_continuous/workspace/.repository/org/eclipse/scout/sdk/org.eclipse.scout.sdk.core.s/9.0.0-SNAPSHOT/org.eclipse.scout.sdk.core.s-9.0.0-SNAPSHOT.pom
09:01:41 [INFO] Installing /jobs/genie.scout/org.eclipse.scout.sdk.branch-9.0_continuous/workspace/org.eclipse.scout.sdk.core.s/target/org.eclipse.scout.sdk.core.s-9.0.0-SNAPSHOT-sources.jar to /home/hudson/genie.scout/.jenkins/jobs/org.eclipse.scout.sdk.branch-9.0_continuous/workspace/.repository/org/eclipse/scout/sdk/org.eclipse.scout.sdk.core.s/9.0.0-SNAPSHOT/org.eclipse.scout.sdk.core.s-9.0.0-SNAPSHOT-sources.jar
09:01:41 [INFO] 
09:01:41 [INFO] ------< org.eclipse.scout.sdk:org.eclipse.scout.sdk.core.s.test >-------
09:01:41 [INFO] Building org.eclipse.scout.sdk:org.eclipse.scout.sdk.core.s.test 9.0.0-SNAPSHOT [8/15]
09:01:41 [INFO] --------------------------------[ jar ]---------------------------------
09:01:41 [INFO] Downloading from eclipse.snapshot: https://repo.eclipse.org/content/groups/snapshots/org/eclipse/scout/rt/org.eclipse.scout.rt.ui.html.test/9.0.0-SNAPSHOT/maven-metadata.xml
09:01:41 [INFO] Downloaded from eclipse.snapshot: https://repo.eclipse.org/content/groups/snapshots/org/eclipse/scout/rt/org.eclipse.scout.rt.ui.html.test/9.0.0-SNAPSHOT/maven-metadata.xml (1.5 kB at 13 kB/s)
09:01:41 [INFO] Downloading from eclipse.snapshot: https://repo.eclipse.org/content/groups/snapshots/org/eclipse/scout/rt/org.eclipse.scout.rt.ui.html.test/9.0.0-SNAPSHOT/org.eclipse.scout.rt.ui.html.test-9.0.0-20190805.223119-130.pom
09:01:41 [INFO] Downloaded from eclipse.snapshot: https://repo.eclipse.org/content/groups/snapshots/org/eclipse/scout/rt/org.eclipse.scout.rt.ui.html.test/9.0.0-SNAPSHOT/org.eclipse.scout.rt.ui.html.test-9.0.0-20190805.223119-130.pom (3.6 kB at 102 kB/s)
09:01:41 [INFO] Downloading from eclipse.snapshot: https://repo.eclipse.org/content/groups/snapshots/org/eclipse/scout/rt/org.eclipse.scout.rt.ui.html/9.0.0-SNAPSHOT/maven-metadata.xml
09:01:41 [INFO] Downloaded from eclipse.snapshot: https://repo.eclipse.org/content/groups/snapshots/org/eclipse/scout/rt/org.eclipse.scout.rt.ui.html/9.0.0-SNAPSHOT/maven-metadata.xml (1.0 kB at 11 kB/s)
09:01:41 [INFO] Downloading from eclipse.snapshot: https://repo.eclipse.org/content/groups/snapshots/org/eclipse/scout/rt/org.eclipse.scout.rt.ui.html/9.0.0-SNAPSHOT/org.eclipse.scout.rt.ui.html-9.0.0-20190805.223109-130.pom
09:01:41 [INFO] Downloaded from eclipse.snapshot: https://repo.eclipse.org/content/groups/snapshots/org/eclipse/scout/rt/org.eclipse.scout.rt.ui.html/9.0.0-SNAPSHOT/org.eclipse.scout.rt.ui.html-9.0.0-20190805.223109-130.pom (2.3 kB at 61 kB/s)
09:01:41 [INFO] Downloading from eclipse.snapshot: https://repo.eclipse.org/content/groups/snapshots/org/eclipse/scout/rt/org.eclipse.scout.rt.server.commons/9.0.0-SNAPSHOT/maven-metadata.xml
09:01:41 [INFO] Downloaded from eclipse.snapshot: https://repo.eclipse.org/content/groups/snapshots/org/eclipse/scout/rt/org.eclipse.scout.rt.server.commons/9.0.0-SNAPSHOT/maven-metadata.xml (1.0 kB at 19 kB/s)
09:01:41 [INFO] Downloading from eclipse.snapshot: https://repo.eclipse.org/content/groups/snapshots/org/eclipse/scout/rt/org.eclipse.scout.rt.server.commons/9.0.0-SNAPSHOT/org.eclipse.scout.rt.server.commons-9.0.0-20190805.222716-130.pom
09:01:41 [INFO] Downloaded from eclipse.snapshot: https://repo.eclipse.org/content/groups/snapshots/org/eclipse/scout/rt/org.eclipse.scout.rt.server.commons/9.0.0-SNAPSHOT/org.eclipse.scout.rt.server.commons-9.0.0-20190805.222716-130.pom (1.4 kB at 44 kB/s)
09:01:41 [INFO] Downloading from eclipse.snapshot: https://repo.eclipse.org/content/groups/snapshots/org/eclipse/scout/rt/org.eclipse.scout.rt.shared/9.0.0-SNAPSHOT/maven-metadata.xml
09:01:41 [INFO] Downloaded from eclipse.snapshot: https://repo.eclipse.org/content/groups/snapshots/org/eclipse/scout/rt/org.eclipse.scout.rt.shared/9.0.0-SNAPSHOT/maven-metadata.xml (1.0 kB at 15 kB/s)
09:01:41 [INFO] Downloading from eclipse.snapshot: https://repo.eclipse.org/content/groups/snapshots/org/eclipse/scout/rt/org.eclipse.scout.rt.shared/9.0.0-SNAPSHOT/org.eclipse.scout.rt.shared-9.0.0-20190805.222653-130.pom
09:01:41 [INFO] Downloaded from eclipse.snapshot: https://repo.eclipse.org/content/groups/snapshots/org/eclipse/scout/rt/org.eclipse.scout.rt.shared/9.0.0-SNAPSHOT/org.eclipse.scout.rt.shared-9.0.0-20190805.222653-130.pom (1.8 kB at 57 kB/s)
09:01:41 [INFO] Downloading from eclipse.snapshot: https://repo.eclipse.org/content/groups/snapshots/org/eclipse/scout/rt/org.eclipse.scout.rt.platform/9.0.0-SNAPSHOT/maven-metadata.xml
09:01:41 [INFO] Downloaded from eclipse.snapshot: https://repo.eclipse.org/content/groups/snapshots/org/eclipse/scout/rt/org.eclipse.scout.rt.platform/9.0.0-SNAPSHOT/maven-metadata.xml (1.0 kB at 18 kB/s)
09:01:41 [INFO] Downloading from eclipse.snapshot: https://repo.eclipse.org/content/groups/snapshots/org/eclipse/scout/rt/org.eclipse.scout.rt.platform/9.0.0-SNAPSHOT/org.eclipse.scout.rt.platform-9.0.0-20190805.222633-130.pom
09:01:42 [INFO] Downloaded from eclipse.snapshot: https://repo.eclipse.org/content/groups/snapshots/org/eclipse/scout/rt/org.eclipse.scout.rt.platform/9.0.0-SNAPSHOT/org.eclipse.scout.rt.platform-9.0.0-20190805.222633-130.pom (3.7 kB at 100 kB/s)
09:01:42 [INFO] Downloading from eclipse.snapshot: https://repo.eclipse.org/content/groups/snapshots/org/eclipse/scout/rt/org.eclipse.scout.rt.client/9.0.0-SNAPSHOT/maven-metadata.xml
09:01:42 [INFO] Downloaded from eclipse.snapshot: https://repo.eclipse.org/content/groups/snapshots/org/eclipse/scout/rt/org.eclipse.scout.rt.client/9.0.0-SNAPSHOT/maven-metadata.xml (1.0 kB at 17 kB/s)
09:01:42 [INFO] Downloading from eclipse.snapshot: https://repo.eclipse.org/content/groups/snapshots/org/eclipse/scout/rt/org.eclipse.scout.rt.client/9.0.0-SNAPSHOT/org.eclipse.scout.rt.client-9.0.0-20190805.223007-130.pom
09:01:42 [INFO] Downloaded from eclipse.snapshot: https://repo.eclipse.org/content/groups/snapshots/org/eclipse/scout/rt/org.eclipse.scout.rt.client/9.0.0-SNAPSHOT/org.eclipse.scout.rt.client-9.0.0-20190805.223007-130.pom (1.3 kB at 27 kB/s)
09:01:42 [INFO] Downloading from eclipse.snapshot: https://repo.eclipse.org/content/groups/snapshots/org/eclipse/scout/rt/org.eclipse.scout.rt.ui.html.scriptprocessor/9.0.0-SNAPSHOT/maven-metadata.xml
09:01:42 [INFO] Downloaded from eclipse.snapshot: https://repo.eclipse.org/content/groups/snapshots/org/eclipse/scout/rt/org.eclipse.scout.rt.ui.html.scriptprocessor/9.0.0-SNAPSHOT/maven-metadata.xml (1.0 kB at 18 kB/s)
09:01:42 [INFO] Downloading from eclipse.snapshot: https://repo.eclipse.org/content/groups/snapshots/org/eclipse/scout/rt/org.eclipse.scout.rt.ui.html.scriptprocessor/9.0.0-SNAPSHOT/org.eclipse.scout.rt.ui.html.scriptprocessor-9.0.0-20190805.223058-130.pom
09:01:42 [INFO] Downloaded from eclipse.snapshot: https://repo.eclipse.org/content/groups/snapshots/org/eclipse/scout/rt/org.eclipse.scout.rt.ui.html.scriptprocessor/9.0.0-SNAPSHOT/org.eclipse.scout.rt.ui.html.scriptprocessor-9.0.0-20190805.223058-130.pom (3.4 kB at 77 kB/s)
09:01:42 [INFO] Downloading from eclipse.snapshot: https://repo.eclipse.org/content/groups/snapshots/org/eclipse/scout/rt/org.eclipse.scout.json/9.0.0-SNAPSHOT/maven-metadata.xml
09:01:42 [INFO] Downloaded from eclipse.snapshot: https://repo.eclipse.org/content/groups/snapshots/org/eclipse/scout/rt/org.eclipse.scout.json/9.0.0-SNAPSHOT/maven-metadata.xml (1.4 kB at 23 kB/s)
09:01:42 [INFO] Downloading from eclipse.snapshot: https://repo.eclipse.org/content/groups/snapshots/org/eclipse/scout/rt/org.eclipse.scout.json/9.0.0-SNAPSHOT/org.eclipse.scout.json-9.0.0-20190805.222624-130.pom
09:01:42 [INFO] Downloaded from eclipse.snapshot: https://repo.eclipse.org/content/groups/snapshots/org/eclipse/scout/rt/org.eclipse.scout.json/9.0.0-SNAPSHOT/org.eclipse.scout.json-9.0.0-20190805.222624-130.pom (2.1 kB at 56 kB/s)
09:01:42 [INFO] Downloading from eclipse.snapshot: https://repo.eclipse.org/content/groups/snapshots/org/eclipse/scout/rt/org.eclipse.scout.rt.client.test/9.0.0-SNAPSHOT/maven-metadata.xml
09:01:42 [INFO] Downloaded from eclipse.snapshot: https://repo.eclipse.org/content/groups/snapshots/org/eclipse/scout/rt/org.eclipse.scout.rt.client.test/9.0.0-SNAPSHOT/maven-metadata.xml (1.5 kB at 20 kB/s)
09:01:42 [INFO] Downloading from eclipse.snapshot: https://repo.eclipse.org/content/groups/snapshots/org/eclipse/scout/rt/org.eclipse.scout.rt.client.test/9.0.0-SNAPSHOT/org.eclipse.scout.rt.client.test-9.0.0-20190805.223022-130.pom
09:01:42 [INFO] Downloaded from eclipse.snapshot: https://repo.eclipse.org/content/groups/snapshots/org/eclipse/scout/rt/org.eclipse.scout.rt.client.test/9.0.0-SNAPSHOT/org.eclipse.scout.rt.client.test-9.0.0-20190805.223022-130.pom (1.7 kB at 54 kB/s)
09:01:42 [INFO] Downloading from eclipse.snapshot: https://repo.eclipse.org/content/groups/snapshots/org/eclipse/scout/rt/org.eclipse.scout.rt.shared.test/9.0.0-SNAPSHOT/maven-metadata.xml
09:01:42 [INFO] Downloaded from eclipse.snapshot: https://repo.eclipse.org/content/groups/snapshots/org/eclipse/scout/rt/org.eclipse.scout.rt.shared.test/9.0.0-SNAPSHOT/maven-metadata.xml (1.5 kB at 30 kB/s)
09:01:42 [INFO] Downloading from eclipse.snapshot: https://repo.eclipse.org/content/groups/snapshots/org/eclipse/scout/rt/org.eclipse.scout.rt.shared.test/9.0.0-SNAPSHOT/org.eclipse.scout.rt.shared.test-9.0.0-20190805.222708-130.pom
09:01:42 [INFO] Downloaded from eclipse.snapshot: https://repo.eclipse.org/content/groups/snapshots/org/eclipse/scout/rt/org.eclipse.scout.rt.shared.test/9.0.0-SNAPSHOT/org.eclipse.scout.rt.shared.test-9.0.0-20190805.222708-130.pom (1.6 kB at 40 kB/s)
09:01:42 [INFO] Downloading from eclipse.snapshot: https://repo.eclipse.org/content/groups/snapshots/org/eclipse/scout/rt/org.eclipse.scout.rt.platform.test/9.0.0-SNAPSHOT/maven-metadata.xml
09:01:42 [INFO] Downloaded from eclipse.snapshot: https://repo.eclipse.org/content/groups/snapshots/org/eclipse/scout/rt/org.eclipse.scout.rt.platform.test/9.0.0-SNAPSHOT/maven-metadata.xml (1.5 kB at 25 kB/s)
09:01:42 [INFO] Downloading from eclipse.snapshot: https://repo.eclipse.org/content/groups/snapshots/org/eclipse/scout/rt/org.eclipse.scout.rt.platform.test/9.0.0-SNAPSHOT/org.eclipse.scout.rt.platform.test-9.0.0-20190805.222645-130.pom
09:01:42 [INFO] Downloaded from eclipse.snapshot: https://repo.eclipse.org/content/groups/snapshots/org/eclipse/scout/rt/org.eclipse.scout.rt.platform.test/9.0.0-SNAPSHOT/org.eclipse.scout.rt.platform.test-9.0.0-20190805.222645-130.pom (1.8 kB at 39 kB/s)
09:01:42 [INFO] Downloading from eclipse.snapshot: https://repo.eclipse.org/content/groups/snapshots/org/eclipse/scout/rt/org.eclipse.scout.rt.server.test/9.0.0-SNAPSHOT/maven-metadata.xml
09:01:42 [INFO] Downloaded from eclipse.snapshot: https://repo.eclipse.org/content/groups/snapshots/org/eclipse/scout/rt/org.eclipse.scout.rt.server.test/9.0.0-SNAPSHOT/maven-metadata.xml (1.5 kB at 17 kB/s)
09:01:42 [INFO] Downloading from eclipse.snapshot: https://repo.eclipse.org/content/groups/snapshots/org/eclipse/scout/rt/org.eclipse.scout.rt.server.test/9.0.0-SNAPSHOT/org.eclipse.scout.rt.server.test-9.0.0-20190805.222746-130.pom
09:01:42 [INFO] Downloaded from eclipse.snapshot: https://repo.eclipse.org/content/groups/snapshots/org/eclipse/scout/rt/org.eclipse.scout.rt.server.test/9.0.0-SNAPSHOT/org.eclipse.scout.rt.server.test-9.0.0-20190805.222746-130.pom (1.8 kB at 33 kB/s)
09:01:42 [INFO] Downloading from eclipse.snapshot: https://repo.eclipse.org/content/groups/snapshots/org/eclipse/scout/rt/org.eclipse.scout.rt.server/9.0.0-SNAPSHOT/maven-metadata.xml
09:01:42 [INFO] Downloaded from eclipse.snapshot: https://repo.eclipse.org/content/groups/snapshots/org/eclipse/scout/rt/org.eclipse.scout.rt.server/9.0.0-SNAPSHOT/maven-metadata.xml (1.0 kB at 17 kB/s)
09:01:42 [INFO] Downloading from eclipse.snapshot: https://repo.eclipse.org/content/groups/snapshots/org/eclipse/scout/rt/org.eclipse.scout.rt.server/9.0.0-SNAPSHOT/org.eclipse.scout.rt.server-9.0.0-20190805.222737-130.pom
09:01:43 [INFO] Downloaded from eclipse.snapshot: https://repo.eclipse.org/content/groups/snapshots/org/eclipse/scout/rt/org.eclipse.scout.rt.server/9.0.0-SNAPSHOT/org.eclipse.scout.rt.server-9.0.0-20190805.222737-130.pom (1.6 kB at 37 kB/s)
09:01:43 [INFO] Downloading from eclipse.snapshot: https://repo.eclipse.org/content/groups/snapshots/org/eclipse/scout/rt/org.eclipse.scout.rt.mom.api/9.0.0-SNAPSHOT/maven-metadata.xml
09:01:43 [INFO] Downloaded from eclipse.snapshot: https://repo.eclipse.org/content/groups/snapshots/org/eclipse/scout/rt/org.eclipse.scout.rt.mom.api/9.0.0-SNAPSHOT/maven-metadata.xml (1.0 kB at 19 kB/s)
09:01:43 [INFO] Downloading from eclipse.snapshot: https://repo.eclipse.org/content/groups/snapshots/org/eclipse/scout/rt/org.eclipse.scout.rt.mom.api/9.0.0-SNAPSHOT/org.eclipse.scout.rt.mom.api-9.0.0-20190805.222729-130.pom
09:01:43 [INFO] Downloaded from eclipse.snapshot: https://repo.eclipse.org/content/groups/snapshots/org/eclipse/scout/rt/org.eclipse.scout.rt.mom.api/9.0.0-SNAPSHOT/org.eclipse.scout.rt.mom.api-9.0.0-20190805.222729-130.pom (1.3 kB at 19 kB/s)
09:01:43 [INFO] Downloading from eclipse.snapshot: https://repo.eclipse.org/content/groups/snapshots/org/eclipse/scout/rt/org.eclipse.scout.rt.server.jaxws/9.0.0-SNAPSHOT/maven-metadata.xml
09:01:43 [INFO] Downloaded from eclipse.snapshot: https://repo.eclipse.org/content/groups/snapshots/org/eclipse/scout/rt/org.eclipse.scout.rt.server.jaxws/9.0.0-SNAPSHOT/maven-metadata.xml (1.0 kB at 20 kB/s)
09:01:43 [INFO] Downloading from eclipse.snapshot: https://repo.eclipse.org/content/groups/snapshots/org/eclipse/scout/rt/org.eclipse.scout.rt.server.jaxws/9.0.0-SNAPSHOT/org.eclipse.scout.rt.server.jaxws-9.0.0-20190805.222753-130.pom
09:01:43 [INFO] Downloaded from eclipse.snapshot: https://repo.eclipse.org/content/groups/snapshots/org/eclipse/scout/rt/org.eclipse.scout.rt.server.jaxws/9.0.0-SNAPSHOT/org.eclipse.scout.rt.server.jaxws-9.0.0-20190805.222753-130.pom (1.5 kB at 76 kB/s)
09:01:43 [INFO] Downloading from eclipse.snapshot: https://repo.eclipse.org/content/groups/snapshots/org/eclipse/scout/rt/org.eclipse.scout.rt.dataobject/9.0.0-SNAPSHOT/maven-metadata.xml
09:01:43 [INFO] Downloaded from eclipse.snapshot: https://repo.eclipse.org/content/groups/snapshots/org/eclipse/scout/rt/org.eclipse.scout.rt.dataobject/9.0.0-SNAPSHOT/maven-metadata.xml (1.0 kB at 19 kB/s)
09:01:43 [INFO] Downloading from eclipse.snapshot: https://repo.eclipse.org/content/groups/snapshots/org/eclipse/scout/rt/org.eclipse.scout.rt.dataobject/9.0.0-SNAPSHOT/org.eclipse.scout.rt.dataobject-9.0.0-20190805.222827-82.pom
09:01:43 [INFO] Downloaded from eclipse.snapshot: https://repo.eclipse.org/content/groups/snapshots/org/eclipse/scout/rt/org.eclipse.scout.rt.dataobject/9.0.0-SNAPSHOT/org.eclipse.scout.rt.dataobject-9.0.0-20190805.222827-82.pom (1.3 kB at 37 kB/s)
09:01:43 [INFO] Downloading from eclipse.snapshot: https://repo.eclipse.org/content/groups/snapshots/org/eclipse/scout/rt/org.eclipse.scout.rt.ui.html.test/9.0.0-SNAPSHOT/org.eclipse.scout.rt.ui.html.test-9.0.0-20190805.223119-130.jar
09:01:43 [INFO] Downloading from eclipse.snapshot: https://repo.eclipse.org/content/groups/snapshots/org/eclipse/scout/rt/org.eclipse.scout.rt.server.commons/9.0.0-SNAPSHOT/org.eclipse.scout.rt.server.commons-9.0.0-20190805.222716-130.jar
09:01:43 [INFO] Downloading from eclipse.snapshot: https://repo.eclipse.org/content/groups/snapshots/org/eclipse/scout/rt/org.eclipse.scout.rt.ui.html/9.0.0-SNAPSHOT/org.eclipse.scout.rt.ui.html-9.0.0-20190805.223109-130.jar
09:01:43 [INFO] Downloading from eclipse.snapshot: https://repo.eclipse.org/content/groups/snapshots/org/eclipse/scout/rt/org.eclipse.scout.rt.ui.html.scriptprocessor/9.0.0-SNAPSHOT/org.eclipse.scout.rt.ui.html.scriptprocessor-9.0.0-20190805.223058-130.jar
09:01:43 [INFO] Downloading from eclipse.snapshot: https://repo.eclipse.org/content/groups/snapshots/org/eclipse/scout/rt/org.eclipse.scout.rt.client/9.0.0-SNAPSHOT/org.eclipse.scout.rt.client-9.0.0-20190805.223007-130.jar
09:01:43 [INFO] Downloaded from eclipse.snapshot: https://repo.eclipse.org/content/groups/snapshots/org/eclipse/scout/rt/org.eclipse.scout.rt.ui.html.test/9.0.0-SNAPSHOT/org.eclipse.scout.rt.ui.html.test-9.0.0-20190805.223119-130.jar (34 kB at 309 kB/s)
09:01:43 [INFO] Downloading from eclipse.snapshot: https://repo.eclipse.org/content/groups/snapshots/org/eclipse/scout/rt/org.eclipse.scout.json/9.0.0-SNAPSHOT/org.eclipse.scout.json-9.0.0-20190805.222624-130.jar
09:01:43 [INFO] Downloaded from eclipse.snapshot: https://repo.eclipse.org/content/groups/snapshots/org/eclipse/scout/rt/org.eclipse.scout.json/9.0.0-SNAPSHOT/org.eclipse.scout.json-9.0.0-20190805.222624-130.jar (31 kB at 168 kB/s)
09:01:43 [INFO] Downloading from eclipse.snapshot: https://repo.eclipse.org/content/groups/snapshots/org/eclipse/scout/rt/org.eclipse.scout.rt.client.test/9.0.0-SNAPSHOT/org.eclipse.scout.rt.client.test-9.0.0-20190805.223022-130.jar
09:01:43 [INFO] Downloaded from eclipse.snapshot: https://repo.eclipse.org/content/groups/snapshots/org/eclipse/scout/rt/org.eclipse.scout.rt.ui.html.scriptprocessor/9.0.0-SNAPSHOT/org.eclipse.scout.rt.ui.html.scriptprocessor-9.0.0-20190805.223058-130.jar (3.1 MB at 14 MB/s)
09:01:43 [INFO] Downloading from eclipse.snapshot: https://repo.eclipse.org/content/groups/snapshots/org/eclipse/scout/rt/org.eclipse.scout.rt.server.test/9.0.0-SNAPSHOT/org.eclipse.scout.rt.server.test-9.0.0-20190805.222746-130.jar
09:01:43 [INFO] Downloaded from eclipse.snapshot: https://repo.eclipse.org/content/groups/snapshots/org/eclipse/scout/rt/org.eclipse.scout.rt.client/9.0.0-SNAPSHOT/org.eclipse.scout.rt.client-9.0.0-20190805.223007-130.jar (3.3 MB at 15 MB/s)
09:01:43 [INFO] Downloading from eclipse.snapshot: https://repo.eclipse.org/content/groups/snapshots/org/eclipse/scout/rt/org.eclipse.scout.rt.server/9.0.0-SNAPSHOT/org.eclipse.scout.rt.server-9.0.0-20190805.222737-130.jar
09:01:43 [INFO] Downloaded from eclipse.snapshot: https://repo.eclipse.org/content/groups/snapshots/org/eclipse/scout/rt/org.eclipse.scout.rt.client.test/9.0.0-SNAPSHOT/org.eclipse.scout.rt.client.test-9.0.0-20190805.223022-130.jar (58 kB at 242 kB/s)
09:01:43 [INFO] Downloading from eclipse.snapshot: https://repo.eclipse.org/content/groups/snapshots/org/eclipse/scout/rt/org.eclipse.scout.rt.shared/9.0.0-SNAPSHOT/org.eclipse.scout.rt.shared-9.0.0-20190805.222653-130.jar
09:01:43 [INFO] Downloaded from eclipse.snapshot: https://repo.eclipse.org/content/groups/snapshots/org/eclipse/scout/rt/org.eclipse.scout.rt.server.test/9.0.0-SNAPSHOT/org.eclipse.scout.rt.server.test-9.0.0-20190805.222746-130.jar (23 kB at 86 kB/s)
09:01:43 [INFO] Downloading from eclipse.snapshot: https://repo.eclipse.org/content/groups/snapshots/org/eclipse/scout/rt/org.eclipse.scout.rt.mom.api/9.0.0-SNAPSHOT/org.eclipse.scout.rt.mom.api-9.0.0-20190805.222729-130.jar
09:01:43 [INFO] Downloaded from eclipse.snapshot: https://repo.eclipse.org/content/groups/snapshots/org/eclipse/scout/rt/org.eclipse.scout.rt.server/9.0.0-SNAPSHOT/org.eclipse.scout.rt.server-9.0.0-20190805.222737-130.jar (290 kB at 1.0 MB/s)
09:01:43 [INFO] Downloading from eclipse.snapshot: https://repo.eclipse.org/content/groups/snapshots/org/eclipse/scout/rt/org.eclipse.scout.rt.shared.test/9.0.0-SNAPSHOT/org.eclipse.scout.rt.shared.test-9.0.0-20190805.222708-130.jar
09:01:43 [INFO] Downloaded from eclipse.snapshot: https://repo.eclipse.org/content/groups/snapshots/org/eclipse/scout/rt/org.eclipse.scout.rt.ui.html/9.0.0-SNAPSHOT/org.eclipse.scout.rt.ui.html-9.0.0-20190805.223109-130.jar (2.8 MB at 9.7 MB/s)
09:01:43 [INFO] Downloading from eclipse.snapshot: https://repo.eclipse.org/content/groups/snapshots/org/eclipse/scout/rt/org.eclipse.scout.rt.platform.test/9.0.0-SNAPSHOT/org.eclipse.scout.rt.platform.test-9.0.0-20190805.222645-130.jar
09:01:43 [INFO] Downloaded from eclipse.snapshot: https://repo.eclipse.org/content/groups/snapshots/org/eclipse/scout/rt/org.eclipse.scout.rt.shared/9.0.0-SNAPSHOT/org.eclipse.scout.rt.shared-9.0.0-20190805.222653-130.jar (781 kB at 2.4 MB/s)
09:01:43 [INFO] Downloading from eclipse.snapshot: https://repo.eclipse.org/content/groups/snapshots/org/eclipse/scout/rt/org.eclipse.scout.rt.server.jaxws/9.0.0-SNAPSHOT/org.eclipse.scout.rt.server.jaxws-9.0.0-20190805.222753-130.jar
09:01:43 [INFO] Downloaded from eclipse.snapshot: https://repo.eclipse.org/content/groups/snapshots/org/eclipse/scout/rt/org.eclipse.scout.rt.server.commons/9.0.0-SNAPSHOT/org.eclipse.scout.rt.server.commons-9.0.0-20190805.222716-130.jar (157 kB at 484 kB/s)
09:01:43 [INFO] Downloading from eclipse.snapshot: https://repo.eclipse.org/content/groups/snapshots/org/eclipse/scout/rt/org.eclipse.scout.rt.dataobject/9.0.0-SNAPSHOT/org.eclipse.scout.rt.dataobject-9.0.0-20190805.222827-82.jar
09:01:43 [INFO] Downloaded from eclipse.snapshot: https://repo.eclipse.org/content/groups/snapshots/org/eclipse/scout/rt/org.eclipse.scout.rt.mom.api/9.0.0-SNAPSHOT/org.eclipse.scout.rt.mom.api-9.0.0-20190805.222729-130.jar (59 kB at 180 kB/s)
09:01:43 [INFO] Downloading from eclipse.snapshot: https://repo.eclipse.org/content/groups/snapshots/org/eclipse/scout/rt/org.eclipse.scout.rt.platform/9.0.0-SNAPSHOT/org.eclipse.scout.rt.platform-9.0.0-20190805.222633-130.jar
09:01:43 [INFO] Downloaded from eclipse.snapshot: https://repo.eclipse.org/content/groups/snapshots/org/eclipse/scout/rt/org.eclipse.scout.rt.shared.test/9.0.0-SNAPSHOT/org.eclipse.scout.rt.shared.test-9.0.0-20190805.222708-130.jar (24 kB at 71 kB/s)
09:01:43 [INFO] Downloaded from eclipse.snapshot: https://repo.eclipse.org/content/groups/snapshots/org/eclipse/scout/rt/org.eclipse.scout.rt.server.jaxws/9.0.0-SNAPSHOT/org.eclipse.scout.rt.server.jaxws-9.0.0-20190805.222753-130.jar (140 kB at 393 kB/s)
09:01:43 [INFO] Downloaded from eclipse.snapshot: https://repo.eclipse.org/content/groups/snapshots/org/eclipse/scout/rt/org.eclipse.scout.rt.platform.test/9.0.0-SNAPSHOT/org.eclipse.scout.rt.platform.test-9.0.0-20190805.222645-130.jar (97 kB at 269 kB/s)
09:01:43 [INFO] Downloaded from eclipse.snapshot: https://repo.eclipse.org/content/groups/snapshots/org/eclipse/scout/rt/org.eclipse.scout.rt.dataobject/9.0.0-SNAPSHOT/org.eclipse.scout.rt.dataobject-9.0.0-20190805.222827-82.jar (31 kB at 82 kB/s)
09:01:43 [INFO] Downloaded from eclipse.snapshot: https://repo.eclipse.org/content/groups/snapshots/org/eclipse/scout/rt/org.eclipse.scout.rt.platform/9.0.0-SNAPSHOT/org.eclipse.scout.rt.platform-9.0.0-20190805.222633-130.jar (908 kB at 2.3 MB/s)
09:01:43 [INFO] 
09:01:43 [INFO] --- maven-clean-plugin:3.1.0:clean (default-clean) @ org.eclipse.scout.sdk.core.s.test ---
09:01:43 [INFO] Deleting /jobs/genie.scout/org.eclipse.scout.sdk.branch-9.0_continuous/workspace/org.eclipse.scout.sdk.core.s.test/target
09:01:43 [INFO] 
09:01:43 [INFO] --- maven-enforcer-plugin:1.4.1:enforce (enforce-rules) @ org.eclipse.scout.sdk.core.s.test ---
09:01:43 [INFO] Skipping Rule Enforcement.
09:01:43 [INFO] 
09:01:43 [INFO] --- git-commit-id-plugin:2.2.5:revision (default) @ org.eclipse.scout.sdk.core.s.test ---
09:01:45 [INFO] 
09:01:45 [INFO] --- jacoco-maven-plugin:0.8.2:prepare-agent (default) @ org.eclipse.scout.sdk.core.s.test ---
09:01:45 [INFO] master_test_jacocoArgLine set to -javaagent:/home/hudson/genie.scout/.jenkins/jobs/org.eclipse.scout.sdk.branch-9.0_continuous/workspace/.repository/org/jacoco/org.jacoco.agent/0.8.2/org.jacoco.agent-0.8.2-runtime.jar=destfile=/jobs/genie.scout/org.eclipse.scout.sdk.branch-9.0_continuous/workspace/org.eclipse.scout.sdk.core.s.test/../org.eclipse.scout.sdk/target/jacoco-all.exec
09:01:45 [INFO] 
09:01:45 [INFO] --- build-helper-maven-plugin:3.0.0:parse-version (initialize-parse-version) @ org.eclipse.scout.sdk.core.s.test ---
09:01:45 [INFO] 
09:01:45 [INFO] --- build-helper-maven-plugin:3.0.0:regex-property (initialize-regex) @ org.eclipse.scout.sdk.core.s.test ---
09:01:45 [INFO] 
09:01:45 [INFO] --- build-helper-maven-plugin:3.0.0:add-source (add-source) @ org.eclipse.scout.sdk.core.s.test ---
09:01:45 [INFO] Source directory: /jobs/genie.scout/org.eclipse.scout.sdk.branch-9.0_continuous/workspace/org.eclipse.scout.sdk.core.s.test/src/main/client added.
09:01:45 [INFO] Source directory: /jobs/genie.scout/org.eclipse.scout.sdk.branch-9.0_continuous/workspace/org.eclipse.scout.sdk.core.s.test/src/main/shared added.
09:01:45 [INFO] 
09:01:45 [INFO] --- maven-resources-plugin:3.1.0:resources (default-resources) @ org.eclipse.scout.sdk.core.s.test ---
09:01:45 [INFO] Using 'UTF-8' encoding to copy filtered resources.
09:01:45 [INFO] skip non existing resourceDirectory /jobs/genie.scout/org.eclipse.scout.sdk.branch-9.0_continuous/workspace/org.eclipse.scout.sdk.core.s.test/src/main/resources
09:01:45 [INFO] Copying 2 resources
09:01:45 [INFO] 
09:01:45 [INFO] --- maven-compiler-plugin:3.8.0:compile (default-compile) @ org.eclipse.scout.sdk.core.s.test ---
09:01:45 [INFO] Changes detected - recompiling the module!
09:01:45 [INFO] Compiling 140 source files to /jobs/genie.scout/org.eclipse.scout.sdk.branch-9.0_continuous/workspace/org.eclipse.scout.sdk.core.s.test/target/classes
09:01:45 [INFO] 
09:01:45 [INFO] --- maven-resources-plugin:3.1.0:testResources (default-testResources) @ org.eclipse.scout.sdk.core.s.test ---
09:01:45 [INFO] Using 'UTF-8' encoding to copy filtered resources.
09:01:45 [INFO] skip non existing resourceDirectory /jobs/genie.scout/org.eclipse.scout.sdk.branch-9.0_continuous/workspace/org.eclipse.scout.sdk.core.s.test/src/test/resources
09:01:45 [INFO] 
09:01:45 [INFO] --- maven-compiler-plugin:3.8.0:testCompile (default-testCompile) @ org.eclipse.scout.sdk.core.s.test ---
09:01:46 [INFO] Changes detected - recompiling the module!
09:01:46 [INFO] Compiling 36 source files to /jobs/genie.scout/org.eclipse.scout.sdk.branch-9.0_continuous/workspace/org.eclipse.scout.sdk.core.s.test/target/test-classes
09:01:46 [INFO] 
09:01:46 [INFO] --- maven-surefire-plugin:2.22.1:test (default-test) @ org.eclipse.scout.sdk.core.s.test ---
09:01:46 [INFO] 
09:01:46 [INFO] -------------------------------------------------------
09:01:46 [INFO]  T E S T S
09:01:46 [INFO] -------------------------------------------------------
09:01:47 [INFO] Running org.eclipse.scout.sdk.core.s.util.CoreScoutUtilsTest
09:01:49 [WARNING]: The @Order value 100000000000000000 is very large and therefore may not be precise enough. It is recommended to use a lower value.
09:01:49 [INFO] Tests run: 6, Failures: 0, Errors: 0, Skipped: 0, Time elapsed: 2.484 s - in org.eclipse.scout.sdk.core.s.util.CoreScoutUtilsTest
09:01:49 [INFO] Running org.eclipse.scout.sdk.core.s.structured.WellformTest
09:01:52 [INFO] Tests run: 2, Failures: 0, Errors: 0, Skipped: 0, Time elapsed: 2.778 s - in org.eclipse.scout.sdk.core.s.structured.WellformTest
09:01:52 [INFO] Running org.eclipse.scout.sdk.core.s.sourcebuilder.testcase.TestSourceBuilderTest
09:01:52 [INFO] Tests run: 2, Failures: 0, Errors: 0, Skipped: 0, Time elapsed: 0.123 s - in org.eclipse.scout.sdk.core.s.sourcebuilder.testcase.TestSourceBuilderTest
09:01:52 [INFO] Running org.eclipse.scout.sdk.core.s.sourcebuilder.page.PageSourceBuilderTest
09:01:52 [INFO] Tests run: 2, Failures: 0, Errors: 0, Skipped: 0, Time elapsed: 0.394 s - in org.eclipse.scout.sdk.core.s.sourcebuilder.page.PageSourceBuilderTest
09:01:52 [INFO] Running org.eclipse.scout.sdk.core.s.sourcebuilder.lookupcall.LookupCallSourceBuilderTest
09:01:53 [INFO] Tests run: 1, Failures: 0, Errors: 0, Skipped: 0, Time elapsed: 0.141 s - in org.eclipse.scout.sdk.core.s.sourcebuilder.lookupcall.LookupCallSourceBuilderTest
09:01:53 [INFO] Running org.eclipse.scout.sdk.core.s.sourcebuilder.form.FormSourceBuilderTest
09:01:53 [INFO] Tests run: 1, Failures: 0, Errors: 0, Skipped: 0, Time elapsed: 0.241 s - in org.eclipse.scout.sdk.core.s.sourcebuilder.form.FormSourceBuilderTest
09:01:53 [INFO] Running org.eclipse.scout.sdk.core.s.sourcebuilder.dto.TableFieldWithIgnoredColumnsTest
09:01:55 [INFO] Tests run: 5, Failures: 0, Errors: 0, Skipped: 0, Time elapsed: 1.721 s - in org.eclipse.scout.sdk.core.s.sourcebuilder.dto.TableFieldWithIgnoredColumnsTest
09:01:55 [INFO] Running org.eclipse.scout.sdk.core.s.sourcebuilder.dto.TableFieldFormTest
09:01:55 [INFO] Tests run: 1, Failures: 0, Errors: 0, Skipped: 0, Time elapsed: 0.628 s - in org.eclipse.scout.sdk.core.s.sourcebuilder.dto.TableFieldFormTest
09:01:55 [INFO] Running org.eclipse.scout.sdk.core.s.sourcebuilder.dto.TableFieldExtensionTest
09:01:55 [INFO] Tests run: 2, Failures: 0, Errors: 0, Skipped: 0, Time elapsed: 0.176 s - in org.eclipse.scout.sdk.core.s.sourcebuilder.dto.TableFieldExtensionTest
09:01:55 [INFO] Running org.eclipse.scout.sdk.core.s.sourcebuilder.dto.TableFieldBeanTest
09:01:58 [WARNING]: Column 'formdata.client.ui.forms.ColumnWithoutTypeForm$MainBox$MyTableField$Table$MyColumn' has no value type.
09:01:58 [INFO] Tests run: 1, Failures: 0, Errors: 0, Skipped: 0, Time elapsed: 2.229 s - in org.eclipse.scout.sdk.core.s.sourcebuilder.dto.TableFieldBeanTest
09:01:58 [INFO] Running org.eclipse.scout.sdk.core.s.sourcebuilder.dto.SimpleFormTest
09:01:58 [INFO] Tests run: 1, Failures: 0, Errors: 0, Skipped: 0, Time elapsed: 0.104 s - in org.eclipse.scout.sdk.core.s.sourcebuilder.dto.SimpleFormTest
09:01:58 [INFO] Running org.eclipse.scout.sdk.core.s.sourcebuilder.dto.ScopeTest
09:01:58 [INFO] Tests run: 1, Failures: 0, Errors: 0, Skipped: 0, Time elapsed: 0.237 s - in org.eclipse.scout.sdk.core.s.sourcebuilder.dto.ScopeTest
09:01:58 [INFO] Running org.eclipse.scout.sdk.core.s.sourcebuilder.dto.ReplacingPageTest
09:01:58 [INFO] Tests run: 1, Failures: 0, Errors: 0, Skipped: 0, Time elapsed: 0.215 s - in org.eclipse.scout.sdk.core.s.sourcebuilder.dto.ReplacingPageTest
09:01:58 [INFO] Running org.eclipse.scout.sdk.core.s.sourcebuilder.dto.ReplacingFormTest
09:01:58 [INFO] Tests run: 1, Failures: 0, Errors: 0, Skipped: 0, Time elapsed: 0.082 s - in org.eclipse.scout.sdk.core.s.sourcebuilder.dto.ReplacingFormTest
09:01:58 [INFO] Running org.eclipse.scout.sdk.core.s.sourcebuilder.dto.ReplaceWithTemplatesTest
09:01:59 [INFO] Tests run: 4, Failures: 0, Errors: 0, Skipped: 0, Time elapsed: 0.717 s - in org.eclipse.scout.sdk.core.s.sourcebuilder.dto.ReplaceWithTemplatesTest
09:01:59 [INFO] Running org.eclipse.scout.sdk.core.s.sourcebuilder.dto.ReplaceFormFieldTest
09:01:59 [INFO] Tests run: 1, Failures: 0, Errors: 0, Skipped: 0, Time elapsed: 0.445 s - in org.eclipse.scout.sdk.core.s.sourcebuilder.dto.ReplaceFormFieldTest
09:01:59 [INFO] Running org.eclipse.scout.sdk.core.s.sourcebuilder.dto.PageBeanDataTest
09:02:00 [INFO] Tests run: 6, Failures: 0, Errors: 0, Skipped: 0, Time elapsed: 1.033 s - in org.eclipse.scout.sdk.core.s.sourcebuilder.dto.PageBeanDataTest
09:02:00 [INFO] Running org.eclipse.scout.sdk.core.s.sourcebuilder.dto.NestedMultiLevelFormFieldTest
09:02:01 [INFO] Tests run: 1, Failures: 0, Errors: 0, Skipped: 0, Time elapsed: 0.399 s - in org.eclipse.scout.sdk.core.s.sourcebuilder.dto.NestedMultiLevelFormFieldTest
09:02:01 [INFO] Running org.eclipse.scout.sdk.core.s.sourcebuilder.dto.MixedValueFieldTest
09:02:01 [INFO] Tests run: 1, Failures: 0, Errors: 0, Skipped: 0, Time elapsed: 0.084 s - in org.eclipse.scout.sdk.core.s.sourcebuilder.dto.MixedValueFieldTest
09:02:01 [INFO] Running org.eclipse.scout.sdk.core.s.sourcebuilder.dto.MasterFieldFormDataTest
09:02:01 [INFO] Tests run: 1, Failures: 0, Errors: 0, Skipped: 0, Time elapsed: 0.069 s - in org.eclipse.scout.sdk.core.s.sourcebuilder.dto.MasterFieldFormDataTest
09:02:01 [INFO] Running org.eclipse.scout.sdk.core.s.sourcebuilder.dto.ListBoxFormTest
09:02:01 [INFO] Tests run: 1, Failures: 0, Errors: 0, Skipped: 0, Time elapsed: 0.071 s - in org.eclipse.scout.sdk.core.s.sourcebuilder.dto.ListBoxFormTest
09:02:01 [INFO] Running org.eclipse.scout.sdk.core.s.sourcebuilder.dto.IgnoredFieldsFormTest
09:02:01 [INFO] Tests run: 1, Failures: 0, Errors: 0, Skipped: 0, Time elapsed: 0.076 s - in org.eclipse.scout.sdk.core.s.sourcebuilder.dto.IgnoredFieldsFormTest
09:02:01 [INFO] Running org.eclipse.scout.sdk.core.s.sourcebuilder.dto.FormWithTemplateTest
09:02:01 [INFO] Tests run: 1, Failures: 0, Errors: 0, Skipped: 0, Time elapsed: 0.091 s - in org.eclipse.scout.sdk.core.s.sourcebuilder.dto.FormWithTemplateTest
09:02:01 [INFO] Running org.eclipse.scout.sdk.core.s.sourcebuilder.dto.FormWithGroupboxesTest
09:02:01 [INFO] Tests run: 1, Failures: 0, Errors: 0, Skipped: 0, Time elapsed: 0.066 s - in org.eclipse.scout.sdk.core.s.sourcebuilder.dto.FormWithGroupboxesTest
09:02:01 [INFO] Running org.eclipse.scout.sdk.core.s.sourcebuilder.dto.FormPropertiesTest
09:02:01 [INFO] Tests run: 1, Failures: 0, Errors: 0, Skipped: 0, Time elapsed: 0.111 s - in org.eclipse.scout.sdk.core.s.sourcebuilder.dto.FormPropertiesTest
09:02:01 [INFO] Running org.eclipse.scout.sdk.core.s.sourcebuilder.dto.FormFieldMenuTest
09:02:02 [INFO] Tests run: 1, Failures: 0, Errors: 0, Skipped: 0, Time elapsed: 0.066 s - in org.eclipse.scout.sdk.core.s.sourcebuilder.dto.FormFieldMenuTest
09:02:02 [INFO] Running org.eclipse.scout.sdk.core.s.sourcebuilder.dto.ExternalTableFieldTest
09:02:02 [INFO] Tests run: 1, Failures: 0, Errors: 0, Skipped: 0, Time elapsed: 0.177 s - in org.eclipse.scout.sdk.core.s.sourcebuilder.dto.ExternalTableFieldTest
09:02:02 [INFO] Running org.eclipse.scout.sdk.core.s.sourcebuilder.dto.ExternalGroupboxTest
09:02:02 [INFO] Tests run: 1, Failures: 0, Errors: 0, Skipped: 0, Time elapsed: 0.063 s - in org.eclipse.scout.sdk.core.s.sourcebuilder.dto.ExternalGroupboxTest
09:02:02 [INFO] Running org.eclipse.scout.sdk.core.s.sourcebuilder.dto.ExternalCheckboxFieldTest
09:02:02 [INFO] Tests run: 1, Failures: 0, Errors: 0, Skipped: 0, Time elapsed: 0.055 s - in org.eclipse.scout.sdk.core.s.sourcebuilder.dto.ExternalCheckboxFieldTest
09:02:02 [INFO] Running org.eclipse.scout.sdk.core.s.sourcebuilder.dto.ExtensionFormDataTest
09:02:02 [INFO] Tests run: 5, Failures: 0, Errors: 0, Skipped: 0, Time elapsed: 0.413 s - in org.eclipse.scout.sdk.core.s.sourcebuilder.dto.ExtensionFormDataTest
09:02:02 [INFO] Running org.eclipse.scout.sdk.core.s.sourcebuilder.dto.AnnotationCopyTest
09:02:02 [INFO] Tests run: 1, Failures: 0, Errors: 0, Skipped: 0, Time elapsed: 0.078 s - in org.eclipse.scout.sdk.core.s.sourcebuilder.dto.AnnotationCopyTest
09:02:02 [INFO] Running org.eclipse.scout.sdk.core.s.sourcebuilder.codetype.CodeTypeSourceBuilderTest
09:02:02 [INFO] Tests run: 1, Failures: 0, Errors: 0, Skipped: 0, Time elapsed: 0.049 s - in org.eclipse.scout.sdk.core.s.sourcebuilder.codetype.CodeTypeSourceBuilderTest
09:02:02 [INFO] Running org.eclipse.scout.sdk.core.s.project.ScoutProjectNewTest
09:02:10 [WARNING]: Don't override file /tmp/genie.scout/CoreScoutTestingUtils-projectDir4889769767195011793/artifact/artifact/pom.xml
09:02:19 [WARNING]: /tmp/genie.scout/CoreScoutTestingUtils-projectDir4889769767195011793/artifact/artifact.shared/src/main/java/group/artifact/shared/security/AccessControlService.java:[5] 
09:02:19 	import org.eclipse.scout.rt.shared.ISession;
09:02:19 	       ^^^^^^^^^^^^^^^^^^^^^^^^^^^^^^^^^^^^
09:02:19 The import org.eclipse.scout.rt.shared.ISession is never used
09:02:19 [WARNING]: /tmp/genie.scout/CoreScoutTestingUtils-projectDir4889769767195011793/artifact/artifact.shared/src/main/java/group/artifact/shared/security/AccessControlService.java:[7] 
09:02:19 	import org.eclipse.scout.rt.shared.services.common.security.IAccessControlService;
09:02:19 	       ^^^^^^^^^^^^^^^^^^^^^^^^^^^^^^^^^^^^^^^^^^^^^^^^^^^^^^^^^^^^^^^^^^^^^^^^^^
09:02:19 The import org.eclipse.scout.rt.shared.services.common.security.IAccessControlService is never used
09:02:19 2 problems (2 warnings)
09:02:23 [WARNING]: /tmp/genie.scout/CoreScoutTestingUtils-projectDir4889769767195011793/artifact/artifact.client/src/main/java/group/artifact/client/ClientSession.java:[4] 
09:02:23 	import org.eclipse.scout.rt.client.IClientSession;
09:02:23 	       ^^^^^^^^^^^^^^^^^^^^^^^^^^^^^^^^^^^^^^^^^^
09:02:23 The import org.eclipse.scout.rt.client.IClientSession is never used
09:02:23 1 problem (1 warning)
09:02:23 [WARNING]: /tmp/genie.scout/CoreScoutTestingUtils-projectDir4889769767195011793/artifact/artifact.client/src/test/java/group/artifact/client/helloworld/HelloWorldFormTest.java:[8] 
09:02:23 	import group.artifact.client.helloworld.HelloWorldForm.MainBox.TopBox.MessageField;
09:02:23 	       ^^^^^^^^^^^^^^^^^^^^^^^^^^^^^^^^^^^^^^^^^^^^^^^^^^^^^^^^^^^^^^^^^^^^^^^^^^^
09:02:23 The import group.artifact.client.helloworld.HelloWorldForm.MainBox.TopBox.MessageField is never used
09:02:23 1 problem (1 warning)
09:02:26 [INFO] Tests run: 1, Failures: 0, Errors: 0, Skipped: 0, Time elapsed: 23.926 s - in org.eclipse.scout.sdk.core.s.project.ScoutProjectNewTest
09:02:26 [INFO] Running org.eclipse.scout.sdk.core.s.jaxws.JaxWsUtilsTest
09:02:26 [INFO] Tests run: 4, Failures: 0, Errors: 0, Skipped: 0, Time elapsed: 0.065 s - in org.eclipse.scout.sdk.core.s.jaxws.JaxWsUtilsTest
09:02:26 [INFO] Running org.eclipse.scout.sdk.core.s.jaxws.JaxWsModuleNewHelperTest
09:02:26 [INFO] Tests run: 1, Failures: 0, Errors: 0, Skipped: 0, Time elapsed: 0.018 s - in org.eclipse.scout.sdk.core.s.jaxws.JaxWsModuleNewHelperTest
09:02:26 [INFO] Running org.eclipse.scout.sdk.core.s.ScoutRuntimeTypesTest
09:02:27 [INFO] Tests run: 1, Failures: 0, Errors: 0, Skipped: 0, Time elapsed: 0.182 s - in org.eclipse.scout.sdk.core.s.ScoutRuntimeTypesTest
09:02:27 [INFO] 
09:02:27 [INFO] Results:
09:02:27 [INFO] 
09:02:27 [INFO] Tests run: 64, Failures: 0, Errors: 0, Skipped: 0
09:02:27 [INFO] 
09:02:27 [INFO] 
09:02:27 [INFO] --- maven-jar-plugin:3.1.1:jar (default-jar) @ org.eclipse.scout.sdk.core.s.test ---
09:02:27 [INFO] Building jar: /jobs/genie.scout/org.eclipse.scout.sdk.branch-9.0_continuous/workspace/org.eclipse.scout.sdk.core.s.test/target/org.eclipse.scout.sdk.core.s.test-9.0.0-SNAPSHOT.jar
09:02:27 [INFO] 
09:02:27 [INFO] --- maven-site-plugin:3.7.1:attach-descriptor (attach-descriptor) @ org.eclipse.scout.sdk.core.s.test ---
09:02:27 [INFO] Skipping because packaging 'jar' is not pom.
09:02:27 [INFO] 
09:02:27 [INFO] --- maven-jar-plugin:3.1.1:test-jar (attach-tests) @ org.eclipse.scout.sdk.core.s.test ---
09:02:27 [INFO] Building jar: /jobs/genie.scout/org.eclipse.scout.sdk.branch-9.0_continuous/workspace/org.eclipse.scout.sdk.core.s.test/target/org.eclipse.scout.sdk.core.s.test-9.0.0-SNAPSHOT-tests.jar
09:02:27 [INFO] 
09:02:27 [INFO] --- maven-source-plugin:3.0.1:test-jar-no-fork (attach-test-sources) @ org.eclipse.scout.sdk.core.s.test ---
09:02:27 [INFO] Building jar: /jobs/genie.scout/org.eclipse.scout.sdk.branch-9.0_continuous/workspace/org.eclipse.scout.sdk.core.s.test/target/org.eclipse.scout.sdk.core.s.test-9.0.0-SNAPSHOT-test-sources.jar
09:02:27 [INFO] 
09:02:27 [INFO] --- duplicate-finder-maven-plugin:1.3.0:check (default) @ org.eclipse.scout.sdk.core.s.test ---
09:02:27 [INFO] Checking compile classpath
09:02:28 [INFO] Checking runtime classpath
09:02:28 [INFO] Checking test classpath
09:02:28 [INFO] 
09:02:28 [INFO] --- animal-sniffer-maven-plugin:1.17:check (enforce-java-api-compatibility) @ org.eclipse.scout.sdk.core.s.test ---
09:02:28 [INFO] Checking unresolved references to org.codehaus.mojo.signature:java18:1.0
09:02:30 [INFO] 
09:02:30 [INFO] --- maven-source-plugin:3.0.1:jar-no-fork (attach-sources) @ org.eclipse.scout.sdk.core.s.test ---
09:02:30 [INFO] Building jar: /jobs/genie.scout/org.eclipse.scout.sdk.branch-9.0_continuous/workspace/org.eclipse.scout.sdk.core.s.test/target/org.eclipse.scout.sdk.core.s.test-9.0.0-SNAPSHOT-sources.jar
09:02:30 [INFO] 
09:02:30 [INFO] --- eclipse-jarsigner-plugin:1.1.5:sign (sign) @ org.eclipse.scout.sdk.core.s.test ---
09:02:30 [INFO] Skip jar signing
09:02:30 [INFO] 
09:02:30 [INFO] --- maven-install-plugin:2.5.2:install (default-install) @ org.eclipse.scout.sdk.core.s.test ---
09:02:30 [INFO] Installing /jobs/genie.scout/org.eclipse.scout.sdk.branch-9.0_continuous/workspace/org.eclipse.scout.sdk.core.s.test/target/org.eclipse.scout.sdk.core.s.test-9.0.0-SNAPSHOT.jar to /home/hudson/genie.scout/.jenkins/jobs/org.eclipse.scout.sdk.branch-9.0_continuous/workspace/.repository/org/eclipse/scout/sdk/org.eclipse.scout.sdk.core.s.test/9.0.0-SNAPSHOT/org.eclipse.scout.sdk.core.s.test-9.0.0-SNAPSHOT.jar
09:02:30 [INFO] Installing /jobs/genie.scout/org.eclipse.scout.sdk.branch-9.0_continuous/workspace/org.eclipse.scout.sdk.core.s.test/pom.xml to /home/hudson/genie.scout/.jenkins/jobs/org.eclipse.scout.sdk.branch-9.0_continuous/workspace/.repository/org/eclipse/scout/sdk/org.eclipse.scout.sdk.core.s.test/9.0.0-SNAPSHOT/org.eclipse.scout.sdk.core.s.test-9.0.0-SNAPSHOT.pom
09:02:30 [INFO] Installing /jobs/genie.scout/org.eclipse.scout.sdk.branch-9.0_continuous/workspace/org.eclipse.scout.sdk.core.s.test/target/org.eclipse.scout.sdk.core.s.test-9.0.0-SNAPSHOT-tests.jar to /home/hudson/genie.scout/.jenkins/jobs/org.eclipse.scout.sdk.branch-9.0_continuous/workspace/.repository/org/eclipse/scout/sdk/org.eclipse.scout.sdk.core.s.test/9.0.0-SNAPSHOT/org.eclipse.scout.sdk.core.s.test-9.0.0-SNAPSHOT-tests.jar
09:02:30 [INFO] Installing /jobs/genie.scout/org.eclipse.scout.sdk.branch-9.0_continuous/workspace/org.eclipse.scout.sdk.core.s.test/target/org.eclipse.scout.sdk.core.s.test-9.0.0-SNAPSHOT-test-sources.jar to /home/hudson/genie.scout/.jenkins/jobs/org.eclipse.scout.sdk.branch-9.0_continuous/workspace/.repository/org/eclipse/scout/sdk/org.eclipse.scout.sdk.core.s.test/9.0.0-SNAPSHOT/org.eclipse.scout.sdk.core.s.test-9.0.0-SNAPSHOT-test-sources.jar
09:02:30 [INFO] Installing /jobs/genie.scout/org.eclipse.scout.sdk.branch-9.0_continuous/workspace/org.eclipse.scout.sdk.core.s.test/target/org.eclipse.scout.sdk.core.s.test-9.0.0-SNAPSHOT-sources.jar to /home/hudson/genie.scout/.jenkins/jobs/org.eclipse.scout.sdk.branch-9.0_continuous/workspace/.repository/org/eclipse/scout/sdk/org.eclipse.scout.sdk.core.s.test/9.0.0-SNAPSHOT/org.eclipse.scout.sdk.core.s.test-9.0.0-SNAPSHOT-sources.jar
09:02:30 [INFO] 
09:02:30 [INFO] --------< org.eclipse.scout.sdk.s2e:org.eclipse.scout.sdk.s2e >---------
09:02:30 [INFO] Building org.eclipse.scout.sdk.s2e:org.eclipse.scout.sdk.s2e 9.0.0-SNAPSHOT [9/15]
09:02:30 [INFO] -------------------------------[ bundle ]-------------------------------
09:02:30 [INFO] Downloading from eclipse.release: https://repo.eclipse.org/content/groups/releases/org/eclipse/platform/org.eclipse.osgi/maven-metadata.xml
09:02:30 [INFO] Downloading from eclipse.snapshot: https://repo.eclipse.org/content/groups/snapshots/org/eclipse/platform/org.eclipse.osgi/maven-metadata.xml
09:02:30 [INFO] Downloading from eclipse.maven.central.mirror: https://repo.eclipse.org/content/repositories/maven_central/org/eclipse/platform/org.eclipse.osgi/maven-metadata.xml
09:02:30 [INFO] Downloaded from eclipse.maven.central.mirror: https://repo.eclipse.org/content/repositories/maven_central/org/eclipse/platform/org.eclipse.osgi/maven-metadata.xml (643 B at 11 kB/s)
09:02:30 [INFO] Downloading from eclipse.maven.central.mirror: https://repo.eclipse.org/content/repositories/maven_central/org/eclipse/platform/org.eclipse.core.jobs/maven-metadata.xml
09:02:30 [INFO] Downloading from eclipse.release: https://repo.eclipse.org/content/groups/releases/org/eclipse/platform/org.eclipse.core.jobs/maven-metadata.xml
09:02:30 [INFO] Downloading from eclipse.snapshot: https://repo.eclipse.org/content/groups/snapshots/org/eclipse/platform/org.eclipse.core.jobs/maven-metadata.xml
09:02:30 [INFO] Downloaded from eclipse.maven.central.mirror: https://repo.eclipse.org/content/repositories/maven_central/org/eclipse/platform/org.eclipse.core.jobs/maven-metadata.xml (646 B at 13 kB/s)
09:02:30 [INFO] Downloading from eclipse.snapshot: https://repo.eclipse.org/content/groups/snapshots/org/eclipse/platform/org.eclipse.core.contenttype/maven-metadata.xml
09:02:30 [INFO] Downloading from eclipse.maven.central.mirror: https://repo.eclipse.org/content/repositories/maven_central/org/eclipse/platform/org.eclipse.core.contenttype/maven-metadata.xml
09:02:30 [INFO] Downloading from eclipse.release: https://repo.eclipse.org/content/groups/releases/org/eclipse/platform/org.eclipse.core.contenttype/maven-metadata.xml
09:02:30 [INFO] Downloaded from eclipse.maven.central.mirror: https://repo.eclipse.org/content/repositories/maven_central/org/eclipse/platform/org.eclipse.core.contenttype/maven-metadata.xml (522 B at 12 kB/s)
09:02:30 [INFO] Downloading from eclipse.release: https://repo.eclipse.org/content/groups/releases/org/eclipse/platform/org.eclipse.equinox.app/maven-metadata.xml
09:02:30 [INFO] Downloading from eclipse.snapshot: https://repo.eclipse.org/content/groups/snapshots/org/eclipse/platform/org.eclipse.equinox.app/maven-metadata.xml
09:02:30 [INFO] Downloading from eclipse.maven.central.mirror: https://repo.eclipse.org/content/repositories/maven_central/org/eclipse/platform/org.eclipse.equinox.app/maven-metadata.xml
09:02:30 [INFO] Downloaded from eclipse.maven.central.mirror: https://repo.eclipse.org/content/repositories/maven_central/org/eclipse/platform/org.eclipse.equinox.app/maven-metadata.xml (519 B at 12 kB/s)
09:02:30 [INFO] Downloading from eclipse.release: https://repo.eclipse.org/content/groups/releases/org/eclipse/jdt/org.eclipse.jdt.debug/maven-metadata.xml
09:02:30 [INFO] Downloading from eclipse.snapshot: https://repo.eclipse.org/content/groups/snapshots/org/eclipse/jdt/org.eclipse.jdt.debug/maven-metadata.xml
09:02:30 [INFO] Downloading from eclipse.maven.central.mirror: https://repo.eclipse.org/content/repositories/maven_central/org/eclipse/jdt/org.eclipse.jdt.debug/maven-metadata.xml
09:02:30 [INFO] Downloaded from eclipse.maven.central.mirror: https://repo.eclipse.org/content/repositories/maven_central/org/eclipse/jdt/org.eclipse.jdt.debug/maven-metadata.xml (577 B at 15 kB/s)
09:02:30 [INFO] Downloading from eclipse.release: https://repo.eclipse.org/content/groups/releases/org/eclipse/platform/org.eclipse.core.filebuffers/maven-metadata.xml
09:02:30 [INFO] Downloading from eclipse.snapshot: https://repo.eclipse.org/content/groups/snapshots/org/eclipse/platform/org.eclipse.core.filebuffers/maven-metadata.xml
09:02:30 [INFO] Downloading from eclipse.maven.central.mirror: https://repo.eclipse.org/content/repositories/maven_central/org/eclipse/platform/org.eclipse.core.filebuffers/maven-metadata.xml
09:02:30 [INFO] Downloaded from eclipse.maven.central.mirror: https://repo.eclipse.org/content/repositories/maven_central/org/eclipse/platform/org.eclipse.core.filebuffers/maven-metadata.xml (557 B at 15 kB/s)
09:02:30 [INFO] 
09:02:30 [INFO] --- maven-clean-plugin:3.1.0:clean (default-clean) @ org.eclipse.scout.sdk.s2e ---
09:02:30 [INFO] Deleting /jobs/genie.scout/org.eclipse.scout.sdk.branch-9.0_continuous/workspace/org.eclipse.scout.sdk.s2e/target
09:02:30 [INFO] 
09:02:30 [INFO] --- maven-enforcer-plugin:1.4.1:enforce (enforce-rules) @ org.eclipse.scout.sdk.s2e ---
09:02:31 [INFO] Skipping Rule Enforcement.
09:02:31 [INFO] 
09:02:31 [INFO] --- git-commit-id-plugin:2.2.5:revision (default) @ org.eclipse.scout.sdk.s2e ---
09:02:32 [INFO] 
09:02:32 [INFO] --- jacoco-maven-plugin:0.8.2:prepare-agent (default) @ org.eclipse.scout.sdk.s2e ---
09:02:32 [INFO] master_test_jacocoArgLine set to -javaagent:/home/hudson/genie.scout/.jenkins/jobs/org.eclipse.scout.sdk.branch-9.0_continuous/workspace/.repository/org/jacoco/org.jacoco.agent/0.8.2/org.jacoco.agent-0.8.2-runtime.jar=destfile=/jobs/genie.scout/org.eclipse.scout.sdk.branch-9.0_continuous/workspace/org.eclipse.scout.sdk.s2e/../org.eclipse.scout.sdk/target/jacoco-all.exec
09:02:32 [INFO] 
09:02:32 [INFO] --- build-helper-maven-plugin:3.0.0:parse-version (initialize-parse-version) @ org.eclipse.scout.sdk.s2e ---
09:02:32 [INFO] 
09:02:32 [INFO] --- build-helper-maven-plugin:3.0.0:regex-property (initialize-regex) @ org.eclipse.scout.sdk.s2e ---
09:02:32 [INFO] 
09:02:32 [INFO] --- maven-resources-plugin:3.1.0:resources (default-resources) @ org.eclipse.scout.sdk.s2e ---
09:02:33 [INFO] Using 'UTF-8' encoding to copy filtered resources.
09:02:33 [INFO] Copying 2 resources
09:02:33 [INFO] Copying 5 resources
09:02:33 [INFO] 
09:02:33 [INFO] --- maven-compiler-plugin:3.8.0:compile (default-compile) @ org.eclipse.scout.sdk.s2e ---
09:02:33 [INFO] Changes detected - recompiling the module!
09:02:33 [INFO] Compiling 58 source files to /jobs/genie.scout/org.eclipse.scout.sdk.branch-9.0_continuous/workspace/org.eclipse.scout.sdk.s2e/target/classes
09:02:34 [INFO] 
09:02:34 [INFO] --- maven-resources-plugin:3.1.0:testResources (default-testResources) @ org.eclipse.scout.sdk.s2e ---
09:02:34 [INFO] Using 'UTF-8' encoding to copy filtered resources.
09:02:34 [INFO] skip non existing resourceDirectory /jobs/genie.scout/org.eclipse.scout.sdk.branch-9.0_continuous/workspace/org.eclipse.scout.sdk.s2e/src/test/resources
09:02:34 [INFO] 
09:02:34 [INFO] --- maven-compiler-plugin:3.8.0:testCompile (default-testCompile) @ org.eclipse.scout.sdk.s2e ---
09:02:34 [INFO] No sources to compile
09:02:34 [INFO] 
09:02:34 [INFO] --- maven-surefire-plugin:2.22.1:test (default-test) @ org.eclipse.scout.sdk.s2e ---
09:02:35 [INFO] No tests to run.
09:02:35 [INFO] 
09:02:35 [INFO] --- maven-bundle-plugin:4.1.0:bundle (default-bundle) @ org.eclipse.scout.sdk.s2e ---
09:02:36 [INFO] 
09:02:36 [INFO] --- maven-site-plugin:3.7.1:attach-descriptor (attach-descriptor) @ org.eclipse.scout.sdk.s2e ---
09:02:36 [INFO] Skipping because packaging 'bundle' is not pom.
09:02:36 [INFO] 
09:02:36 [INFO] --- maven-jar-plugin:3.1.1:test-jar (attach-tests) @ org.eclipse.scout.sdk.s2e ---
09:02:36 [INFO] Skipping packaging of the test-jar
09:02:36 [INFO] 
09:02:36 [INFO] --- maven-source-plugin:3.0.1:test-jar-no-fork (attach-test-sources) @ org.eclipse.scout.sdk.s2e ---
09:02:36 [INFO] No sources in project. Archive not created.
09:02:36 [INFO] 
09:02:36 [INFO] --- duplicate-finder-maven-plugin:1.3.0:check (default) @ org.eclipse.scout.sdk.s2e ---
09:02:36 [INFO] Checking compile classpath
09:02:37 [INFO] Checking runtime classpath
09:02:37 [INFO] Checking test classpath
09:02:37 [INFO] 
09:02:37 [INFO] --- animal-sniffer-maven-plugin:1.17:check (enforce-java-api-compatibility) @ org.eclipse.scout.sdk.s2e ---
09:02:37 [INFO] Checking unresolved references to org.codehaus.mojo.signature:java18:1.0
09:02:39 [INFO] 
09:02:39 [INFO] --- maven-source-plugin:3.0.1:jar-no-fork (attach-sources) @ org.eclipse.scout.sdk.s2e ---
09:02:39 [INFO] Building jar: /jobs/genie.scout/org.eclipse.scout.sdk.branch-9.0_continuous/workspace/org.eclipse.scout.sdk.s2e/target/org.eclipse.scout.sdk.s2e-9.0.0-SNAPSHOT-sources.jar
09:02:39 [INFO] 
09:02:39 [INFO] --- eclipse-jarsigner-plugin:1.1.5:sign (sign) @ org.eclipse.scout.sdk.s2e ---
09:02:39 [INFO] Skip jar signing
09:02:39 [INFO] 
09:02:39 [INFO] --- maven-install-plugin:2.5.2:install (default-install) @ org.eclipse.scout.sdk.s2e ---
09:02:39 [INFO] Installing /jobs/genie.scout/org.eclipse.scout.sdk.branch-9.0_continuous/workspace/org.eclipse.scout.sdk.s2e/target/org.eclipse.scout.sdk.s2e-9.0.0-SNAPSHOT.jar to /home/hudson/genie.scout/.jenkins/jobs/org.eclipse.scout.sdk.branch-9.0_continuous/workspace/.repository/org/eclipse/scout/sdk/s2e/org.eclipse.scout.sdk.s2e/9.0.0-SNAPSHOT/org.eclipse.scout.sdk.s2e-9.0.0-SNAPSHOT.jar
09:02:39 [INFO] Installing /jobs/genie.scout/org.eclipse.scout.sdk.branch-9.0_continuous/workspace/org.eclipse.scout.sdk.s2e/pom.xml to /home/hudson/genie.scout/.jenkins/jobs/org.eclipse.scout.sdk.branch-9.0_continuous/workspace/.repository/org/eclipse/scout/sdk/s2e/org.eclipse.scout.sdk.s2e/9.0.0-SNAPSHOT/org.eclipse.scout.sdk.s2e-9.0.0-SNAPSHOT.pom
09:02:39 [INFO] Installing /jobs/genie.scout/org.eclipse.scout.sdk.branch-9.0_continuous/workspace/org.eclipse.scout.sdk.s2e/target/org.eclipse.scout.sdk.s2e-9.0.0-SNAPSHOT-sources.jar to /home/hudson/genie.scout/.jenkins/jobs/org.eclipse.scout.sdk.branch-9.0_continuous/workspace/.repository/org/eclipse/scout/sdk/s2e/org.eclipse.scout.sdk.s2e/9.0.0-SNAPSHOT/org.eclipse.scout.sdk.s2e-9.0.0-SNAPSHOT-sources.jar
09:02:39 [INFO] 
09:02:39 [INFO] --- maven-bundle-plugin:4.1.0:install (default-install) @ org.eclipse.scout.sdk.s2e ---
09:02:39 [INFO] Local OBR update disabled (enable with -DobrRepository)
09:02:39 [INFO] 
09:02:39 [INFO] ------< org.eclipse.scout.sdk.s2e:org.eclipse.scout.sdk.s2e.test >------
09:02:39 [INFO] Building org.eclipse.scout.sdk.s2e:org.eclipse.scout.sdk.s2e.test 9.0.0-SNAPSHOT [10/15]
09:02:39 [INFO] --------------------------------[ jar ]---------------------------------
09:02:39 [WARNING] The POM for org.eclipse.platform:org.eclipse.swt:jar:3.109.0 is invalid, transitive dependencies (if any) will not be available, enable debug logging for more details
09:02:39 [INFO] Downloading from eclipse.release: https://repo.eclipse.org/content/groups/releases/org/eclipse/platform/org.eclipse.jface/maven-metadata.xml
09:02:39 [INFO] Downloading from eclipse.maven.central.mirror: https://repo.eclipse.org/content/repositories/maven_central/org/eclipse/platform/org.eclipse.jface/maven-metadata.xml
09:02:39 [INFO] Downloading from eclipse.snapshot: https://repo.eclipse.org/content/groups/snapshots/org/eclipse/platform/org.eclipse.jface/maven-metadata.xml
09:02:39 [INFO] Downloaded from eclipse.maven.central.mirror: https://repo.eclipse.org/content/repositories/maven_central/org/eclipse/platform/org.eclipse.jface/maven-metadata.xml (639 B at 20 kB/s)
09:02:39 [INFO] 
09:02:39 [INFO] --- maven-clean-plugin:3.1.0:clean (default-clean) @ org.eclipse.scout.sdk.s2e.test ---
09:02:39 [INFO] Deleting /jobs/genie.scout/org.eclipse.scout.sdk.branch-9.0_continuous/workspace/org.eclipse.scout.sdk.s2e.test/target
09:02:39 [INFO] 
09:02:39 [INFO] --- maven-enforcer-plugin:1.4.1:enforce (enforce-rules) @ org.eclipse.scout.sdk.s2e.test ---
09:02:39 [INFO] Skipping Rule Enforcement.
09:02:39 [INFO] 
09:02:39 [INFO] --- git-commit-id-plugin:2.2.5:revision (default) @ org.eclipse.scout.sdk.s2e.test ---
09:02:41 [INFO] 
09:02:41 [INFO] --- jacoco-maven-plugin:0.8.2:prepare-agent (default) @ org.eclipse.scout.sdk.s2e.test ---
09:02:41 [INFO] master_test_jacocoArgLine set to -javaagent:/home/hudson/genie.scout/.jenkins/jobs/org.eclipse.scout.sdk.branch-9.0_continuous/workspace/.repository/org/jacoco/org.jacoco.agent/0.8.2/org.jacoco.agent-0.8.2-runtime.jar=destfile=/jobs/genie.scout/org.eclipse.scout.sdk.branch-9.0_continuous/workspace/org.eclipse.scout.sdk.s2e.test/../org.eclipse.scout.sdk/target/jacoco-all.exec
09:02:41 [INFO] 
09:02:41 [INFO] --- build-helper-maven-plugin:3.0.0:parse-version (initialize-parse-version) @ org.eclipse.scout.sdk.s2e.test ---
09:02:41 [INFO] 
09:02:41 [INFO] --- build-helper-maven-plugin:3.0.0:regex-property (initialize-regex) @ org.eclipse.scout.sdk.s2e.test ---
09:02:41 [INFO] 
09:02:41 [INFO] --- maven-resources-plugin:3.1.0:resources (default-resources) @ org.eclipse.scout.sdk.s2e.test ---
09:02:41 [INFO] Using 'UTF-8' encoding to copy filtered resources.
09:02:41 [INFO] skip non existing resourceDirectory /jobs/genie.scout/org.eclipse.scout.sdk.branch-9.0_continuous/workspace/org.eclipse.scout.sdk.s2e.test/src/main/resources
09:02:41 [INFO] Copying 2 resources
09:02:41 [INFO] 
09:02:41 [INFO] --- maven-compiler-plugin:3.8.0:compile (default-compile) @ org.eclipse.scout.sdk.s2e.test ---
09:02:41 [INFO] Changes detected - recompiling the module!
09:02:41 [INFO] Compiling 7 source files to /jobs/genie.scout/org.eclipse.scout.sdk.branch-9.0_continuous/workspace/org.eclipse.scout.sdk.s2e.test/target/classes
09:02:41 [INFO] 
09:02:41 [INFO] --- maven-resources-plugin:3.1.0:testResources (default-testResources) @ org.eclipse.scout.sdk.s2e.test ---
09:02:41 [INFO] Using 'UTF-8' encoding to copy filtered resources.
09:02:41 [INFO] Copying 7 resources
09:02:41 [INFO] 
09:02:41 [INFO] --- maven-compiler-plugin:3.8.0:testCompile (default-testCompile) @ org.eclipse.scout.sdk.s2e.test ---
09:02:41 [INFO] Changes detected - recompiling the module!
09:02:41 [INFO] Compiling 11 source files to /jobs/genie.scout/org.eclipse.scout.sdk.branch-9.0_continuous/workspace/org.eclipse.scout.sdk.s2e.test/target/test-classes
09:02:41 [INFO] 
09:02:41 [INFO] --- maven-surefire-plugin:2.22.1:test (default-test) @ org.eclipse.scout.sdk.s2e.test ---
09:02:41 [INFO] 
09:02:41 [INFO] -------------------------------------------------------
09:02:41 [INFO]  T E S T S
09:02:41 [INFO] -------------------------------------------------------
09:02:42 [INFO] Running org.eclipse.scout.sdk.s2e.util.ScoutTierTest
09:02:44 [INFO] Tests run: 3, Failures: 0, Errors: 0, Skipped: 0, Time elapsed: 1.623 s - in org.eclipse.scout.sdk.s2e.util.ScoutTierTest
09:02:44 [INFO] Running org.eclipse.scout.sdk.s2e.util.ScoutStatusTest
09:02:44 [INFO] Tests run: 1, Failures: 0, Errors: 0, Skipped: 0, Time elapsed: 0.053 s - in org.eclipse.scout.sdk.s2e.util.ScoutStatusTest
09:02:44 [INFO] Running org.eclipse.scout.sdk.s2e.test.ApiTest
09:02:45 [INFO] Tests run: 2, Failures: 0, Errors: 0, Skipped: 0, Time elapsed: 1.573 s - in org.eclipse.scout.sdk.s2e.test.ApiTest
09:02:45 [INFO] Running org.eclipse.scout.sdk.s2e.operation.permission.PermissionNewOperationTest
09:02:47 [INFO] Tests run: 1, Failures: 0, Errors: 0, Skipped: 0, Time elapsed: 1.548 s - in org.eclipse.scout.sdk.s2e.operation.permission.PermissionNewOperationTest
09:02:47 [INFO] Running org.eclipse.scout.sdk.s2e.operation.page.PageNewOperationTest
09:02:55 [INFO] Tests run: 20, Failures: 0, Errors: 0, Skipped: 0, Time elapsed: 8.35 s - in org.eclipse.scout.sdk.s2e.operation.page.PageNewOperationTest
09:02:55 [INFO] Running org.eclipse.scout.sdk.s2e.operation.lookupcall.LookupCallNewOperationTest
09:02:56 [INFO] Tests run: 6, Failures: 0, Errors: 0, Skipped: 0, Time elapsed: 1.02 s - in org.eclipse.scout.sdk.s2e.operation.lookupcall.LookupCallNewOperationTest
09:02:56 [INFO] Running org.eclipse.scout.sdk.s2e.operation.jaxws.WebServiceUpdateOperationTest
09:03:04 [WARNING]: Don't override file /tmp/genie.scout/CoreScoutTestingUtils-projectDir14031291452436245784/artifact/artifact/pom.xml
09:03:10 [WARNING]: CP Don't override file /tmp/genie.scout/jaxws-module-tmp62964560616297629/artifact.server.jaxws/src/main/resources/META-INF/scout.xml
09:04:57 [WARNING]: /tmp/genie.scout/CoreScoutTestingUtils-projectDir14031291452436245784/artifact/artifact.server.jaxws/target/generated-sources/wsimport/test/provider/multifile/ErrorResponse.java:[15] 
09:04:57 	public class ErrorResponse
09:04:57 	             ^^^^^^^^^^^^^
09:04:57 The serializable class ErrorResponse does not declare a static final serialVersionUID field of type long
09:04:57 2. WARNING: Annotation processing: Annotation processing started... [processor=JaxWsAnnotationProcessor]
09:04:57 3. WARNING: Annotation processing: Generate entry point for endpoint interface 'test.provider.multifile.IScoutQueryInterface2PortType' [entryPoint=test.provider.multifile.ScoutQueryInterface2WebServiceEntryPoint, wsdl:portType=scoutQueryInterface2, wsdl:service=scoutQuery, wsdl:port=scoutQueryPort] [processor=JaxWsAnnotationProcessor]
09:04:57 4. WARNING: Annotation processing: Generate handler delegate [handler=org.eclipse.scout.rt.server.jaxws.handler.WsProviderCorrelationIdHandler, handlerDelegate=test.provider.multifile.ScoutQueryInterface2WebServiceEntryPoint_WsProviderCorrelationIdHandler, portTypeDefinition=test.provider.multifile.IScoutQueryInterface2WebServiceEntryPointDefinition, endpointInterface=test.provider.multifile.IScoutQueryInterface2PortType] [processor=JaxWsAnnotationProcessor]
09:04:57 5. WARNING: Annotation processing: Generate handler delegate [handler=org.eclipse.scout.rt.server.jaxws.handler.LogHandler, handlerDelegate=test.provider.multifile.ScoutQueryInterface2WebServiceEntryPoint_LogHandler, portTypeDefinition=test.provider.multifile.IScoutQueryInterface2WebServiceEntryPointDefinition, endpointInterface=test.provider.multifile.IScoutQueryInterface2PortType] [processor=JaxWsAnnotationProcessor]
09:04:57 6. WARNING: Annotation processing: Generate AuthHandler [authHandler=test.provider.multifile.ScoutQueryInterface2WebServiceEntryPoint_AuthHandler, portTypeDefinition=test.provider.multifile.IScoutQueryInterface2WebServiceEntryPointDefinition, endpointInterface=test.provider.multifile.IScoutQueryInterface2PortType] [processor=JaxWsAnnotationProcessor]
09:04:57 7. WARNING: Annotation processing: Generate handler chain XML-file [file=ScoutQueryInterface2WebServiceEntryPoint_handler-chain.xml, portTypeDefinition=test.provider.multifile.IScoutQueryInterface2WebServiceEntryPointDefinition, endpointInterface=test.provider.multifile.IScoutQueryInterface2PortType] [processor=JaxWsAnnotationProcessor]
09:04:57 8. WARNING: Annotation processing: Entry point successfully generated. [entryPoint=test.provider.multifile.ScoutQueryInterface2WebServiceEntryPoint, endpointInterface=test.provider.multifile.IScoutQueryInterface2PortType, entryPointDefinition=test.provider.multifile.IScoutQueryInterface2WebServiceEntryPointDefinition] [processor=JaxWsAnnotationProcessor]
09:04:57 9. WARNING: Annotation processing: Annotation processing started... [processor=JaxWsAnnotationProcessor]
09:04:57 10. WARNING: Annotation processing: Annotation processing started... [processor=JaxWsAnnotationProcessor]
09:04:57 10 problems (10 warnings)
09:05:12 [WARNING]: /tmp/genie.scout/CoreScoutTestingUtils-projectDir14031291452436245784/artifact/artifact.shared/src/main/java/group/artifact/shared/security/AccessControlService.java:[5] 
09:05:12 	import org.eclipse.scout.rt.shared.ISession;
09:05:12 	       ^^^^^^^^^^^^^^^^^^^^^^^^^^^^^^^^^^^^
09:05:12 The import org.eclipse.scout.rt.shared.ISession is never used
09:05:12 [WARNING]: /tmp/genie.scout/CoreScoutTestingUtils-projectDir14031291452436245784/artifact/artifact.shared/src/main/java/group/artifact/shared/security/AccessControlService.java:[7] 
09:05:12 	import org.eclipse.scout.rt.shared.services.common.security.IAccessControlService;
09:05:12 	       ^^^^^^^^^^^^^^^^^^^^^^^^^^^^^^^^^^^^^^^^^^^^^^^^^^^^^^^^^^^^^^^^^^^^^^^^^^
09:05:12 The import org.eclipse.scout.rt.shared.services.common.security.IAccessControlService is never used
09:05:12 2 problems (2 warnings)
09:05:48 [WARNING]: /tmp/genie.scout/CoreScoutTestingUtils-projectDir14031291452436245784/artifact/artifact.server.jaxws/target/generated-sources/wsimport/test/provider/multifile/ErrorResponse.java:[15] 
09:05:48 	public class ErrorResponse
09:05:48 	             ^^^^^^^^^^^^^
09:05:48 The serializable class ErrorResponse does not declare a static final serialVersionUID field of type long
09:05:48 2. WARNING: Annotation processing: Annotation processing started... [processor=JaxWsAnnotationProcessor]
09:05:48 3. WARNING: Annotation processing: Generate entry point for endpoint interface 'test.provider.multifile.IScoutQueryInterface2PortType' [entryPoint=test.provider.multifile.ScoutQueryInterface2WebServiceEntryPoint, wsdl:portType=scoutQueryInterface2, wsdl:service=scoutQuery, wsdl:port=scoutQueryPort] [processor=JaxWsAnnotationProcessor]
09:05:48 4. WARNING: Annotation processing: Generate handler delegate [handler=org.eclipse.scout.rt.server.jaxws.handler.WsProviderCorrelationIdHandler, handlerDelegate=test.provider.multifile.ScoutQueryInterface2WebServiceEntryPoint_WsProviderCorrelationIdHandler, portTypeDefinition=test.provider.multifile.IScoutQueryInterface2WebServiceEntryPointDefinition, endpointInterface=test.provider.multifile.IScoutQueryInterface2PortType] [processor=JaxWsAnnotationProcessor]
09:05:48 5. WARNING: Annotation processing: Generate handler delegate [handler=org.eclipse.scout.rt.server.jaxws.handler.LogHandler, handlerDelegate=test.provider.multifile.ScoutQueryInterface2WebServiceEntryPoint_LogHandler, portTypeDefinition=test.provider.multifile.IScoutQueryInterface2WebServiceEntryPointDefinition, endpointInterface=test.provider.multifile.IScoutQueryInterface2PortType] [processor=JaxWsAnnotationProcessor]
09:05:48 6. WARNING: Annotation processing: Generate AuthHandler [authHandler=test.provider.multifile.ScoutQueryInterface2WebServiceEntryPoint_AuthHandler, portTypeDefinition=test.provider.multifile.IScoutQueryInterface2WebServiceEntryPointDefinition, endpointInterface=test.provider.multifile.IScoutQueryInterface2PortType] [processor=JaxWsAnnotationProcessor]
09:05:48 7. WARNING: Annotation processing: Generate handler chain XML-file [file=ScoutQueryInterface2WebServiceEntryPoint_handler-chain.xml, portTypeDefinition=test.provider.multifile.IScoutQueryInterface2WebServiceEntryPointDefinition, endpointInterface=test.provider.multifile.IScoutQueryInterface2PortType] [processor=JaxWsAnnotationProcessor]
09:05:48 8. WARNING: Annotation processing: Entry point successfully generated. [entryPoint=test.provider.multifile.ScoutQueryInterface2WebServiceEntryPoint, endpointInterface=test.provider.multifile.IScoutQueryInterface2PortType, entryPointDefinition=test.provider.multifile.IScoutQueryInterface2WebServiceEntryPointDefinition] [processor=JaxWsAnnotationProcessor]
09:05:48 9. WARNING: Annotation processing: Annotation processing started... [processor=JaxWsAnnotationProcessor]
09:05:48 10. WARNING: Annotation processing: Annotation processing started... [processor=JaxWsAnnotationProcessor]
09:05:48 10 problems (10 warnings)
09:05:52 [WARNING]: /tmp/genie.scout/CoreScoutTestingUtils-projectDir14031291452436245784/artifact/artifact.client/src/main/java/group/artifact/client/ClientSession.java:[4] 
09:05:52 	import org.eclipse.scout.rt.client.IClientSession;
09:05:52 	       ^^^^^^^^^^^^^^^^^^^^^^^^^^^^^^^^^^^^^^^^^^
09:05:52 The import org.eclipse.scout.rt.client.IClientSession is never used
09:05:52 1 problem (1 warning)
09:05:52 [WARNING]: /tmp/genie.scout/CoreScoutTestingUtils-projectDir14031291452436245784/artifact/artifact.client/src/test/java/group/artifact/client/helloworld/HelloWorldFormTest.java:[8] 
09:05:52 	import group.artifact.client.helloworld.HelloWorldForm.MainBox.TopBox.MessageField;
09:05:52 	       ^^^^^^^^^^^^^^^^^^^^^^^^^^^^^^^^^^^^^^^^^^^^^^^^^^^^^^^^^^^^^^^^^^^^^^^^^^^
09:05:52 The import group.artifact.client.helloworld.HelloWorldForm.MainBox.TopBox.MessageField is never used
09:05:52 1 problem (1 warning)
09:06:05 [WARNING]: /tmp/genie.scout/CoreScoutTestingUtils-projectDir14031291452436245784/artifact/artifact.shared/src/main/java/group/artifact/shared/security/AccessControlService.java:[5] 
09:06:05 	import org.eclipse.scout.rt.shared.ISession;
09:06:05 	       ^^^^^^^^^^^^^^^^^^^^^^^^^^^^^^^^^^^^
09:06:05 The import org.eclipse.scout.rt.shared.ISession is never used
09:06:05 [WARNING]: /tmp/genie.scout/CoreScoutTestingUtils-projectDir14031291452436245784/artifact/artifact.shared/src/main/java/group/artifact/shared/security/AccessControlService.java:[7] 
09:06:05 	import org.eclipse.scout.rt.shared.services.common.security.IAccessControlService;
09:06:05 	       ^^^^^^^^^^^^^^^^^^^^^^^^^^^^^^^^^^^^^^^^^^^^^^^^^^^^^^^^^^^^^^^^^^^^^^^^^^
09:06:05 The import org.eclipse.scout.rt.shared.services.common.security.IAccessControlService is never used
09:06:05 2 problems (2 warnings)
09:06:42 [WARNING]: /tmp/genie.scout/CoreScoutTestingUtils-projectDir14031291452436245784/artifact/artifact.server.jaxws/target/generated-sources/wsimport/test/provider/newMultiFile/ErrorResponse.java:[15] 
09:06:42 	public class ErrorResponse
09:06:42 	             ^^^^^^^^^^^^^
09:06:42 The serializable class ErrorResponse does not declare a static final serialVersionUID field of type long
09:06:42 2. WARNING: Annotation processing: Annotation processing started... [processor=JaxWsAnnotationProcessor]
09:06:42 3. WARNING: Annotation processing: Generate entry point for endpoint interface 'test.provider.newMultiFile.IChangedPortType' [entryPoint=entry.point.changedpackage.ChangedEntryPointName, wsdl:portType=scoutQueryInterface2, wsdl:service=scoutQuery, wsdl:port=scoutQueryPort] [processor=JaxWsAnnotationProcessor]
09:06:42 4. WARNING: Annotation processing: Generate handler delegate [handler=org.eclipse.scout.rt.server.jaxws.handler.WsProviderCorrelationIdHandler, handlerDelegate=entry.point.changedpackage.ChangedEntryPointName_WsProviderCorrelationIdHandler, portTypeDefinition=test.provider.multifile.IScoutQueryInterface2WebServiceEntryPointDefinition, endpointInterface=test.provider.newMultiFile.IChangedPortType] [processor=JaxWsAnnotationProcessor]
09:06:42 5. WARNING: Annotation processing: Generate handler delegate [handler=org.eclipse.scout.rt.server.jaxws.handler.LogHandler, handlerDelegate=entry.point.changedpackage.ChangedEntryPointName_LogHandler, portTypeDefinition=test.provider.multifile.IScoutQueryInterface2WebServiceEntryPointDefinition, endpointInterface=test.provider.newMultiFile.IChangedPortType] [processor=JaxWsAnnotationProcessor]
09:06:42 6. WARNING: Annotation processing: Generate AuthHandler [authHandler=entry.point.changedpackage.ChangedEntryPointName_AuthHandler, portTypeDefinition=test.provider.multifile.IScoutQueryInterface2WebServiceEntryPointDefinition, endpointInterface=test.provider.newMultiFile.IChangedPortType] [processor=JaxWsAnnotationProcessor]
09:06:42 7. WARNING: Annotation processing: Generate handler chain XML-file [file=ChangedEntryPointName_handler-chain.xml, portTypeDefinition=test.provider.multifile.IScoutQueryInterface2WebServiceEntryPointDefinition, endpointInterface=test.provider.newMultiFile.IChangedPortType] [processor=JaxWsAnnotationProcessor]
09:06:42 8. WARNING: Annotation processing: Entry point successfully generated. [entryPoint=entry.point.changedpackage.ChangedEntryPointName, endpointInterface=test.provider.newMultiFile.IChangedPortType, entryPointDefinition=test.provider.multifile.IScoutQueryInterface2WebServiceEntryPointDefinition] [processor=JaxWsAnnotationProcessor]
09:06:42 9. WARNING: Annotation processing: Annotation processing started... [processor=JaxWsAnnotationProcessor]
09:06:42 10. WARNING: Annotation processing: Annotation processing started... [processor=JaxWsAnnotationProcessor]
09:06:42 10 problems (10 warnings)
09:06:47 [WARNING]: /tmp/genie.scout/CoreScoutTestingUtils-projectDir14031291452436245784/artifact/artifact.client/src/main/java/group/artifact/client/ClientSession.java:[4] 
09:06:47 	import org.eclipse.scout.rt.client.IClientSession;
09:06:47 	       ^^^^^^^^^^^^^^^^^^^^^^^^^^^^^^^^^^^^^^^^^^
09:06:47 The import org.eclipse.scout.rt.client.IClientSession is never used
09:06:47 1 problem (1 warning)
09:06:47 [WARNING]: /tmp/genie.scout/CoreScoutTestingUtils-projectDir14031291452436245784/artifact/artifact.client/src/test/java/group/artifact/client/helloworld/HelloWorldFormTest.java:[8] 
09:06:47 	import group.artifact.client.helloworld.HelloWorldForm.MainBox.TopBox.MessageField;
09:06:47 	       ^^^^^^^^^^^^^^^^^^^^^^^^^^^^^^^^^^^^^^^^^^^^^^^^^^^^^^^^^^^^^^^^^^^^^^^^^^^
09:06:47 The import group.artifact.client.helloworld.HelloWorldForm.MainBox.TopBox.MessageField is never used
09:06:47 1 problem (1 warning)
09:06:57 [WARNING]: Don't override file /tmp/genie.scout/CoreScoutTestingUtils-projectDir17393355978177997890/artifact/artifact/pom.xml
09:07:03 [WARNING]: CP Don't override file /tmp/genie.scout/jaxws-module-tmp12651453272094553231/artifact.server.jaxws/src/main/resources/META-INF/scout.xml
09:08:15 [WARNING]: /tmp/genie.scout/CoreScoutTestingUtils-projectDir17393355978177997890/artifact/artifact.server.jaxws/target/generated-sources/wsimport/test/consumer/multifile/ErrorResponse.java:[15] 
09:08:15 	public class ErrorResponse
09:08:15 	             ^^^^^^^^^^^^^
09:08:15 The serializable class ErrorResponse does not declare a static final serialVersionUID field of type long
09:08:15 2. WARNING: Annotation processing: Annotation processing started... [processor=JaxWsAnnotationProcessor]
09:08:15 3. WARNING: Annotation processing: Skipped entry point generation for endpoint interface 'test.consumer.multifile.IScoutQueryInterface2PortType' because not configured with WebServiceEntryPoint annotation. [processor=JaxWsAnnotationProcessor]
09:08:15 4. WARNING: Annotation processing: Annotation processing started... [processor=JaxWsAnnotationProcessor]
09:08:15 4 problems (4 warnings)
09:08:24 [WARNING]: /tmp/genie.scout/CoreScoutTestingUtils-projectDir17393355978177997890/artifact/artifact.shared/src/main/java/group/artifact/shared/security/AccessControlService.java:[5] 
09:08:24 	import org.eclipse.scout.rt.shared.ISession;
09:08:24 	       ^^^^^^^^^^^^^^^^^^^^^^^^^^^^^^^^^^^^
09:08:24 The import org.eclipse.scout.rt.shared.ISession is never used
09:08:24 [WARNING]: /tmp/genie.scout/CoreScoutTestingUtils-projectDir17393355978177997890/artifact/artifact.shared/src/main/java/group/artifact/shared/security/AccessControlService.java:[7] 
09:08:24 	import org.eclipse.scout.rt.shared.services.common.security.IAccessControlService;
09:08:24 	       ^^^^^^^^^^^^^^^^^^^^^^^^^^^^^^^^^^^^^^^^^^^^^^^^^^^^^^^^^^^^^^^^^^^^^^^^^^
09:08:24 The import org.eclipse.scout.rt.shared.services.common.security.IAccessControlService is never used
09:08:24 2 problems (2 warnings)
09:08:59 [WARNING]: /tmp/genie.scout/CoreScoutTestingUtils-projectDir17393355978177997890/artifact/artifact.server.jaxws/target/generated-sources/wsimport/test/consumer/multifile/ErrorResponse.java:[15] 
09:08:59 	public class ErrorResponse
09:08:59 	             ^^^^^^^^^^^^^
09:08:59 The serializable class ErrorResponse does not declare a static final serialVersionUID field of type long
09:08:59 2. WARNING: Annotation processing: Annotation processing started... [processor=JaxWsAnnotationProcessor]
09:08:59 3. WARNING: Annotation processing: Skipped entry point generation for endpoint interface 'test.consumer.multifile.IScoutQueryInterface2PortType' because not configured with WebServiceEntryPoint annotation. [processor=JaxWsAnnotationProcessor]
09:08:59 4. WARNING: Annotation processing: Annotation processing started... [processor=JaxWsAnnotationProcessor]
09:08:59 4 problems (4 warnings)
09:09:04 [WARNING]: /tmp/genie.scout/CoreScoutTestingUtils-projectDir17393355978177997890/artifact/artifact.client/src/main/java/group/artifact/client/ClientSession.java:[4] 
09:09:04 	import org.eclipse.scout.rt.client.IClientSession;
09:09:04 	       ^^^^^^^^^^^^^^^^^^^^^^^^^^^^^^^^^^^^^^^^^^
09:09:04 The import org.eclipse.scout.rt.client.IClientSession is never used
09:09:04 1 problem (1 warning)
09:09:04 [WARNING]: /tmp/genie.scout/CoreScoutTestingUtils-projectDir17393355978177997890/artifact/artifact.client/src/test/java/group/artifact/client/helloworld/HelloWorldFormTest.java:[8] 
09:09:04 	import group.artifact.client.helloworld.HelloWorldForm.MainBox.TopBox.MessageField;
09:09:04 	       ^^^^^^^^^^^^^^^^^^^^^^^^^^^^^^^^^^^^^^^^^^^^^^^^^^^^^^^^^^^^^^^^^^^^^^^^^^^
09:09:04 The import group.artifact.client.helloworld.HelloWorldForm.MainBox.TopBox.MessageField is never used
09:09:04 1 problem (1 warning)
09:09:16 [WARNING]: /tmp/genie.scout/CoreScoutTestingUtils-projectDir17393355978177997890/artifact/artifact.shared/src/main/java/group/artifact/shared/security/AccessControlService.java:[5] 
09:09:16 	import org.eclipse.scout.rt.shared.ISession;
09:09:16 	       ^^^^^^^^^^^^^^^^^^^^^^^^^^^^^^^^^^^^
09:09:16 The import org.eclipse.scout.rt.shared.ISession is never used
09:09:16 [WARNING]: /tmp/genie.scout/CoreScoutTestingUtils-projectDir17393355978177997890/artifact/artifact.shared/src/main/java/group/artifact/shared/security/AccessControlService.java:[7] 
09:09:16 	import org.eclipse.scout.rt.shared.services.common.security.IAccessControlService;
09:09:16 	       ^^^^^^^^^^^^^^^^^^^^^^^^^^^^^^^^^^^^^^^^^^^^^^^^^^^^^^^^^^^^^^^^^^^^^^^^^^
09:09:16 The import org.eclipse.scout.rt.shared.services.common.security.IAccessControlService is never used
09:09:16 2 problems (2 warnings)
09:09:51 [WARNING]: /tmp/genie.scout/CoreScoutTestingUtils-projectDir17393355978177997890/artifact/artifact.server.jaxws/target/generated-sources/wsimport/test/consumer/newMultiFile/ErrorResponse.java:[15] 
09:09:51 	public class ErrorResponse
09:09:51 	             ^^^^^^^^^^^^^
09:09:51 The serializable class ErrorResponse does not declare a static final serialVersionUID field of type long
09:09:51 2. WARNING: Annotation processing: Annotation processing started... [processor=JaxWsAnnotationProcessor]
09:09:51 3. WARNING: Annotation processing: Skipped entry point generation for endpoint interface 'test.consumer.newMultiFile.IChangedPortType' because not configured with WebServiceEntryPoint annotation. [processor=JaxWsAnnotationProcessor]
09:09:51 4. WARNING: Annotation processing: Annotation processing started... [processor=JaxWsAnnotationProcessor]
09:09:51 4 problems (4 warnings)
09:09:56 [WARNING]: /tmp/genie.scout/CoreScoutTestingUtils-projectDir17393355978177997890/artifact/artifact.client/src/main/java/group/artifact/client/ClientSession.java:[4] 
09:09:56 	import org.eclipse.scout.rt.client.IClientSession;
09:09:56 	       ^^^^^^^^^^^^^^^^^^^^^^^^^^^^^^^^^^^^^^^^^^
09:09:56 The import org.eclipse.scout.rt.client.IClientSession is never used
09:09:56 1 problem (1 warning)
09:09:56 [WARNING]: /tmp/genie.scout/CoreScoutTestingUtils-projectDir17393355978177997890/artifact/artifact.client/src/test/java/group/artifact/client/helloworld/HelloWorldFormTest.java:[8] 
09:09:56 	import group.artifact.client.helloworld.HelloWorldForm.MainBox.TopBox.MessageField;
09:09:56 	       ^^^^^^^^^^^^^^^^^^^^^^^^^^^^^^^^^^^^^^^^^^^^^^^^^^^^^^^^^^^^^^^^^^^^^^^^^^^
09:09:56 The import group.artifact.client.helloworld.HelloWorldForm.MainBox.TopBox.MessageField is never used
09:09:56 1 problem (1 warning)
09:09:59 [INFO] Tests run: 2, Failures: 0, Errors: 0, Skipped: 0, Time elapsed: 423.261 s - in org.eclipse.scout.sdk.s2e.operation.jaxws.WebServiceUpdateOperationTest
09:09:59 [INFO] Running org.eclipse.scout.sdk.s2e.operation.jaxws.WebServiceNewOperationTest
09:10:10 [WARNING]: Don't override file /tmp/genie.scout/CoreScoutTestingUtils-projectDir6946251913539346933/artifact/artifact/pom.xml
09:10:17 [WARNING]: CP Don't override file /tmp/genie.scout/jaxws-module-tmp2036494717317480733/artifact.server.jaxws/src/main/resources/META-INF/scout.xml
09:11:27 [WARNING]: /tmp/genie.scout/CoreScoutTestingUtils-projectDir6946251913539346933/artifact/artifact.server.jaxws/target/generated-sources/wsimport/test/provider/multifile/ErrorResponse.java:[15] 
09:11:27 	public class ErrorResponse
09:11:27 	             ^^^^^^^^^^^^^
09:11:27 The serializable class ErrorResponse does not declare a static final serialVersionUID field of type long
09:11:27 2. WARNING: Annotation processing: Annotation processing started... [processor=JaxWsAnnotationProcessor]
09:11:27 3. WARNING: Annotation processing: Generate entry point for endpoint interface 'test.provider.multifile.IScoutQueryInterface2PortType' [entryPoint=test.provider.multifile.ScoutQueryInterface2WebServiceEntryPoint, wsdl:portType=scoutQueryInterface2, wsdl:service=scoutQuery, wsdl:port=scoutQueryPort] [processor=JaxWsAnnotationProcessor]
09:11:27 4. WARNING: Annotation processing: Generate handler delegate [handler=org.eclipse.scout.rt.server.jaxws.handler.WsProviderCorrelationIdHandler, handlerDelegate=test.provider.multifile.ScoutQueryInterface2WebServiceEntryPoint_WsProviderCorrelationIdHandler, portTypeDefinition=test.provider.multifile.IScoutQueryInterface2WebServiceEntryPointDefinition, endpointInterface=test.provider.multifile.IScoutQueryInterface2PortType] [processor=JaxWsAnnotationProcessor]
09:11:27 5. WARNING: Annotation processing: Generate handler delegate [handler=org.eclipse.scout.rt.server.jaxws.handler.LogHandler, handlerDelegate=test.provider.multifile.ScoutQueryInterface2WebServiceEntryPoint_LogHandler, portTypeDefinition=test.provider.multifile.IScoutQueryInterface2WebServiceEntryPointDefinition, endpointInterface=test.provider.multifile.IScoutQueryInterface2PortType] [processor=JaxWsAnnotationProcessor]
09:11:27 6. WARNING: Annotation processing: Generate AuthHandler [authHandler=test.provider.multifile.ScoutQueryInterface2WebServiceEntryPoint_AuthHandler, portTypeDefinition=test.provider.multifile.IScoutQueryInterface2WebServiceEntryPointDefinition, endpointInterface=test.provider.multifile.IScoutQueryInterface2PortType] [processor=JaxWsAnnotationProcessor]
09:11:27 7. WARNING: Annotation processing: Generate handler chain XML-file [file=ScoutQueryInterface2WebServiceEntryPoint_handler-chain.xml, portTypeDefinition=test.provider.multifile.IScoutQueryInterface2WebServiceEntryPointDefinition, endpointInterface=test.provider.multifile.IScoutQueryInterface2PortType] [processor=JaxWsAnnotationProcessor]
09:11:27 8. WARNING: Annotation processing: Entry point successfully generated. [entryPoint=test.provider.multifile.ScoutQueryInterface2WebServiceEntryPoint, endpointInterface=test.provider.multifile.IScoutQueryInterface2PortType, entryPointDefinition=test.provider.multifile.IScoutQueryInterface2WebServiceEntryPointDefinition] [processor=JaxWsAnnotationProcessor]
09:11:27 9. WARNING: Annotation processing: Annotation processing started... [processor=JaxWsAnnotationProcessor]
09:11:27 10. WARNING: Annotation processing: Annotation processing started... [processor=JaxWsAnnotationProcessor]
09:11:27 10 problems (10 warnings)
09:11:35 [WARNING]: /tmp/genie.scout/CoreScoutTestingUtils-projectDir6946251913539346933/artifact/artifact.shared/src/main/java/group/artifact/shared/security/AccessControlService.java:[5] 
09:11:35 	import org.eclipse.scout.rt.shared.ISession;
09:11:35 	       ^^^^^^^^^^^^^^^^^^^^^^^^^^^^^^^^^^^^
09:11:35 The import org.eclipse.scout.rt.shared.ISession is never used
09:11:35 [WARNING]: /tmp/genie.scout/CoreScoutTestingUtils-projectDir6946251913539346933/artifact/artifact.shared/src/main/java/group/artifact/shared/security/AccessControlService.java:[7] 
09:11:35 	import org.eclipse.scout.rt.shared.services.common.security.IAccessControlService;
09:11:35 	       ^^^^^^^^^^^^^^^^^^^^^^^^^^^^^^^^^^^^^^^^^^^^^^^^^^^^^^^^^^^^^^^^^^^^^^^^^^
09:11:35 The import org.eclipse.scout.rt.shared.services.common.security.IAccessControlService is never used
09:11:35 2 problems (2 warnings)
09:12:11 [WARNING]: /tmp/genie.scout/CoreScoutTestingUtils-projectDir6946251913539346933/artifact/artifact.server.jaxws/target/generated-sources/wsimport/test/provider/multifile/ErrorResponse.java:[15] 
09:12:11 	public class ErrorResponse
09:12:11 	             ^^^^^^^^^^^^^
09:12:11 The serializable class ErrorResponse does not declare a static final serialVersionUID field of type long
09:12:11 2. WARNING: Annotation processing: Annotation processing started... [processor=JaxWsAnnotationProcessor]
09:12:11 3. WARNING: Annotation processing: Generate entry point for endpoint interface 'test.provider.multifile.IScoutQueryInterface2PortType' [entryPoint=test.provider.multifile.ScoutQueryInterface2WebServiceEntryPoint, wsdl:portType=scoutQueryInterface2, wsdl:service=scoutQuery, wsdl:port=scoutQueryPort] [processor=JaxWsAnnotationProcessor]
09:12:11 4. WARNING: Annotation processing: Generate handler delegate [handler=org.eclipse.scout.rt.server.jaxws.handler.WsProviderCorrelationIdHandler, handlerDelegate=test.provider.multifile.ScoutQueryInterface2WebServiceEntryPoint_WsProviderCorrelationIdHandler, portTypeDefinition=test.provider.multifile.IScoutQueryInterface2WebServiceEntryPointDefinition, endpointInterface=test.provider.multifile.IScoutQueryInterface2PortType] [processor=JaxWsAnnotationProcessor]
09:12:11 5. WARNING: Annotation processing: Generate handler delegate [handler=org.eclipse.scout.rt.server.jaxws.handler.LogHandler, handlerDelegate=test.provider.multifile.ScoutQueryInterface2WebServiceEntryPoint_LogHandler, portTypeDefinition=test.provider.multifile.IScoutQueryInterface2WebServiceEntryPointDefinition, endpointInterface=test.provider.multifile.IScoutQueryInterface2PortType] [processor=JaxWsAnnotationProcessor]
09:12:11 6. WARNING: Annotation processing: Generate AuthHandler [authHandler=test.provider.multifile.ScoutQueryInterface2WebServiceEntryPoint_AuthHandler, portTypeDefinition=test.provider.multifile.IScoutQueryInterface2WebServiceEntryPointDefinition, endpointInterface=test.provider.multifile.IScoutQueryInterface2PortType] [processor=JaxWsAnnotationProcessor]
09:12:11 7. WARNING: Annotation processing: Generate handler chain XML-file [file=ScoutQueryInterface2WebServiceEntryPoint_handler-chain.xml, portTypeDefinition=test.provider.multifile.IScoutQueryInterface2WebServiceEntryPointDefinition, endpointInterface=test.provider.multifile.IScoutQueryInterface2PortType] [processor=JaxWsAnnotationProcessor]
09:12:11 8. WARNING: Annotation processing: Entry point successfully generated. [entryPoint=test.provider.multifile.ScoutQueryInterface2WebServiceEntryPoint, endpointInterface=test.provider.multifile.IScoutQueryInterface2PortType, entryPointDefinition=test.provider.multifile.IScoutQueryInterface2WebServiceEntryPointDefinition] [processor=JaxWsAnnotationProcessor]
09:12:11 9. WARNING: Annotation processing: Annotation processing started... [processor=JaxWsAnnotationProcessor]
09:12:11 10. WARNING: Annotation processing: Annotation processing started... [processor=JaxWsAnnotationProcessor]
09:12:11 10 problems (10 warnings)
09:12:15 [WARNING]: /tmp/genie.scout/CoreScoutTestingUtils-projectDir6946251913539346933/artifact/artifact.client/src/main/java/group/artifact/client/ClientSession.java:[4] 
09:12:15 	import org.eclipse.scout.rt.client.IClientSession;
09:12:15 	       ^^^^^^^^^^^^^^^^^^^^^^^^^^^^^^^^^^^^^^^^^^
09:12:15 The import org.eclipse.scout.rt.client.IClientSession is never used
09:12:15 1 problem (1 warning)
09:12:15 [WARNING]: /tmp/genie.scout/CoreScoutTestingUtils-projectDir6946251913539346933/artifact/artifact.client/src/test/java/group/artifact/client/helloworld/HelloWorldFormTest.java:[8] 
09:12:15 	import group.artifact.client.helloworld.HelloWorldForm.MainBox.TopBox.MessageField;
09:12:15 	       ^^^^^^^^^^^^^^^^^^^^^^^^^^^^^^^^^^^^^^^^^^^^^^^^^^^^^^^^^^^^^^^^^^^^^^^^^^^
09:12:15 The import group.artifact.client.helloworld.HelloWorldForm.MainBox.TopBox.MessageField is never used
09:12:15 1 problem (1 warning)
09:13:01 [WARNING]: /tmp/genie.scout/CoreScoutTestingUtils-projectDir6946251913539346933/artifact/artifact.server.jaxws/target/generated-sources/wsimport/test/provider/multifile/ErrorResponse.java:[15] 
09:13:01 	public class ErrorResponse
09:13:01 	             ^^^^^^^^^^^^^
09:13:01 The serializable class ErrorResponse does not declare a static final serialVersionUID field of type long
09:13:01 2. WARNING: Annotation processing: Annotation processing started... [processor=JaxWsAnnotationProcessor]
09:13:01 3. WARNING: Annotation processing: Generate entry point for endpoint interface 'test.provider.multifile.IScoutQueryInterface2PortType' [entryPoint=test.provider.multifile.ScoutQueryInterface2WebServiceEntryPoint, wsdl:portType=scoutQueryInterface2, wsdl:service=scoutQuery, wsdl:port=scoutQueryPort] [processor=JaxWsAnnotationProcessor]
09:13:01 4. WARNING: Annotation processing: Generate handler delegate [handler=org.eclipse.scout.rt.server.jaxws.handler.WsProviderCorrelationIdHandler, handlerDelegate=test.provider.multifile.ScoutQueryInterface2WebServiceEntryPoint_WsProviderCorrelationIdHandler, portTypeDefinition=test.provider.multifile.IScoutQueryInterface2WebServiceEntryPointDefinition, endpointInterface=test.provider.multifile.IScoutQueryInterface2PortType] [processor=JaxWsAnnotationProcessor]
09:13:01 5. WARNING: Annotation processing: Generate handler delegate [handler=org.eclipse.scout.rt.server.jaxws.handler.LogHandler, handlerDelegate=test.provider.multifile.ScoutQueryInterface2WebServiceEntryPoint_LogHandler, portTypeDefinition=test.provider.multifile.IScoutQueryInterface2WebServiceEntryPointDefinition, endpointInterface=test.provider.multifile.IScoutQueryInterface2PortType] [processor=JaxWsAnnotationProcessor]
09:13:01 6. WARNING: Annotation processing: Generate AuthHandler [authHandler=test.provider.multifile.ScoutQueryInterface2WebServiceEntryPoint_AuthHandler, portTypeDefinition=test.provider.multifile.IScoutQueryInterface2WebServiceEntryPointDefinition, endpointInterface=test.provider.multifile.IScoutQueryInterface2PortType] [processor=JaxWsAnnotationProcessor]
09:13:01 7. WARNING: Annotation processing: Generate handler chain XML-file [file=ScoutQueryInterface2WebServiceEntryPoint_handler-chain.xml, portTypeDefinition=test.provider.multifile.IScoutQueryInterface2WebServiceEntryPointDefinition, endpointInterface=test.provider.multifile.IScoutQueryInterface2PortType] [processor=JaxWsAnnotationProcessor]
09:13:01 8. WARNING: Annotation processing: Entry point successfully generated. [entryPoint=test.provider.multifile.ScoutQueryInterface2WebServiceEntryPoint, endpointInterface=test.provider.multifile.IScoutQueryInterface2PortType, entryPointDefinition=test.provider.multifile.IScoutQueryInterface2WebServiceEntryPointDefinition] [processor=JaxWsAnnotationProcessor]
09:13:01 9. WARNING: Annotation processing: Skipped entry point generation for endpoint interface 'test.consumer.multiservice.IFirstWebServiceOnePortType' because not configured with WebServiceEntryPoint annotation. [processor=JaxWsAnnotationProcessor]
09:13:01 10. WARNING: Annotation processing: Skipped entry point generation for endpoint interface 'test.consumer.multiservice.IFirstWebServiceTwoPortType' because not configured with WebServiceEntryPoint annotation. [processor=JaxWsAnnotationProcessor]
09:13:01 11. WARNING: Annotation processing: Skipped entry point generation for endpoint interface 'test.consumer.multiservice.ISecondWebServiceOnePortType' because not configured with WebServiceEntryPoint annotation. [processor=JaxWsAnnotationProcessor]
09:13:01 12. WARNING: Annotation processing: Skipped entry point generation for endpoint interface 'test.consumer.multiservice.ISecondWebServiceTwoPortType' because not configured with WebServiceEntryPoint annotation. [processor=JaxWsAnnotationProcessor]
09:13:01 13. WARNING: Annotation processing: Annotation processing started... [processor=JaxWsAnnotationProcessor]
09:13:01 14. WARNING: Annotation processing: Annotation processing started... [processor=JaxWsAnnotationProcessor]
09:13:01 14 problems (14 warnings)
09:13:10 [WARNING]: /tmp/genie.scout/CoreScoutTestingUtils-projectDir6946251913539346933/artifact/artifact.shared/src/main/java/group/artifact/shared/security/AccessControlService.java:[5] 
09:13:10 	import org.eclipse.scout.rt.shared.ISession;
09:13:10 	       ^^^^^^^^^^^^^^^^^^^^^^^^^^^^^^^^^^^^
09:13:10 The import org.eclipse.scout.rt.shared.ISession is never used
09:13:10 [WARNING]: /tmp/genie.scout/CoreScoutTestingUtils-projectDir6946251913539346933/artifact/artifact.shared/src/main/java/group/artifact/shared/security/AccessControlService.java:[7] 
09:13:10 	import org.eclipse.scout.rt.shared.services.common.security.IAccessControlService;
09:13:10 	       ^^^^^^^^^^^^^^^^^^^^^^^^^^^^^^^^^^^^^^^^^^^^^^^^^^^^^^^^^^^^^^^^^^^^^^^^^^
09:13:10 The import org.eclipse.scout.rt.shared.services.common.security.IAccessControlService is never used
09:13:10 2 problems (2 warnings)
09:13:47 [WARNING]: /tmp/genie.scout/CoreScoutTestingUtils-projectDir6946251913539346933/artifact/artifact.server.jaxws/target/generated-sources/wsimport/test/provider/multifile/ErrorResponse.java:[15] 
09:13:47 	public class ErrorResponse
09:13:47 	             ^^^^^^^^^^^^^
09:13:47 The serializable class ErrorResponse does not declare a static final serialVersionUID field of type long
09:13:47 2. WARNING: Annotation processing: Annotation processing started... [processor=JaxWsAnnotationProcessor]
09:13:47 3. WARNING: Annotation processing: Generate entry point for endpoint interface 'test.provider.multifile.IScoutQueryInterface2PortType' [entryPoint=test.provider.multifile.ScoutQueryInterface2WebServiceEntryPoint, wsdl:portType=scoutQueryInterface2, wsdl:service=scoutQuery, wsdl:port=scoutQueryPort] [processor=JaxWsAnnotationProcessor]
09:13:47 4. WARNING: Annotation processing: Generate handler delegate [handler=org.eclipse.scout.rt.server.jaxws.handler.WsProviderCorrelationIdHandler, handlerDelegate=test.provider.multifile.ScoutQueryInterface2WebServiceEntryPoint_WsProviderCorrelationIdHandler, portTypeDefinition=test.provider.multifile.IScoutQueryInterface2WebServiceEntryPointDefinition, endpointInterface=test.provider.multifile.IScoutQueryInterface2PortType] [processor=JaxWsAnnotationProcessor]
09:13:47 5. WARNING: Annotation processing: Generate handler delegate [handler=org.eclipse.scout.rt.server.jaxws.handler.LogHandler, handlerDelegate=test.provider.multifile.ScoutQueryInterface2WebServiceEntryPoint_LogHandler, portTypeDefinition=test.provider.multifile.IScoutQueryInterface2WebServiceEntryPointDefinition, endpointInterface=test.provider.multifile.IScoutQueryInterface2PortType] [processor=JaxWsAnnotationProcessor]
09:13:47 6. WARNING: Annotation processing: Generate AuthHandler [authHandler=test.provider.multifile.ScoutQueryInterface2WebServiceEntryPoint_AuthHandler, portTypeDefinition=test.provider.multifile.IScoutQueryInterface2WebServiceEntryPointDefinition, endpointInterface=test.provider.multifile.IScoutQueryInterface2PortType] [processor=JaxWsAnnotationProcessor]
09:13:47 7. WARNING: Annotation processing: Generate handler chain XML-file [file=ScoutQueryInterface2WebServiceEntryPoint_handler-chain.xml, portTypeDefinition=test.provider.multifile.IScoutQueryInterface2WebServiceEntryPointDefinition, endpointInterface=test.provider.multifile.IScoutQueryInterface2PortType] [processor=JaxWsAnnotationProcessor]
09:13:47 8. WARNING: Annotation processing: Entry point successfully generated. [entryPoint=test.provider.multifile.ScoutQueryInterface2WebServiceEntryPoint, endpointInterface=test.provider.multifile.IScoutQueryInterface2PortType, entryPointDefinition=test.provider.multifile.IScoutQueryInterface2WebServiceEntryPointDefinition] [processor=JaxWsAnnotationProcessor]
09:13:47 9. WARNING: Annotation processing: Skipped entry point generation for endpoint interface 'test.consumer.multiservice.IFirstWebServiceOnePortType' because not configured with WebServiceEntryPoint annotation. [processor=JaxWsAnnotationProcessor]
09:13:47 10. WARNING: Annotation processing: Skipped entry point generation for endpoint interface 'test.consumer.multiservice.IFirstWebServiceTwoPortType' because not configured with WebServiceEntryPoint annotation. [processor=JaxWsAnnotationProcessor]
09:13:47 11. WARNING: Annotation processing: Skipped entry point generation for endpoint interface 'test.consumer.multiservice.ISecondWebServiceOnePortType' because not configured with WebServiceEntryPoint annotation. [processor=JaxWsAnnotationProcessor]
09:13:47 12. WARNING: Annotation processing: Skipped entry point generation for endpoint interface 'test.consumer.multiservice.ISecondWebServiceTwoPortType' because not configured with WebServiceEntryPoint annotation. [processor=JaxWsAnnotationProcessor]
09:13:47 13. WARNING: Annotation processing: Annotation processing started... [processor=JaxWsAnnotationProcessor]
09:13:47 14. WARNING: Annotation processing: Annotation processing started... [processor=JaxWsAnnotationProcessor]
09:13:47 14 problems (14 warnings)
09:13:51 [WARNING]: /tmp/genie.scout/CoreScoutTestingUtils-projectDir6946251913539346933/artifact/artifact.client/src/main/java/group/artifact/client/ClientSession.java:[4] 
09:13:51 	import org.eclipse.scout.rt.client.IClientSession;
09:13:51 	       ^^^^^^^^^^^^^^^^^^^^^^^^^^^^^^^^^^^^^^^^^^
09:13:51 The import org.eclipse.scout.rt.client.IClientSession is never used
09:13:51 1 problem (1 warning)
09:13:51 [WARNING]: /tmp/genie.scout/CoreScoutTestingUtils-projectDir6946251913539346933/artifact/artifact.client/src/test/java/group/artifact/client/helloworld/HelloWorldFormTest.java:[8] 
09:13:51 	import group.artifact.client.helloworld.HelloWorldForm.MainBox.TopBox.MessageField;
09:13:51 	       ^^^^^^^^^^^^^^^^^^^^^^^^^^^^^^^^^^^^^^^^^^^^^^^^^^^^^^^^^^^^^^^^^^^^^^^^^^^
09:13:51 The import group.artifact.client.helloworld.HelloWorldForm.MainBox.TopBox.MessageField is never used
09:13:51 1 problem (1 warning)
09:14:37 [WARNING]: /tmp/genie.scout/CoreScoutTestingUtils-projectDir6946251913539346933/artifact/artifact.server.jaxws/target/generated-sources/wsimport/test/provider/multifile/ErrorResponse.java:[15] 
09:14:37 	public class ErrorResponse
09:14:37 	             ^^^^^^^^^^^^^
09:14:37 The serializable class ErrorResponse does not declare a static final serialVersionUID field of type long
09:14:37 2. WARNING: Annotation processing: Annotation processing started... [processor=JaxWsAnnotationProcessor]
09:14:37 3. WARNING: Annotation processing: Generate entry point for endpoint interface 'test.provider.multifile.IScoutQueryInterface2PortType' [entryPoint=test.provider.multifile.ScoutQueryInterface2WebServiceEntryPoint, wsdl:portType=scoutQueryInterface2, wsdl:service=scoutQuery, wsdl:port=scoutQueryPort] [processor=JaxWsAnnotationProcessor]
09:14:37 4. WARNING: Annotation processing: Generate handler delegate [handler=org.eclipse.scout.rt.server.jaxws.handler.WsProviderCorrelationIdHandler, handlerDelegate=test.provider.multifile.ScoutQueryInterface2WebServiceEntryPoint_WsProviderCorrelationIdHandler, portTypeDefinition=test.provider.multifile.IScoutQueryInterface2WebServiceEntryPointDefinition, endpointInterface=test.provider.multifile.IScoutQueryInterface2PortType] [processor=JaxWsAnnotationProcessor]
09:14:37 5. WARNING: Annotation processing: Generate handler delegate [handler=org.eclipse.scout.rt.server.jaxws.handler.LogHandler, handlerDelegate=test.provider.multifile.ScoutQueryInterface2WebServiceEntryPoint_LogHandler, portTypeDefinition=test.provider.multifile.IScoutQueryInterface2WebServiceEntryPointDefinition, endpointInterface=test.provider.multifile.IScoutQueryInterface2PortType] [processor=JaxWsAnnotationProcessor]
09:14:37 6. WARNING: Annotation processing: Generate AuthHandler [authHandler=test.provider.multifile.ScoutQueryInterface2WebServiceEntryPoint_AuthHandler, portTypeDefinition=test.provider.multifile.IScoutQueryInterface2WebServiceEntryPointDefinition, endpointInterface=test.provider.multifile.IScoutQueryInterface2PortType] [processor=JaxWsAnnotationProcessor]
09:14:37 7. WARNING: Annotation processing: Generate handler chain XML-file [file=ScoutQueryInterface2WebServiceEntryPoint_handler-chain.xml, portTypeDefinition=test.provider.multifile.IScoutQueryInterface2WebServiceEntryPointDefinition, endpointInterface=test.provider.multifile.IScoutQueryInterface2PortType] [processor=JaxWsAnnotationProcessor]
09:14:37 8. WARNING: Annotation processing: Entry point successfully generated. [entryPoint=test.provider.multifile.ScoutQueryInterface2WebServiceEntryPoint, endpointInterface=test.provider.multifile.IScoutQueryInterface2PortType, entryPointDefinition=test.provider.multifile.IScoutQueryInterface2WebServiceEntryPointDefinition] [processor=JaxWsAnnotationProcessor]
09:14:37 9. WARNING: Annotation processing: Generate entry point for endpoint interface 'test.provider.empty.IWhateverPortType' [entryPoint=test.provider.empty.WhateverWebServiceEntryPoint, wsdl:portType=WhateverPortType, wsdl:service=WhateverWebService, wsdl:port=WhateverPort] [processor=JaxWsAnnotationProcessor]
09:14:37 10. WARNING: Annotation processing: Generate handler delegate [handler=org.eclipse.scout.rt.server.jaxws.handler.WsProviderCorrelationIdHandler, handlerDelegate=test.provider.empty.WhateverWebServiceEntryPoint_WsProviderCorrelationIdHandler, portTypeDefinition=test.provider.empty.IWhateverWebServiceEntryPointDefinition, endpointInterface=test.provider.empty.IWhateverPortType] [processor=JaxWsAnnotationProcessor]
09:14:37 11. WARNING: Annotation processing: Generate handler delegate [handler=org.eclipse.scout.rt.server.jaxws.handler.LogHandler, handlerDelegate=test.provider.empty.WhateverWebServiceEntryPoint_LogHandler, portTypeDefinition=test.provider.empty.IWhateverWebServiceEntryPointDefinition, endpointInterface=test.provider.empty.IWhateverPortType] [processor=JaxWsAnnotationProcessor]
09:14:37 12. WARNING: Annotation processing: Generate AuthHandler [authHandler=test.provider.empty.WhateverWebServiceEntryPoint_AuthHandler, portTypeDefinition=test.provider.empty.IWhateverWebServiceEntryPointDefinition, endpointInterface=test.provider.empty.IWhateverPortType] [processor=JaxWsAnnotationProcessor]
09:14:37 13. WARNING: Annotation processing: Generate handler chain XML-file [file=WhateverWebServiceEntryPoint_handler-chain.xml, portTypeDefinition=test.provider.empty.IWhateverWebServiceEntryPointDefinition, endpointInterface=test.provider.empty.IWhateverPortType] [processor=JaxWsAnnotationProcessor]
09:14:37 14. WARNING: Annotation processing: Entry point successfully generated. [entryPoint=test.provider.empty.WhateverWebServiceEntryPoint, endpointInterface=test.provider.empty.IWhateverPortType, entryPointDefinition=test.provider.empty.IWhateverWebServiceEntryPointDefinition] [processor=JaxWsAnnotationProcessor]
09:14:37 15. WARNING: Annotation processing: Skipped entry point generation for endpoint interface 'test.consumer.multiservice.IFirstWebServiceOnePortType' because not configured with WebServiceEntryPoint annotation. [processor=JaxWsAnnotationProcessor]
09:14:37 16. WARNING: Annotation processing: Skipped entry point generation for endpoint interface 'test.consumer.multiservice.IFirstWebServiceTwoPortType' because not configured with WebServiceEntryPoint annotation. [processor=JaxWsAnnotationProcessor]
09:14:37 17. WARNING: Annotation processing: Skipped entry point generation for endpoint interface 'test.consumer.multiservice.ISecondWebServiceOnePortType' because not configured with WebServiceEntryPoint annotation. [processor=JaxWsAnnotationProcessor]
09:14:37 18. WARNING: Annotation processing: Skipped entry point generation for endpoint interface 'test.consumer.multiservice.ISecondWebServiceTwoPortType' because not configured with WebServiceEntryPoint annotation. [processor=JaxWsAnnotationProcessor]
09:14:37 19. WARNING: Annotation processing: Annotation processing started... [processor=JaxWsAnnotationProcessor]
09:14:37 20. WARNING: Annotation processing: Annotation processing started... [processor=JaxWsAnnotationProcessor]
09:14:37 20 problems (20 warnings)
09:14:44 [WARNING]: /tmp/genie.scout/CoreScoutTestingUtils-projectDir6946251913539346933/artifact/artifact.shared/src/main/java/group/artifact/shared/security/AccessControlService.java:[5] 
09:14:44 	import org.eclipse.scout.rt.shared.ISession;
09:14:44 	       ^^^^^^^^^^^^^^^^^^^^^^^^^^^^^^^^^^^^
09:14:44 The import org.eclipse.scout.rt.shared.ISession is never used
09:14:44 [WARNING]: /tmp/genie.scout/CoreScoutTestingUtils-projectDir6946251913539346933/artifact/artifact.shared/src/main/java/group/artifact/shared/security/AccessControlService.java:[7] 
09:14:44 	import org.eclipse.scout.rt.shared.services.common.security.IAccessControlService;
09:14:44 	       ^^^^^^^^^^^^^^^^^^^^^^^^^^^^^^^^^^^^^^^^^^^^^^^^^^^^^^^^^^^^^^^^^^^^^^^^^^
09:14:44 The import org.eclipse.scout.rt.shared.services.common.security.IAccessControlService is never used
09:14:44 2 problems (2 warnings)
09:15:23 [WARNING]: /tmp/genie.scout/CoreScoutTestingUtils-projectDir6946251913539346933/artifact/artifact.server.jaxws/target/generated-sources/wsimport/test/provider/multifile/ErrorResponse.java:[15] 
09:15:23 	public class ErrorResponse
09:15:23 	             ^^^^^^^^^^^^^
09:15:23 The serializable class ErrorResponse does not declare a static final serialVersionUID field of type long
09:15:23 2. WARNING: Annotation processing: Annotation processing started... [processor=JaxWsAnnotationProcessor]
09:15:23 3. WARNING: Annotation processing: Generate entry point for endpoint interface 'test.provider.multifile.IScoutQueryInterface2PortType' [entryPoint=test.provider.multifile.ScoutQueryInterface2WebServiceEntryPoint, wsdl:portType=scoutQueryInterface2, wsdl:service=scoutQuery, wsdl:port=scoutQueryPort] [processor=JaxWsAnnotationProcessor]
09:15:23 4. WARNING: Annotation processing: Generate handler delegate [handler=org.eclipse.scout.rt.server.jaxws.handler.WsProviderCorrelationIdHandler, handlerDelegate=test.provider.multifile.ScoutQueryInterface2WebServiceEntryPoint_WsProviderCorrelationIdHandler, portTypeDefinition=test.provider.multifile.IScoutQueryInterface2WebServiceEntryPointDefinition, endpointInterface=test.provider.multifile.IScoutQueryInterface2PortType] [processor=JaxWsAnnotationProcessor]
09:15:23 5. WARNING: Annotation processing: Generate handler delegate [handler=org.eclipse.scout.rt.server.jaxws.handler.LogHandler, handlerDelegate=test.provider.multifile.ScoutQueryInterface2WebServiceEntryPoint_LogHandler, portTypeDefinition=test.provider.multifile.IScoutQueryInterface2WebServiceEntryPointDefinition, endpointInterface=test.provider.multifile.IScoutQueryInterface2PortType] [processor=JaxWsAnnotationProcessor]
09:15:23 6. WARNING: Annotation processing: Generate AuthHandler [authHandler=test.provider.multifile.ScoutQueryInterface2WebServiceEntryPoint_AuthHandler, portTypeDefinition=test.provider.multifile.IScoutQueryInterface2WebServiceEntryPointDefinition, endpointInterface=test.provider.multifile.IScoutQueryInterface2PortType] [processor=JaxWsAnnotationProcessor]
09:15:23 7. WARNING: Annotation processing: Generate handler chain XML-file [file=ScoutQueryInterface2WebServiceEntryPoint_handler-chain.xml, portTypeDefinition=test.provider.multifile.IScoutQueryInterface2WebServiceEntryPointDefinition, endpointInterface=test.provider.multifile.IScoutQueryInterface2PortType] [processor=JaxWsAnnotationProcessor]
09:15:23 8. WARNING: Annotation processing: Entry point successfully generated. [entryPoint=test.provider.multifile.ScoutQueryInterface2WebServiceEntryPoint, endpointInterface=test.provider.multifile.IScoutQueryInterface2PortType, entryPointDefinition=test.provider.multifile.IScoutQueryInterface2WebServiceEntryPointDefinition] [processor=JaxWsAnnotationProcessor]
09:15:23 9. WARNING: Annotation processing: Generate entry point for endpoint interface 'test.provider.empty.IWhateverPortType' [entryPoint=test.provider.empty.WhateverWebServiceEntryPoint, wsdl:portType=WhateverPortType, wsdl:service=WhateverWebService, wsdl:port=WhateverPort] [processor=JaxWsAnnotationProcessor]
09:15:23 10. WARNING: Annotation processing: Generate handler delegate [handler=org.eclipse.scout.rt.server.jaxws.handler.WsProviderCorrelationIdHandler, handlerDelegate=test.provider.empty.WhateverWebServiceEntryPoint_WsProviderCorrelationIdHandler, portTypeDefinition=test.provider.empty.IWhateverWebServiceEntryPointDefinition, endpointInterface=test.provider.empty.IWhateverPortType] [processor=JaxWsAnnotationProcessor]
09:15:23 11. WARNING: Annotation processing: Generate handler delegate [handler=org.eclipse.scout.rt.server.jaxws.handler.LogHandler, handlerDelegate=test.provider.empty.WhateverWebServiceEntryPoint_LogHandler, portTypeDefinition=test.provider.empty.IWhateverWebServiceEntryPointDefinition, endpointInterface=test.provider.empty.IWhateverPortType] [processor=JaxWsAnnotationProcessor]
09:15:23 12. WARNING: Annotation processing: Generate AuthHandler [authHandler=test.provider.empty.WhateverWebServiceEntryPoint_AuthHandler, portTypeDefinition=test.provider.empty.IWhateverWebServiceEntryPointDefinition, endpointInterface=test.provider.empty.IWhateverPortType] [processor=JaxWsAnnotationProcessor]
09:15:23 13. WARNING: Annotation processing: Generate handler chain XML-file [file=WhateverWebServiceEntryPoint_handler-chain.xml, portTypeDefinition=test.provider.empty.IWhateverWebServiceEntryPointDefinition, endpointInterface=test.provider.empty.IWhateverPortType] [processor=JaxWsAnnotationProcessor]
09:15:23 14. WARNING: Annotation processing: Entry point successfully generated. [entryPoint=test.provider.empty.WhateverWebServiceEntryPoint, endpointInterface=test.provider.empty.IWhateverPortType, entryPointDefinition=test.provider.empty.IWhateverWebServiceEntryPointDefinition] [processor=JaxWsAnnotationProcessor]
09:15:23 15. WARNING: Annotation processing: Skipped entry point generation for endpoint interface 'test.consumer.multiservice.IFirstWebServiceOnePortType' because not configured with WebServiceEntryPoint annotation. [processor=JaxWsAnnotationProcessor]
09:15:23 16. WARNING: Annotation processing: Skipped entry point generation for endpoint interface 'test.consumer.multiservice.IFirstWebServiceTwoPortType' because not configured with WebServiceEntryPoint annotation. [processor=JaxWsAnnotationProcessor]
09:15:23 17. WARNING: Annotation processing: Skipped entry point generation for endpoint interface 'test.consumer.multiservice.ISecondWebServiceOnePortType' because not configured with WebServiceEntryPoint annotation. [processor=JaxWsAnnotationProcessor]
09:15:23 18. WARNING: Annotation processing: Skipped entry point generation for endpoint interface 'test.consumer.multiservice.ISecondWebServiceTwoPortType' because not configured with WebServiceEntryPoint annotation. [processor=JaxWsAnnotationProcessor]
09:15:23 19. WARNING: Annotation processing: Annotation processing started... [processor=JaxWsAnnotationProcessor]
09:15:23 20. WARNING: Annotation processing: Annotation processing started... [processor=JaxWsAnnotationProcessor]
09:15:23 20 problems (20 warnings)
09:15:26 [WARNING]: /tmp/genie.scout/CoreScoutTestingUtils-projectDir6946251913539346933/artifact/artifact.client/src/main/java/group/artifact/client/ClientSession.java:[4] 
09:15:26 	import org.eclipse.scout.rt.client.IClientSession;
09:15:26 	       ^^^^^^^^^^^^^^^^^^^^^^^^^^^^^^^^^^^^^^^^^^
09:15:26 The import org.eclipse.scout.rt.client.IClientSession is never used
09:15:26 1 problem (1 warning)
09:15:27 [WARNING]: /tmp/genie.scout/CoreScoutTestingUtils-projectDir6946251913539346933/artifact/artifact.client/src/test/java/group/artifact/client/helloworld/HelloWorldFormTest.java:[8] 
09:15:27 	import group.artifact.client.helloworld.HelloWorldForm.MainBox.TopBox.MessageField;
09:15:27 	       ^^^^^^^^^^^^^^^^^^^^^^^^^^^^^^^^^^^^^^^^^^^^^^^^^^^^^^^^^^^^^^^^^^^^^^^^^^^
09:15:27 The import group.artifact.client.helloworld.HelloWorldForm.MainBox.TopBox.MessageField is never used
09:15:27 1 problem (1 warning)
09:15:37 [WARNING]: Don't override file /tmp/genie.scout/CoreScoutTestingUtils-projectDir4741405033257768389/artifact/artifact/pom.xml
09:15:43 [WARNING]: CP Don't override file /tmp/genie.scout/jaxws-module-tmp905980867306182028/artifact.server.jaxws/src/main/resources/META-INF/scout.xml
09:16:10 [INFO] 
09:16:10 [INFO] Results:
09:16:10 [INFO] 
09:16:10 [INFO] Tests run: 35, Failures: 0, Errors: 0, Skipped: 0
09:16:10 [INFO] 
09:16:10 [ERROR] There are test failures.
09:16:10 
09:16:10 Please refer to /jobs/genie.scout/org.eclipse.scout.sdk.branch-9.0_continuous/workspace/org.eclipse.scout.sdk.s2e.test/target/surefire-reports for the individual test results.
09:16:10 Please refer to dump files (if any exist) [date].dump, [date]-jvmRun[N].dump and [date].dumpstream.
09:16:10 The forked VM terminated without properly saying goodbye. VM crash or System.exit called?
09:16:10 Command was /bin/sh -c cd /jobs/genie.scout/org.eclipse.scout.sdk.branch-9.0_continuous/workspace/org.eclipse.scout.sdk.s2e.test && /opt/public/common/java/openjdk/jdk11-x64/bin/java -javaagent:/home/hudson/genie.scout/.jenkins/jobs/org.eclipse.scout.sdk.branch-9.0_continuous/workspace/.repository/org/jacoco/org.jacoco.agent/0.8.2/org.jacoco.agent-0.8.2-runtime.jar=destfile=/jobs/genie.scout/org.eclipse.scout.sdk.branch-9.0_continuous/workspace/org.eclipse.scout.sdk.s2e.test/../org.eclipse.scout.sdk/target/jacoco-all.exec -Xms512m -Xmx2048m -Dfile.encoding=UTF-8 org.apache.maven.surefire.booter.ForkedBooter /jobs/genie.scout/org.eclipse.scout.sdk.branch-9.0_continuous/workspace/org.eclipse.scout.sdk.s2e.test/target/surefire 2019-08-06T09-01-29_353-jvmRun1 surefire8499550962721183373tmp surefire_26297173414693643587tmp
09:16:10 Error occurred in starting fork, check output in log
09:16:10 Process Exit Code: 143
09:16:10 Crashed tests:
09:16:10 org.eclipse.scout.sdk.s2e.operation.jaxws.WebServiceNewOperationTest
09:16:10 org.apache.maven.surefire.booter.SurefireBooterForkException: The forked VM terminated without properly saying goodbye. VM crash or System.exit called?
09:16:10 Command was /bin/sh -c cd /jobs/genie.scout/org.eclipse.scout.sdk.branch-9.0_continuous/workspace/org.eclipse.scout.sdk.s2e.test && /opt/public/common/java/openjdk/jdk11-x64/bin/java -javaagent:/home/hudson/genie.scout/.jenkins/jobs/org.eclipse.scout.sdk.branch-9.0_continuous/workspace/.repository/org/jacoco/org.jacoco.agent/0.8.2/org.jacoco.agent-0.8.2-runtime.jar=destfile=/jobs/genie.scout/org.eclipse.scout.sdk.branch-9.0_continuous/workspace/org.eclipse.scout.sdk.s2e.test/../org.eclipse.scout.sdk/target/jacoco-all.exec -Xms512m -Xmx2048m -Dfile.encoding=UTF-8 org.apache.maven.surefire.booter.ForkedBooter /jobs/genie.scout/org.eclipse.scout.sdk.branch-9.0_continuous/workspace/org.eclipse.scout.sdk.s2e.test/target/surefire 2019-08-06T09-01-29_353-jvmRun1 surefire8499550962721183373tmp surefire_26297173414693643587tmp
09:16:10 Error occurred in starting fork, check output in log
09:16:10 Process Exit Code: 143
09:16:10 Crashed tests:
09:16:10 org.eclipse.scout.sdk.s2e.operation.jaxws.WebServiceNewOperationTest
09:16:10 	at org.apache.maven.plugin.surefire.booterclient.ForkStarter.fork(ForkStarter.java:669)
09:16:11 Build was aborted
09:16:11 Aborted by jeremie.miserez@bsi-software.com
09:16:11 Recording test results
09:16:11 Started calculate disk usage of build
09:16:11 Finished Calculation of disk usage of build in 0 seconds
09:16:15 Started calculate disk usage of workspace
09:16:15 Finished Calculation of disk usage of workspace in 0 seconds
09:16:17 Finished: ABORTED