FailedConsole Output

12:03:11 Started by an SCM change
12:03:11 Building in workspace /home/hudson/genie.scout/.jenkins/jobs/org.eclipse.scout.sdk.branch-8.0_continuous/workspace
12:03:11 No credentials specified
12:03:11  > /usr/local/bin/git rev-parse --is-inside-work-tree # timeout=10
12:03:11 Fetching changes from the remote Git repository
12:03:11  > /usr/local/bin/git config remote.origin.url git://git.eclipse.org/gitroot/scout/org.eclipse.scout.sdk.git # timeout=10
12:03:11 Fetching upstream changes from git://git.eclipse.org/gitroot/scout/org.eclipse.scout.sdk.git
12:03:11  > /usr/local/bin/git --version # timeout=10
12:03:11  > /usr/local/bin/git fetch --tags --progress git://git.eclipse.org/gitroot/scout/org.eclipse.scout.sdk.git +refs/heads/*:refs/remotes/origin/*
12:03:15  > /usr/local/bin/git rev-parse refs/remotes/origin/releases/8.0.x^{commit} # timeout=10
12:03:15  > /usr/local/bin/git rev-parse refs/remotes/origin/origin/releases/8.0.x^{commit} # timeout=10
12:03:15 Checking out Revision 9c73e7c7547f2c6dda595d635dd02f08b2bdbd04 (refs/remotes/origin/releases/8.0.x)
12:03:15  > /usr/local/bin/git config core.sparsecheckout # timeout=10
12:03:15  > /usr/local/bin/git checkout -f 9c73e7c7547f2c6dda595d635dd02f08b2bdbd04
12:03:15 Commit message: "Disable sonarlint on all Scout 8.0 projects"
12:03:15  > /usr/local/bin/git rev-list --no-walk 2ab2fcfb4e503f2b8e9de039756f45d75c7b1e6e # timeout=10
12:03:15 [workspace] $ /shared/common/apache-maven-latest/bin/mvn -f pom.xml -Dbranch=origin/releases/8.0.x -Dcbi.jarsigner.skip=true -Dmaven.repo.local=/home/hudson/genie.scout/.jenkins/jobs/org.eclipse.scout.sdk.branch-8.0_continuous/workspace/.repository -Dgpg.skip=true clean install -U -B -Psign
12:03:15 Picked up JAVA_TOOL_OPTIONS: -Xmx2G -Djava.io.tmpdir=/tmp/genie.scout -DforkCount=1
12:03:17 [INFO] Scanning for projects...
12:03:19 [INFO] Downloading from eclipse.snapshot: https://repo.eclipse.org/content/groups/snapshots/org/eclipse/scout/rt/org.eclipse.scout.rt/8.0.0-SNAPSHOT/maven-metadata.xml
12:03:20 [INFO] Downloaded from eclipse.snapshot: https://repo.eclipse.org/content/groups/snapshots/org/eclipse/scout/rt/org.eclipse.scout.rt/8.0.0-SNAPSHOT/maven-metadata.xml (621 B at 1.4 kB/s)
12:03:20 [INFO] Downloading from eclipse.snapshot: https://repo.eclipse.org/content/groups/snapshots/org/eclipse/scout/rt/org.eclipse.scout.rt/8.0.0-SNAPSHOT/org.eclipse.scout.rt-8.0.0-20191111.233001-163.pom
12:03:20 [INFO] Downloaded from eclipse.snapshot: https://repo.eclipse.org/content/groups/snapshots/org/eclipse/scout/rt/org.eclipse.scout.rt/8.0.0-SNAPSHOT/org.eclipse.scout.rt-8.0.0-20191111.233001-163.pom (30 kB at 442 kB/s)
12:03:22 [WARNING] The project org.eclipse.scout.sdk:org.eclipse.scout.sdk:pom:8.0.0-SNAPSHOT uses prerequisites which is only intended for maven-plugin projects but not for non maven-plugin projects. For such purposes you should use the maven-enforcer-plugin. See https://maven.apache.org/enforcer/enforcer-rules/requireMavenVersion.html
12:03:22 [WARNING] The project org.eclipse.scout.sdk:org.eclipse.scout.sdk-settings:jar:8.0.0-SNAPSHOT uses prerequisites which is only intended for maven-plugin projects but not for non maven-plugin projects. For such purposes you should use the maven-enforcer-plugin. See https://maven.apache.org/enforcer/enforcer-rules/requireMavenVersion.html
12:03:22 [INFO] ------------------------------------------------------------------------
12:03:22 [INFO] Reactor Build Order:
12:03:22 [INFO] 
12:03:22 [INFO] Scout Hello World Sample Application                   [maven-archetype]
12:03:22 [INFO] Scout JaxWs Module                                     [maven-archetype]
12:03:22 [INFO] ScoutJS Sample Application                             [maven-archetype]
12:03:22 [INFO] Eclipse Scout SDK                                                  [pom]
12:03:22 [INFO] org.eclipse.scout.sdk:org.eclipse.scout.sdk.core                   [jar]
12:03:22 [INFO] org.eclipse.scout.sdk:org.eclipse.scout.sdk.core.test              [jar]
12:03:22 [INFO] org.eclipse.scout.sdk:org.eclipse.scout.sdk.core.s                 [jar]
12:03:22 [INFO] org.eclipse.scout.sdk:org.eclipse.scout.sdk.core.s.test            [jar]
12:03:22 [INFO] org.eclipse.scout.sdk.s2e:org.eclipse.scout.sdk.s2e             [bundle]
12:03:22 [INFO] org.eclipse.scout.sdk.s2e:org.eclipse.scout.sdk.s2e.test           [jar]
12:03:22 [INFO] org.eclipse.scout.sdk.s2e:org.eclipse.scout.sdk.s2e.doc         [bundle]
12:03:22 [INFO] org.eclipse.scout.sdk.s2e:org.eclipse.scout.sdk.s2e.nls         [bundle]
12:03:22 [INFO] org.eclipse.scout.sdk.s2e:org.eclipse.scout.sdk.s2e.ui          [bundle]
12:03:22 [INFO] org.eclipse.scout.sdk-settings                                     [jar]
12:03:22 [INFO] Eclipse Scout SDK                                                  [pom]
12:03:22 [INFO] 
12:03:22 [INFO] ---------< org.eclipse.scout.archetypes:scout-helloworld-app >----------
12:03:22 [INFO] Building Scout Hello World Sample Application 8.0.0-SNAPSHOT      [1/15]
12:03:22 [INFO] --------------------------[ maven-archetype ]---------------------------
12:03:22 [INFO] 
12:03:22 [INFO] --- maven-clean-plugin:3.0.0:clean (default-clean) @ scout-helloworld-app ---
12:03:23 [INFO] Deleting /jobs/genie.scout/org.eclipse.scout.sdk.branch-8.0_continuous/workspace/scout-helloworld-app/target
12:03:23 [INFO] 
12:03:23 [INFO] --- flatten-maven-plugin:1.0.0:clean (flatten.clean) @ scout-helloworld-app ---
12:03:23 [INFO] Deleting /jobs/genie.scout/org.eclipse.scout.sdk.branch-8.0_continuous/workspace/scout-helloworld-app/.flattened-pom.xml
12:03:23 [INFO] 
12:03:23 [INFO] --- maven-enforcer-plugin:1.4.1:enforce (enforce-rules) @ scout-helloworld-app ---
12:03:24 [INFO] 
12:03:24 [INFO] --- git-commit-id-plugin:2.2.2:revision (default) @ scout-helloworld-app ---
12:03:30 [INFO] 
12:03:30 [INFO] --- jacoco-maven-plugin:0.7.9:prepare-agent (default) @ scout-helloworld-app ---
12:03:31 [INFO] master_test_jacocoArgLine set to -javaagent:/home/hudson/genie.scout/.jenkins/jobs/org.eclipse.scout.sdk.branch-8.0_continuous/workspace/.repository/org/jacoco/org.jacoco.agent/0.7.9/org.jacoco.agent-0.7.9-runtime.jar=destfile=/jobs/genie.scout/org.eclipse.scout.sdk.branch-8.0_continuous/workspace/scout-helloworld-app/../target/jacoco-all.exec
12:03:31 [INFO] 
12:03:31 [INFO] --- build-helper-maven-plugin:1.12:parse-version (initialize-parse-version) @ scout-helloworld-app ---
12:03:31 [INFO] 
12:03:31 [INFO] --- build-helper-maven-plugin:1.12:regex-property (initialize-regex) @ scout-helloworld-app ---
12:03:31 [INFO] 
12:03:31 [INFO] --- maven-resources-plugin:2.7:resources (default-resources) @ scout-helloworld-app ---
12:03:32 [INFO] Using 'UTF-8' encoding to copy filtered resources.
12:03:32 [INFO] Copying 105 resources
12:03:32 [INFO] Copying 2 resources
12:03:32 [INFO] 
12:03:32 [INFO] --- flatten-maven-plugin:1.0.0:flatten (flatten) @ scout-helloworld-app ---
12:03:32 [INFO] Generating flattened POM of project org.eclipse.scout.archetypes:scout-helloworld-app:maven-archetype:8.0.0-SNAPSHOT...
12:03:32 [INFO] 
12:03:32 [INFO] --- maven-resources-plugin:2.7:testResources (default-testResources) @ scout-helloworld-app ---
12:03:32 [INFO] Using 'UTF-8' encoding to copy filtered resources.
12:03:32 [INFO] Copying 2 resources
12:03:32 [INFO] 
12:03:32 [INFO] --- maven-archetype-plugin:2.4:jar (default-jar) @ scout-helloworld-app ---
12:03:33 [INFO] Building archetype jar: /jobs/genie.scout/org.eclipse.scout.sdk.branch-8.0_continuous/workspace/scout-helloworld-app/target/scout-helloworld-app-8.0.0-SNAPSHOT
12:03:33 [INFO] 
12:03:33 [INFO] --- maven-site-plugin:3.6:attach-descriptor (attach-descriptor) @ scout-helloworld-app ---
12:03:35 [INFO] Skipping because packaging 'maven-archetype' is not pom.
12:03:35 [INFO] 
12:03:35 [INFO] --- maven-jar-plugin:2.6:test-jar (attach-tests) @ scout-helloworld-app ---
12:03:35 [INFO] Building jar: /jobs/genie.scout/org.eclipse.scout.sdk.branch-8.0_continuous/workspace/scout-helloworld-app/target/scout-helloworld-app-8.0.0-SNAPSHOT-tests.jar
12:03:35 [INFO] 
12:03:35 [INFO] --- maven-source-plugin:2.4:test-jar-no-fork (attach-test-sources) @ scout-helloworld-app ---
12:03:35 [INFO] No sources in project. Archive not created.
12:03:35 [INFO] 
12:03:35 [INFO] --- maven-archetype-plugin:2.4:integration-test (default-integration-test) @ scout-helloworld-app ---
12:03:35 [INFO] Processing Archetype IT project: basic
12:03:35 [INFO] ----------------------------------------------------------------------------
12:03:35 [INFO] Using following parameters for creating project from Archetype: scout-helloworld-app:8.0.0-SNAPSHOT
12:03:35 [INFO] ----------------------------------------------------------------------------
12:03:35 [INFO] Parameter: groupId, Value: org.eclipse.scout.apps
12:03:35 [INFO] Parameter: artifactId, Value: helloworld
12:03:35 [INFO] Parameter: version, Value: 1.0.0-SNAPSHOT
12:03:35 [INFO] Parameter: package, Value: org.eclipse.scout.apps.helloworld
12:03:35 [INFO] Parameter: packageInPathFormat, Value: org/eclipse/scout/apps/helloworld
12:03:35 [INFO] Parameter: scoutAuthPublicKeyDev, Value: TODO (use org.eclipse.scout.rt.platform.security.SecurityUtility.generateKeyPair())
12:03:35 [INFO] Parameter: groupId, Value: org.eclipse.scout.apps
12:03:35 [INFO] Parameter: scoutAuthPrivateKeyDev, Value: TODO (use org.eclipse.scout.rt.platform.security.SecurityUtility.generateKeyPair())
12:03:35 [INFO] Parameter: scoutAuthPublicKey, Value: TODO (use org.eclipse.scout.rt.platform.security.SecurityUtility.generateKeyPair())
12:03:35 [INFO] Parameter: version, Value: 1.0.0-SNAPSHOT
12:03:35 [INFO] Parameter: userName, Value: Scout Robot
12:03:35 [INFO] Parameter: displayName, Value: My Application
12:03:35 [INFO] Parameter: javaVersion, Value: 1.8
12:03:35 [INFO] Parameter: package, Value: org.eclipse.scout.apps.helloworld
12:03:35 [INFO] Parameter: artifactId, Value: helloworld
12:03:35 [INFO] Parameter: scoutAuthPrivateKey, Value: TODO (use org.eclipse.scout.rt.platform.security.SecurityUtility.generateKeyPair())
12:03:35 [INFO] Parent element not overwritten in /jobs/genie.scout/org.eclipse.scout.sdk.branch-8.0_continuous/workspace/scout-helloworld-app/target/test-classes/projects/basic/project/helloworld/helloworld/pom.xml
12:03:35 [WARNING] Don't override file /jobs/genie.scout/org.eclipse.scout.sdk.branch-8.0_continuous/workspace/scout-helloworld-app/target/test-classes/projects/basic/project/helloworld/helloworld/pom.xml
12:03:35 [INFO] Parent element not overwritten in /jobs/genie.scout/org.eclipse.scout.sdk.branch-8.0_continuous/workspace/scout-helloworld-app/target/test-classes/projects/basic/project/helloworld/helloworld.shared/pom.xml
12:03:35 [INFO] Parent element not overwritten in /jobs/genie.scout/org.eclipse.scout.sdk.branch-8.0_continuous/workspace/scout-helloworld-app/target/test-classes/projects/basic/project/helloworld/helloworld.server/pom.xml
12:03:35 [INFO] Parent element not overwritten in /jobs/genie.scout/org.eclipse.scout.sdk.branch-8.0_continuous/workspace/scout-helloworld-app/target/test-classes/projects/basic/project/helloworld/helloworld.client/pom.xml
12:03:35 [INFO] Parent element not overwritten in /jobs/genie.scout/org.eclipse.scout.sdk.branch-8.0_continuous/workspace/scout-helloworld-app/target/test-classes/projects/basic/project/helloworld/helloworld.server.app.war/pom.xml
12:03:35 [INFO] Parent element not overwritten in /jobs/genie.scout/org.eclipse.scout.sdk.branch-8.0_continuous/workspace/scout-helloworld-app/target/test-classes/projects/basic/project/helloworld/helloworld.server.app.dev/pom.xml
12:03:36 [INFO] Parent element not overwritten in /jobs/genie.scout/org.eclipse.scout.sdk.branch-8.0_continuous/workspace/scout-helloworld-app/target/test-classes/projects/basic/project/helloworld/helloworld.ui.html/pom.xml
12:03:36 [INFO] Parent element not overwritten in /jobs/genie.scout/org.eclipse.scout.sdk.branch-8.0_continuous/workspace/scout-helloworld-app/target/test-classes/projects/basic/project/helloworld/helloworld.ui.html.app.war/pom.xml
12:03:36 [INFO] Parent element not overwritten in /jobs/genie.scout/org.eclipse.scout.sdk.branch-8.0_continuous/workspace/scout-helloworld-app/target/test-classes/projects/basic/project/helloworld/helloworld.ui.html.app.dev/pom.xml
12:03:36 [INFO] project created from Archetype in dir: /jobs/genie.scout/org.eclipse.scout.sdk.branch-8.0_continuous/workspace/scout-helloworld-app/target/test-classes/projects/basic/project/helloworld
12:03:36 [INFO] 
12:03:36 [INFO] --- duplicate-finder-maven-plugin:1.2.1:check (default) @ scout-helloworld-app ---
12:03:36 [INFO] Checking compile classpath
12:03:36 [INFO] Checking runtime classpath
12:03:36 [INFO] Checking test classpath
12:03:36 [INFO] 
12:03:36 [INFO] --- animal-sniffer-maven-plugin:1.15:check (enforce-java-api-compatibility) @ scout-helloworld-app ---
12:03:36 [INFO] Checking unresolved references to org.kaazing.mojo.signature:java18:1.0
12:03:37 [INFO] 
12:03:37 [INFO] --- maven-source-plugin:2.4:jar-no-fork (attach-sources) @ scout-helloworld-app ---
12:03:37 [INFO] No sources in project. Archive not created.
12:03:37 [INFO] 
12:03:37 [INFO] --- eclipse-jarsigner-plugin:1.1.2:sign (sign) @ scout-helloworld-app ---
12:03:37 [INFO] Skipping artifact signing
12:03:37 [INFO] 
12:03:37 [INFO] --- maven-install-plugin:2.5.2:install (default-install) @ scout-helloworld-app ---
12:03:38 [INFO] Installing /jobs/genie.scout/org.eclipse.scout.sdk.branch-8.0_continuous/workspace/scout-helloworld-app/target/scout-helloworld-app-8.0.0-SNAPSHOT.jar to /home/hudson/genie.scout/.jenkins/jobs/org.eclipse.scout.sdk.branch-8.0_continuous/workspace/.repository/org/eclipse/scout/archetypes/scout-helloworld-app/8.0.0-SNAPSHOT/scout-helloworld-app-8.0.0-SNAPSHOT.jar
12:03:38 [INFO] Installing /jobs/genie.scout/org.eclipse.scout.sdk.branch-8.0_continuous/workspace/scout-helloworld-app/.flattened-pom.xml to /home/hudson/genie.scout/.jenkins/jobs/org.eclipse.scout.sdk.branch-8.0_continuous/workspace/.repository/org/eclipse/scout/archetypes/scout-helloworld-app/8.0.0-SNAPSHOT/scout-helloworld-app-8.0.0-SNAPSHOT.pom
12:03:38 [INFO] Installing /jobs/genie.scout/org.eclipse.scout.sdk.branch-8.0_continuous/workspace/scout-helloworld-app/target/scout-helloworld-app-8.0.0-SNAPSHOT-tests.jar to /home/hudson/genie.scout/.jenkins/jobs/org.eclipse.scout.sdk.branch-8.0_continuous/workspace/.repository/org/eclipse/scout/archetypes/scout-helloworld-app/8.0.0-SNAPSHOT/scout-helloworld-app-8.0.0-SNAPSHOT-tests.jar
12:03:38 [INFO] 
12:03:38 [INFO] --- maven-archetype-plugin:2.4:update-local-catalog (default-update-local-catalog) @ scout-helloworld-app ---
12:03:38 [INFO] 
12:03:38 [INFO] ----------< org.eclipse.scout.archetypes:scout-jaxws-module >-----------
12:03:38 [INFO] Building Scout JaxWs Module 8.0.0-SNAPSHOT                        [2/15]
12:03:38 [INFO] --------------------------[ maven-archetype ]---------------------------
12:03:38 [INFO] 
12:03:38 [INFO] --- maven-clean-plugin:3.0.0:clean (default-clean) @ scout-jaxws-module ---
12:03:38 [INFO] Deleting /jobs/genie.scout/org.eclipse.scout.sdk.branch-8.0_continuous/workspace/scout-jaxws-module/target
12:03:38 [INFO] 
12:03:38 [INFO] --- flatten-maven-plugin:1.0.0:clean (flatten.clean) @ scout-jaxws-module ---
12:03:38 [INFO] Deleting /jobs/genie.scout/org.eclipse.scout.sdk.branch-8.0_continuous/workspace/scout-jaxws-module/.flattened-pom.xml
12:03:38 [INFO] 
12:03:38 [INFO] --- maven-enforcer-plugin:1.4.1:enforce (enforce-rules) @ scout-jaxws-module ---
12:03:38 [INFO] 
12:03:38 [INFO] --- git-commit-id-plugin:2.2.2:revision (default) @ scout-jaxws-module ---
12:03:39 [INFO] 
12:03:39 [INFO] --- jacoco-maven-plugin:0.7.9:prepare-agent (default) @ scout-jaxws-module ---
12:03:39 [INFO] master_test_jacocoArgLine set to -javaagent:/home/hudson/genie.scout/.jenkins/jobs/org.eclipse.scout.sdk.branch-8.0_continuous/workspace/.repository/org/jacoco/org.jacoco.agent/0.7.9/org.jacoco.agent-0.7.9-runtime.jar=destfile=/jobs/genie.scout/org.eclipse.scout.sdk.branch-8.0_continuous/workspace/scout-jaxws-module/../target/jacoco-all.exec
12:03:39 [INFO] 
12:03:39 [INFO] --- build-helper-maven-plugin:1.12:parse-version (initialize-parse-version) @ scout-jaxws-module ---
12:03:39 [INFO] 
12:03:39 [INFO] --- build-helper-maven-plugin:1.12:regex-property (initialize-regex) @ scout-jaxws-module ---
12:03:39 [INFO] 
12:03:39 [INFO] --- maven-resources-plugin:2.7:resources (default-resources) @ scout-jaxws-module ---
12:03:39 [INFO] Using 'UTF-8' encoding to copy filtered resources.
12:03:39 [INFO] Copying 7 resources
12:03:39 [INFO] Copying 2 resources
12:03:39 [INFO] 
12:03:39 [INFO] --- flatten-maven-plugin:1.0.0:flatten (flatten) @ scout-jaxws-module ---
12:03:39 [INFO] Generating flattened POM of project org.eclipse.scout.archetypes:scout-jaxws-module:maven-archetype:8.0.0-SNAPSHOT...
12:03:39 [INFO] 
12:03:39 [INFO] --- maven-resources-plugin:2.7:testResources (default-testResources) @ scout-jaxws-module ---
12:03:39 [INFO] Using 'UTF-8' encoding to copy filtered resources.
12:03:39 [INFO] Copying 2 resources
12:03:39 [INFO] 
12:03:39 [INFO] --- maven-archetype-plugin:2.4:jar (default-jar) @ scout-jaxws-module ---
12:03:39 [INFO] Building archetype jar: /jobs/genie.scout/org.eclipse.scout.sdk.branch-8.0_continuous/workspace/scout-jaxws-module/target/scout-jaxws-module-8.0.0-SNAPSHOT
12:03:39 [INFO] 
12:03:39 [INFO] --- maven-site-plugin:3.6:attach-descriptor (attach-descriptor) @ scout-jaxws-module ---
12:03:39 [INFO] Skipping because packaging 'maven-archetype' is not pom.
12:03:39 [INFO] 
12:03:39 [INFO] --- maven-jar-plugin:2.6:test-jar (attach-tests) @ scout-jaxws-module ---
12:03:39 [INFO] Building jar: /jobs/genie.scout/org.eclipse.scout.sdk.branch-8.0_continuous/workspace/scout-jaxws-module/target/scout-jaxws-module-8.0.0-SNAPSHOT-tests.jar
12:03:39 [INFO] 
12:03:39 [INFO] --- maven-source-plugin:2.4:test-jar-no-fork (attach-test-sources) @ scout-jaxws-module ---
12:03:39 [INFO] No sources in project. Archive not created.
12:03:39 [INFO] 
12:03:39 [INFO] --- maven-archetype-plugin:2.4:integration-test (default-integration-test) @ scout-jaxws-module ---
12:03:39 [INFO] Processing Archetype IT project: basic
12:03:39 [INFO] ----------------------------------------------------------------------------
12:03:39 [INFO] Using following parameters for creating project from Archetype: scout-jaxws-module:8.0.0-SNAPSHOT
12:03:39 [INFO] ----------------------------------------------------------------------------
12:03:39 [INFO] Parameter: groupId, Value: org.eclipse.scout.apps
12:03:39 [INFO] Parameter: artifactId, Value: helloworld.server.jaxws
12:03:39 [INFO] Parameter: version, Value: 1.0.0-SNAPSHOT
12:03:39 [INFO] Parameter: package, Value: org.eclipse.scout.apps.helloworld
12:03:39 [INFO] Parameter: packageInPathFormat, Value: org/eclipse/scout/apps/helloworld
12:03:39 [INFO] Parameter: displayName, Value: My Application
12:03:39 [INFO] Parameter: version, Value: 1.0.0-SNAPSHOT
12:03:39 [INFO] Parameter: package, Value: org.eclipse.scout.apps.helloworld
12:03:39 [INFO] Parameter: groupId, Value: org.eclipse.scout.apps
12:03:39 [INFO] Parameter: parentArtifactId, Value: helloworld
12:03:39 [INFO] Parameter: artifactId, Value: helloworld.server.jaxws
12:03:39 [WARNING] CP Don't override file /jobs/genie.scout/org.eclipse.scout.sdk.branch-8.0_continuous/workspace/scout-jaxws-module/target/test-classes/projects/basic/project/helloworld.server.jaxws/src/main/resources/META-INF/scout.xml
12:03:39 [INFO] project created from Archetype in dir: /jobs/genie.scout/org.eclipse.scout.sdk.branch-8.0_continuous/workspace/scout-jaxws-module/target/test-classes/projects/basic/project/helloworld.server.jaxws
12:03:39 [INFO] 
12:03:39 [INFO] --- duplicate-finder-maven-plugin:1.2.1:check (default) @ scout-jaxws-module ---
12:03:39 [INFO] Checking compile classpath
12:03:39 [INFO] Checking runtime classpath
12:03:39 [INFO] Checking test classpath
12:03:39 [INFO] 
12:03:39 [INFO] --- animal-sniffer-maven-plugin:1.15:check (enforce-java-api-compatibility) @ scout-jaxws-module ---
12:03:39 [INFO] Checking unresolved references to org.kaazing.mojo.signature:java18:1.0
12:03:40 [INFO] 
12:03:40 [INFO] --- maven-source-plugin:2.4:jar-no-fork (attach-sources) @ scout-jaxws-module ---
12:03:40 [INFO] No sources in project. Archive not created.
12:03:40 [INFO] 
12:03:40 [INFO] --- eclipse-jarsigner-plugin:1.1.2:sign (sign) @ scout-jaxws-module ---
12:03:40 [INFO] Skipping artifact signing
12:03:40 [INFO] 
12:03:40 [INFO] --- maven-install-plugin:2.5.2:install (default-install) @ scout-jaxws-module ---
12:03:40 [INFO] Installing /jobs/genie.scout/org.eclipse.scout.sdk.branch-8.0_continuous/workspace/scout-jaxws-module/target/scout-jaxws-module-8.0.0-SNAPSHOT.jar to /home/hudson/genie.scout/.jenkins/jobs/org.eclipse.scout.sdk.branch-8.0_continuous/workspace/.repository/org/eclipse/scout/archetypes/scout-jaxws-module/8.0.0-SNAPSHOT/scout-jaxws-module-8.0.0-SNAPSHOT.jar
12:03:40 [INFO] Installing /jobs/genie.scout/org.eclipse.scout.sdk.branch-8.0_continuous/workspace/scout-jaxws-module/.flattened-pom.xml to /home/hudson/genie.scout/.jenkins/jobs/org.eclipse.scout.sdk.branch-8.0_continuous/workspace/.repository/org/eclipse/scout/archetypes/scout-jaxws-module/8.0.0-SNAPSHOT/scout-jaxws-module-8.0.0-SNAPSHOT.pom
12:03:40 [INFO] Installing /jobs/genie.scout/org.eclipse.scout.sdk.branch-8.0_continuous/workspace/scout-jaxws-module/target/scout-jaxws-module-8.0.0-SNAPSHOT-tests.jar to /home/hudson/genie.scout/.jenkins/jobs/org.eclipse.scout.sdk.branch-8.0_continuous/workspace/.repository/org/eclipse/scout/archetypes/scout-jaxws-module/8.0.0-SNAPSHOT/scout-jaxws-module-8.0.0-SNAPSHOT-tests.jar
12:03:40 [INFO] 
12:03:40 [INFO] --- maven-archetype-plugin:2.4:update-local-catalog (default-update-local-catalog) @ scout-jaxws-module ---
12:03:40 [INFO] 
12:03:40 [INFO] -----------< org.eclipse.scout.archetypes:scout-hellojs-app >-----------
12:03:40 [INFO] Building ScoutJS Sample Application 8.0.0-SNAPSHOT                [3/15]
12:03:40 [INFO] --------------------------[ maven-archetype ]---------------------------
12:03:40 [INFO] 
12:03:40 [INFO] --- maven-clean-plugin:3.0.0:clean (default-clean) @ scout-hellojs-app ---
12:03:40 [INFO] Deleting /jobs/genie.scout/org.eclipse.scout.sdk.branch-8.0_continuous/workspace/scout-hellojs-app/target
12:03:40 [INFO] 
12:03:40 [INFO] --- flatten-maven-plugin:1.0.0:clean (flatten.clean) @ scout-hellojs-app ---
12:03:40 [INFO] Deleting /jobs/genie.scout/org.eclipse.scout.sdk.branch-8.0_continuous/workspace/scout-hellojs-app/.flattened-pom.xml
12:03:40 [INFO] 
12:03:40 [INFO] --- maven-enforcer-plugin:1.4.1:enforce (enforce-rules) @ scout-hellojs-app ---
12:03:40 [INFO] 
12:03:40 [INFO] --- git-commit-id-plugin:2.2.2:revision (default) @ scout-hellojs-app ---
12:03:41 [INFO] 
12:03:41 [INFO] --- jacoco-maven-plugin:0.7.9:prepare-agent (default) @ scout-hellojs-app ---
12:03:41 [INFO] master_test_jacocoArgLine set to -javaagent:/home/hudson/genie.scout/.jenkins/jobs/org.eclipse.scout.sdk.branch-8.0_continuous/workspace/.repository/org/jacoco/org.jacoco.agent/0.7.9/org.jacoco.agent-0.7.9-runtime.jar=destfile=/jobs/genie.scout/org.eclipse.scout.sdk.branch-8.0_continuous/workspace/scout-hellojs-app/../target/jacoco-all.exec
12:03:41 [INFO] 
12:03:41 [INFO] --- build-helper-maven-plugin:1.12:parse-version (initialize-parse-version) @ scout-hellojs-app ---
12:03:41 [INFO] 
12:03:41 [INFO] --- build-helper-maven-plugin:1.12:regex-property (initialize-regex) @ scout-hellojs-app ---
12:03:41 [INFO] 
12:03:41 [INFO] --- maven-resources-plugin:2.7:resources (default-resources) @ scout-hellojs-app ---
12:03:41 [INFO] Using 'UTF-8' encoding to copy filtered resources.
12:03:41 [INFO] Copying 140 resources
12:03:44 [INFO] Copying 2 resources
12:03:44 [INFO] 
12:03:44 [INFO] --- flatten-maven-plugin:1.0.0:flatten (flatten) @ scout-hellojs-app ---
12:03:44 [INFO] Generating flattened POM of project org.eclipse.scout.archetypes:scout-hellojs-app:maven-archetype:8.0.0-SNAPSHOT...
12:03:44 [INFO] 
12:03:44 [INFO] --- maven-resources-plugin:2.7:testResources (default-testResources) @ scout-hellojs-app ---
12:03:44 [INFO] Using 'UTF-8' encoding to copy filtered resources.
12:03:44 [INFO] Copying 2 resources
12:03:44 [INFO] 
12:03:44 [INFO] --- maven-archetype-plugin:2.4:jar (default-jar) @ scout-hellojs-app ---
12:03:44 [INFO] Building archetype jar: /jobs/genie.scout/org.eclipse.scout.sdk.branch-8.0_continuous/workspace/scout-hellojs-app/target/scout-hellojs-app-8.0.0-SNAPSHOT
12:03:44 [INFO] 
12:03:45 [INFO] --- maven-site-plugin:3.6:attach-descriptor (attach-descriptor) @ scout-hellojs-app ---
12:03:45 [INFO] Skipping because packaging 'maven-archetype' is not pom.
12:03:45 [INFO] 
12:03:45 [INFO] --- maven-jar-plugin:2.6:test-jar (attach-tests) @ scout-hellojs-app ---
12:03:45 [INFO] Building jar: /jobs/genie.scout/org.eclipse.scout.sdk.branch-8.0_continuous/workspace/scout-hellojs-app/target/scout-hellojs-app-8.0.0-SNAPSHOT-tests.jar
12:03:45 [INFO] 
12:03:45 [INFO] --- maven-source-plugin:2.4:test-jar-no-fork (attach-test-sources) @ scout-hellojs-app ---
12:03:45 [INFO] No sources in project. Archive not created.
12:03:45 [INFO] 
12:03:45 [INFO] --- maven-archetype-plugin:2.4:integration-test (default-integration-test) @ scout-hellojs-app ---
12:03:45 [INFO] Processing Archetype IT project: basic
12:03:45 [INFO] ----------------------------------------------------------------------------
12:03:45 [INFO] Using following parameters for creating project from Archetype: scout-hellojs-app:8.0.0-SNAPSHOT
12:03:45 [INFO] ----------------------------------------------------------------------------
12:03:45 [INFO] Parameter: groupId, Value: org.eclipse.scout.apps
12:03:45 [INFO] Parameter: artifactId, Value: hellojs
12:03:45 [INFO] Parameter: version, Value: 1.0.0-SNAPSHOT
12:03:45 [INFO] Parameter: package, Value: org.eclipse.scout.apps.hellojs
12:03:45 [INFO] Parameter: packageInPathFormat, Value: org/eclipse/scout/apps/hellojs
12:03:45 [INFO] Parameter: displayName, Value: My Application
12:03:45 [INFO] Parameter: version, Value: 1.0.0-SNAPSHOT
12:03:45 [INFO] Parameter: package, Value: org.eclipse.scout.apps.hellojs
12:03:45 [INFO] Parameter: simpleArtifactName, Value: hellojs
12:03:45 [INFO] Parameter: javaVersion, Value: 1.8
12:03:45 [INFO] Parameter: groupId, Value: org.eclipse.scout.apps
12:03:45 [INFO] Parameter: scoutAuthPublicKeyDev, Value: changeme_database_password
12:03:45 [INFO] Parameter: artifactId, Value: hellojs
12:03:45 [INFO] Parent element not overwritten in /jobs/genie.scout/org.eclipse.scout.sdk.branch-8.0_continuous/workspace/scout-hellojs-app/target/test-classes/projects/basic/project/hellojs/hellojs/pom.xml
12:03:45 [WARNING] Don't override file /jobs/genie.scout/org.eclipse.scout.sdk.branch-8.0_continuous/workspace/scout-hellojs-app/target/test-classes/projects/basic/project/hellojs/hellojs/pom.xml
12:03:45 [INFO] Parent element not overwritten in /jobs/genie.scout/org.eclipse.scout.sdk.branch-8.0_continuous/workspace/scout-hellojs-app/target/test-classes/projects/basic/project/hellojs/hellojs.api/pom.xml
12:03:45 [INFO] Parent element not overwritten in /jobs/genie.scout/org.eclipse.scout.sdk.branch-8.0_continuous/workspace/scout-hellojs-app/target/test-classes/projects/basic/project/hellojs/hellojs.app/pom.xml
12:03:45 [INFO] Parent element not overwritten in /jobs/genie.scout/org.eclipse.scout.sdk.branch-8.0_continuous/workspace/scout-hellojs-app/target/test-classes/projects/basic/project/hellojs/hellojs.app.dev/pom.xml
12:03:45 [INFO] Parent element not overwritten in /jobs/genie.scout/org.eclipse.scout.sdk.branch-8.0_continuous/workspace/scout-hellojs-app/target/test-classes/projects/basic/project/hellojs/hellojs.app.war/pom.xml
12:03:45 [INFO] Parent element not overwritten in /jobs/genie.scout/org.eclipse.scout.sdk.branch-8.0_continuous/workspace/scout-hellojs-app/target/test-classes/projects/basic/project/hellojs/hellojs.core/pom.xml
12:03:45 [INFO] Parent element not overwritten in /jobs/genie.scout/org.eclipse.scout.sdk.branch-8.0_continuous/workspace/scout-hellojs-app/target/test-classes/projects/basic/project/hellojs/hellojs.core.test/pom.xml
12:03:45 [INFO] Parent element not overwritten in /jobs/genie.scout/org.eclipse.scout.sdk.branch-8.0_continuous/workspace/scout-hellojs-app/target/test-classes/projects/basic/project/hellojs/hellojs.data/pom.xml
12:03:45 [INFO] Parent element not overwritten in /jobs/genie.scout/org.eclipse.scout.sdk.branch-8.0_continuous/workspace/scout-hellojs-app/target/test-classes/projects/basic/project/hellojs/hellojs.db/pom.xml
12:03:45 [INFO] Parent element not overwritten in /jobs/genie.scout/org.eclipse.scout.sdk.branch-8.0_continuous/workspace/scout-hellojs-app/target/test-classes/projects/basic/project/hellojs/hellojs.persistence/pom.xml
12:03:45 [INFO] Parent element not overwritten in /jobs/genie.scout/org.eclipse.scout.sdk.branch-8.0_continuous/workspace/scout-hellojs-app/target/test-classes/projects/basic/project/hellojs/hellojs.persistence.test/pom.xml
12:03:45 [INFO] Parent element not overwritten in /jobs/genie.scout/org.eclipse.scout.sdk.branch-8.0_continuous/workspace/scout-hellojs-app/target/test-classes/projects/basic/project/hellojs/hellojs.ui/pom.xml
12:03:45 [INFO] project created from Archetype in dir: /jobs/genie.scout/org.eclipse.scout.sdk.branch-8.0_continuous/workspace/scout-hellojs-app/target/test-classes/projects/basic/project/hellojs
12:03:45 [INFO] 
12:03:45 [INFO] --- duplicate-finder-maven-plugin:1.2.1:check (default) @ scout-hellojs-app ---
12:03:45 [INFO] Checking compile classpath
12:03:45 [INFO] Checking runtime classpath
12:03:45 [INFO] Checking test classpath
12:03:45 [INFO] 
12:03:45 [INFO] --- animal-sniffer-maven-plugin:1.15:check (enforce-java-api-compatibility) @ scout-hellojs-app ---
12:03:45 [INFO] Checking unresolved references to org.kaazing.mojo.signature:java18:1.0
12:03:45 [INFO] 
12:03:45 [INFO] --- maven-source-plugin:2.4:jar-no-fork (attach-sources) @ scout-hellojs-app ---
12:03:45 [INFO] No sources in project. Archive not created.
12:03:45 [INFO] 
12:03:45 [INFO] --- eclipse-jarsigner-plugin:1.1.2:sign (sign) @ scout-hellojs-app ---
12:03:45 [INFO] Skipping artifact signing
12:03:45 [INFO] 
12:03:45 [INFO] --- maven-install-plugin:2.5.2:install (default-install) @ scout-hellojs-app ---
12:03:45 [INFO] Installing /jobs/genie.scout/org.eclipse.scout.sdk.branch-8.0_continuous/workspace/scout-hellojs-app/target/scout-hellojs-app-8.0.0-SNAPSHOT.jar to /home/hudson/genie.scout/.jenkins/jobs/org.eclipse.scout.sdk.branch-8.0_continuous/workspace/.repository/org/eclipse/scout/archetypes/scout-hellojs-app/8.0.0-SNAPSHOT/scout-hellojs-app-8.0.0-SNAPSHOT.jar
12:03:45 [INFO] Installing /jobs/genie.scout/org.eclipse.scout.sdk.branch-8.0_continuous/workspace/scout-hellojs-app/.flattened-pom.xml to /home/hudson/genie.scout/.jenkins/jobs/org.eclipse.scout.sdk.branch-8.0_continuous/workspace/.repository/org/eclipse/scout/archetypes/scout-hellojs-app/8.0.0-SNAPSHOT/scout-hellojs-app-8.0.0-SNAPSHOT.pom
12:03:45 [INFO] Installing /jobs/genie.scout/org.eclipse.scout.sdk.branch-8.0_continuous/workspace/scout-hellojs-app/target/scout-hellojs-app-8.0.0-SNAPSHOT-tests.jar to /home/hudson/genie.scout/.jenkins/jobs/org.eclipse.scout.sdk.branch-8.0_continuous/workspace/.repository/org/eclipse/scout/archetypes/scout-hellojs-app/8.0.0-SNAPSHOT/scout-hellojs-app-8.0.0-SNAPSHOT-tests.jar
12:03:45 [INFO] 
12:03:45 [INFO] --- maven-archetype-plugin:2.4:update-local-catalog (default-update-local-catalog) @ scout-hellojs-app ---
12:03:45 [INFO] 
12:03:45 [INFO] ------------< org.eclipse.scout.sdk:org.eclipse.scout.sdk >-------------
12:03:45 [INFO] Building Eclipse Scout SDK 8.0.0-SNAPSHOT                         [4/15]
12:03:45 [INFO] --------------------------------[ pom ]---------------------------------
12:03:45 [INFO] 
12:03:45 [INFO] --- maven-clean-plugin:3.0.0:clean (default-clean) @ org.eclipse.scout.sdk ---
12:03:45 [INFO] Deleting /jobs/genie.scout/org.eclipse.scout.sdk.branch-8.0_continuous/workspace/org.eclipse.scout.sdk/target
12:03:45 [INFO] 
12:03:45 [INFO] --- flatten-maven-plugin:1.0.0:clean (flatten.clean) @ org.eclipse.scout.sdk ---
12:03:45 [INFO] Deleting /jobs/genie.scout/org.eclipse.scout.sdk.branch-8.0_continuous/workspace/org.eclipse.scout.sdk/.flattened-pom.xml
12:03:45 [INFO] 
12:03:45 [INFO] --- maven-enforcer-plugin:1.4.1:enforce (enforce-rules) @ org.eclipse.scout.sdk ---
12:03:45 [INFO] 
12:03:45 [INFO] --- git-commit-id-plugin:2.2.2:revision (default) @ org.eclipse.scout.sdk ---
12:03:45 [INFO] 
12:03:45 [INFO] --- jacoco-maven-plugin:0.7.9:prepare-agent (default) @ org.eclipse.scout.sdk ---
12:03:45 [INFO] master_test_jacocoArgLine set to -javaagent:/home/hudson/genie.scout/.jenkins/jobs/org.eclipse.scout.sdk.branch-8.0_continuous/workspace/.repository/org/jacoco/org.jacoco.agent/0.7.9/org.jacoco.agent-0.7.9-runtime.jar=destfile=/jobs/genie.scout/org.eclipse.scout.sdk.branch-8.0_continuous/workspace/org.eclipse.scout.sdk/../org.eclipse.scout.sdk/target/jacoco-all.exec
12:03:45 [INFO] 
12:03:45 [INFO] --- build-helper-maven-plugin:1.12:parse-version (initialize-parse-version) @ org.eclipse.scout.sdk ---
12:03:45 [INFO] 
12:03:45 [INFO] --- build-helper-maven-plugin:1.12:regex-property (initialize-regex) @ org.eclipse.scout.sdk ---
12:03:45 [INFO] 
12:03:45 [INFO] --- flatten-maven-plugin:1.0.0:flatten (flatten) @ org.eclipse.scout.sdk ---
12:03:45 [INFO] Generating flattened POM of project org.eclipse.scout.sdk:org.eclipse.scout.sdk:pom:8.0.0-SNAPSHOT...
12:03:48 [INFO] 
12:03:48 [INFO] --- maven-site-plugin:3.6:attach-descriptor (attach-descriptor) @ org.eclipse.scout.sdk ---
12:03:48 [INFO] No site descriptor found: nothing to attach.
12:03:48 [INFO] 
12:03:48 [INFO] --- maven-jar-plugin:2.6:test-jar (attach-tests) @ org.eclipse.scout.sdk ---
12:03:48 [INFO] Skipping packaging of the test-jar
12:03:48 [INFO] 
12:03:48 [INFO] --- maven-source-plugin:2.4:test-jar-no-fork (attach-test-sources) @ org.eclipse.scout.sdk ---
12:03:49 [INFO] 
12:03:49 [INFO] --- duplicate-finder-maven-plugin:1.2.1:check (default) @ org.eclipse.scout.sdk ---
12:03:49 [INFO] Checking compile classpath
12:03:49 [INFO] Checking runtime classpath
12:03:49 [INFO] Checking test classpath
12:03:49 [INFO] 
12:03:49 [INFO] --- animal-sniffer-maven-plugin:1.15:check (enforce-java-api-compatibility) @ org.eclipse.scout.sdk ---
12:03:49 [INFO] Checking unresolved references to org.kaazing.mojo.signature:java18:1.0
12:03:50 [INFO] 
12:03:50 [INFO] --- maven-source-plugin:2.4:jar-no-fork (attach-sources) @ org.eclipse.scout.sdk ---
12:03:50 [INFO] 
12:03:50 [INFO] --- eclipse-jarsigner-plugin:1.1.2:sign (sign) @ org.eclipse.scout.sdk ---
12:03:50 [INFO] Skipping artifact signing
12:03:50 [INFO] 
12:03:50 [INFO] --- maven-install-plugin:2.5.2:install (default-install) @ org.eclipse.scout.sdk ---
12:03:50 [INFO] Installing /jobs/genie.scout/org.eclipse.scout.sdk.branch-8.0_continuous/workspace/org.eclipse.scout.sdk/.flattened-pom.xml to /home/hudson/genie.scout/.jenkins/jobs/org.eclipse.scout.sdk.branch-8.0_continuous/workspace/.repository/org/eclipse/scout/sdk/org.eclipse.scout.sdk/8.0.0-SNAPSHOT/org.eclipse.scout.sdk-8.0.0-SNAPSHOT.pom
12:03:50 [INFO] 
12:03:50 [INFO] ----------< org.eclipse.scout.sdk:org.eclipse.scout.sdk.core >----------
12:03:50 [INFO] Building org.eclipse.scout.sdk:org.eclipse.scout.sdk.core 8.0.0-SNAPSHOT [5/15]
12:03:50 [INFO] --------------------------------[ jar ]---------------------------------
12:03:51 [INFO] 
12:03:51 [INFO] --- maven-clean-plugin:3.0.0:clean (default-clean) @ org.eclipse.scout.sdk.core ---
12:03:51 [INFO] Deleting /jobs/genie.scout/org.eclipse.scout.sdk.branch-8.0_continuous/workspace/org.eclipse.scout.sdk.core/target
12:03:51 [INFO] 
12:03:51 [INFO] --- maven-enforcer-plugin:1.4.1:enforce (enforce-rules) @ org.eclipse.scout.sdk.core ---
12:03:51 [INFO] 
12:03:51 [INFO] --- git-commit-id-plugin:2.2.2:revision (default) @ org.eclipse.scout.sdk.core ---
12:03:52 [INFO] 
12:03:52 [INFO] --- jacoco-maven-plugin:0.7.9:prepare-agent (default) @ org.eclipse.scout.sdk.core ---
12:03:52 [INFO] master_test_jacocoArgLine set to -javaagent:/home/hudson/genie.scout/.jenkins/jobs/org.eclipse.scout.sdk.branch-8.0_continuous/workspace/.repository/org/jacoco/org.jacoco.agent/0.7.9/org.jacoco.agent-0.7.9-runtime.jar=destfile=/jobs/genie.scout/org.eclipse.scout.sdk.branch-8.0_continuous/workspace/org.eclipse.scout.sdk.core/../org.eclipse.scout.sdk/target/jacoco-all.exec
12:03:52 [INFO] 
12:03:52 [INFO] --- build-helper-maven-plugin:1.12:parse-version (initialize-parse-version) @ org.eclipse.scout.sdk.core ---
12:03:52 [INFO] 
12:03:52 [INFO] --- build-helper-maven-plugin:1.12:regex-property (initialize-regex) @ org.eclipse.scout.sdk.core ---
12:03:52 [INFO] 
12:03:52 [INFO] --- maven-resources-plugin:2.7:resources (default-resources) @ org.eclipse.scout.sdk.core ---
12:03:52 [INFO] Using 'UTF-8' encoding to copy filtered resources.
12:03:52 [INFO] skip non existing resourceDirectory /jobs/genie.scout/org.eclipse.scout.sdk.branch-8.0_continuous/workspace/org.eclipse.scout.sdk.core/src/main/resources
12:03:52 [INFO] Copying 2 resources
12:03:52 [INFO] 
12:03:52 [INFO] --- maven-compiler-plugin:3.6.1:compile (default-compile) @ org.eclipse.scout.sdk.core ---
12:03:53 [INFO] Changes detected - recompiling the module!
12:03:53 [INFO] Compiling 165 source files to /jobs/genie.scout/org.eclipse.scout.sdk.branch-8.0_continuous/workspace/org.eclipse.scout.sdk.core/target/classes
12:04:01 [INFO] 
12:04:01 [INFO] --- maven-resources-plugin:2.7:testResources (default-testResources) @ org.eclipse.scout.sdk.core ---
12:04:01 [INFO] Using 'UTF-8' encoding to copy filtered resources.
12:04:01 [INFO] skip non existing resourceDirectory /jobs/genie.scout/org.eclipse.scout.sdk.branch-8.0_continuous/workspace/org.eclipse.scout.sdk.core/src/test/resources
12:04:01 [INFO] 
12:04:01 [INFO] --- maven-compiler-plugin:3.6.1:testCompile (default-testCompile) @ org.eclipse.scout.sdk.core ---
12:04:01 [INFO] No sources to compile
12:04:01 [INFO] 
12:04:01 [INFO] --- maven-surefire-plugin:2.19.1:test (default-test) @ org.eclipse.scout.sdk.core ---
12:04:02 [INFO] No tests to run.
12:04:02 [INFO] 
12:04:02 [INFO] --- maven-jar-plugin:2.6:jar (default-jar) @ org.eclipse.scout.sdk.core ---
12:04:02 [INFO] Building jar: /jobs/genie.scout/org.eclipse.scout.sdk.branch-8.0_continuous/workspace/org.eclipse.scout.sdk.core/target/org.eclipse.scout.sdk.core-8.0.0-SNAPSHOT.jar
12:04:02 [INFO] 
12:04:02 [INFO] --- maven-site-plugin:3.6:attach-descriptor (attach-descriptor) @ org.eclipse.scout.sdk.core ---
12:04:02 [INFO] Skipping because packaging 'jar' is not pom.
12:04:02 [INFO] 
12:04:02 [INFO] --- maven-jar-plugin:2.6:test-jar (attach-tests) @ org.eclipse.scout.sdk.core ---
12:04:02 [INFO] Skipping packaging of the test-jar
12:04:02 [INFO] 
12:04:02 [INFO] --- maven-source-plugin:2.4:test-jar-no-fork (attach-test-sources) @ org.eclipse.scout.sdk.core ---
12:04:02 [INFO] No sources in project. Archive not created.
12:04:02 [INFO] 
12:04:02 [INFO] --- duplicate-finder-maven-plugin:1.2.1:check (default) @ org.eclipse.scout.sdk.core ---
12:04:02 [INFO] Checking compile classpath
12:04:03 [INFO] Checking runtime classpath
12:04:03 [INFO] Checking test classpath
12:04:03 [INFO] 
12:04:03 [INFO] --- animal-sniffer-maven-plugin:1.15:check (enforce-java-api-compatibility) @ org.eclipse.scout.sdk.core ---
12:04:03 [INFO] Signature checking is skipped.
12:04:03 [INFO] 
12:04:03 [INFO] --- maven-source-plugin:2.4:jar-no-fork (attach-sources) @ org.eclipse.scout.sdk.core ---
12:04:03 [INFO] Building jar: /jobs/genie.scout/org.eclipse.scout.sdk.branch-8.0_continuous/workspace/org.eclipse.scout.sdk.core/target/org.eclipse.scout.sdk.core-8.0.0-SNAPSHOT-sources.jar
12:04:03 [INFO] 
12:04:03 [INFO] --- eclipse-jarsigner-plugin:1.1.2:sign (sign) @ org.eclipse.scout.sdk.core ---
12:04:03 [INFO] Skipping artifact signing
12:04:03 [INFO] 
12:04:03 [INFO] --- maven-install-plugin:2.5.2:install (default-install) @ org.eclipse.scout.sdk.core ---
12:04:03 [INFO] Installing /jobs/genie.scout/org.eclipse.scout.sdk.branch-8.0_continuous/workspace/org.eclipse.scout.sdk.core/target/org.eclipse.scout.sdk.core-8.0.0-SNAPSHOT.jar to /home/hudson/genie.scout/.jenkins/jobs/org.eclipse.scout.sdk.branch-8.0_continuous/workspace/.repository/org/eclipse/scout/sdk/org.eclipse.scout.sdk.core/8.0.0-SNAPSHOT/org.eclipse.scout.sdk.core-8.0.0-SNAPSHOT.jar
12:04:03 [INFO] Installing /jobs/genie.scout/org.eclipse.scout.sdk.branch-8.0_continuous/workspace/org.eclipse.scout.sdk.core/pom.xml to /home/hudson/genie.scout/.jenkins/jobs/org.eclipse.scout.sdk.branch-8.0_continuous/workspace/.repository/org/eclipse/scout/sdk/org.eclipse.scout.sdk.core/8.0.0-SNAPSHOT/org.eclipse.scout.sdk.core-8.0.0-SNAPSHOT.pom
12:04:03 [INFO] Installing /jobs/genie.scout/org.eclipse.scout.sdk.branch-8.0_continuous/workspace/org.eclipse.scout.sdk.core/target/org.eclipse.scout.sdk.core-8.0.0-SNAPSHOT-sources.jar to /home/hudson/genie.scout/.jenkins/jobs/org.eclipse.scout.sdk.branch-8.0_continuous/workspace/.repository/org/eclipse/scout/sdk/org.eclipse.scout.sdk.core/8.0.0-SNAPSHOT/org.eclipse.scout.sdk.core-8.0.0-SNAPSHOT-sources.jar
12:04:03 [INFO] 
12:04:03 [INFO] -------< org.eclipse.scout.sdk:org.eclipse.scout.sdk.core.test >--------
12:04:03 [INFO] Building org.eclipse.scout.sdk:org.eclipse.scout.sdk.core.test 8.0.0-SNAPSHOT [6/15]
12:04:03 [INFO] --------------------------------[ jar ]---------------------------------
12:04:03 [INFO] 
12:04:03 [INFO] --- maven-clean-plugin:3.0.0:clean (default-clean) @ org.eclipse.scout.sdk.core.test ---
12:04:03 [INFO] Deleting /jobs/genie.scout/org.eclipse.scout.sdk.branch-8.0_continuous/workspace/org.eclipse.scout.sdk.core.test/target
12:04:04 [INFO] 
12:04:04 [INFO] --- maven-enforcer-plugin:1.4.1:enforce (enforce-rules) @ org.eclipse.scout.sdk.core.test ---
12:04:04 [INFO] 
12:04:04 [INFO] --- git-commit-id-plugin:2.2.2:revision (default) @ org.eclipse.scout.sdk.core.test ---
12:04:05 [INFO] 
12:04:05 [INFO] --- jacoco-maven-plugin:0.7.9:prepare-agent (default) @ org.eclipse.scout.sdk.core.test ---
12:04:05 [INFO] master_test_jacocoArgLine set to -javaagent:/home/hudson/genie.scout/.jenkins/jobs/org.eclipse.scout.sdk.branch-8.0_continuous/workspace/.repository/org/jacoco/org.jacoco.agent/0.7.9/org.jacoco.agent-0.7.9-runtime.jar=destfile=/jobs/genie.scout/org.eclipse.scout.sdk.branch-8.0_continuous/workspace/org.eclipse.scout.sdk.core.test/../org.eclipse.scout.sdk/target/jacoco-all.exec
12:04:05 [INFO] 
12:04:05 [INFO] --- build-helper-maven-plugin:1.12:parse-version (initialize-parse-version) @ org.eclipse.scout.sdk.core.test ---
12:04:05 [INFO] 
12:04:05 [INFO] --- build-helper-maven-plugin:1.12:regex-property (initialize-regex) @ org.eclipse.scout.sdk.core.test ---
12:04:05 [INFO] 
12:04:05 [INFO] --- build-helper-maven-plugin:1.12:add-source (add-source) @ org.eclipse.scout.sdk.core.test ---
12:04:05 [INFO] Source directory: /jobs/genie.scout/org.eclipse.scout.sdk.branch-8.0_continuous/workspace/org.eclipse.scout.sdk.core.test/src/main/fixture added.
12:04:05 [INFO] 
12:04:05 [INFO] --- maven-resources-plugin:2.7:resources (default-resources) @ org.eclipse.scout.sdk.core.test ---
12:04:05 [INFO] Using 'UTF-8' encoding to copy filtered resources.
12:04:05 [INFO] Copying 2 resources
12:04:05 [INFO] Copying 2 resources
12:04:05 [INFO] 
12:04:05 [INFO] --- maven-compiler-plugin:3.6.1:compile (default-compile) @ org.eclipse.scout.sdk.core.test ---
12:04:05 [INFO] Changes detected - recompiling the module!
12:04:05 [INFO] Compiling 38 source files to /jobs/genie.scout/org.eclipse.scout.sdk.branch-8.0_continuous/workspace/org.eclipse.scout.sdk.core.test/target/classes
12:04:13 [INFO] 
12:04:13 [INFO] --- maven-resources-plugin:2.7:testResources (default-testResources) @ org.eclipse.scout.sdk.core.test ---
12:04:13 [INFO] Using 'UTF-8' encoding to copy filtered resources.
12:04:13 [INFO] skip non existing resourceDirectory /jobs/genie.scout/org.eclipse.scout.sdk.branch-8.0_continuous/workspace/org.eclipse.scout.sdk.core.test/src/test/resources
12:04:13 [INFO] 
12:04:13 [INFO] --- maven-compiler-plugin:3.6.1:testCompile (default-testCompile) @ org.eclipse.scout.sdk.core.test ---
12:04:13 [INFO] Changes detected - recompiling the module!
12:04:13 [INFO] Compiling 29 source files to /jobs/genie.scout/org.eclipse.scout.sdk.branch-8.0_continuous/workspace/org.eclipse.scout.sdk.core.test/target/test-classes
12:04:15 [INFO] 
12:04:15 [INFO] --- maven-surefire-plugin:2.19.1:test (default-test) @ org.eclipse.scout.sdk.core.test ---
12:04:16 
12:04:16 -------------------------------------------------------
12:04:16  T E S T S
12:04:16 -------------------------------------------------------
12:04:16 Picked up JAVA_TOOL_OPTIONS: -Xmx2G -Djava.io.tmpdir=/tmp/genie.scout -DforkCount=1
12:04:16 Running org.eclipse.scout.sdk.core.importvalidator.ImportValidatorTest
12:04:18 Tests run: 15, Failures: 0, Errors: 0, Skipped: 0, Time elapsed: 1.486 sec - in org.eclipse.scout.sdk.core.importvalidator.ImportValidatorTest
12:04:18 Running org.eclipse.scout.sdk.core.model.AnnotationElementTest
12:04:18 Tests run: 3, Failures: 0, Errors: 0, Skipped: 0, Time elapsed: 0.301 sec - in org.eclipse.scout.sdk.core.model.AnnotationElementTest
12:04:18 Running org.eclipse.scout.sdk.core.model.AnnotationQueryTest
12:04:19 Tests run: 4, Failures: 0, Errors: 0, Skipped: 0, Time elapsed: 0.331 sec - in org.eclipse.scout.sdk.core.model.AnnotationQueryTest
12:04:19 Running org.eclipse.scout.sdk.core.model.AnnotationSourceTest
12:04:19 Tests run: 6, Failures: 0, Errors: 0, Skipped: 0, Time elapsed: 0.66 sec - in org.eclipse.scout.sdk.core.model.AnnotationSourceTest
12:04:19 Running org.eclipse.scout.sdk.core.model.AnnotationTest
12:04:23 Tests run: 5, Failures: 0, Errors: 0, Skipped: 0, Time elapsed: 0.478 sec - in org.eclipse.scout.sdk.core.model.AnnotationTest
12:04:23 Running org.eclipse.scout.sdk.core.model.ArrayTypeTest
12:04:23 Tests run: 1, Failures: 0, Errors: 0, Skipped: 0, Time elapsed: 0 sec - in org.eclipse.scout.sdk.core.model.ArrayTypeTest
12:04:23 Running org.eclipse.scout.sdk.core.model.CompilationUnitTest
12:04:23 Tests run: 3, Failures: 0, Errors: 0, Skipped: 0, Time elapsed: 0 sec - in org.eclipse.scout.sdk.core.model.CompilationUnitTest
12:04:23 Running org.eclipse.scout.sdk.core.model.CreateAndOverrideNewCompilationUnitTest
12:04:23 Tests run: 4, Failures: 0, Errors: 0, Skipped: 0, Time elapsed: 0 sec - in org.eclipse.scout.sdk.core.model.CreateAndOverrideNewCompilationUnitTest
12:04:23 Running org.eclipse.scout.sdk.core.model.FieldTest
12:04:23 Tests run: 8, Failures: 0, Errors: 0, Skipped: 0, Time elapsed: 0 sec - in org.eclipse.scout.sdk.core.model.FieldTest
12:04:23 Running org.eclipse.scout.sdk.core.model.GenericMethodTest
12:04:23 Tests run: 7, Failures: 0, Errors: 0, Skipped: 0, Time elapsed: 0 sec - in org.eclipse.scout.sdk.core.model.GenericMethodTest
12:04:23 Running org.eclipse.scout.sdk.core.model.ImportDeclarationTest
12:04:23 Tests run: 2, Failures: 0, Errors: 0, Skipped: 0, Time elapsed: 0.001 sec - in org.eclipse.scout.sdk.core.model.ImportDeclarationTest
12:04:23 Running org.eclipse.scout.sdk.core.model.ManagedAnnotationTest
12:04:23 Tests run: 9, Failures: 0, Errors: 0, Skipped: 0, Time elapsed: 0 sec - in org.eclipse.scout.sdk.core.model.ManagedAnnotationTest
12:04:23 Running org.eclipse.scout.sdk.core.model.MethodParameterTest
12:04:23 Tests run: 3, Failures: 0, Errors: 0, Skipped: 0, Time elapsed: 0 sec - in org.eclipse.scout.sdk.core.model.MethodParameterTest
12:04:23 Running org.eclipse.scout.sdk.core.model.MethodTest
12:04:23 Tests run: 3, Failures: 0, Errors: 0, Skipped: 0, Time elapsed: 0.001 sec - in org.eclipse.scout.sdk.core.model.MethodTest
12:04:23 Running org.eclipse.scout.sdk.core.model.PackageTest
12:04:23 Tests run: 4, Failures: 0, Errors: 0, Skipped: 0, Time elapsed: 0 sec - in org.eclipse.scout.sdk.core.model.PackageTest
12:04:23 Running org.eclipse.scout.sdk.core.model.PrimitiveTypeTest
12:04:23 Tests run: 1, Failures: 0, Errors: 0, Skipped: 0, Time elapsed: 0 sec - in org.eclipse.scout.sdk.core.model.PrimitiveTypeTest
12:04:23 Running org.eclipse.scout.sdk.core.model.SourceRangeTest
12:04:23 Tests run: 1, Failures: 0, Errors: 0, Skipped: 0, Time elapsed: 0 sec - in org.eclipse.scout.sdk.core.model.SourceRangeTest
12:04:23 Running org.eclipse.scout.sdk.core.model.TypeParameterTest
12:04:23 Tests run: 3, Failures: 0, Errors: 0, Skipped: 0, Time elapsed: 0 sec - in org.eclipse.scout.sdk.core.model.TypeParameterTest
12:04:23 Running org.eclipse.scout.sdk.core.model.TypeTest
12:04:23 Tests run: 6, Failures: 0, Errors: 0, Skipped: 0, Time elapsed: 0 sec - in org.eclipse.scout.sdk.core.model.TypeTest
12:04:23 Running org.eclipse.scout.sdk.core.model.spi.internal.ClasspathBuilderTest
12:04:23 Tests run: 2, Failures: 0, Errors: 0, Skipped: 0, Time elapsed: 0 sec - in org.eclipse.scout.sdk.core.model.spi.internal.ClasspathBuilderTest
12:04:23 Running org.eclipse.scout.sdk.core.model.spi.internal.CompositeObjectTest
12:04:23 Tests run: 2, Failures: 0, Errors: 0, Skipped: 0, Time elapsed: 0 sec - in org.eclipse.scout.sdk.core.model.spi.internal.CompositeObjectTest
12:04:23 Running org.eclipse.scout.sdk.core.model.spi.internal.metavalue.MetaValueFactoryTest
12:04:23 Tests run: 17, Failures: 0, Errors: 0, Skipped: 0, Time elapsed: 0 sec - in org.eclipse.scout.sdk.core.model.spi.internal.metavalue.MetaValueFactoryTest
12:04:23 Running org.eclipse.scout.sdk.core.model.sugar.QueryTest
12:04:23 Tests run: 7, Failures: 0, Errors: 0, Skipped: 0, Time elapsed: 0 sec - in org.eclipse.scout.sdk.core.model.sugar.QueryTest
12:04:23 Running org.eclipse.scout.sdk.core.signature.SignatureTest
12:04:23 Tests run: 189, Failures: 0, Errors: 0, Skipped: 0, Time elapsed: 0.008 sec - in org.eclipse.scout.sdk.core.signature.SignatureTest
12:04:23 Running org.eclipse.scout.sdk.core.signature.SignatureUtilsTest
12:04:23 Tests run: 12, Failures: 0, Errors: 0, Skipped: 0, Time elapsed: 0.001 sec - in org.eclipse.scout.sdk.core.signature.SignatureUtilsTest
12:04:23 Running org.eclipse.scout.sdk.core.sourcebuilder.SourceModelRoundtripTest
12:04:23 Tests run: 2, Failures: 0, Errors: 0, Skipped: 0, Time elapsed: 0 sec - in org.eclipse.scout.sdk.core.sourcebuilder.SourceModelRoundtripTest
12:04:23 Running org.eclipse.scout.sdk.core.util.CoreUtilsTest
12:04:23 Tests run: 39, Failures: 0, Errors: 0, Skipped: 0, Time elapsed: 0.375 sec - in org.eclipse.scout.sdk.core.util.CoreUtilsTest
12:04:23 Running org.eclipse.scout.sdk.core.util.JavaEnvironmentImportExportTest
12:04:23 Tests run: 1, Failures: 0, Errors: 0, Skipped: 0, Time elapsed: 0.008 sec - in org.eclipse.scout.sdk.core.util.JavaEnvironmentImportExportTest
12:04:23 Running org.eclipse.scout.sdk.core.util.SdkLogTest
12:04:23 Unable to parse log level 'aa'. Fallback to default: 'WARNING'.
12:04:23 java.lang.IllegalArgumentException: Bad level "aa"
12:04:23 	at java.util.logging.Level.parse(Level.java:488)
12:04:23 	at org.eclipse.scout.sdk.core.util.SdkLog.parseLevel(SdkLog.java:424)
12:04:23 	at org.eclipse.scout.sdk.core.util.SdkLogTest.testParseLevel(SdkLogTest.java:96)
12:04:23 	at sun.reflect.NativeMethodAccessorImpl.invoke0(Native Method)
12:04:23 	at sun.reflect.NativeMethodAccessorImpl.invoke(NativeMethodAccessorImpl.java:62)
12:04:23 	at sun.reflect.DelegatingMethodAccessorImpl.invoke(DelegatingMethodAccessorImpl.java:43)
12:04:23 	at java.lang.reflect.Method.invoke(Method.java:498)
12:04:23 	at org.junit.runners.model.FrameworkMethod$1.runReflectiveCall(FrameworkMethod.java:50)
12:04:23 	at org.junit.internal.runners.model.ReflectiveCallable.run(ReflectiveCallable.java:12)
12:04:23 	at org.junit.runners.model.FrameworkMethod.invokeExplosively(FrameworkMethod.java:47)
12:04:23 	at org.junit.internal.runners.statements.InvokeMethod.evaluate(InvokeMethod.java:17)
12:04:23 	at org.junit.runners.ParentRunner.runLeaf(ParentRunner.java:325)
12:04:23 	at org.junit.runners.BlockJUnit4ClassRunner.runChild(BlockJUnit4ClassRunner.java:78)
12:04:23 	at org.junit.runners.BlockJUnit4ClassRunner.runChild(BlockJUnit4ClassRunner.java:57)
12:04:23 	at org.junit.runners.ParentRunner$3.run(ParentRunner.java:290)
12:04:23 	at org.junit.runners.ParentRunner$1.schedule(ParentRunner.java:71)
12:04:23 	at org.junit.runners.ParentRunner.runChildren(ParentRunner.java:288)
12:04:23 	at org.junit.runners.ParentRunner.access$000(ParentRunner.java:58)
12:04:23 	at org.junit.runners.ParentRunner$2.evaluate(ParentRunner.java:268)
12:04:23 	at org.junit.runners.ParentRunner.run(ParentRunner.java:363)
12:04:23 	at org.apache.maven.surefire.junit4.JUnit4Provider.execute(JUnit4Provider.java:367)
12:04:23 	at org.apache.maven.surefire.junit4.JUnit4Provider.executeWithRerun(JUnit4Provider.java:274)
12:04:23 	at org.apache.maven.surefire.junit4.JUnit4Provider.executeTestSet(JUnit4Provider.java:238)
12:04:23 	at org.apache.maven.surefire.junit4.JUnit4Provider.invoke(JUnit4Provider.java:161)
12:04:23 	at org.apache.maven.surefire.booter.ForkedBooter.invokeProviderInSameClassLoader(ForkedBooter.java:290)
12:04:23 	at org.apache.maven.surefire.booter.ForkedBooter.runSuitesInProcess(ForkedBooter.java:242)
12:04:23 	at org.apache.maven.surefire.booter.ForkedBooter.main(ForkedBooter.java:121)
12:04:23 Scout SdkLog: Failed toString() invocation on an object of type [org.eclipse.scout.sdk.core.util.SdkLogTest$ClassWithToStringThrowingNpeFixture]
12:04:23 java.lang.NullPointerException: NPE of test class org.eclipse.scout.sdk.core.util.SdkLogTest
12:04:23 	at org.eclipse.scout.sdk.core.util.SdkLogTest$ClassWithToStringThrowingNpeFixture.toString(SdkLogTest.java:156)
12:04:23 	at org.eclipse.scout.sdk.core.util.SdkLog.safeObjectToString(SdkLog.java:223)
12:04:23 	at org.eclipse.scout.sdk.core.util.SdkLog.toString(SdkLog.java:159)
12:04:23 	at org.eclipse.scout.sdk.core.util.SdkLog.handlePlaceholders(SdkLog.java:149)
12:04:23 	at org.eclipse.scout.sdk.core.util.SdkLog.log(SdkLog.java:93)
12:04:23 	at org.eclipse.scout.sdk.core.util.SdkLog.error(SdkLog.java:317)
12:04:23 	at org.eclipse.scout.sdk.core.util.SdkLogTest$1.run(SdkLogTest.java:104)
12:04:23 	at org.eclipse.scout.sdk.core.util.SdkLogTest.runWithPrivateLogger(SdkLogTest.java:193)
12:04:23 	at org.eclipse.scout.sdk.core.util.SdkLogTest.testLogOfObjectWithToStringThrowingException(SdkLogTest.java:101)
12:04:23 	at sun.reflect.NativeMethodAccessorImpl.invoke0(Native Method)
12:04:23 	at sun.reflect.NativeMethodAccessorImpl.invoke(NativeMethodAccessorImpl.java:62)
12:04:23 	at sun.reflect.DelegatingMethodAccessorImpl.invoke(DelegatingMethodAccessorImpl.java:43)
12:04:23 	at java.lang.reflect.Method.invoke(Method.java:498)
12:04:23 	at org.junit.runners.model.FrameworkMethod$1.runReflectiveCall(FrameworkMethod.java:50)
12:04:23 	at org.junit.internal.runners.model.ReflectiveCallable.run(ReflectiveCallable.java:12)
12:04:23 	at org.junit.runners.model.FrameworkMethod.invokeExplosively(FrameworkMethod.java:47)
12:04:23 	at org.junit.internal.runners.statements.InvokeMethod.evaluate(InvokeMethod.java:17)
12:04:23 	at org.junit.runners.ParentRunner.runLeaf(ParentRunner.java:325)
12:04:23 	at org.junit.runners.BlockJUnit4ClassRunner.runChild(BlockJUnit4ClassRunner.java:78)
12:04:23 	at org.junit.runners.BlockJUnit4ClassRunner.runChild(BlockJUnit4ClassRunner.java:57)
12:04:23 	at org.junit.runners.ParentRunner$3.run(ParentRunner.java:290)
12:04:23 	at org.junit.runners.ParentRunner$1.schedule(ParentRunner.java:71)
12:04:23 	at org.junit.runners.ParentRunner.runChildren(ParentRunner.java:288)
12:04:23 	at org.junit.runners.ParentRunner.access$000(ParentRunner.java:58)
12:04:23 	at org.junit.runners.ParentRunner$2.evaluate(ParentRunner.java:268)
12:04:23 	at org.junit.runners.ParentRunner.run(ParentRunner.java:363)
12:04:23 	at org.apache.maven.surefire.junit4.JUnit4Provider.execute(JUnit4Provider.java:367)
12:04:23 	at org.apache.maven.surefire.junit4.JUnit4Provider.executeWithRerun(JUnit4Provider.java:274)
12:04:23 	at org.apache.maven.surefire.junit4.JUnit4Provider.executeTestSet(JUnit4Provider.java:238)
12:04:23 	at org.apache.maven.surefire.junit4.JUnit4Provider.invoke(JUnit4Provider.java:161)
12:04:23 	at org.apache.maven.surefire.booter.ForkedBooter.invokeProviderInSameClassLoader(ForkedBooter.java:290)
12:04:23 	at org.apache.maven.surefire.booter.ForkedBooter.runSuitesInProcess(ForkedBooter.java:242)
12:04:23 	at org.apache.maven.surefire.booter.ForkedBooter.main(ForkedBooter.java:121)
12:04:23 Tests run: 5, Failures: 0, Errors: 0, Skipped: 0, Time elapsed: 0.016 sec - in org.eclipse.scout.sdk.core.util.SdkLogTest
12:04:24 
12:04:24 Results :
12:04:24 
12:04:24 Tests run: 364, Failures: 0, Errors: 0, Skipped: 0
12:04:24 
12:04:24 [INFO] 
12:04:24 [INFO] --- maven-jar-plugin:2.6:jar (default-jar) @ org.eclipse.scout.sdk.core.test ---
12:04:24 [INFO] Building jar: /jobs/genie.scout/org.eclipse.scout.sdk.branch-8.0_continuous/workspace/org.eclipse.scout.sdk.core.test/target/org.eclipse.scout.sdk.core.test-8.0.0-SNAPSHOT.jar
12:04:24 [INFO] 
12:04:24 [INFO] --- maven-site-plugin:3.6:attach-descriptor (attach-descriptor) @ org.eclipse.scout.sdk.core.test ---
12:04:24 [INFO] Skipping because packaging 'jar' is not pom.
12:04:24 [INFO] 
12:04:24 [INFO] --- maven-jar-plugin:2.6:test-jar (attach-tests) @ org.eclipse.scout.sdk.core.test ---
12:04:24 [INFO] Building jar: /jobs/genie.scout/org.eclipse.scout.sdk.branch-8.0_continuous/workspace/org.eclipse.scout.sdk.core.test/target/org.eclipse.scout.sdk.core.test-8.0.0-SNAPSHOT-tests.jar
12:04:24 [INFO] 
12:04:24 [INFO] --- maven-source-plugin:2.4:test-jar-no-fork (attach-test-sources) @ org.eclipse.scout.sdk.core.test ---
12:04:24 [INFO] Building jar: /jobs/genie.scout/org.eclipse.scout.sdk.branch-8.0_continuous/workspace/org.eclipse.scout.sdk.core.test/target/org.eclipse.scout.sdk.core.test-8.0.0-SNAPSHOT-test-sources.jar
12:04:24 [INFO] 
12:04:24 [INFO] --- duplicate-finder-maven-plugin:1.2.1:check (default) @ org.eclipse.scout.sdk.core.test ---
12:04:24 [INFO] Checking compile classpath
12:04:24 [INFO] Checking runtime classpath
12:04:24 [INFO] Checking test classpath
12:04:24 [INFO] 
12:04:24 [INFO] --- animal-sniffer-maven-plugin:1.15:check (enforce-java-api-compatibility) @ org.eclipse.scout.sdk.core.test ---
12:04:24 [INFO] Checking unresolved references to org.kaazing.mojo.signature:java18:1.0
12:04:24 [INFO] 
12:04:24 [INFO] --- maven-source-plugin:2.4:jar-no-fork (attach-sources) @ org.eclipse.scout.sdk.core.test ---
12:04:24 [INFO] Building jar: /jobs/genie.scout/org.eclipse.scout.sdk.branch-8.0_continuous/workspace/org.eclipse.scout.sdk.core.test/target/org.eclipse.scout.sdk.core.test-8.0.0-SNAPSHOT-sources.jar
12:04:24 [INFO] 
12:04:24 [INFO] --- eclipse-jarsigner-plugin:1.1.2:sign (sign) @ org.eclipse.scout.sdk.core.test ---
12:04:24 [INFO] Skipping artifact signing
12:04:24 [INFO] 
12:04:24 [INFO] --- maven-install-plugin:2.5.2:install (default-install) @ org.eclipse.scout.sdk.core.test ---
12:04:24 [INFO] Installing /jobs/genie.scout/org.eclipse.scout.sdk.branch-8.0_continuous/workspace/org.eclipse.scout.sdk.core.test/target/org.eclipse.scout.sdk.core.test-8.0.0-SNAPSHOT.jar to /home/hudson/genie.scout/.jenkins/jobs/org.eclipse.scout.sdk.branch-8.0_continuous/workspace/.repository/org/eclipse/scout/sdk/org.eclipse.scout.sdk.core.test/8.0.0-SNAPSHOT/org.eclipse.scout.sdk.core.test-8.0.0-SNAPSHOT.jar
12:04:24 [INFO] Installing /jobs/genie.scout/org.eclipse.scout.sdk.branch-8.0_continuous/workspace/org.eclipse.scout.sdk.core.test/pom.xml to /home/hudson/genie.scout/.jenkins/jobs/org.eclipse.scout.sdk.branch-8.0_continuous/workspace/.repository/org/eclipse/scout/sdk/org.eclipse.scout.sdk.core.test/8.0.0-SNAPSHOT/org.eclipse.scout.sdk.core.test-8.0.0-SNAPSHOT.pom
12:04:24 [INFO] Installing /jobs/genie.scout/org.eclipse.scout.sdk.branch-8.0_continuous/workspace/org.eclipse.scout.sdk.core.test/target/org.eclipse.scout.sdk.core.test-8.0.0-SNAPSHOT-tests.jar to /home/hudson/genie.scout/.jenkins/jobs/org.eclipse.scout.sdk.branch-8.0_continuous/workspace/.repository/org/eclipse/scout/sdk/org.eclipse.scout.sdk.core.test/8.0.0-SNAPSHOT/org.eclipse.scout.sdk.core.test-8.0.0-SNAPSHOT-tests.jar
12:04:24 [INFO] Installing /jobs/genie.scout/org.eclipse.scout.sdk.branch-8.0_continuous/workspace/org.eclipse.scout.sdk.core.test/target/org.eclipse.scout.sdk.core.test-8.0.0-SNAPSHOT-test-sources.jar to /home/hudson/genie.scout/.jenkins/jobs/org.eclipse.scout.sdk.branch-8.0_continuous/workspace/.repository/org/eclipse/scout/sdk/org.eclipse.scout.sdk.core.test/8.0.0-SNAPSHOT/org.eclipse.scout.sdk.core.test-8.0.0-SNAPSHOT-test-sources.jar
12:04:24 [INFO] Installing /jobs/genie.scout/org.eclipse.scout.sdk.branch-8.0_continuous/workspace/org.eclipse.scout.sdk.core.test/target/org.eclipse.scout.sdk.core.test-8.0.0-SNAPSHOT-sources.jar to /home/hudson/genie.scout/.jenkins/jobs/org.eclipse.scout.sdk.branch-8.0_continuous/workspace/.repository/org/eclipse/scout/sdk/org.eclipse.scout.sdk.core.test/8.0.0-SNAPSHOT/org.eclipse.scout.sdk.core.test-8.0.0-SNAPSHOT-sources.jar
12:04:24 [INFO] 
12:04:24 [INFO] ---------< org.eclipse.scout.sdk:org.eclipse.scout.sdk.core.s >---------
12:04:24 [INFO] Building org.eclipse.scout.sdk:org.eclipse.scout.sdk.core.s 8.0.0-SNAPSHOT [7/15]
12:04:24 [INFO] --------------------------------[ jar ]---------------------------------
12:04:24 [INFO] 
12:04:24 [INFO] --- maven-clean-plugin:3.0.0:clean (default-clean) @ org.eclipse.scout.sdk.core.s ---
12:04:24 [INFO] Deleting /jobs/genie.scout/org.eclipse.scout.sdk.branch-8.0_continuous/workspace/org.eclipse.scout.sdk.core.s/target
12:04:24 [INFO] 
12:04:24 [INFO] --- maven-enforcer-plugin:1.4.1:enforce (enforce-rules) @ org.eclipse.scout.sdk.core.s ---
12:04:24 [INFO] 
12:04:24 [INFO] --- git-commit-id-plugin:2.2.2:revision (default) @ org.eclipse.scout.sdk.core.s ---
12:04:25 [INFO] 
12:04:25 [INFO] --- jacoco-maven-plugin:0.7.9:prepare-agent (default) @ org.eclipse.scout.sdk.core.s ---
12:04:25 [INFO] master_test_jacocoArgLine set to -javaagent:/home/hudson/genie.scout/.jenkins/jobs/org.eclipse.scout.sdk.branch-8.0_continuous/workspace/.repository/org/jacoco/org.jacoco.agent/0.7.9/org.jacoco.agent-0.7.9-runtime.jar=destfile=/jobs/genie.scout/org.eclipse.scout.sdk.branch-8.0_continuous/workspace/org.eclipse.scout.sdk.core.s/../org.eclipse.scout.sdk/target/jacoco-all.exec
12:04:25 [INFO] 
12:04:25 [INFO] --- build-helper-maven-plugin:1.12:parse-version (initialize-parse-version) @ org.eclipse.scout.sdk.core.s ---
12:04:25 [INFO] 
12:04:25 [INFO] --- build-helper-maven-plugin:1.12:regex-property (initialize-regex) @ org.eclipse.scout.sdk.core.s ---
12:04:25 [INFO] 
12:04:25 [INFO] --- maven-resources-plugin:2.7:resources (default-resources) @ org.eclipse.scout.sdk.core.s ---
12:04:25 [INFO] Using 'UTF-8' encoding to copy filtered resources.
12:04:25 [INFO] skip non existing resourceDirectory /jobs/genie.scout/org.eclipse.scout.sdk.branch-8.0_continuous/workspace/org.eclipse.scout.sdk.core.s/src/main/resources
12:04:25 [INFO] Copying 2 resources
12:04:25 [INFO] 
12:04:25 [INFO] --- maven-compiler-plugin:3.6.1:compile (default-compile) @ org.eclipse.scout.sdk.core.s ---
12:04:25 [INFO] Changes detected - recompiling the module!
12:04:25 [INFO] Compiling 50 source files to /jobs/genie.scout/org.eclipse.scout.sdk.branch-8.0_continuous/workspace/org.eclipse.scout.sdk.core.s/target/classes
12:04:26 [INFO] 
12:04:26 [INFO] --- maven-resources-plugin:2.7:testResources (default-testResources) @ org.eclipse.scout.sdk.core.s ---
12:04:26 [INFO] Using 'UTF-8' encoding to copy filtered resources.
12:04:26 [INFO] skip non existing resourceDirectory /jobs/genie.scout/org.eclipse.scout.sdk.branch-8.0_continuous/workspace/org.eclipse.scout.sdk.core.s/src/test/resources
12:04:26 [INFO] 
12:04:26 [INFO] --- maven-compiler-plugin:3.6.1:testCompile (default-testCompile) @ org.eclipse.scout.sdk.core.s ---
12:04:26 [INFO] No sources to compile
12:04:26 [INFO] 
12:04:26 [INFO] --- maven-surefire-plugin:2.19.1:test (default-test) @ org.eclipse.scout.sdk.core.s ---
12:04:26 [INFO] No tests to run.
12:04:26 [INFO] 
12:04:26 [INFO] --- maven-jar-plugin:2.6:jar (default-jar) @ org.eclipse.scout.sdk.core.s ---
12:04:26 [INFO] Building jar: /jobs/genie.scout/org.eclipse.scout.sdk.branch-8.0_continuous/workspace/org.eclipse.scout.sdk.core.s/target/org.eclipse.scout.sdk.core.s-8.0.0-SNAPSHOT.jar
12:04:26 [INFO] 
12:04:26 [INFO] --- maven-site-plugin:3.6:attach-descriptor (attach-descriptor) @ org.eclipse.scout.sdk.core.s ---
12:04:26 [INFO] Skipping because packaging 'jar' is not pom.
12:04:26 [INFO] 
12:04:26 [INFO] --- maven-jar-plugin:2.6:test-jar (attach-tests) @ org.eclipse.scout.sdk.core.s ---
12:04:26 [INFO] Skipping packaging of the test-jar
12:04:26 [INFO] 
12:04:26 [INFO] --- maven-source-plugin:2.4:test-jar-no-fork (attach-test-sources) @ org.eclipse.scout.sdk.core.s ---
12:04:26 [INFO] No sources in project. Archive not created.
12:04:26 [INFO] 
12:04:26 [INFO] --- duplicate-finder-maven-plugin:1.2.1:check (default) @ org.eclipse.scout.sdk.core.s ---
12:04:26 [INFO] Checking compile classpath
12:04:27 [INFO] Checking runtime classpath
12:04:27 [INFO] Checking test classpath
12:04:27 [INFO] 
12:04:27 [INFO] --- animal-sniffer-maven-plugin:1.15:check (enforce-java-api-compatibility) @ org.eclipse.scout.sdk.core.s ---
12:04:27 [INFO] Checking unresolved references to org.kaazing.mojo.signature:java18:1.0
12:04:28 [INFO] 
12:04:28 [INFO] --- maven-source-plugin:2.4:jar-no-fork (attach-sources) @ org.eclipse.scout.sdk.core.s ---
12:04:28 [INFO] Building jar: /jobs/genie.scout/org.eclipse.scout.sdk.branch-8.0_continuous/workspace/org.eclipse.scout.sdk.core.s/target/org.eclipse.scout.sdk.core.s-8.0.0-SNAPSHOT-sources.jar
12:04:28 [INFO] 
12:04:28 [INFO] --- eclipse-jarsigner-plugin:1.1.2:sign (sign) @ org.eclipse.scout.sdk.core.s ---
12:04:28 [INFO] Skipping artifact signing
12:04:28 [INFO] 
12:04:28 [INFO] --- maven-install-plugin:2.5.2:install (default-install) @ org.eclipse.scout.sdk.core.s ---
12:04:28 [INFO] Installing /jobs/genie.scout/org.eclipse.scout.sdk.branch-8.0_continuous/workspace/org.eclipse.scout.sdk.core.s/target/org.eclipse.scout.sdk.core.s-8.0.0-SNAPSHOT.jar to /home/hudson/genie.scout/.jenkins/jobs/org.eclipse.scout.sdk.branch-8.0_continuous/workspace/.repository/org/eclipse/scout/sdk/org.eclipse.scout.sdk.core.s/8.0.0-SNAPSHOT/org.eclipse.scout.sdk.core.s-8.0.0-SNAPSHOT.jar
12:04:28 [INFO] Installing /jobs/genie.scout/org.eclipse.scout.sdk.branch-8.0_continuous/workspace/org.eclipse.scout.sdk.core.s/pom.xml to /home/hudson/genie.scout/.jenkins/jobs/org.eclipse.scout.sdk.branch-8.0_continuous/workspace/.repository/org/eclipse/scout/sdk/org.eclipse.scout.sdk.core.s/8.0.0-SNAPSHOT/org.eclipse.scout.sdk.core.s-8.0.0-SNAPSHOT.pom
12:04:28 [INFO] Installing /jobs/genie.scout/org.eclipse.scout.sdk.branch-8.0_continuous/workspace/org.eclipse.scout.sdk.core.s/target/org.eclipse.scout.sdk.core.s-8.0.0-SNAPSHOT-sources.jar to /home/hudson/genie.scout/.jenkins/jobs/org.eclipse.scout.sdk.branch-8.0_continuous/workspace/.repository/org/eclipse/scout/sdk/org.eclipse.scout.sdk.core.s/8.0.0-SNAPSHOT/org.eclipse.scout.sdk.core.s-8.0.0-SNAPSHOT-sources.jar
12:04:28 [INFO] 
12:04:28 [INFO] ------< org.eclipse.scout.sdk:org.eclipse.scout.sdk.core.s.test >-------
12:04:28 [INFO] Building org.eclipse.scout.sdk:org.eclipse.scout.sdk.core.s.test 8.0.0-SNAPSHOT [8/15]
12:04:28 [INFO] --------------------------------[ jar ]---------------------------------
12:04:28 [INFO] Downloading from eclipse.snapshot: https://repo.eclipse.org/content/groups/snapshots/org/eclipse/scout/rt/org.eclipse.scout.rt.ui.html.test/8.0.0-SNAPSHOT/maven-metadata.xml
12:04:28 [INFO] Downloaded from eclipse.snapshot: https://repo.eclipse.org/content/groups/snapshots/org/eclipse/scout/rt/org.eclipse.scout.rt.ui.html.test/8.0.0-SNAPSHOT/maven-metadata.xml (1.5 kB at 6.1 kB/s)
12:04:28 [INFO] Downloading from eclipse.snapshot: https://repo.eclipse.org/content/groups/snapshots/org/eclipse/scout/rt/org.eclipse.scout.rt.ui.html.test/8.0.0-SNAPSHOT/org.eclipse.scout.rt.ui.html.test-8.0.0-20191111.233536-163.pom
12:04:29 [INFO] Downloaded from eclipse.snapshot: https://repo.eclipse.org/content/groups/snapshots/org/eclipse/scout/rt/org.eclipse.scout.rt.ui.html.test/8.0.0-SNAPSHOT/org.eclipse.scout.rt.ui.html.test-8.0.0-20191111.233536-163.pom (3.6 kB at 3.6 kB/s)
12:04:29 [INFO] Downloading from eclipse.snapshot: https://repo.eclipse.org/content/groups/snapshots/org/eclipse/scout/rt/org.eclipse.scout.rt.ui.html/8.0.0-SNAPSHOT/maven-metadata.xml
12:04:31 [INFO] Downloaded from eclipse.snapshot: https://repo.eclipse.org/content/groups/snapshots/org/eclipse/scout/rt/org.eclipse.scout.rt.ui.html/8.0.0-SNAPSHOT/maven-metadata.xml (1.0 kB at 557 B/s)
12:04:31 [INFO] Downloading from eclipse.snapshot: https://repo.eclipse.org/content/groups/snapshots/org/eclipse/scout/rt/org.eclipse.scout.rt.ui.html/8.0.0-SNAPSHOT/org.eclipse.scout.rt.ui.html-8.0.0-20191111.233523-163.pom
12:04:32 [INFO] Downloaded from eclipse.snapshot: https://repo.eclipse.org/content/groups/snapshots/org/eclipse/scout/rt/org.eclipse.scout.rt.ui.html/8.0.0-SNAPSHOT/org.eclipse.scout.rt.ui.html-8.0.0-20191111.233523-163.pom (2.3 kB at 1.9 kB/s)
12:04:32 [INFO] Downloading from eclipse.snapshot: https://repo.eclipse.org/content/groups/snapshots/org/eclipse/scout/rt/org.eclipse.scout.rt.server.commons/8.0.0-SNAPSHOT/maven-metadata.xml
12:04:32 [INFO] Downloaded from eclipse.snapshot: https://repo.eclipse.org/content/groups/snapshots/org/eclipse/scout/rt/org.eclipse.scout.rt.server.commons/8.0.0-SNAPSHOT/maven-metadata.xml (1.0 kB at 15 kB/s)
12:04:32 [INFO] Downloading from eclipse.snapshot: https://repo.eclipse.org/content/groups/snapshots/org/eclipse/scout/rt/org.eclipse.scout.rt.server.commons/8.0.0-SNAPSHOT/org.eclipse.scout.rt.server.commons-8.0.0-20191111.233109-163.pom
12:04:33 [INFO] Downloaded from eclipse.snapshot: https://repo.eclipse.org/content/groups/snapshots/org/eclipse/scout/rt/org.eclipse.scout.rt.server.commons/8.0.0-SNAPSHOT/org.eclipse.scout.rt.server.commons-8.0.0-20191111.233109-163.pom (1.4 kB at 26 kB/s)
12:04:33 [INFO] Downloading from eclipse.snapshot: https://repo.eclipse.org/content/groups/snapshots/org/eclipse/scout/rt/org.eclipse.scout.rt.shared/8.0.0-SNAPSHOT/maven-metadata.xml
12:04:33 [INFO] Downloaded from eclipse.snapshot: https://repo.eclipse.org/content/groups/snapshots/org/eclipse/scout/rt/org.eclipse.scout.rt.shared/8.0.0-SNAPSHOT/maven-metadata.xml (1.0 kB at 15 kB/s)
12:04:33 [INFO] Downloading from eclipse.snapshot: https://repo.eclipse.org/content/groups/snapshots/org/eclipse/scout/rt/org.eclipse.scout.rt.shared/8.0.0-SNAPSHOT/org.eclipse.scout.rt.shared-8.0.0-20191111.233052-163.pom
12:04:33 [INFO] Downloaded from eclipse.snapshot: https://repo.eclipse.org/content/groups/snapshots/org/eclipse/scout/rt/org.eclipse.scout.rt.shared/8.0.0-SNAPSHOT/org.eclipse.scout.rt.shared-8.0.0-20191111.233052-163.pom (2.0 kB at 27 kB/s)
12:04:33 [INFO] Downloading from eclipse.snapshot: https://repo.eclipse.org/content/groups/snapshots/org/eclipse/scout/rt/org.eclipse.scout.rt.platform/8.0.0-SNAPSHOT/maven-metadata.xml
12:04:33 [INFO] Downloaded from eclipse.snapshot: https://repo.eclipse.org/content/groups/snapshots/org/eclipse/scout/rt/org.eclipse.scout.rt.platform/8.0.0-SNAPSHOT/maven-metadata.xml (1.0 kB at 10 kB/s)
12:04:33 [INFO] Downloading from eclipse.snapshot: https://repo.eclipse.org/content/groups/snapshots/org/eclipse/scout/rt/org.eclipse.scout.rt.platform/8.0.0-SNAPSHOT/org.eclipse.scout.rt.platform-8.0.0-20191111.233023-163.pom
12:04:33 [INFO] Downloaded from eclipse.snapshot: https://repo.eclipse.org/content/groups/snapshots/org/eclipse/scout/rt/org.eclipse.scout.rt.platform/8.0.0-SNAPSHOT/org.eclipse.scout.rt.platform-8.0.0-20191111.233023-163.pom (3.3 kB at 80 kB/s)
12:04:33 [INFO] Downloading from eclipse.snapshot: https://repo.eclipse.org/content/groups/snapshots/org/eclipse/scout/rt/org.eclipse.scout.rt.mail/8.0.0-SNAPSHOT/maven-metadata.xml
12:04:33 [INFO] Downloaded from eclipse.snapshot: https://repo.eclipse.org/content/groups/snapshots/org/eclipse/scout/rt/org.eclipse.scout.rt.mail/8.0.0-SNAPSHOT/maven-metadata.xml (1.0 kB at 11 kB/s)
12:04:33 [INFO] Downloading from eclipse.snapshot: https://repo.eclipse.org/content/groups/snapshots/org/eclipse/scout/rt/org.eclipse.scout.rt.mail/8.0.0-SNAPSHOT/org.eclipse.scout.rt.mail-8.0.0-20191111.233042-163.pom
12:04:33 [INFO] Downloaded from eclipse.snapshot: https://repo.eclipse.org/content/groups/snapshots/org/eclipse/scout/rt/org.eclipse.scout.rt.mail/8.0.0-SNAPSHOT/org.eclipse.scout.rt.mail-8.0.0-20191111.233042-163.pom (1.4 kB at 34 kB/s)
12:04:33 [INFO] Downloading from eclipse.snapshot: https://repo.eclipse.org/content/groups/snapshots/org/eclipse/scout/rt/org.eclipse.scout.rt.client/8.0.0-SNAPSHOT/maven-metadata.xml
12:04:33 [INFO] Downloaded from eclipse.snapshot: https://repo.eclipse.org/content/groups/snapshots/org/eclipse/scout/rt/org.eclipse.scout.rt.client/8.0.0-SNAPSHOT/maven-metadata.xml (1.0 kB at 11 kB/s)
12:04:33 [INFO] Downloading from eclipse.snapshot: https://repo.eclipse.org/content/groups/snapshots/org/eclipse/scout/rt/org.eclipse.scout.rt.client/8.0.0-SNAPSHOT/org.eclipse.scout.rt.client-8.0.0-20191111.233416-163.pom
12:04:33 [INFO] Downloaded from eclipse.snapshot: https://repo.eclipse.org/content/groups/snapshots/org/eclipse/scout/rt/org.eclipse.scout.rt.client/8.0.0-SNAPSHOT/org.eclipse.scout.rt.client-8.0.0-20191111.233416-163.pom (1.3 kB at 23 kB/s)
12:04:33 [INFO] Downloading from eclipse.snapshot: https://repo.eclipse.org/content/groups/snapshots/org/eclipse/scout/rt/org.eclipse.scout.rt.ui.html.scriptprocessor/8.0.0-SNAPSHOT/maven-metadata.xml
12:04:33 [INFO] Downloaded from eclipse.snapshot: https://repo.eclipse.org/content/groups/snapshots/org/eclipse/scout/rt/org.eclipse.scout.rt.ui.html.scriptprocessor/8.0.0-SNAPSHOT/maven-metadata.xml (1.0 kB at 15 kB/s)
12:04:33 [INFO] Downloading from eclipse.snapshot: https://repo.eclipse.org/content/groups/snapshots/org/eclipse/scout/rt/org.eclipse.scout.rt.ui.html.scriptprocessor/8.0.0-SNAPSHOT/org.eclipse.scout.rt.ui.html.scriptprocessor-8.0.0-20191111.233512-163.pom
12:04:33 [INFO] Downloaded from eclipse.snapshot: https://repo.eclipse.org/content/groups/snapshots/org/eclipse/scout/rt/org.eclipse.scout.rt.ui.html.scriptprocessor/8.0.0-SNAPSHOT/org.eclipse.scout.rt.ui.html.scriptprocessor-8.0.0-20191111.233512-163.pom (3.4 kB at 91 kB/s)
12:04:33 [INFO] Downloading from eclipse.snapshot: https://repo.eclipse.org/content/groups/snapshots/org/eclipse/scout/rt/org.eclipse.scout.json/8.0.0-SNAPSHOT/maven-metadata.xml
12:04:34 [INFO] Downloaded from eclipse.snapshot: https://repo.eclipse.org/content/groups/snapshots/org/eclipse/scout/rt/org.eclipse.scout.json/8.0.0-SNAPSHOT/maven-metadata.xml (1.4 kB at 20 kB/s)
12:04:34 [INFO] Downloading from eclipse.snapshot: https://repo.eclipse.org/content/groups/snapshots/org/eclipse/scout/rt/org.eclipse.scout.json/8.0.0-SNAPSHOT/org.eclipse.scout.json-8.0.0-20191111.233013-163.pom
12:04:34 [INFO] Downloaded from eclipse.snapshot: https://repo.eclipse.org/content/groups/snapshots/org/eclipse/scout/rt/org.eclipse.scout.json/8.0.0-SNAPSHOT/org.eclipse.scout.json-8.0.0-20191111.233013-163.pom (2.1 kB at 35 kB/s)
12:04:34 [INFO] Downloading from eclipse.snapshot: https://repo.eclipse.org/content/groups/snapshots/org/eclipse/scout/rt/org.eclipse.scout.rt.client.test/8.0.0-SNAPSHOT/maven-metadata.xml
12:04:34 [INFO] Downloaded from eclipse.snapshot: https://repo.eclipse.org/content/groups/snapshots/org/eclipse/scout/rt/org.eclipse.scout.rt.client.test/8.0.0-SNAPSHOT/maven-metadata.xml (1.5 kB at 23 kB/s)
12:04:34 [INFO] Downloading from eclipse.snapshot: https://repo.eclipse.org/content/groups/snapshots/org/eclipse/scout/rt/org.eclipse.scout.rt.client.test/8.0.0-SNAPSHOT/org.eclipse.scout.rt.client.test-8.0.0-20191111.233429-163.pom
12:04:34 [INFO] Downloaded from eclipse.snapshot: https://repo.eclipse.org/content/groups/snapshots/org/eclipse/scout/rt/org.eclipse.scout.rt.client.test/8.0.0-SNAPSHOT/org.eclipse.scout.rt.client.test-8.0.0-20191111.233429-163.pom (1.7 kB at 43 kB/s)
12:04:34 [INFO] Downloading from eclipse.snapshot: https://repo.eclipse.org/content/groups/snapshots/org/eclipse/scout/rt/org.eclipse.scout.rt.shared.test/8.0.0-SNAPSHOT/maven-metadata.xml
12:04:34 [INFO] Downloaded from eclipse.snapshot: https://repo.eclipse.org/content/groups/snapshots/org/eclipse/scout/rt/org.eclipse.scout.rt.shared.test/8.0.0-SNAPSHOT/maven-metadata.xml (1.5 kB at 23 kB/s)
12:04:34 [INFO] Downloading from eclipse.snapshot: https://repo.eclipse.org/content/groups/snapshots/org/eclipse/scout/rt/org.eclipse.scout.rt.shared.test/8.0.0-SNAPSHOT/org.eclipse.scout.rt.shared.test-8.0.0-20191111.233101-163.pom
12:04:34 [INFO] Downloaded from eclipse.snapshot: https://repo.eclipse.org/content/groups/snapshots/org/eclipse/scout/rt/org.eclipse.scout.rt.shared.test/8.0.0-SNAPSHOT/org.eclipse.scout.rt.shared.test-8.0.0-20191111.233101-163.pom (1.6 kB at 37 kB/s)
12:04:34 [INFO] Downloading from eclipse.snapshot: https://repo.eclipse.org/content/groups/snapshots/org/eclipse/scout/rt/org.eclipse.scout.rt.platform.test/8.0.0-SNAPSHOT/maven-metadata.xml
12:04:34 [INFO] Downloaded from eclipse.snapshot: https://repo.eclipse.org/content/groups/snapshots/org/eclipse/scout/rt/org.eclipse.scout.rt.platform.test/8.0.0-SNAPSHOT/maven-metadata.xml (1.5 kB at 22 kB/s)
12:04:34 [INFO] Downloading from eclipse.snapshot: https://repo.eclipse.org/content/groups/snapshots/org/eclipse/scout/rt/org.eclipse.scout.rt.platform.test/8.0.0-SNAPSHOT/org.eclipse.scout.rt.platform.test-8.0.0-20191111.233035-163.pom
12:04:34 [INFO] Downloaded from eclipse.snapshot: https://repo.eclipse.org/content/groups/snapshots/org/eclipse/scout/rt/org.eclipse.scout.rt.platform.test/8.0.0-SNAPSHOT/org.eclipse.scout.rt.platform.test-8.0.0-20191111.233035-163.pom (1.8 kB at 46 kB/s)
12:04:34 [INFO] Downloading from eclipse.snapshot: https://repo.eclipse.org/content/groups/snapshots/org/eclipse/scout/rt/org.eclipse.scout.rt.server.test/8.0.0-SNAPSHOT/maven-metadata.xml
12:04:34 [INFO] Downloaded from eclipse.snapshot: https://repo.eclipse.org/content/groups/snapshots/org/eclipse/scout/rt/org.eclipse.scout.rt.server.test/8.0.0-SNAPSHOT/maven-metadata.xml (1.5 kB at 23 kB/s)
12:04:34 [INFO] Downloading from eclipse.snapshot: https://repo.eclipse.org/content/groups/snapshots/org/eclipse/scout/rt/org.eclipse.scout.rt.server.test/8.0.0-SNAPSHOT/org.eclipse.scout.rt.server.test-8.0.0-20191111.233140-163.pom
12:04:34 [INFO] Downloaded from eclipse.snapshot: https://repo.eclipse.org/content/groups/snapshots/org/eclipse/scout/rt/org.eclipse.scout.rt.server.test/8.0.0-SNAPSHOT/org.eclipse.scout.rt.server.test-8.0.0-20191111.233140-163.pom (1.8 kB at 46 kB/s)
12:04:34 [INFO] Downloading from eclipse.snapshot: https://repo.eclipse.org/content/groups/snapshots/org/eclipse/scout/rt/org.eclipse.scout.rt.server/8.0.0-SNAPSHOT/maven-metadata.xml
12:04:34 [INFO] Downloaded from eclipse.snapshot: https://repo.eclipse.org/content/groups/snapshots/org/eclipse/scout/rt/org.eclipse.scout.rt.server/8.0.0-SNAPSHOT/maven-metadata.xml (1.0 kB at 7.8 kB/s)
12:04:34 [INFO] Downloading from eclipse.snapshot: https://repo.eclipse.org/content/groups/snapshots/org/eclipse/scout/rt/org.eclipse.scout.rt.server/8.0.0-SNAPSHOT/org.eclipse.scout.rt.server-8.0.0-20191111.233131-163.pom
12:04:34 [INFO] Downloaded from eclipse.snapshot: https://repo.eclipse.org/content/groups/snapshots/org/eclipse/scout/rt/org.eclipse.scout.rt.server/8.0.0-SNAPSHOT/org.eclipse.scout.rt.server-8.0.0-20191111.233131-163.pom (1.6 kB at 38 kB/s)
12:04:34 [INFO] Downloading from eclipse.snapshot: https://repo.eclipse.org/content/groups/snapshots/org/eclipse/scout/rt/org.eclipse.scout.rt.mom.api/8.0.0-SNAPSHOT/maven-metadata.xml
12:04:34 [INFO] Downloaded from eclipse.snapshot: https://repo.eclipse.org/content/groups/snapshots/org/eclipse/scout/rt/org.eclipse.scout.rt.mom.api/8.0.0-SNAPSHOT/maven-metadata.xml (1.0 kB at 14 kB/s)
12:04:34 [INFO] Downloading from eclipse.snapshot: https://repo.eclipse.org/content/groups/snapshots/org/eclipse/scout/rt/org.eclipse.scout.rt.mom.api/8.0.0-SNAPSHOT/org.eclipse.scout.rt.mom.api-8.0.0-20191111.233123-163.pom
12:04:35 [INFO] Downloaded from eclipse.snapshot: https://repo.eclipse.org/content/groups/snapshots/org/eclipse/scout/rt/org.eclipse.scout.rt.mom.api/8.0.0-SNAPSHOT/org.eclipse.scout.rt.mom.api-8.0.0-20191111.233123-163.pom (1.3 kB at 26 kB/s)
12:04:35 [INFO] Downloading from eclipse.snapshot: https://repo.eclipse.org/content/groups/snapshots/org/eclipse/scout/rt/org.eclipse.scout.rt.server.jaxws/8.0.0-SNAPSHOT/maven-metadata.xml
12:04:35 [INFO] Downloaded from eclipse.snapshot: https://repo.eclipse.org/content/groups/snapshots/org/eclipse/scout/rt/org.eclipse.scout.rt.server.jaxws/8.0.0-SNAPSHOT/maven-metadata.xml (1.0 kB at 19 kB/s)
12:04:35 [INFO] Downloading from eclipse.snapshot: https://repo.eclipse.org/content/groups/snapshots/org/eclipse/scout/rt/org.eclipse.scout.rt.server.jaxws/8.0.0-SNAPSHOT/org.eclipse.scout.rt.server.jaxws-8.0.0-20191111.233147-163.pom
12:04:35 [INFO] Downloaded from eclipse.snapshot: https://repo.eclipse.org/content/groups/snapshots/org/eclipse/scout/rt/org.eclipse.scout.rt.server.jaxws/8.0.0-SNAPSHOT/org.eclipse.scout.rt.server.jaxws-8.0.0-20191111.233147-163.pom (1.4 kB at 22 kB/s)
12:04:35 [INFO] Downloading from eclipse.snapshot: https://repo.eclipse.org/content/groups/snapshots/org/eclipse/scout/rt/org.eclipse.scout.rt.dataobject/8.0.0-SNAPSHOT/maven-metadata.xml
12:04:35 [INFO] Downloaded from eclipse.snapshot: https://repo.eclipse.org/content/groups/snapshots/org/eclipse/scout/rt/org.eclipse.scout.rt.dataobject/8.0.0-SNAPSHOT/maven-metadata.xml (1.0 kB at 16 kB/s)
12:04:35 [INFO] Downloading from eclipse.snapshot: https://repo.eclipse.org/content/groups/snapshots/org/eclipse/scout/rt/org.eclipse.scout.rt.dataobject/8.0.0-SNAPSHOT/org.eclipse.scout.rt.dataobject-8.0.0-20191111.233226-128.pom
12:04:35 [INFO] Downloaded from eclipse.snapshot: https://repo.eclipse.org/content/groups/snapshots/org/eclipse/scout/rt/org.eclipse.scout.rt.dataobject/8.0.0-SNAPSHOT/org.eclipse.scout.rt.dataobject-8.0.0-20191111.233226-128.pom (1.3 kB at 36 kB/s)
12:04:35 [INFO] Downloading from eclipse.snapshot: https://repo.eclipse.org/content/groups/snapshots/org/eclipse/scout/rt/org.eclipse.scout.rt.ui.html.test/8.0.0-SNAPSHOT/org.eclipse.scout.rt.ui.html.test-8.0.0-20191111.233536-163.jar
12:04:35 [INFO] Downloading from eclipse.snapshot: https://repo.eclipse.org/content/groups/snapshots/org/eclipse/scout/rt/org.eclipse.scout.rt.server.commons/8.0.0-SNAPSHOT/org.eclipse.scout.rt.server.commons-8.0.0-20191111.233109-163.jar
12:04:35 [INFO] Downloading from eclipse.snapshot: https://repo.eclipse.org/content/groups/snapshots/org/eclipse/scout/rt/org.eclipse.scout.rt.ui.html/8.0.0-SNAPSHOT/org.eclipse.scout.rt.ui.html-8.0.0-20191111.233523-163.jar
12:04:35 [INFO] Downloading from eclipse.snapshot: https://repo.eclipse.org/content/groups/snapshots/org/eclipse/scout/rt/org.eclipse.scout.rt.ui.html.scriptprocessor/8.0.0-SNAPSHOT/org.eclipse.scout.rt.ui.html.scriptprocessor-8.0.0-20191111.233512-163.jar
12:04:35 [INFO] Downloading from eclipse.snapshot: https://repo.eclipse.org/content/groups/snapshots/org/eclipse/scout/rt/org.eclipse.scout.rt.client/8.0.0-SNAPSHOT/org.eclipse.scout.rt.client-8.0.0-20191111.233416-163.jar
12:04:35 [INFO] Downloaded from eclipse.snapshot: https://repo.eclipse.org/content/groups/snapshots/org/eclipse/scout/rt/org.eclipse.scout.rt.ui.html.test/8.0.0-SNAPSHOT/org.eclipse.scout.rt.ui.html.test-8.0.0-20191111.233536-163.jar (33 kB at 405 kB/s)
12:04:35 [INFO] Downloading from eclipse.snapshot: https://repo.eclipse.org/content/groups/snapshots/org/eclipse/scout/rt/org.eclipse.scout.json/8.0.0-SNAPSHOT/org.eclipse.scout.json-8.0.0-20191111.233013-163.jar
12:04:35 [INFO] Downloaded from eclipse.snapshot: https://repo.eclipse.org/content/groups/snapshots/org/eclipse/scout/rt/org.eclipse.scout.rt.server.commons/8.0.0-SNAPSHOT/org.eclipse.scout.rt.server.commons-8.0.0-20191111.233109-163.jar (155 kB at 1.0 MB/s)
12:04:35 [INFO] Downloading from eclipse.snapshot: https://repo.eclipse.org/content/groups/snapshots/org/eclipse/scout/rt/org.eclipse.scout.rt.client.test/8.0.0-SNAPSHOT/org.eclipse.scout.rt.client.test-8.0.0-20191111.233429-163.jar
12:04:35 [INFO] Downloaded from eclipse.snapshot: https://repo.eclipse.org/content/groups/snapshots/org/eclipse/scout/rt/org.eclipse.scout.rt.ui.html.scriptprocessor/8.0.0-SNAPSHOT/org.eclipse.scout.rt.ui.html.scriptprocessor-8.0.0-20191111.233512-163.jar (3.0 MB at 11 MB/s)
12:04:35 [INFO] Downloading from eclipse.snapshot: https://repo.eclipse.org/content/groups/snapshots/org/eclipse/scout/rt/org.eclipse.scout.rt.server.test/8.0.0-SNAPSHOT/org.eclipse.scout.rt.server.test-8.0.0-20191111.233140-163.jar
12:04:35 [INFO] Downloaded from eclipse.snapshot: https://repo.eclipse.org/content/groups/snapshots/org/eclipse/scout/rt/org.eclipse.scout.rt.ui.html/8.0.0-SNAPSHOT/org.eclipse.scout.rt.ui.html-8.0.0-20191111.233523-163.jar (2.6 MB at 9.8 MB/s)
12:04:35 [INFO] Downloading from eclipse.snapshot: https://repo.eclipse.org/content/groups/snapshots/org/eclipse/scout/rt/org.eclipse.scout.rt.server/8.0.0-SNAPSHOT/org.eclipse.scout.rt.server-8.0.0-20191111.233131-163.jar
12:04:35 [INFO] Downloaded from eclipse.snapshot: https://repo.eclipse.org/content/groups/snapshots/org/eclipse/scout/rt/org.eclipse.scout.rt.client.test/8.0.0-SNAPSHOT/org.eclipse.scout.rt.client.test-8.0.0-20191111.233429-163.jar (57 kB at 216 kB/s)
12:04:35 [INFO] Downloading from eclipse.snapshot: https://repo.eclipse.org/content/groups/snapshots/org/eclipse/scout/rt/org.eclipse.scout.rt.shared/8.0.0-SNAPSHOT/org.eclipse.scout.rt.shared-8.0.0-20191111.233052-163.jar
12:04:35 [INFO] Downloaded from eclipse.snapshot: https://repo.eclipse.org/content/groups/snapshots/org/eclipse/scout/rt/org.eclipse.scout.rt.client/8.0.0-SNAPSHOT/org.eclipse.scout.rt.client-8.0.0-20191111.233416-163.jar (3.2 MB at 9.9 MB/s)
12:04:35 [INFO] Downloading from eclipse.snapshot: https://repo.eclipse.org/content/groups/snapshots/org/eclipse/scout/rt/org.eclipse.scout.rt.mail/8.0.0-SNAPSHOT/org.eclipse.scout.rt.mail-8.0.0-20191111.233042-163.jar
12:04:35 [INFO] Downloaded from eclipse.snapshot: https://repo.eclipse.org/content/groups/snapshots/org/eclipse/scout/rt/org.eclipse.scout.rt.server.test/8.0.0-SNAPSHOT/org.eclipse.scout.rt.server.test-8.0.0-20191111.233140-163.jar (23 kB at 48 kB/s)
12:04:35 [INFO] Downloading from eclipse.snapshot: https://repo.eclipse.org/content/groups/snapshots/org/eclipse/scout/rt/org.eclipse.scout.rt.mom.api/8.0.0-SNAPSHOT/org.eclipse.scout.rt.mom.api-8.0.0-20191111.233123-163.jar
12:04:35 [INFO] Downloaded from eclipse.snapshot: https://repo.eclipse.org/content/groups/snapshots/org/eclipse/scout/rt/org.eclipse.scout.rt.shared/8.0.0-SNAPSHOT/org.eclipse.scout.rt.shared-8.0.0-20191111.233052-163.jar (783 kB at 1.6 MB/s)
12:04:35 [INFO] Downloading from eclipse.snapshot: https://repo.eclipse.org/content/groups/snapshots/org/eclipse/scout/rt/org.eclipse.scout.rt.shared.test/8.0.0-SNAPSHOT/org.eclipse.scout.rt.shared.test-8.0.0-20191111.233101-163.jar
12:04:35 [INFO] Downloaded from eclipse.snapshot: https://repo.eclipse.org/content/groups/snapshots/org/eclipse/scout/rt/org.eclipse.scout.json/8.0.0-SNAPSHOT/org.eclipse.scout.json-8.0.0-20191111.233013-163.jar (31 kB at 65 kB/s)
12:04:35 [INFO] Downloading from eclipse.snapshot: https://repo.eclipse.org/content/groups/snapshots/org/eclipse/scout/rt/org.eclipse.scout.rt.platform.test/8.0.0-SNAPSHOT/org.eclipse.scout.rt.platform.test-8.0.0-20191111.233035-163.jar
12:04:35 [INFO] Downloaded from eclipse.snapshot: https://repo.eclipse.org/content/groups/snapshots/org/eclipse/scout/rt/org.eclipse.scout.rt.server/8.0.0-SNAPSHOT/org.eclipse.scout.rt.server-8.0.0-20191111.233131-163.jar (318 kB at 634 kB/s)
12:04:35 [INFO] Downloading from eclipse.snapshot: https://repo.eclipse.org/content/groups/snapshots/org/eclipse/scout/rt/org.eclipse.scout.rt.server.jaxws/8.0.0-SNAPSHOT/org.eclipse.scout.rt.server.jaxws-8.0.0-20191111.233147-163.jar
12:04:35 [INFO] Downloaded from eclipse.snapshot: https://repo.eclipse.org/content/groups/snapshots/org/eclipse/scout/rt/org.eclipse.scout.rt.mail/8.0.0-SNAPSHOT/org.eclipse.scout.rt.mail-8.0.0-20191111.233042-163.jar (73 kB at 145 kB/s)
12:04:35 [INFO] Downloading from eclipse.snapshot: https://repo.eclipse.org/content/groups/snapshots/org/eclipse/scout/rt/org.eclipse.scout.rt.dataobject/8.0.0-SNAPSHOT/org.eclipse.scout.rt.dataobject-8.0.0-20191111.233226-128.jar
12:04:35 [INFO] Downloaded from eclipse.snapshot: https://repo.eclipse.org/content/groups/snapshots/org/eclipse/scout/rt/org.eclipse.scout.rt.mom.api/8.0.0-SNAPSHOT/org.eclipse.scout.rt.mom.api-8.0.0-20191111.233123-163.jar (59 kB at 113 kB/s)
12:04:35 [INFO] Downloading from eclipse.snapshot: https://repo.eclipse.org/content/groups/snapshots/org/eclipse/scout/rt/org.eclipse.scout.rt.platform/8.0.0-SNAPSHOT/org.eclipse.scout.rt.platform-8.0.0-20191111.233023-163.jar
12:04:35 [INFO] Downloaded from eclipse.snapshot: https://repo.eclipse.org/content/groups/snapshots/org/eclipse/scout/rt/org.eclipse.scout.rt.platform.test/8.0.0-SNAPSHOT/org.eclipse.scout.rt.platform.test-8.0.0-20191111.233035-163.jar (94 kB at 176 kB/s)
12:04:35 [INFO] Downloaded from eclipse.snapshot: https://repo.eclipse.org/content/groups/snapshots/org/eclipse/scout/rt/org.eclipse.scout.rt.shared.test/8.0.0-SNAPSHOT/org.eclipse.scout.rt.shared.test-8.0.0-20191111.233101-163.jar (24 kB at 44 kB/s)
12:04:35 [INFO] Downloaded from eclipse.snapshot: https://repo.eclipse.org/content/groups/snapshots/org/eclipse/scout/rt/org.eclipse.scout.rt.dataobject/8.0.0-SNAPSHOT/org.eclipse.scout.rt.dataobject-8.0.0-20191111.233226-128.jar (31 kB at 56 kB/s)
12:04:35 [INFO] Downloaded from eclipse.snapshot: https://repo.eclipse.org/content/groups/snapshots/org/eclipse/scout/rt/org.eclipse.scout.rt.server.jaxws/8.0.0-SNAPSHOT/org.eclipse.scout.rt.server.jaxws-8.0.0-20191111.233147-163.jar (140 kB at 245 kB/s)
12:04:35 [INFO] Downloaded from eclipse.snapshot: https://repo.eclipse.org/content/groups/snapshots/org/eclipse/scout/rt/org.eclipse.scout.rt.platform/8.0.0-SNAPSHOT/org.eclipse.scout.rt.platform-8.0.0-20191111.233023-163.jar (900 kB at 1.5 MB/s)
12:04:35 [INFO] 
12:04:35 [INFO] --- maven-clean-plugin:3.0.0:clean (default-clean) @ org.eclipse.scout.sdk.core.s.test ---
12:04:35 [INFO] Deleting /jobs/genie.scout/org.eclipse.scout.sdk.branch-8.0_continuous/workspace/org.eclipse.scout.sdk.core.s.test/target
12:04:36 [INFO] 
12:04:36 [INFO] --- maven-enforcer-plugin:1.4.1:enforce (enforce-rules) @ org.eclipse.scout.sdk.core.s.test ---
12:04:36 [INFO] 
12:04:36 [INFO] --- git-commit-id-plugin:2.2.2:revision (default) @ org.eclipse.scout.sdk.core.s.test ---
12:04:37 [INFO] 
12:04:37 [INFO] --- jacoco-maven-plugin:0.7.9:prepare-agent (default) @ org.eclipse.scout.sdk.core.s.test ---
12:04:37 [INFO] master_test_jacocoArgLine set to -javaagent:/home/hudson/genie.scout/.jenkins/jobs/org.eclipse.scout.sdk.branch-8.0_continuous/workspace/.repository/org/jacoco/org.jacoco.agent/0.7.9/org.jacoco.agent-0.7.9-runtime.jar=destfile=/jobs/genie.scout/org.eclipse.scout.sdk.branch-8.0_continuous/workspace/org.eclipse.scout.sdk.core.s.test/../org.eclipse.scout.sdk/target/jacoco-all.exec
12:04:37 [INFO] 
12:04:37 [INFO] --- build-helper-maven-plugin:1.12:parse-version (initialize-parse-version) @ org.eclipse.scout.sdk.core.s.test ---
12:04:37 [INFO] 
12:04:37 [INFO] --- build-helper-maven-plugin:1.12:regex-property (initialize-regex) @ org.eclipse.scout.sdk.core.s.test ---
12:04:37 [INFO] 
12:04:37 [INFO] --- build-helper-maven-plugin:1.12:add-source (add-source) @ org.eclipse.scout.sdk.core.s.test ---
12:04:37 [INFO] Source directory: /jobs/genie.scout/org.eclipse.scout.sdk.branch-8.0_continuous/workspace/org.eclipse.scout.sdk.core.s.test/src/main/client added.
12:04:37 [INFO] Source directory: /jobs/genie.scout/org.eclipse.scout.sdk.branch-8.0_continuous/workspace/org.eclipse.scout.sdk.core.s.test/src/main/shared added.
12:04:37 [INFO] 
12:04:37 [INFO] --- maven-resources-plugin:2.7:resources (default-resources) @ org.eclipse.scout.sdk.core.s.test ---
12:04:37 [INFO] Using 'UTF-8' encoding to copy filtered resources.
12:04:37 [INFO] skip non existing resourceDirectory /jobs/genie.scout/org.eclipse.scout.sdk.branch-8.0_continuous/workspace/org.eclipse.scout.sdk.core.s.test/src/main/resources
12:04:37 [INFO] Copying 2 resources
12:04:37 [INFO] 
12:04:37 [INFO] --- maven-compiler-plugin:3.6.1:compile (default-compile) @ org.eclipse.scout.sdk.core.s.test ---
12:04:37 [INFO] Changes detected - recompiling the module!
12:04:37 [INFO] Compiling 140 source files to /jobs/genie.scout/org.eclipse.scout.sdk.branch-8.0_continuous/workspace/org.eclipse.scout.sdk.core.s.test/target/classes
12:04:40 [INFO] 
12:04:40 [INFO] --- maven-resources-plugin:2.7:testResources (default-testResources) @ org.eclipse.scout.sdk.core.s.test ---
12:04:40 [INFO] Using 'UTF-8' encoding to copy filtered resources.
12:04:40 [INFO] skip non existing resourceDirectory /jobs/genie.scout/org.eclipse.scout.sdk.branch-8.0_continuous/workspace/org.eclipse.scout.sdk.core.s.test/src/test/resources
12:04:40 [INFO] 
12:04:40 [INFO] --- maven-compiler-plugin:3.6.1:testCompile (default-testCompile) @ org.eclipse.scout.sdk.core.s.test ---
12:04:40 [INFO] Changes detected - recompiling the module!
12:04:40 [INFO] Compiling 36 source files to /jobs/genie.scout/org.eclipse.scout.sdk.branch-8.0_continuous/workspace/org.eclipse.scout.sdk.core.s.test/target/test-classes
12:04:42 [INFO] 
12:04:42 [INFO] --- maven-surefire-plugin:2.19.1:test (default-test) @ org.eclipse.scout.sdk.core.s.test ---
12:04:42 
12:04:42 -------------------------------------------------------
12:04:42  T E S T S
12:04:42 -------------------------------------------------------
12:04:42 Picked up JAVA_TOOL_OPTIONS: -Xmx2G -Djava.io.tmpdir=/tmp/genie.scout -DforkCount=1
12:04:43 Running org.eclipse.scout.sdk.core.s.ScoutRuntimeTypesTest
12:04:45 Tests run: 1, Failures: 0, Errors: 0, Skipped: 0, Time elapsed: 1.916 sec - in org.eclipse.scout.sdk.core.s.ScoutRuntimeTypesTest
12:04:45 Running org.eclipse.scout.sdk.core.s.jaxws.JaxWsModuleNewHelperTest
12:04:45 Tests run: 1, Failures: 0, Errors: 0, Skipped: 0, Time elapsed: 0.086 sec - in org.eclipse.scout.sdk.core.s.jaxws.JaxWsModuleNewHelperTest
12:04:45 Running org.eclipse.scout.sdk.core.s.jaxws.JaxWsUtilsTest
12:04:45 Tests run: 4, Failures: 0, Errors: 0, Skipped: 0, Time elapsed: 0.059 sec - in org.eclipse.scout.sdk.core.s.jaxws.JaxWsUtilsTest
12:04:45 Running org.eclipse.scout.sdk.core.s.project.ScoutProjectNewTest
12:04:52 [WARNING]: Don't override file /tmp/genie.scout/CoreScoutTestingUtils-projectDir7182688883147945652/artifact/artifact/pom.xml
12:05:02 [WARNING]: /tmp/genie.scout/CoreScoutTestingUtils-projectDir7182688883147945652/artifact/artifact.shared/src/main/java/group/artifact/shared/security/AccessControlService.java:[5] 
12:05:02 	import org.eclipse.scout.rt.shared.ISession;
12:05:02 	       ^^^^^^^^^^^^^^^^^^^^^^^^^^^^^^^^^^^^
12:05:02 The import org.eclipse.scout.rt.shared.ISession is never used
12:05:02 [WARNING]: /tmp/genie.scout/CoreScoutTestingUtils-projectDir7182688883147945652/artifact/artifact.shared/src/main/java/group/artifact/shared/security/AccessControlService.java:[7] 
12:05:02 	import org.eclipse.scout.rt.shared.services.common.security.IAccessControlService;
12:05:02 	       ^^^^^^^^^^^^^^^^^^^^^^^^^^^^^^^^^^^^^^^^^^^^^^^^^^^^^^^^^^^^^^^^^^^^^^^^^^
12:05:02 The import org.eclipse.scout.rt.shared.services.common.security.IAccessControlService is never used
12:05:02 2 problems (2 warnings)
12:05:12 [SEVERE]: There are test failures.
12:05:12 
12:05:12 Please refer to /tmp/genie.scout/CoreScoutTestingUtils-projectDir7182688883147945652/artifact/artifact.server/target/surefire-reports for the individual test results.
12:05:20 [WARNING]: /tmp/genie.scout/CoreScoutTestingUtils-projectDir7182688883147945652/artifact/artifact.client/src/main/java/group/artifact/client/ClientSession.java:[4] 
12:05:20 	import org.eclipse.scout.rt.client.IClientSession;
12:05:20 	       ^^^^^^^^^^^^^^^^^^^^^^^^^^^^^^^^^^^^^^^^^^
12:05:20 The import org.eclipse.scout.rt.client.IClientSession is never used
12:05:20 1 problem (1 warning)
12:05:20 [WARNING]: /tmp/genie.scout/CoreScoutTestingUtils-projectDir7182688883147945652/artifact/artifact.client/src/test/java/group/artifact/client/helloworld/HelloWorldFormTest.java:[8] 
12:05:20 	import group.artifact.client.helloworld.HelloWorldForm.MainBox.TopBox.MessageField;
12:05:20 	       ^^^^^^^^^^^^^^^^^^^^^^^^^^^^^^^^^^^^^^^^^^^^^^^^^^^^^^^^^^^^^^^^^^^^^^^^^^^
12:05:20 The import group.artifact.client.helloworld.HelloWorldForm.MainBox.TopBox.MessageField is never used
12:05:20 1 problem (1 warning)
12:05:38 Tests run: 1, Failures: 0, Errors: 0, Skipped: 0, Time elapsed: 53.813 sec - in org.eclipse.scout.sdk.core.s.project.ScoutProjectNewTest
12:05:38 Running org.eclipse.scout.sdk.core.s.sourcebuilder.codetype.CodeTypeSourceBuilderTest
12:05:39 Tests run: 1, Failures: 0, Errors: 0, Skipped: 0, Time elapsed: 0.432 sec - in org.eclipse.scout.sdk.core.s.sourcebuilder.codetype.CodeTypeSourceBuilderTest
12:05:39 Running org.eclipse.scout.sdk.core.s.sourcebuilder.dto.AnnotationCopyTest
12:05:39 Tests run: 1, Failures: 0, Errors: 0, Skipped: 0, Time elapsed: 0.387 sec - in org.eclipse.scout.sdk.core.s.sourcebuilder.dto.AnnotationCopyTest
12:05:39 Running org.eclipse.scout.sdk.core.s.sourcebuilder.dto.ExtensionFormDataTest
12:05:48 Tests run: 5, Failures: 0, Errors: 0, Skipped: 0, Time elapsed: 1.395 sec - in org.eclipse.scout.sdk.core.s.sourcebuilder.dto.ExtensionFormDataTest
12:05:48 Running org.eclipse.scout.sdk.core.s.sourcebuilder.dto.ExternalCheckboxFieldTest
12:05:48 Tests run: 1, Failures: 0, Errors: 0, Skipped: 0, Time elapsed: 0 sec - in org.eclipse.scout.sdk.core.s.sourcebuilder.dto.ExternalCheckboxFieldTest
12:05:48 Running org.eclipse.scout.sdk.core.s.sourcebuilder.dto.ExternalGroupboxTest
12:05:48 Tests run: 1, Failures: 0, Errors: 0, Skipped: 0, Time elapsed: 0 sec - in org.eclipse.scout.sdk.core.s.sourcebuilder.dto.ExternalGroupboxTest
12:05:48 Running org.eclipse.scout.sdk.core.s.sourcebuilder.dto.ExternalTableFieldTest
12:05:48 Tests run: 1, Failures: 0, Errors: 0, Skipped: 0, Time elapsed: 0 sec - in org.eclipse.scout.sdk.core.s.sourcebuilder.dto.ExternalTableFieldTest
12:05:48 Running org.eclipse.scout.sdk.core.s.sourcebuilder.dto.FormFieldMenuTest
12:05:48 Tests run: 1, Failures: 0, Errors: 0, Skipped: 0, Time elapsed: 0 sec - in org.eclipse.scout.sdk.core.s.sourcebuilder.dto.FormFieldMenuTest
12:05:48 Running org.eclipse.scout.sdk.core.s.sourcebuilder.dto.FormPropertiesTest
12:05:48 Tests run: 1, Failures: 0, Errors: 0, Skipped: 0, Time elapsed: 0 sec - in org.eclipse.scout.sdk.core.s.sourcebuilder.dto.FormPropertiesTest
12:05:48 Running org.eclipse.scout.sdk.core.s.sourcebuilder.dto.FormWithGroupboxesTest
12:05:48 Tests run: 1, Failures: 0, Errors: 0, Skipped: 0, Time elapsed: 0 sec - in org.eclipse.scout.sdk.core.s.sourcebuilder.dto.FormWithGroupboxesTest
12:05:48 Running org.eclipse.scout.sdk.core.s.sourcebuilder.dto.FormWithTemplateTest
12:05:48 Tests run: 1, Failures: 0, Errors: 0, Skipped: 0, Time elapsed: 0 sec - in org.eclipse.scout.sdk.core.s.sourcebuilder.dto.FormWithTemplateTest
12:05:48 Running org.eclipse.scout.sdk.core.s.sourcebuilder.dto.IgnoredFieldsFormTest
12:05:48 Tests run: 1, Failures: 0, Errors: 0, Skipped: 0, Time elapsed: 0 sec - in org.eclipse.scout.sdk.core.s.sourcebuilder.dto.IgnoredFieldsFormTest
12:05:48 Running org.eclipse.scout.sdk.core.s.sourcebuilder.dto.ListBoxFormTest
12:05:48 Tests run: 1, Failures: 0, Errors: 0, Skipped: 0, Time elapsed: 0 sec - in org.eclipse.scout.sdk.core.s.sourcebuilder.dto.ListBoxFormTest
12:05:48 Running org.eclipse.scout.sdk.core.s.sourcebuilder.dto.MasterFieldFormDataTest
12:05:48 Tests run: 1, Failures: 0, Errors: 0, Skipped: 0, Time elapsed: 0 sec - in org.eclipse.scout.sdk.core.s.sourcebuilder.dto.MasterFieldFormDataTest
12:05:48 Running org.eclipse.scout.sdk.core.s.sourcebuilder.dto.MixedValueFieldTest
12:05:48 Tests run: 1, Failures: 0, Errors: 0, Skipped: 0, Time elapsed: 0 sec - in org.eclipse.scout.sdk.core.s.sourcebuilder.dto.MixedValueFieldTest
12:05:48 Running org.eclipse.scout.sdk.core.s.sourcebuilder.dto.NestedMultiLevelFormFieldTest
12:05:48 Tests run: 1, Failures: 0, Errors: 0, Skipped: 0, Time elapsed: 0 sec - in org.eclipse.scout.sdk.core.s.sourcebuilder.dto.NestedMultiLevelFormFieldTest
12:05:48 Running org.eclipse.scout.sdk.core.s.sourcebuilder.dto.PageBeanDataTest
12:05:48 Tests run: 6, Failures: 0, Errors: 0, Skipped: 0, Time elapsed: 0.328 sec - in org.eclipse.scout.sdk.core.s.sourcebuilder.dto.PageBeanDataTest
12:05:48 Running org.eclipse.scout.sdk.core.s.sourcebuilder.dto.ReplaceFormFieldTest
12:05:49 Tests run: 1, Failures: 0, Errors: 0, Skipped: 0, Time elapsed: 0.857 sec - in org.eclipse.scout.sdk.core.s.sourcebuilder.dto.ReplaceFormFieldTest
12:05:49 Running org.eclipse.scout.sdk.core.s.sourcebuilder.dto.ReplaceWithTemplatesTest
12:05:51 Tests run: 4, Failures: 0, Errors: 0, Skipped: 0, Time elapsed: 1.705 sec - in org.eclipse.scout.sdk.core.s.sourcebuilder.dto.ReplaceWithTemplatesTest
12:05:51 Running org.eclipse.scout.sdk.core.s.sourcebuilder.dto.ReplacingFormTest
12:05:51 Tests run: 1, Failures: 0, Errors: 0, Skipped: 0, Time elapsed: 0.192 sec - in org.eclipse.scout.sdk.core.s.sourcebuilder.dto.ReplacingFormTest
12:05:51 Running org.eclipse.scout.sdk.core.s.sourcebuilder.dto.ReplacingPageTest
12:05:52 Tests run: 1, Failures: 0, Errors: 0, Skipped: 0, Time elapsed: 0.656 sec - in org.eclipse.scout.sdk.core.s.sourcebuilder.dto.ReplacingPageTest
12:05:52 Running org.eclipse.scout.sdk.core.s.sourcebuilder.dto.ScopeTest
12:05:53 Tests run: 1, Failures: 0, Errors: 0, Skipped: 0, Time elapsed: 0.656 sec - in org.eclipse.scout.sdk.core.s.sourcebuilder.dto.ScopeTest
12:05:53 Running org.eclipse.scout.sdk.core.s.sourcebuilder.dto.SimpleFormTest
12:05:53 Tests run: 1, Failures: 0, Errors: 0, Skipped: 0, Time elapsed: 0.257 sec - in org.eclipse.scout.sdk.core.s.sourcebuilder.dto.SimpleFormTest
12:05:53 Running org.eclipse.scout.sdk.core.s.sourcebuilder.dto.TableFieldBeanTest
12:06:00 [WARNING]: Column 'formdata.client.ui.forms.ColumnWithoutTypeForm$MainBox$MyTableField$Table$MyColumn' has no value type.
12:06:00 Tests run: 1, Failures: 0, Errors: 0, Skipped: 0, Time elapsed: 7.296 sec - in org.eclipse.scout.sdk.core.s.sourcebuilder.dto.TableFieldBeanTest
12:06:00 Running org.eclipse.scout.sdk.core.s.sourcebuilder.dto.TableFieldExtensionTest
12:06:01 Tests run: 2, Failures: 0, Errors: 0, Skipped: 0, Time elapsed: 0.461 sec - in org.eclipse.scout.sdk.core.s.sourcebuilder.dto.TableFieldExtensionTest
12:06:01 Running org.eclipse.scout.sdk.core.s.sourcebuilder.dto.TableFieldFormTest
12:06:02 Tests run: 1, Failures: 0, Errors: 0, Skipped: 0, Time elapsed: 1.838 sec - in org.eclipse.scout.sdk.core.s.sourcebuilder.dto.TableFieldFormTest
12:06:02 Running org.eclipse.scout.sdk.core.s.sourcebuilder.dto.TableFieldWithIgnoredColumnsTest
12:06:06 Tests run: 5, Failures: 0, Errors: 0, Skipped: 0, Time elapsed: 3.156 sec - in org.eclipse.scout.sdk.core.s.sourcebuilder.dto.TableFieldWithIgnoredColumnsTest
12:06:06 Running org.eclipse.scout.sdk.core.s.sourcebuilder.form.FormSourceBuilderTest
12:06:06 Tests run: 1, Failures: 0, Errors: 0, Skipped: 0, Time elapsed: 0.461 sec - in org.eclipse.scout.sdk.core.s.sourcebuilder.form.FormSourceBuilderTest
12:06:06 Running org.eclipse.scout.sdk.core.s.sourcebuilder.lookupcall.LookupCallSourceBuilderTest
12:06:06 Tests run: 1, Failures: 0, Errors: 0, Skipped: 0, Time elapsed: 0.215 sec - in org.eclipse.scout.sdk.core.s.sourcebuilder.lookupcall.LookupCallSourceBuilderTest
12:06:06 Running org.eclipse.scout.sdk.core.s.sourcebuilder.page.PageSourceBuilderTest
12:06:07 Tests run: 2, Failures: 0, Errors: 0, Skipped: 0, Time elapsed: 0.593 sec - in org.eclipse.scout.sdk.core.s.sourcebuilder.page.PageSourceBuilderTest
12:06:07 Running org.eclipse.scout.sdk.core.s.sourcebuilder.testcase.TestSourceBuilderTest
12:06:07 Tests run: 2, Failures: 0, Errors: 0, Skipped: 0, Time elapsed: 0.163 sec - in org.eclipse.scout.sdk.core.s.sourcebuilder.testcase.TestSourceBuilderTest
12:06:07 Running org.eclipse.scout.sdk.core.s.structured.WellformTest
12:06:09 Tests run: 2, Failures: 0, Errors: 0, Skipped: 0, Time elapsed: 2.151 sec - in org.eclipse.scout.sdk.core.s.structured.WellformTest
12:06:09 Running org.eclipse.scout.sdk.core.s.util.CoreScoutUtilsTest
12:06:09 [WARNING]: The @Order value 100000000000000000 is very large and therefore may not be precise enough. It is recommended to use a lower value.
12:06:09 Tests run: 6, Failures: 0, Errors: 0, Skipped: 0, Time elapsed: 0.209 sec - in org.eclipse.scout.sdk.core.s.util.CoreScoutUtilsTest
12:06:10 
12:06:10 Results :
12:06:10 
12:06:10 Tests run: 64, Failures: 0, Errors: 0, Skipped: 0
12:06:10 
12:06:10 [INFO] 
12:06:10 [INFO] --- maven-jar-plugin:2.6:jar (default-jar) @ org.eclipse.scout.sdk.core.s.test ---
12:06:10 [INFO] Building jar: /jobs/genie.scout/org.eclipse.scout.sdk.branch-8.0_continuous/workspace/org.eclipse.scout.sdk.core.s.test/target/org.eclipse.scout.sdk.core.s.test-8.0.0-SNAPSHOT.jar
12:06:10 [INFO] 
12:06:10 [INFO] --- maven-site-plugin:3.6:attach-descriptor (attach-descriptor) @ org.eclipse.scout.sdk.core.s.test ---
12:06:10 [INFO] Skipping because packaging 'jar' is not pom.
12:06:10 [INFO] 
12:06:10 [INFO] --- maven-jar-plugin:2.6:test-jar (attach-tests) @ org.eclipse.scout.sdk.core.s.test ---
12:06:10 [INFO] Building jar: /jobs/genie.scout/org.eclipse.scout.sdk.branch-8.0_continuous/workspace/org.eclipse.scout.sdk.core.s.test/target/org.eclipse.scout.sdk.core.s.test-8.0.0-SNAPSHOT-tests.jar
12:06:10 [INFO] 
12:06:10 [INFO] --- maven-source-plugin:2.4:test-jar-no-fork (attach-test-sources) @ org.eclipse.scout.sdk.core.s.test ---
12:06:10 [INFO] Building jar: /jobs/genie.scout/org.eclipse.scout.sdk.branch-8.0_continuous/workspace/org.eclipse.scout.sdk.core.s.test/target/org.eclipse.scout.sdk.core.s.test-8.0.0-SNAPSHOT-test-sources.jar
12:06:10 [INFO] 
12:06:10 [INFO] --- duplicate-finder-maven-plugin:1.2.1:check (default) @ org.eclipse.scout.sdk.core.s.test ---
12:06:10 [INFO] Checking compile classpath
12:06:11 [INFO] Checking runtime classpath
12:06:11 [INFO] Checking test classpath
12:06:11 [INFO] 
12:06:11 [INFO] --- animal-sniffer-maven-plugin:1.15:check (enforce-java-api-compatibility) @ org.eclipse.scout.sdk.core.s.test ---
12:06:11 [INFO] Checking unresolved references to org.kaazing.mojo.signature:java18:1.0
12:06:13 [INFO] 
12:06:13 [INFO] --- maven-source-plugin:2.4:jar-no-fork (attach-sources) @ org.eclipse.scout.sdk.core.s.test ---
12:06:13 [INFO] Building jar: /jobs/genie.scout/org.eclipse.scout.sdk.branch-8.0_continuous/workspace/org.eclipse.scout.sdk.core.s.test/target/org.eclipse.scout.sdk.core.s.test-8.0.0-SNAPSHOT-sources.jar
12:06:13 [INFO] 
12:06:13 [INFO] --- eclipse-jarsigner-plugin:1.1.2:sign (sign) @ org.eclipse.scout.sdk.core.s.test ---
12:06:13 [INFO] Skipping artifact signing
12:06:13 [INFO] 
12:06:13 [INFO] --- maven-install-plugin:2.5.2:install (default-install) @ org.eclipse.scout.sdk.core.s.test ---
12:06:13 [INFO] Installing /jobs/genie.scout/org.eclipse.scout.sdk.branch-8.0_continuous/workspace/org.eclipse.scout.sdk.core.s.test/target/org.eclipse.scout.sdk.core.s.test-8.0.0-SNAPSHOT.jar to /home/hudson/genie.scout/.jenkins/jobs/org.eclipse.scout.sdk.branch-8.0_continuous/workspace/.repository/org/eclipse/scout/sdk/org.eclipse.scout.sdk.core.s.test/8.0.0-SNAPSHOT/org.eclipse.scout.sdk.core.s.test-8.0.0-SNAPSHOT.jar
12:06:13 [INFO] Installing /jobs/genie.scout/org.eclipse.scout.sdk.branch-8.0_continuous/workspace/org.eclipse.scout.sdk.core.s.test/pom.xml to /home/hudson/genie.scout/.jenkins/jobs/org.eclipse.scout.sdk.branch-8.0_continuous/workspace/.repository/org/eclipse/scout/sdk/org.eclipse.scout.sdk.core.s.test/8.0.0-SNAPSHOT/org.eclipse.scout.sdk.core.s.test-8.0.0-SNAPSHOT.pom
12:06:13 [INFO] Installing /jobs/genie.scout/org.eclipse.scout.sdk.branch-8.0_continuous/workspace/org.eclipse.scout.sdk.core.s.test/target/org.eclipse.scout.sdk.core.s.test-8.0.0-SNAPSHOT-tests.jar to /home/hudson/genie.scout/.jenkins/jobs/org.eclipse.scout.sdk.branch-8.0_continuous/workspace/.repository/org/eclipse/scout/sdk/org.eclipse.scout.sdk.core.s.test/8.0.0-SNAPSHOT/org.eclipse.scout.sdk.core.s.test-8.0.0-SNAPSHOT-tests.jar
12:06:13 [INFO] Installing /jobs/genie.scout/org.eclipse.scout.sdk.branch-8.0_continuous/workspace/org.eclipse.scout.sdk.core.s.test/target/org.eclipse.scout.sdk.core.s.test-8.0.0-SNAPSHOT-test-sources.jar to /home/hudson/genie.scout/.jenkins/jobs/org.eclipse.scout.sdk.branch-8.0_continuous/workspace/.repository/org/eclipse/scout/sdk/org.eclipse.scout.sdk.core.s.test/8.0.0-SNAPSHOT/org.eclipse.scout.sdk.core.s.test-8.0.0-SNAPSHOT-test-sources.jar
12:06:13 [INFO] Installing /jobs/genie.scout/org.eclipse.scout.sdk.branch-8.0_continuous/workspace/org.eclipse.scout.sdk.core.s.test/target/org.eclipse.scout.sdk.core.s.test-8.0.0-SNAPSHOT-sources.jar to /home/hudson/genie.scout/.jenkins/jobs/org.eclipse.scout.sdk.branch-8.0_continuous/workspace/.repository/org/eclipse/scout/sdk/org.eclipse.scout.sdk.core.s.test/8.0.0-SNAPSHOT/org.eclipse.scout.sdk.core.s.test-8.0.0-SNAPSHOT-sources.jar
12:06:13 [INFO] 
12:06:13 [INFO] --------< org.eclipse.scout.sdk.s2e:org.eclipse.scout.sdk.s2e >---------
12:06:13 [INFO] Building org.eclipse.scout.sdk.s2e:org.eclipse.scout.sdk.s2e 8.0.0-SNAPSHOT [9/15]
12:06:13 [INFO] -------------------------------[ bundle ]-------------------------------
12:06:13 [INFO] Downloading from eclipse.release: https://repo.eclipse.org/content/groups/releases/org/eclipse/scout/sdk/deps/org.eclipse.osgi/maven-metadata.xml
12:06:13 [INFO] Downloading from eclipse.maven.central.mirror: https://repo.eclipse.org/content/repositories/maven_central/org/eclipse/scout/sdk/deps/org.eclipse.osgi/maven-metadata.xml
12:06:13 [INFO] Downloading from eclipse.snapshot: https://repo.eclipse.org/content/groups/snapshots/org/eclipse/scout/sdk/deps/org.eclipse.osgi/maven-metadata.xml
12:06:13 [INFO] Downloaded from eclipse.maven.central.mirror: https://repo.eclipse.org/content/repositories/maven_central/org/eclipse/scout/sdk/deps/org.eclipse.osgi/maven-metadata.xml (446 B at 1.6 kB/s)
12:06:15 [INFO] Downloaded from eclipse.release: https://repo.eclipse.org/content/groups/releases/org/eclipse/scout/sdk/deps/org.eclipse.osgi/maven-metadata.xml (403 B at 207 B/s)
12:06:15 [INFO] Downloading from eclipse.maven.central.mirror: https://repo.eclipse.org/content/repositories/maven_central/org/eclipse/scout/sdk/deps/org.eclipse.core.jobs/maven-metadata.xml
12:06:15 [INFO] Downloading from eclipse.release: https://repo.eclipse.org/content/groups/releases/org/eclipse/scout/sdk/deps/org.eclipse.core.jobs/maven-metadata.xml
12:06:15 [INFO] Downloading from eclipse.snapshot: https://repo.eclipse.org/content/groups/snapshots/org/eclipse/scout/sdk/deps/org.eclipse.core.jobs/maven-metadata.xml
12:06:15 [INFO] Downloaded from eclipse.maven.central.mirror: https://repo.eclipse.org/content/repositories/maven_central/org/eclipse/scout/sdk/deps/org.eclipse.core.jobs/maven-metadata.xml (445 B at 11 kB/s)
12:06:15 [INFO] Downloaded from eclipse.release: https://repo.eclipse.org/content/groups/releases/org/eclipse/scout/sdk/deps/org.eclipse.core.jobs/maven-metadata.xml (399 B at 5.9 kB/s)
12:06:15 [INFO] Downloading from eclipse.release: https://repo.eclipse.org/content/groups/releases/org/eclipse/scout/sdk/deps/org.eclipse.core.contenttype/maven-metadata.xml
12:06:15 [INFO] Downloading from eclipse.snapshot: https://repo.eclipse.org/content/groups/snapshots/org/eclipse/scout/sdk/deps/org.eclipse.core.contenttype/maven-metadata.xml
12:06:15 [INFO] Downloading from eclipse.maven.central.mirror: https://repo.eclipse.org/content/repositories/maven_central/org/eclipse/scout/sdk/deps/org.eclipse.core.contenttype/maven-metadata.xml
12:06:15 [INFO] Downloaded from eclipse.release: https://repo.eclipse.org/content/groups/releases/org/eclipse/scout/sdk/deps/org.eclipse.core.contenttype/maven-metadata.xml (406 B at 4.1 kB/s)
12:06:15 [INFO] Downloaded from eclipse.maven.central.mirror: https://repo.eclipse.org/content/repositories/maven_central/org/eclipse/scout/sdk/deps/org.eclipse.core.contenttype/maven-metadata.xml (458 B at 2.8 kB/s)
12:06:15 [INFO] Downloading from eclipse.release: https://repo.eclipse.org/content/groups/releases/org/eclipse/scout/sdk/deps/org.eclipse.text/maven-metadata.xml
12:06:15 [INFO] Downloading from eclipse.maven.central.mirror: https://repo.eclipse.org/content/repositories/maven_central/org/eclipse/scout/sdk/deps/org.eclipse.text/maven-metadata.xml
12:06:15 [INFO] Downloading from eclipse.snapshot: https://repo.eclipse.org/content/groups/snapshots/org/eclipse/scout/sdk/deps/org.eclipse.text/maven-metadata.xml
12:06:15 [INFO] Downloaded from eclipse.maven.central.mirror: https://repo.eclipse.org/content/repositories/maven_central/org/eclipse/scout/sdk/deps/org.eclipse.text/maven-metadata.xml (442 B at 7.9 kB/s)
12:06:15 [INFO] Downloaded from eclipse.release: https://repo.eclipse.org/content/groups/releases/org/eclipse/scout/sdk/deps/org.eclipse.text/maven-metadata.xml (400 B at 2.8 kB/s)
12:06:16 [INFO] Downloading from eclipse.release: https://repo.eclipse.org/content/groups/releases/org/eclipse/scout/sdk/deps/org.eclipse.jface/maven-metadata.xml
12:06:16 [INFO] Downloading from eclipse.maven.central.mirror: https://repo.eclipse.org/content/repositories/maven_central/org/eclipse/scout/sdk/deps/org.eclipse.jface/maven-metadata.xml
12:06:16 [INFO] Downloading from eclipse.snapshot: https://repo.eclipse.org/content/groups/snapshots/org/eclipse/scout/sdk/deps/org.eclipse.jface/maven-metadata.xml
12:06:16 [INFO] Downloaded from eclipse.maven.central.mirror: https://repo.eclipse.org/content/repositories/maven_central/org/eclipse/scout/sdk/deps/org.eclipse.jface/maven-metadata.xml (445 B at 7.3 kB/s)
12:06:16 [INFO] Downloaded from eclipse.release: https://repo.eclipse.org/content/groups/releases/org/eclipse/scout/sdk/deps/org.eclipse.jface/maven-metadata.xml (398 B at 956 B/s)
12:06:16 [INFO] Downloading from eclipse.release: https://repo.eclipse.org/content/groups/releases/org/eclipse/scout/sdk/deps/org.eclipse.swt.win32.win32.x86/maven-metadata.xml
12:06:16 [INFO] Downloading from eclipse.snapshot: https://repo.eclipse.org/content/groups/snapshots/org/eclipse/scout/sdk/deps/org.eclipse.swt.win32.win32.x86/maven-metadata.xml
12:06:16 [INFO] Downloading from eclipse.maven.central.mirror: https://repo.eclipse.org/content/repositories/maven_central/org/eclipse/scout/sdk/deps/org.eclipse.swt.win32.win32.x86/maven-metadata.xml
12:06:16 [INFO] Downloaded from eclipse.maven.central.mirror: https://repo.eclipse.org/content/repositories/maven_central/org/eclipse/scout/sdk/deps/org.eclipse.swt.win32.win32.x86/maven-metadata.xml (463 B at 8.6 kB/s)
12:06:16 [INFO] Downloaded from eclipse.release: https://repo.eclipse.org/content/groups/releases/org/eclipse/scout/sdk/deps/org.eclipse.swt.win32.win32.x86/maven-metadata.xml (415 B at 4.4 kB/s)
12:06:16 [INFO] Downloading from eclipse.release: https://repo.eclipse.org/content/groups/releases/org/eclipse/scout/sdk/deps/org.eclipse.ui.workbench.texteditor/maven-metadata.xml
12:06:16 [INFO] Downloading from eclipse.maven.central.mirror: https://repo.eclipse.org/content/repositories/maven_central/org/eclipse/scout/sdk/deps/org.eclipse.ui.workbench.texteditor/maven-metadata.xml
12:06:16 [INFO] Downloading from eclipse.snapshot: https://repo.eclipse.org/content/groups/snapshots/org/eclipse/scout/sdk/deps/org.eclipse.ui.workbench.texteditor/maven-metadata.xml
12:06:16 [INFO] Downloaded from eclipse.maven.central.mirror: https://repo.eclipse.org/content/repositories/maven_central/org/eclipse/scout/sdk/deps/org.eclipse.ui.workbench.texteditor/maven-metadata.xml (464 B at 11 kB/s)
12:06:16 [INFO] Downloaded from eclipse.release: https://repo.eclipse.org/content/groups/releases/org/eclipse/scout/sdk/deps/org.eclipse.ui.workbench.texteditor/maven-metadata.xml (419 B at 3.4 kB/s)
12:06:16 [INFO] Downloading from eclipse.snapshot: https://repo.eclipse.org/content/groups/snapshots/org/eclipse/scout/sdk/deps/org.eclipse.ui.views/maven-metadata.xml
12:06:16 [INFO] Downloading from eclipse.maven.central.mirror: https://repo.eclipse.org/content/repositories/maven_central/org/eclipse/scout/sdk/deps/org.eclipse.ui.views/maven-metadata.xml
12:06:16 [INFO] Downloading from eclipse.release: https://repo.eclipse.org/content/groups/releases/org/eclipse/scout/sdk/deps/org.eclipse.ui.views/maven-metadata.xml
12:06:16 [INFO] Downloaded from eclipse.maven.central.mirror: https://repo.eclipse.org/content/repositories/maven_central/org/eclipse/scout/sdk/deps/org.eclipse.ui.views/maven-metadata.xml (450 B at 13 kB/s)
12:06:16 [INFO] Downloaded from eclipse.release: https://repo.eclipse.org/content/groups/releases/org/eclipse/scout/sdk/deps/org.eclipse.ui.views/maven-metadata.xml (398 B at 1.3 kB/s)
12:06:16 [INFO] Downloading from eclipse.snapshot: https://repo.eclipse.org/content/groups/snapshots/org/eclipse/scout/sdk/deps/org.eclipse.ui.forms/maven-metadata.xml
12:06:16 [INFO] Downloading from eclipse.release: https://repo.eclipse.org/content/groups/releases/org/eclipse/scout/sdk/deps/org.eclipse.ui.forms/maven-metadata.xml
12:06:16 [INFO] Downloading from eclipse.maven.central.mirror: https://repo.eclipse.org/content/repositories/maven_central/org/eclipse/scout/sdk/deps/org.eclipse.ui.forms/maven-metadata.xml
12:06:17 [INFO] Downloaded from eclipse.maven.central.mirror: https://repo.eclipse.org/content/repositories/maven_central/org/eclipse/scout/sdk/deps/org.eclipse.ui.forms/maven-metadata.xml (446 B at 9.5 kB/s)
12:06:17 [INFO] Downloaded from eclipse.release: https://repo.eclipse.org/content/groups/releases/org/eclipse/scout/sdk/deps/org.eclipse.ui.forms/maven-metadata.xml (404 B at 2.9 kB/s)
12:06:17 [INFO] 
12:06:17 [INFO] --- maven-clean-plugin:3.0.0:clean (default-clean) @ org.eclipse.scout.sdk.s2e ---
12:06:17 [INFO] Deleting /jobs/genie.scout/org.eclipse.scout.sdk.branch-8.0_continuous/workspace/org.eclipse.scout.sdk.s2e/target
12:06:17 [INFO] 
12:06:17 [INFO] --- maven-enforcer-plugin:1.4.1:enforce (enforce-rules) @ org.eclipse.scout.sdk.s2e ---
12:06:17 [INFO] 
12:06:17 [INFO] --- git-commit-id-plugin:2.2.2:revision (default) @ org.eclipse.scout.sdk.s2e ---
12:06:18 [INFO] 
12:06:18 [INFO] --- jacoco-maven-plugin:0.7.9:prepare-agent (default) @ org.eclipse.scout.sdk.s2e ---
12:06:18 [INFO] master_test_jacocoArgLine set to -javaagent:/home/hudson/genie.scout/.jenkins/jobs/org.eclipse.scout.sdk.branch-8.0_continuous/workspace/.repository/org/jacoco/org.jacoco.agent/0.7.9/org.jacoco.agent-0.7.9-runtime.jar=destfile=/jobs/genie.scout/org.eclipse.scout.sdk.branch-8.0_continuous/workspace/org.eclipse.scout.sdk.s2e/../org.eclipse.scout.sdk/target/jacoco-all.exec
12:06:18 [INFO] 
12:06:18 [INFO] --- build-helper-maven-plugin:1.12:parse-version (initialize-parse-version) @ org.eclipse.scout.sdk.s2e ---
12:06:18 [INFO] 
12:06:18 [INFO] --- build-helper-maven-plugin:1.12:regex-property (initialize-regex) @ org.eclipse.scout.sdk.s2e ---
12:06:18 [INFO] 
12:06:18 [INFO] --- maven-resources-plugin:2.7:resources (default-resources) @ org.eclipse.scout.sdk.s2e ---
12:06:18 [INFO] Using 'UTF-8' encoding to copy filtered resources.
12:06:21 [INFO] Copying 2 resources
12:06:21 [INFO] Copying 5 resources
12:06:21 [INFO] 
12:06:21 [INFO] --- maven-compiler-plugin:3.6.1:compile (default-compile) @ org.eclipse.scout.sdk.s2e ---
12:06:21 [INFO] Changes detected - recompiling the module!
12:06:21 [INFO] Compiling 57 source files to /jobs/genie.scout/org.eclipse.scout.sdk.branch-8.0_continuous/workspace/org.eclipse.scout.sdk.s2e/target/classes
12:06:31 [INFO] 
12:06:31 [INFO] --- maven-resources-plugin:2.7:testResources (default-testResources) @ org.eclipse.scout.sdk.s2e ---
12:06:31 [INFO] Using 'UTF-8' encoding to copy filtered resources.
12:06:31 [INFO] skip non existing resourceDirectory /jobs/genie.scout/org.eclipse.scout.sdk.branch-8.0_continuous/workspace/org.eclipse.scout.sdk.s2e/src/test/resources
12:06:31 [INFO] 
12:06:31 [INFO] --- maven-compiler-plugin:3.6.1:testCompile (default-testCompile) @ org.eclipse.scout.sdk.s2e ---
12:06:31 [INFO] No sources to compile
12:06:31 [INFO] 
12:06:31 [INFO] --- maven-surefire-plugin:2.19.1:test (default-test) @ org.eclipse.scout.sdk.s2e ---
12:06:31 [INFO] No tests to run.
12:06:31 [INFO] 
12:06:31 [INFO] >>> maven-bundle-plugin:2.5.4:bundle (default-bundle) > package @ org.eclipse.scout.sdk.s2e >>>
12:06:31 [INFO] 
12:06:31 [INFO] --- maven-enforcer-plugin:1.4.1:enforce (enforce-rules) @ org.eclipse.scout.sdk.s2e ---
12:06:31 [INFO] 
12:06:31 [INFO] --- git-commit-id-plugin:2.2.2:revision (default) @ org.eclipse.scout.sdk.s2e ---
12:06:32 [INFO] 
12:06:32 [INFO] --- jacoco-maven-plugin:0.7.9:prepare-agent (default) @ org.eclipse.scout.sdk.s2e ---
12:06:32 [INFO] master_test_jacocoArgLine set to -javaagent:/home/hudson/genie.scout/.jenkins/jobs/org.eclipse.scout.sdk.branch-8.0_continuous/workspace/.repository/org/jacoco/org.jacoco.agent/0.7.9/org.jacoco.agent-0.7.9-runtime.jar=destfile=/jobs/genie.scout/org.eclipse.scout.sdk.branch-8.0_continuous/workspace/org.eclipse.scout.sdk.s2e/../org.eclipse.scout.sdk/target/jacoco-all.exec
12:06:32 [INFO] 
12:06:32 [INFO] --- build-helper-maven-plugin:1.12:parse-version (initialize-parse-version) @ org.eclipse.scout.sdk.s2e ---
12:06:32 [INFO] 
12:06:32 [INFO] --- build-helper-maven-plugin:1.12:regex-property (initialize-regex) @ org.eclipse.scout.sdk.s2e ---
12:06:32 [INFO] 
12:06:32 [INFO] --- maven-resources-plugin:2.7:resources (default-resources) @ org.eclipse.scout.sdk.s2e ---
12:06:32 [INFO] Using 'UTF-8' encoding to copy filtered resources.
12:06:32 [INFO] Copying 2 resources
12:06:32 [INFO] Copying 5 resources
12:06:32 [INFO] 
12:06:32 [INFO] --- maven-compiler-plugin:3.6.1:compile (default-compile) @ org.eclipse.scout.sdk.s2e ---
12:06:32 [INFO] Nothing to compile - all classes are up to date
12:06:32 [INFO] 
12:06:32 [INFO] --- maven-resources-plugin:2.7:testResources (default-testResources) @ org.eclipse.scout.sdk.s2e ---
12:06:32 [INFO] Using 'UTF-8' encoding to copy filtered resources.
12:06:32 [INFO] skip non existing resourceDirectory /jobs/genie.scout/org.eclipse.scout.sdk.branch-8.0_continuous/workspace/org.eclipse.scout.sdk.s2e/src/test/resources
12:06:32 [INFO] 
12:06:32 [INFO] --- maven-compiler-plugin:3.6.1:testCompile (default-testCompile) @ org.eclipse.scout.sdk.s2e ---
12:06:32 [INFO] No sources to compile
12:06:32 [INFO] 
12:06:32 [INFO] --- maven-surefire-plugin:2.19.1:test (default-test) @ org.eclipse.scout.sdk.s2e ---
12:06:32 [INFO] No tests to run.
12:06:32 [INFO] Skipping execution of surefire because it has already been run for this configuration
12:06:32 [INFO] 
12:06:32 [INFO] --- maven-site-plugin:3.6:attach-descriptor (attach-descriptor) @ org.eclipse.scout.sdk.s2e ---
12:06:33 [INFO] Skipping because packaging 'bundle' is not pom.
12:06:33 [INFO] 
12:06:33 [INFO] --- maven-jar-plugin:2.6:test-jar (attach-tests) @ org.eclipse.scout.sdk.s2e ---
12:06:33 [INFO] Skipping packaging of the test-jar
12:06:33 [INFO] 
12:06:33 [INFO] --- maven-source-plugin:2.4:test-jar-no-fork (attach-test-sources) @ org.eclipse.scout.sdk.s2e ---
12:06:33 [INFO] No sources in project. Archive not created.
12:06:33 [INFO] 
12:06:33 [INFO] <<< maven-bundle-plugin:2.5.4:bundle (default-bundle) < package @ org.eclipse.scout.sdk.s2e <<<
12:06:33 [INFO] 
12:06:33 [INFO] 
12:06:33 [INFO] --- maven-bundle-plugin:2.5.4:bundle (default-bundle) @ org.eclipse.scout.sdk.s2e ---
12:06:34 [INFO] 
12:06:34 [INFO] --- maven-site-plugin:3.6:attach-descriptor (attach-descriptor) @ org.eclipse.scout.sdk.s2e ---
12:06:34 [INFO] Skipping because packaging 'bundle' is not pom.
12:06:34 [INFO] 
12:06:34 [INFO] --- maven-jar-plugin:2.6:test-jar (attach-tests) @ org.eclipse.scout.sdk.s2e ---
12:06:34 [INFO] Skipping packaging of the test-jar
12:06:34 [INFO] 
12:06:34 [INFO] --- maven-source-plugin:2.4:test-jar-no-fork (attach-test-sources) @ org.eclipse.scout.sdk.s2e ---
12:06:34 [INFO] No sources in project. Archive not created.
12:06:34 [INFO] 
12:06:34 [INFO] --- duplicate-finder-maven-plugin:1.2.1:check (default) @ org.eclipse.scout.sdk.s2e ---
12:06:34 [INFO] Checking compile classpath
12:06:36 [INFO] Checking runtime classpath
12:06:36 [INFO] Checking test classpath
12:06:36 [INFO] 
12:06:36 [INFO] --- animal-sniffer-maven-plugin:1.15:check (enforce-java-api-compatibility) @ org.eclipse.scout.sdk.s2e ---
12:06:36 [INFO] Checking unresolved references to org.kaazing.mojo.signature:java18:1.0
12:06:39 [INFO] 
12:06:39 [INFO] --- maven-source-plugin:2.4:jar-no-fork (attach-sources) @ org.eclipse.scout.sdk.s2e ---
12:06:39 [INFO] Building jar: /jobs/genie.scout/org.eclipse.scout.sdk.branch-8.0_continuous/workspace/org.eclipse.scout.sdk.s2e/target/org.eclipse.scout.sdk.s2e-8.0.0-SNAPSHOT-sources.jar
12:06:39 [INFO] 
12:06:39 [INFO] --- eclipse-jarsigner-plugin:1.1.2:sign (sign) @ org.eclipse.scout.sdk.s2e ---
12:06:39 [INFO] Skipping artifact signing
12:06:39 [INFO] 
12:06:39 [INFO] --- maven-install-plugin:2.5.2:install (default-install) @ org.eclipse.scout.sdk.s2e ---
12:06:39 [INFO] Installing /jobs/genie.scout/org.eclipse.scout.sdk.branch-8.0_continuous/workspace/org.eclipse.scout.sdk.s2e/target/org.eclipse.scout.sdk.s2e-8.0.0-SNAPSHOT.jar to /home/hudson/genie.scout/.jenkins/jobs/org.eclipse.scout.sdk.branch-8.0_continuous/workspace/.repository/org/eclipse/scout/sdk/s2e/org.eclipse.scout.sdk.s2e/8.0.0-SNAPSHOT/org.eclipse.scout.sdk.s2e-8.0.0-SNAPSHOT.jar
12:06:39 [INFO] Installing /jobs/genie.scout/org.eclipse.scout.sdk.branch-8.0_continuous/workspace/org.eclipse.scout.sdk.s2e/pom.xml to /home/hudson/genie.scout/.jenkins/jobs/org.eclipse.scout.sdk.branch-8.0_continuous/workspace/.repository/org/eclipse/scout/sdk/s2e/org.eclipse.scout.sdk.s2e/8.0.0-SNAPSHOT/org.eclipse.scout.sdk.s2e-8.0.0-SNAPSHOT.pom
12:06:39 [INFO] Installing /jobs/genie.scout/org.eclipse.scout.sdk.branch-8.0_continuous/workspace/org.eclipse.scout.sdk.s2e/target/org.eclipse.scout.sdk.s2e-8.0.0-SNAPSHOT-sources.jar to /home/hudson/genie.scout/.jenkins/jobs/org.eclipse.scout.sdk.branch-8.0_continuous/workspace/.repository/org/eclipse/scout/sdk/s2e/org.eclipse.scout.sdk.s2e/8.0.0-SNAPSHOT/org.eclipse.scout.sdk.s2e-8.0.0-SNAPSHOT-sources.jar
12:06:39 [INFO] 
12:06:39 [INFO] >>> maven-bundle-plugin:2.5.4:install (default-install) > install @ org.eclipse.scout.sdk.s2e >>>
12:06:39 [INFO] 
12:06:39 [INFO] --- maven-enforcer-plugin:1.4.1:enforce (enforce-rules) @ org.eclipse.scout.sdk.s2e ---
12:06:39 [INFO] 
12:06:39 [INFO] --- git-commit-id-plugin:2.2.2:revision (default) @ org.eclipse.scout.sdk.s2e ---
12:06:43 [INFO] 
12:06:43 [INFO] --- jacoco-maven-plugin:0.7.9:prepare-agent (default) @ org.eclipse.scout.sdk.s2e ---
12:06:43 [INFO] master_test_jacocoArgLine set to -javaagent:/home/hudson/genie.scout/.jenkins/jobs/org.eclipse.scout.sdk.branch-8.0_continuous/workspace/.repository/org/jacoco/org.jacoco.agent/0.7.9/org.jacoco.agent-0.7.9-runtime.jar=destfile=/jobs/genie.scout/org.eclipse.scout.sdk.branch-8.0_continuous/workspace/org.eclipse.scout.sdk.s2e/../org.eclipse.scout.sdk/target/jacoco-all.exec
12:06:43 [INFO] 
12:06:43 [INFO] --- build-helper-maven-plugin:1.12:parse-version (initialize-parse-version) @ org.eclipse.scout.sdk.s2e ---
12:06:43 [INFO] 
12:06:43 [INFO] --- build-helper-maven-plugin:1.12:regex-property (initialize-regex) @ org.eclipse.scout.sdk.s2e ---
12:06:43 [INFO] 
12:06:43 [INFO] --- maven-resources-plugin:2.7:resources (default-resources) @ org.eclipse.scout.sdk.s2e ---
12:06:43 [INFO] Using 'UTF-8' encoding to copy filtered resources.
12:06:43 [INFO] Copying 2 resources
12:06:43 [INFO] Copying 5 resources
12:06:43 [INFO] 
12:06:43 [INFO] --- maven-compiler-plugin:3.6.1:compile (default-compile) @ org.eclipse.scout.sdk.s2e ---
12:06:43 [INFO] Nothing to compile - all classes are up to date
12:06:43 [INFO] 
12:06:43 [INFO] --- maven-resources-plugin:2.7:testResources (default-testResources) @ org.eclipse.scout.sdk.s2e ---
12:06:43 [INFO] Using 'UTF-8' encoding to copy filtered resources.
12:06:43 [INFO] skip non existing resourceDirectory /jobs/genie.scout/org.eclipse.scout.sdk.branch-8.0_continuous/workspace/org.eclipse.scout.sdk.s2e/src/test/resources
12:06:43 [INFO] 
12:06:43 [INFO] --- maven-compiler-plugin:3.6.1:testCompile (default-testCompile) @ org.eclipse.scout.sdk.s2e ---
12:06:43 [INFO] No sources to compile
12:06:43 [INFO] 
12:06:43 [INFO] --- maven-surefire-plugin:2.19.1:test (default-test) @ org.eclipse.scout.sdk.s2e ---
12:06:43 [INFO] No tests to run.
12:06:43 [INFO] Skipping execution of surefire because it has already been run for this configuration
12:06:43 [INFO] 
12:06:43 [INFO] >>> maven-bundle-plugin:2.5.4:bundle (default-bundle) > package @ org.eclipse.scout.sdk.s2e >>>
12:06:43 [INFO] 
12:06:43 [INFO] --- maven-enforcer-plugin:1.4.1:enforce (enforce-rules) @ org.eclipse.scout.sdk.s2e ---
12:06:43 [INFO] 
12:06:43 [INFO] --- git-commit-id-plugin:2.2.2:revision (default) @ org.eclipse.scout.sdk.s2e ---
12:06:44 [INFO] 
12:06:44 [INFO] --- jacoco-maven-plugin:0.7.9:prepare-agent (default) @ org.eclipse.scout.sdk.s2e ---
12:06:44 [INFO] master_test_jacocoArgLine set to -javaagent:/home/hudson/genie.scout/.jenkins/jobs/org.eclipse.scout.sdk.branch-8.0_continuous/workspace/.repository/org/jacoco/org.jacoco.agent/0.7.9/org.jacoco.agent-0.7.9-runtime.jar=destfile=/jobs/genie.scout/org.eclipse.scout.sdk.branch-8.0_continuous/workspace/org.eclipse.scout.sdk.s2e/../org.eclipse.scout.sdk/target/jacoco-all.exec
12:06:44 [INFO] 
12:06:44 [INFO] --- build-helper-maven-plugin:1.12:parse-version (initialize-parse-version) @ org.eclipse.scout.sdk.s2e ---
12:06:44 [INFO] 
12:06:44 [INFO] --- build-helper-maven-plugin:1.12:regex-property (initialize-regex) @ org.eclipse.scout.sdk.s2e ---
12:06:44 [INFO] 
12:06:44 [INFO] --- maven-resources-plugin:2.7:resources (default-resources) @ org.eclipse.scout.sdk.s2e ---
12:06:44 [INFO] Using 'UTF-8' encoding to copy filtered resources.
12:06:44 [INFO] Copying 2 resources
12:06:44 [INFO] Copying 5 resources
12:06:44 [INFO] 
12:06:44 [INFO] --- maven-compiler-plugin:3.6.1:compile (default-compile) @ org.eclipse.scout.sdk.s2e ---
12:06:44 [INFO] Nothing to compile - all classes are up to date
12:06:44 [INFO] 
12:06:44 [INFO] --- maven-resources-plugin:2.7:testResources (default-testResources) @ org.eclipse.scout.sdk.s2e ---
12:06:44 [INFO] Using 'UTF-8' encoding to copy filtered resources.
12:06:44 [INFO] skip non existing resourceDirectory /jobs/genie.scout/org.eclipse.scout.sdk.branch-8.0_continuous/workspace/org.eclipse.scout.sdk.s2e/src/test/resources
12:06:44 [INFO] 
12:06:44 [INFO] --- maven-compiler-plugin:3.6.1:testCompile (default-testCompile) @ org.eclipse.scout.sdk.s2e ---
12:06:44 [INFO] No sources to compile
12:06:44 [INFO] 
12:06:44 [INFO] --- maven-surefire-plugin:2.19.1:test (default-test) @ org.eclipse.scout.sdk.s2e ---
12:06:44 [INFO] No tests to run.
12:06:44 [INFO] Skipping execution of surefire because it has already been run for this configuration
12:06:44 [INFO] 
12:06:44 [INFO] --- maven-site-plugin:3.6:attach-descriptor (attach-descriptor) @ org.eclipse.scout.sdk.s2e ---
12:06:44 [INFO] Skipping because packaging 'bundle' is not pom.
12:06:44 [INFO] 
12:06:44 [INFO] --- maven-jar-plugin:2.6:test-jar (attach-tests) @ org.eclipse.scout.sdk.s2e ---
12:06:44 [INFO] Skipping packaging of the test-jar
12:06:44 [INFO] 
12:06:44 [INFO] --- maven-source-plugin:2.4:test-jar-no-fork (attach-test-sources) @ org.eclipse.scout.sdk.s2e ---
12:06:44 [INFO] No sources in project. Archive not created.
12:06:44 [INFO] 
12:06:44 [INFO] <<< maven-bundle-plugin:2.5.4:bundle (default-bundle) < package @ org.eclipse.scout.sdk.s2e <<<
12:06:44 [INFO] 
12:06:44 [INFO] 
12:06:44 [INFO] --- maven-bundle-plugin:2.5.4:bundle (default-bundle) @ org.eclipse.scout.sdk.s2e ---
12:06:45 [INFO] 
12:06:45 [INFO] --- maven-site-plugin:3.6:attach-descriptor (attach-descriptor) @ org.eclipse.scout.sdk.s2e ---
12:06:45 [INFO] Skipping because packaging 'bundle' is not pom.
12:06:45 [INFO] 
12:06:45 [INFO] --- maven-jar-plugin:2.6:test-jar (attach-tests) @ org.eclipse.scout.sdk.s2e ---
12:06:45 [INFO] Skipping packaging of the test-jar
12:06:45 [INFO] 
12:06:45 [INFO] --- maven-source-plugin:2.4:test-jar-no-fork (attach-test-sources) @ org.eclipse.scout.sdk.s2e ---
12:06:45 [INFO] No sources in project. Archive not created.
12:06:45 [INFO] 
12:06:45 [INFO] --- duplicate-finder-maven-plugin:1.2.1:check (default) @ org.eclipse.scout.sdk.s2e ---
12:06:45 [INFO] Checking compile classpath
12:06:45 [INFO] Checking runtime classpath
12:06:45 [INFO] Checking test classpath
12:06:45 [INFO] 
12:06:45 [INFO] --- animal-sniffer-maven-plugin:1.15:check (enforce-java-api-compatibility) @ org.eclipse.scout.sdk.s2e ---
12:06:45 [INFO] Checking unresolved references to org.kaazing.mojo.signature:java18:1.0
12:06:48 [INFO] 
12:06:48 [INFO] --- maven-source-plugin:2.4:jar-no-fork (attach-sources) @ org.eclipse.scout.sdk.s2e ---
12:06:48 [INFO] Building jar: /jobs/genie.scout/org.eclipse.scout.sdk.branch-8.0_continuous/workspace/org.eclipse.scout.sdk.s2e/target/org.eclipse.scout.sdk.s2e-8.0.0-SNAPSHOT-sources.jar
12:06:48 [INFO] 
12:06:48 [INFO] --- eclipse-jarsigner-plugin:1.1.2:sign (sign) @ org.eclipse.scout.sdk.s2e ---
12:06:48 [INFO] Skipping artifact signing
12:06:48 [INFO] 
12:06:48 [INFO] --- maven-install-plugin:2.5.2:install (default-install) @ org.eclipse.scout.sdk.s2e ---
12:06:48 [INFO] Installing /jobs/genie.scout/org.eclipse.scout.sdk.branch-8.0_continuous/workspace/org.eclipse.scout.sdk.s2e/target/org.eclipse.scout.sdk.s2e-8.0.0-SNAPSHOT.jar to /home/hudson/genie.scout/.jenkins/jobs/org.eclipse.scout.sdk.branch-8.0_continuous/workspace/.repository/org/eclipse/scout/sdk/s2e/org.eclipse.scout.sdk.s2e/8.0.0-SNAPSHOT/org.eclipse.scout.sdk.s2e-8.0.0-SNAPSHOT.jar
12:06:48 [INFO] Installing /jobs/genie.scout/org.eclipse.scout.sdk.branch-8.0_continuous/workspace/org.eclipse.scout.sdk.s2e/pom.xml to /home/hudson/genie.scout/.jenkins/jobs/org.eclipse.scout.sdk.branch-8.0_continuous/workspace/.repository/org/eclipse/scout/sdk/s2e/org.eclipse.scout.sdk.s2e/8.0.0-SNAPSHOT/org.eclipse.scout.sdk.s2e-8.0.0-SNAPSHOT.pom
12:06:48 [INFO] Installing /jobs/genie.scout/org.eclipse.scout.sdk.branch-8.0_continuous/workspace/org.eclipse.scout.sdk.s2e/target/org.eclipse.scout.sdk.s2e-8.0.0-SNAPSHOT-sources.jar to /home/hudson/genie.scout/.jenkins/jobs/org.eclipse.scout.sdk.branch-8.0_continuous/workspace/.repository/org/eclipse/scout/sdk/s2e/org.eclipse.scout.sdk.s2e/8.0.0-SNAPSHOT/org.eclipse.scout.sdk.s2e-8.0.0-SNAPSHOT-sources.jar
12:06:48 [INFO] Installing /jobs/genie.scout/org.eclipse.scout.sdk.branch-8.0_continuous/workspace/org.eclipse.scout.sdk.s2e/target/org.eclipse.scout.sdk.s2e-8.0.0-SNAPSHOT-sources.jar to /home/hudson/genie.scout/.jenkins/jobs/org.eclipse.scout.sdk.branch-8.0_continuous/workspace/.repository/org/eclipse/scout/sdk/s2e/org.eclipse.scout.sdk.s2e/8.0.0-SNAPSHOT/org.eclipse.scout.sdk.s2e-8.0.0-SNAPSHOT-sources.jar
12:06:48 [INFO] 
12:06:48 [INFO] <<< maven-bundle-plugin:2.5.4:install (default-install) < install @ org.eclipse.scout.sdk.s2e <<<
12:06:48 [INFO] 
12:06:48 [INFO] 
12:06:48 [INFO] --- maven-bundle-plugin:2.5.4:install (default-install) @ org.eclipse.scout.sdk.s2e ---
12:06:48 [INFO] Local OBR update disabled (enable with -DobrRepository)
12:06:48 [INFO] 
12:06:48 [INFO] ------< org.eclipse.scout.sdk.s2e:org.eclipse.scout.sdk.s2e.test >------
12:06:48 [INFO] Building org.eclipse.scout.sdk.s2e:org.eclipse.scout.sdk.s2e.test 8.0.0-SNAPSHOT [10/15]
12:06:48 [INFO] --------------------------------[ jar ]---------------------------------
12:06:48 [INFO] 
12:06:48 [INFO] --- maven-clean-plugin:3.0.0:clean (default-clean) @ org.eclipse.scout.sdk.s2e.test ---
12:06:48 [INFO] Deleting /jobs/genie.scout/org.eclipse.scout.sdk.branch-8.0_continuous/workspace/org.eclipse.scout.sdk.s2e.test/target
12:06:48 [INFO] 
12:06:48 [INFO] --- maven-enforcer-plugin:1.4.1:enforce (enforce-rules) @ org.eclipse.scout.sdk.s2e.test ---
12:06:48 [INFO] 
12:06:48 [INFO] --- git-commit-id-plugin:2.2.2:revision (default) @ org.eclipse.scout.sdk.s2e.test ---
12:06:49 [INFO] 
12:06:49 [INFO] --- jacoco-maven-plugin:0.7.9:prepare-agent (default) @ org.eclipse.scout.sdk.s2e.test ---
12:06:49 [INFO] master_test_jacocoArgLine set to -javaagent:/home/hudson/genie.scout/.jenkins/jobs/org.eclipse.scout.sdk.branch-8.0_continuous/workspace/.repository/org/jacoco/org.jacoco.agent/0.7.9/org.jacoco.agent-0.7.9-runtime.jar=destfile=/jobs/genie.scout/org.eclipse.scout.sdk.branch-8.0_continuous/workspace/org.eclipse.scout.sdk.s2e.test/../org.eclipse.scout.sdk/target/jacoco-all.exec
12:06:49 [INFO] 
12:06:49 [INFO] --- build-helper-maven-plugin:1.12:parse-version (initialize-parse-version) @ org.eclipse.scout.sdk.s2e.test ---
12:06:49 [INFO] 
12:06:49 [INFO] --- build-helper-maven-plugin:1.12:regex-property (initialize-regex) @ org.eclipse.scout.sdk.s2e.test ---
12:06:49 [INFO] 
12:06:49 [INFO] --- maven-resources-plugin:2.7:resources (default-resources) @ org.eclipse.scout.sdk.s2e.test ---
12:06:49 [INFO] Using 'UTF-8' encoding to copy filtered resources.
12:06:49 [INFO] skip non existing resourceDirectory /jobs/genie.scout/org.eclipse.scout.sdk.branch-8.0_continuous/workspace/org.eclipse.scout.sdk.s2e.test/src/main/resources
12:06:49 [INFO] Copying 2 resources
12:06:49 [INFO] 
12:06:49 [INFO] --- maven-compiler-plugin:3.6.1:compile (default-compile) @ org.eclipse.scout.sdk.s2e.test ---
12:06:49 [INFO] Changes detected - recompiling the module!
12:06:49 [INFO] Compiling 7 source files to /jobs/genie.scout/org.eclipse.scout.sdk.branch-8.0_continuous/workspace/org.eclipse.scout.sdk.s2e.test/target/classes
12:06:50 [INFO] 
12:06:50 [INFO] --- maven-resources-plugin:2.7:testResources (default-testResources) @ org.eclipse.scout.sdk.s2e.test ---
12:06:50 [INFO] Using 'UTF-8' encoding to copy filtered resources.
12:06:50 [INFO] Copying 7 resources
12:06:50 [INFO] 
12:06:50 [INFO] --- maven-compiler-plugin:3.6.1:testCompile (default-testCompile) @ org.eclipse.scout.sdk.s2e.test ---
12:06:50 [INFO] Changes detected - recompiling the module!
12:06:50 [INFO] Compiling 11 source files to /jobs/genie.scout/org.eclipse.scout.sdk.branch-8.0_continuous/workspace/org.eclipse.scout.sdk.s2e.test/target/test-classes
12:06:51 [INFO] 
12:06:55 [INFO] --- maven-surefire-plugin:2.19.1:test (default-test) @ org.eclipse.scout.sdk.s2e.test ---
12:06:55 
12:06:55 -------------------------------------------------------
12:06:55  T E S T S
12:06:55 -------------------------------------------------------
12:06:55 Picked up JAVA_TOOL_OPTIONS: -Xmx2G -Djava.io.tmpdir=/tmp/genie.scout -DforkCount=1
12:06:55 Running org.eclipse.scout.sdk.s2e.job.ResourceBlockingOperationJobTest
12:06:55 [WARNING]: operation 'org.eclipse.scout.sdk.s2e.operation.IOperation$MockitoMock$2032797690' does not have a name.
12:06:55 [WARNING]: operation 'org.eclipse.scout.sdk.s2e.operation.IOperation$MockitoMock$2032797690' does not have a name.
12:06:55 Tests run: 1, Failures: 0, Errors: 0, Skipped: 0, Time elapsed: 1.19 sec - in org.eclipse.scout.sdk.s2e.job.ResourceBlockingOperationJobTest
12:06:55 Running org.eclipse.scout.sdk.s2e.operation.codetype.CodeTypeNewOperationTest
12:06:56 Tests run: 2, Failures: 0, Errors: 0, Skipped: 0, Time elapsed: 3.373 sec - in org.eclipse.scout.sdk.s2e.operation.codetype.CodeTypeNewOperationTest
12:06:56 Running org.eclipse.scout.sdk.s2e.operation.form.FormNewOperationTest
12:07:07 Tests run: 12, Failures: 0, Errors: 0, Skipped: 0, Time elapsed: 11.193 sec - in org.eclipse.scout.sdk.s2e.operation.form.FormNewOperationTest
12:07:07 Running org.eclipse.scout.sdk.s2e.operation.jaxws.WebServiceNewOperationTest
12:07:13 [WARNING]: Don't override file /tmp/genie.scout/CoreScoutTestingUtils-projectDir7006672996639071713/artifact/artifact/pom.xml
12:07:18 [WARNING]: CP Don't override file /tmp/genie.scout/jaxws-module-tmp471951667042136605/artifact.server.jaxws/src/main/resources/META-INF/scout.xml
12:08:37 [WARNING]: /tmp/genie.scout/CoreScoutTestingUtils-projectDir7006672996639071713/artifact/artifact.server.jaxws/target/generated-sources/wsimport/test/provider/multifile/ErrorResponse.java:[15] 
12:08:37 	public class ErrorResponse
12:08:37 	             ^^^^^^^^^^^^^
12:08:37 The serializable class ErrorResponse does not declare a static final serialVersionUID field of type long
12:08:37 2. WARNING: Annotation processing: Annotation processing started... [processor=JaxWsAnnotationProcessor]
12:08:37 3. WARNING: Annotation processing: Generate entry point for endpoint interface 'test.provider.multifile.IScoutQueryInterface2PortType' [entryPoint=test.provider.multifile.ScoutQueryInterface2WebServiceEntryPoint, wsdl:portType=scoutQueryInterface2, wsdl:service=scoutQuery, wsdl:port=scoutQueryPort] [processor=JaxWsAnnotationProcessor]
12:08:37 4. WARNING: Annotation processing: Generate handler delegate [handler=org.eclipse.scout.rt.server.jaxws.handler.WsProviderCorrelationIdHandler, handlerDelegate=test.provider.multifile.ScoutQueryInterface2WebServiceEntryPoint_WsProviderCorrelationIdHandler, portTypeDefinition=test.provider.multifile.IScoutQueryInterface2WebServiceEntryPointDefinition, endpointInterface=test.provider.multifile.IScoutQueryInterface2PortType] [processor=JaxWsAnnotationProcessor]
12:08:37 5. WARNING: Annotation processing: Generate handler delegate [handler=org.eclipse.scout.rt.server.jaxws.handler.LogHandler, handlerDelegate=test.provider.multifile.ScoutQueryInterface2WebServiceEntryPoint_LogHandler, portTypeDefinition=test.provider.multifile.IScoutQueryInterface2WebServiceEntryPointDefinition, endpointInterface=test.provider.multifile.IScoutQueryInterface2PortType] [processor=JaxWsAnnotationProcessor]
12:08:37 6. WARNING: Annotation processing: Generate AuthHandler [authHandler=test.provider.multifile.ScoutQueryInterface2WebServiceEntryPoint_AuthHandler, portTypeDefinition=test.provider.multifile.IScoutQueryInterface2WebServiceEntryPointDefinition, endpointInterface=test.provider.multifile.IScoutQueryInterface2PortType] [processor=JaxWsAnnotationProcessor]
12:08:37 7. WARNING: Annotation processing: Generate handler chain XML-file [file=ScoutQueryInterface2WebServiceEntryPoint_handler-chain.xml, portTypeDefinition=test.provider.multifile.IScoutQueryInterface2WebServiceEntryPointDefinition, endpointInterface=test.provider.multifile.IScoutQueryInterface2PortType] [processor=JaxWsAnnotationProcessor]
12:08:37 8. WARNING: Annotation processing: Entry point successfully generated. [entryPoint=test.provider.multifile.ScoutQueryInterface2WebServiceEntryPoint, endpointInterface=test.provider.multifile.IScoutQueryInterface2PortType, entryPointDefinition=test.provider.multifile.IScoutQueryInterface2WebServiceEntryPointDefinition] [processor=JaxWsAnnotationProcessor]
12:08:37 9. WARNING: Annotation processing: Annotation processing started... [processor=JaxWsAnnotationProcessor]
12:08:37 10. WARNING: Annotation processing: Annotation processing started... [processor=JaxWsAnnotationProcessor]
12:08:37 10 problems (10 warnings)
12:08:44 [WARNING]: /tmp/genie.scout/CoreScoutTestingUtils-projectDir7006672996639071713/artifact/artifact.shared/src/main/java/group/artifact/shared/security/AccessControlService.java:[5] 
12:08:44 	import org.eclipse.scout.rt.shared.ISession;
12:08:44 	       ^^^^^^^^^^^^^^^^^^^^^^^^^^^^^^^^^^^^
12:08:44 The import org.eclipse.scout.rt.shared.ISession is never used
12:08:44 [WARNING]: /tmp/genie.scout/CoreScoutTestingUtils-projectDir7006672996639071713/artifact/artifact.shared/src/main/java/group/artifact/shared/security/AccessControlService.java:[7] 
12:08:44 	import org.eclipse.scout.rt.shared.services.common.security.IAccessControlService;
12:08:44 	       ^^^^^^^^^^^^^^^^^^^^^^^^^^^^^^^^^^^^^^^^^^^^^^^^^^^^^^^^^^^^^^^^^^^^^^^^^^
12:08:44 The import org.eclipse.scout.rt.shared.services.common.security.IAccessControlService is never used
12:08:44 2 problems (2 warnings)
12:09:18 [WARNING]: /tmp/genie.scout/CoreScoutTestingUtils-projectDir7006672996639071713/artifact/artifact.server.jaxws/target/generated-sources/wsimport/test/provider/multifile/ErrorResponse.java:[15] 
12:09:18 	public class ErrorResponse
12:09:18 	             ^^^^^^^^^^^^^
12:09:18 The serializable class ErrorResponse does not declare a static final serialVersionUID field of type long
12:09:18 2. WARNING: Annotation processing: Annotation processing started... [processor=JaxWsAnnotationProcessor]
12:09:18 3. WARNING: Annotation processing: Generate entry point for endpoint interface 'test.provider.multifile.IScoutQueryInterface2PortType' [entryPoint=test.provider.multifile.ScoutQueryInterface2WebServiceEntryPoint, wsdl:portType=scoutQueryInterface2, wsdl:service=scoutQuery, wsdl:port=scoutQueryPort] [processor=JaxWsAnnotationProcessor]
12:09:18 4. WARNING: Annotation processing: Generate handler delegate [handler=org.eclipse.scout.rt.server.jaxws.handler.WsProviderCorrelationIdHandler, handlerDelegate=test.provider.multifile.ScoutQueryInterface2WebServiceEntryPoint_WsProviderCorrelationIdHandler, portTypeDefinition=test.provider.multifile.IScoutQueryInterface2WebServiceEntryPointDefinition, endpointInterface=test.provider.multifile.IScoutQueryInterface2PortType] [processor=JaxWsAnnotationProcessor]
12:09:18 5. WARNING: Annotation processing: Generate handler delegate [handler=org.eclipse.scout.rt.server.jaxws.handler.LogHandler, handlerDelegate=test.provider.multifile.ScoutQueryInterface2WebServiceEntryPoint_LogHandler, portTypeDefinition=test.provider.multifile.IScoutQueryInterface2WebServiceEntryPointDefinition, endpointInterface=test.provider.multifile.IScoutQueryInterface2PortType] [processor=JaxWsAnnotationProcessor]
12:09:18 6. WARNING: Annotation processing: Generate AuthHandler [authHandler=test.provider.multifile.ScoutQueryInterface2WebServiceEntryPoint_AuthHandler, portTypeDefinition=test.provider.multifile.IScoutQueryInterface2WebServiceEntryPointDefinition, endpointInterface=test.provider.multifile.IScoutQueryInterface2PortType] [processor=JaxWsAnnotationProcessor]
12:09:18 7. WARNING: Annotation processing: Generate handler chain XML-file [file=ScoutQueryInterface2WebServiceEntryPoint_handler-chain.xml, portTypeDefinition=test.provider.multifile.IScoutQueryInterface2WebServiceEntryPointDefinition, endpointInterface=test.provider.multifile.IScoutQueryInterface2PortType] [processor=JaxWsAnnotationProcessor]
12:09:18 8. WARNING: Annotation processing: Entry point successfully generated. [entryPoint=test.provider.multifile.ScoutQueryInterface2WebServiceEntryPoint, endpointInterface=test.provider.multifile.IScoutQueryInterface2PortType, entryPointDefinition=test.provider.multifile.IScoutQueryInterface2WebServiceEntryPointDefinition] [processor=JaxWsAnnotationProcessor]
12:09:18 9. WARNING: Annotation processing: Annotation processing started... [processor=JaxWsAnnotationProcessor]
12:09:18 10. WARNING: Annotation processing: Annotation processing started... [processor=JaxWsAnnotationProcessor]
12:09:18 10 problems (10 warnings)
12:09:22 [WARNING]: /tmp/genie.scout/CoreScoutTestingUtils-projectDir7006672996639071713/artifact/artifact.client/src/main/java/group/artifact/client/ClientSession.java:[4] 
12:09:22 	import org.eclipse.scout.rt.client.IClientSession;
12:09:22 	       ^^^^^^^^^^^^^^^^^^^^^^^^^^^^^^^^^^^^^^^^^^
12:09:22 The import org.eclipse.scout.rt.client.IClientSession is never used
12:09:22 1 problem (1 warning)
12:09:22 [WARNING]: /tmp/genie.scout/CoreScoutTestingUtils-projectDir7006672996639071713/artifact/artifact.client/src/test/java/group/artifact/client/helloworld/HelloWorldFormTest.java:[8] 
12:09:22 	import group.artifact.client.helloworld.HelloWorldForm.MainBox.TopBox.MessageField;
12:09:22 	       ^^^^^^^^^^^^^^^^^^^^^^^^^^^^^^^^^^^^^^^^^^^^^^^^^^^^^^^^^^^^^^^^^^^^^^^^^^^
12:09:22 The import group.artifact.client.helloworld.HelloWorldForm.MainBox.TopBox.MessageField is never used
12:09:22 1 problem (1 warning)
12:10:16 [WARNING]: /tmp/genie.scout/CoreScoutTestingUtils-projectDir7006672996639071713/artifact/artifact.server.jaxws/target/generated-sources/wsimport/test/provider/multifile/ErrorResponse.java:[15] 
12:10:16 	public class ErrorResponse
12:10:16 	             ^^^^^^^^^^^^^
12:10:16 The serializable class ErrorResponse does not declare a static final serialVersionUID field of type long
12:10:16 2. WARNING: Annotation processing: Annotation processing started... [processor=JaxWsAnnotationProcessor]
12:10:16 3. WARNING: Annotation processing: Generate entry point for endpoint interface 'test.provider.multifile.IScoutQueryInterface2PortType' [entryPoint=test.provider.multifile.ScoutQueryInterface2WebServiceEntryPoint, wsdl:portType=scoutQueryInterface2, wsdl:service=scoutQuery, wsdl:port=scoutQueryPort] [processor=JaxWsAnnotationProcessor]
12:10:16 4. WARNING: Annotation processing: Generate handler delegate [handler=org.eclipse.scout.rt.server.jaxws.handler.WsProviderCorrelationIdHandler, handlerDelegate=test.provider.multifile.ScoutQueryInterface2WebServiceEntryPoint_WsProviderCorrelationIdHandler, portTypeDefinition=test.provider.multifile.IScoutQueryInterface2WebServiceEntryPointDefinition, endpointInterface=test.provider.multifile.IScoutQueryInterface2PortType] [processor=JaxWsAnnotationProcessor]
12:10:16 5. WARNING: Annotation processing: Generate handler delegate [handler=org.eclipse.scout.rt.server.jaxws.handler.LogHandler, handlerDelegate=test.provider.multifile.ScoutQueryInterface2WebServiceEntryPoint_LogHandler, portTypeDefinition=test.provider.multifile.IScoutQueryInterface2WebServiceEntryPointDefinition, endpointInterface=test.provider.multifile.IScoutQueryInterface2PortType] [processor=JaxWsAnnotationProcessor]
12:10:16 6. WARNING: Annotation processing: Generate AuthHandler [authHandler=test.provider.multifile.ScoutQueryInterface2WebServiceEntryPoint_AuthHandler, portTypeDefinition=test.provider.multifile.IScoutQueryInterface2WebServiceEntryPointDefinition, endpointInterface=test.provider.multifile.IScoutQueryInterface2PortType] [processor=JaxWsAnnotationProcessor]
12:10:16 7. WARNING: Annotation processing: Generate handler chain XML-file [file=ScoutQueryInterface2WebServiceEntryPoint_handler-chain.xml, portTypeDefinition=test.provider.multifile.IScoutQueryInterface2WebServiceEntryPointDefinition, endpointInterface=test.provider.multifile.IScoutQueryInterface2PortType] [processor=JaxWsAnnotationProcessor]
12:10:16 8. WARNING: Annotation processing: Entry point successfully generated. [entryPoint=test.provider.multifile.ScoutQueryInterface2WebServiceEntryPoint, endpointInterface=test.provider.multifile.IScoutQueryInterface2PortType, entryPointDefinition=test.provider.multifile.IScoutQueryInterface2WebServiceEntryPointDefinition] [processor=JaxWsAnnotationProcessor]
12:10:16 9. WARNING: Annotation processing: Skipped entry point generation for endpoint interface 'test.consumer.multiservice.IFirstWebServiceOnePortType' because not configured with WebServiceEntryPoint annotation. [processor=JaxWsAnnotationProcessor]
12:10:16 10. WARNING: Annotation processing: Skipped entry point generation for endpoint interface 'test.consumer.multiservice.IFirstWebServiceTwoPortType' because not configured with WebServiceEntryPoint annotation. [processor=JaxWsAnnotationProcessor]
12:10:16 11. WARNING: Annotation processing: Skipped entry point generation for endpoint interface 'test.consumer.multiservice.ISecondWebServiceOnePortType' because not configured with WebServiceEntryPoint annotation. [processor=JaxWsAnnotationProcessor]
12:10:16 12. WARNING: Annotation processing: Skipped entry point generation for endpoint interface 'test.consumer.multiservice.ISecondWebServiceTwoPortType' because not configured with WebServiceEntryPoint annotation. [processor=JaxWsAnnotationProcessor]
12:10:16 13. WARNING: Annotation processing: Annotation processing started... [processor=JaxWsAnnotationProcessor]
12:10:16 14. WARNING: Annotation processing: Annotation processing started... [processor=JaxWsAnnotationProcessor]
12:10:16 14 problems (14 warnings)
12:11:00 
12:11:00 Results :
12:11:00 
12:11:00 Tests run: 15, Failures: 0, Errors: 0, Skipped: 0
12:11:00 
12:11:00 [INFO] ------------------------------------------------------------------------
12:11:00 [INFO] Reactor Summary:
12:11:00 [INFO] 
12:11:00 [INFO] Scout Hello World Sample Application 8.0.0-SNAPSHOT  SUCCESS [ 16.268 s]
12:11:00 [INFO] Scout JaxWs Module 8.0.0-SNAPSHOT .................. SUCCESS [  1.507 s]
12:11:00 [INFO] ScoutJS Sample Application 8.0.0-SNAPSHOT .......... SUCCESS [  4.943 s]
12:11:00 [INFO] Eclipse Scout SDK 8.0.0-SNAPSHOT ................... SUCCESS [  5.546 s]
12:11:00 [INFO] org.eclipse.scout.sdk:org.eclipse.scout.sdk.core 8.0.0-SNAPSHOT SUCCESS [ 12.935 s]
12:11:00 [INFO] org.eclipse.scout.sdk:org.eclipse.scout.sdk.core.test 8.0.0-SNAPSHOT SUCCESS [ 21.170 s]
12:11:00 [INFO] org.eclipse.scout.sdk:org.eclipse.scout.sdk.core.s 8.0.0-SNAPSHOT SUCCESS [  3.568 s]
12:11:00 [INFO] org.eclipse.scout.sdk:org.eclipse.scout.sdk.core.s.test 8.0.0-SNAPSHOT SUCCESS [01:45 min]
12:11:00 [INFO] org.eclipse.scout.sdk.s2e:org.eclipse.scout.sdk.s2e 8.0.0-SNAPSHOT SUCCESS [ 35.057 s]
12:11:00 [INFO] org.eclipse.scout.sdk.s2e:org.eclipse.scout.sdk.s2e.test 8.0.0-SNAPSHOT FAILURE [04:11 min]
12:11:00 [INFO] org.eclipse.scout.sdk.s2e:org.eclipse.scout.sdk.s2e.doc 8.0.0-SNAPSHOT SKIPPED
12:11:00 [INFO] org.eclipse.scout.sdk.s2e:org.eclipse.scout.sdk.s2e.nls 8.0.0-SNAPSHOT SKIPPED
12:11:00 [INFO] org.eclipse.scout.sdk.s2e:org.eclipse.scout.sdk.s2e.ui 8.0.0-SNAPSHOT SKIPPED
12:11:00 [INFO] org.eclipse.scout.sdk-settings 8.0.0-SNAPSHOT ...... SKIPPED
12:11:00 [INFO] Eclipse Scout SDK 7.1.0-SNAPSHOT ................... SKIPPED
12:11:00 [INFO] ------------------------------------------------------------------------
12:11:00 [INFO] BUILD FAILURE
12:11:00 [INFO] ------------------------------------------------------------------------
12:11:00 [INFO] Total time:  07:43 min
12:11:00 [INFO] Finished at: 2019-11-12T12:11:00-05:00
12:11:00 [INFO] ------------------------------------------------------------------------
12:11:00 [ERROR] Failed to execute goal org.apache.maven.plugins:maven-surefire-plugin:2.19.1:test (default-test) on project org.eclipse.scout.sdk.s2e.test: Execution default-test of goal org.apache.maven.plugins:maven-surefire-plugin:2.19.1:test failed: The forked VM terminated without properly saying goodbye. VM crash or System.exit called?
12:11:00 [ERROR] Command was /bin/sh -c cd /jobs/genie.scout/org.eclipse.scout.sdk.branch-8.0_continuous/workspace/org.eclipse.scout.sdk.s2e.test && /opt/public/common/java/oracle/jdk1.8.0_192_x64/jre/bin/java -javaagent:/home/hudson/genie.scout/.jenkins/jobs/org.eclipse.scout.sdk.branch-8.0_continuous/workspace/.repository/org/jacoco/org.jacoco.agent/0.7.9/org.jacoco.agent-0.7.9-runtime.jar=destfile=/jobs/genie.scout/org.eclipse.scout.sdk.branch-8.0_continuous/workspace/org.eclipse.scout.sdk.s2e.test/../org.eclipse.scout.sdk/target/jacoco-all.exec -Xms512m -Xmx2048m -Dfile.encoding=UTF-8 org.apache.maven.surefire.booter.ForkedBooter /jobs/genie.scout/org.eclipse.scout.sdk.branch-8.0_continuous/workspace/org.eclipse.scout.sdk.s2e.test/target/surefire/surefire1898791257174159792tmp /jobs/genie.scout/org.eclipse.scout.sdk.branch-8.0_continuous/workspace/org.eclipse.scout.sdk.s2e.test/target/surefire/surefire_27995880681580859153tmp
12:11:00 [ERROR] -> [Help 1]
12:11:00 [ERROR] 
12:11:00 [ERROR] To see the full stack trace of the errors, re-run Maven with the -e switch.
12:11:00 [ERROR] Re-run Maven using the -X switch to enable full debug logging.
12:11:00 [ERROR] 
12:11:00 [ERROR] For more information about the errors and possible solutions, please read the following articles:
12:11:00 [ERROR] [Help 1] http://cwiki.apache.org/confluence/display/MAVEN/PluginExecutionException
12:11:00 [ERROR] 
12:11:00 [ERROR] After correcting the problems, you can resume the build with the command
12:11:00 [ERROR]   mvn <goals> -rf :org.eclipse.scout.sdk.s2e.test
12:11:00 Build step 'Invoke top-level Maven targets' marked build as failure
12:11:00 Sending e-mails to: Arthur.vanDorp@bsi-software.com
12:11:01 Recording test results
12:11:02 Started calculate disk usage of build
12:11:02 Finished Calculation of disk usage of build in 0 seconds
12:11:04 Started calculate disk usage of workspace
12:11:04 Finished Calculation of disk usage of workspace in 0 seconds
12:11:06 Finished: FAILURE