FailedConsole Output

Started by user sravankumarl@in.ibm.com
Starting xvnc
[workspace] $ Xvnc :1491 -geometry 1024x768 -depth 24 -ac -SecurityTypes none -noreset
[workspace] $ /usr/bin/env bash -x /tmp/hudson4816896343302593827.sh

Xvnc TigerVNC 1.4.1 - built ??? ?? ???? ??:??:??
Copyright (C) 1999-2013 TigerVNC Team and many others (see README.txt)
See http://www.tigervnc.org for information on TigerVNC.
Underlying X server release 11502000, The X.Org Foundation

Initializing built-in extension VNC-EXTENSION
Initializing built-in extension Generic Event Extension
Initializing built-in extension SHAPE
Initializing built-in extension MIT-SHM
Initializing built-in extension XInputExtension
Initializing built-in extension XTEST
Initializing built-in extension BIG-REQUESTS
Initializing built-in extension SYNC
Initializing built-in extension XKEYBOARD
Initializing built-in extension XC-MISC
Initializing built-in extension XFIXES
Initializing built-in extension RENDER
Initializing built-in extension RANDR
Initializing built-in extension COMPOSITE
Initializing built-in extension DAMAGE
Initializing built-in extension MIT-SCREEN-SAVER
Initializing built-in extension DOUBLE-BUFFER
Initializing built-in extension RECORD
Initializing built-in extension DPMS
Initializing built-in extension Present
Initializing built-in extension X-Resource
Initializing built-in extension XVideo
Initializing built-in extension XVideo-MotionCompensation
Initializing built-in extension GLX

Wed Oct  5 07:40:19 2016
 vncext:      VNC extension running!
 vncext:      Listening for VNC connections on all interface(s), port 7391
 vncext:      created VNC server for screen 0
+ rm -f cloneUtilities.sh
+ wget http://git.eclipse.org/c/platform/eclipse.platform.releng.aggregator.git/plain/production/miscToolsAndNotes/cloneUtilities/cloneUtilities.sh
--2016-10-05 07:40:19--  http://git.eclipse.org/c/platform/eclipse.platform.releng.aggregator.git/plain/production/miscToolsAndNotes/cloneUtilities/cloneUtilities.sh
Resolving proxy.eclipse.org (proxy.eclipse.org)... 172.30.206.220
Connecting to proxy.eclipse.org (proxy.eclipse.org)|172.30.206.220|:9898... connected.
Proxy request sent, awaiting response... [dix] Could not init font path element /usr/share/fonts/TTF/, removing from list!
[dix] Could not init font path element /usr/share/fonts/OTF/, removing from list!
200 OK
Length: 4957 (4.8K) [text/plain]
Saving to: ‘cloneUtilities.sh’

     0K ....                                                  100%  498M=0s

2016-10-05 07:40:20 (498 MB/s) - ‘cloneUtilities.sh’ saved [4957/4957]

+ chmod +x cloneUtilities.sh
+ /home/hudson/genie.releng/.hudson/jobs/publish-eclipse-build/workspace/cloneUtilities.sh

	[INFO] utilities directory found to exist, so will fetch and reset

~/.hudson/jobs/publish-eclipse-build/workspace/utilities /jobs/genie.releng/publish-eclipse-build/workspace

	[INFO] Doing rebase --abort in case starting from a failed previous run.
No rebase in progress?

	[INFO] initial git rebase --abort returned non zero return code: RC: 1

	       probably due to not needing to do an initial rebase --abort.

	[INFO] Doing fetch origin --depth=1 which we'll force to be our new HEAD
From file:///gitroot/platform/eclipse.platform.releng.aggregator
 + e0be6d0...28266ef master     -> origin/master  (forced update)

	[INFO] Now doing reset --hard origin/master forcing our local pointer to what ever was fetched.
HEAD is now at 28266ef Bug 503388 - Unable to access eclipse update sites from releng hipp -

	[INFO] Elapsed seconds to pull: 0

/jobs/genie.releng/publish-eclipse-build/workspace

	[INFO] Make sure sh files are executable. If any changes are seen in log, they should be fixed in Git

[workspace] $ /bin/sh -xe /tmp/hudson62665200286109825.sh
+ export UTILITIES_HOME=/home/hudson/genie.releng/.hudson/jobs/publish-eclipse-build/workspace/utilities/production
+ UTILITIES_HOME=/home/hudson/genie.releng/.hudson/jobs/publish-eclipse-build/workspace/utilities/production
+ /home/hudson/genie.releng/.hudson/jobs/publish-eclipse-build/workspace/utilities/production/gather-parts.sh /shared/eclipse/builds/4I/siteDir/eclipse/downloads/drops4/I20161004-1000/buildproperties.shsource

	[INFO] SCRIPT_PATH defined as /home/hudson/genie.releng/.hudson/jobs/I-build/workspace/utilities/production

	[DEBUG] RAWDATE in gather-parts.sh was empty (as expected) so setting to "now minus 20" (truncating to nearest 5 minutes): 1475667600


	[INFO] SCRIPT_PATH defined as /home/hudson/genie.releng/.hudson/jobs/I-build/workspace/utilities/production

	REPO_AND_ACCESS:	file:///gitroot

	BUILD_ROOT:	/shared/eclipse/builds/4I

	AGGREGATOR_REPO:	file:///gitroot/platform/eclipse.platform.releng.aggregator.git

	BUILD_TYPE:	I

	STREAM:	4.7.0

	gitCache:	/shared/eclipse/builds/4I/gitCache
aggDir was already defined as /shared/eclipse/builds/4I/gitCache/eclipse.platform.releng.aggregator
BUILD_ID was already defined as I20161004-1000
buildDirectory was already defined as /shared/eclipse/builds/4I/siteDir/eclipse/downloads/drops4/I20161004-1000

	DEBUG: executing /home/hudson/genie.releng/.hudson/jobs/I-build/workspace/utilities/production/getEBuilderForDropDir.sh
			As called from , called from line number 0 in .

	INFO: SCRIPT_PATH: /home/hudson/genie.releng/.hudson/jobs/I-build/workspace/utilities/production

	[INFO] SCRIPT_PATH defined as /home/hudson/genie.releng/.hudson/jobs/I-build/workspace/utilities/production

	[DEBUG] RAWDATE in getEBuilderForDropDir.sh was already set. RAWDATE: 1475667600


	[INFO] SCRIPT_PATH defined as /home/hudson/genie.releng/.hudson/jobs/I-build/workspace/utilities/production

	REPO_AND_ACCESS:	file:///gitroot

	BUILD_ROOT:	/shared/eclipse/builds/4I

	AGGREGATOR_REPO:	file:///gitroot/platform/eclipse.platform.releng.aggregator.git

	BUILD_TYPE:	I

	STREAM:	4.7.0
gitCache was already defined as /shared/eclipse/builds/4I/gitCache
aggDir was already defined as /shared/eclipse/builds/4I/gitCache/eclipse.platform.releng.aggregator
BUILD_ID was already defined as I20161004-1000
buildDirectory was already defined as /shared/eclipse/builds/4I/siteDir/eclipse/downloads/drops4/I20161004-1000
/shared/eclipse/builds/4I/siteDir/eclipse/downloads/drops4/I20161004-1000 /shared/eclipse/builds/4I
/shared/eclipse/builds/4I
Doing git clone using:  --reference  ${aggDir} ${AGGREGATOR_REPO} ${BUILD_DIR}/${EBUILDER}
which evaluates to git clone  --reference  /shared/eclipse/builds/4I/gitCache/eclipse.platform.releng.aggregator file:///gitroot/platform/eclipse.platform.releng.aggregator.git /shared/eclipse/builds/4I/siteDir/eclipse/downloads/drops4/I20161004-1000/eclipse.platform.releng.aggregator
Cloning into '/shared/eclipse/builds/4I/siteDir/eclipse/downloads/drops4/I20161004-1000/eclipse.platform.releng.aggregator'...
Checking out files:  50% (282/563)   
Checking out files:  51% (288/563)   
Checking out files:  52% (293/563)   
Checking out files:  53% (299/563)   
Checking out files:  54% (305/563)   
Checking out files:  55% (310/563)   
Checking out files:  56% (316/563)   
Checking out files:  57% (321/563)   
Checking out files:  58% (327/563)   
Checking out files:  59% (333/563)   
Checking out files:  60% (338/563)   
Checking out files:  61% (344/563)   
Checking out files:  62% (350/563)   
Checking out files:  63% (355/563)   
Checking out files:  64% (361/563)   
Checking out files:  65% (366/563)   
Checking out files:  66% (372/563)   
Checking out files:  67% (378/563)   
Checking out files:  68% (383/563)   
Checking out files:  69% (389/563)   
Checking out files:  70% (395/563)   
Checking out files:  71% (400/563)   
Checking out files:  72% (406/563)   
Checking out files:  73% (411/563)   
Checking out files:  74% (417/563)   
Checking out files:  75% (423/563)   
Checking out files:  76% (428/563)   
Checking out files:  77% (434/563)   
Checking out files:  78% (440/563)   
Checking out files:  79% (445/563)   
Checking out files:  80% (451/563)   
Checking out files:  81% (457/563)   
Checking out files:  82% (462/563)   
Checking out files:  83% (468/563)   
Checking out files:  84% (473/563)   
Checking out files:  85% (479/563)   
Checking out files:  86% (485/563)   
Checking out files:  87% (490/563)   
Checking out files:  88% (496/563)   
Checking out files:  89% (502/563)   
Checking out files:  90% (507/563)   
Checking out files:  91% (513/563)   
Checking out files:  92% (518/563)   
Checking out files:  93% (524/563)   
Checking out files:  94% (530/563)   
Checking out files:  95% (535/563)   
Checking out files:  96% (541/563)   
Checking out files:  97% (547/563)   
Checking out files:  98% (552/563)   
Checking out files:  99% (558/563)   
Checking out files: 100% (563/563)   
Checking out files: 100% (563/563), done.
INFO: ebuilder directory cloned.
INFO:    Location: /shared/eclipse/builds/4I/siteDir/eclipse/downloads/drops4/I20161004-1000/eclipse.platform.releng.aggregator
INFO:    checking out specific HASH (which will make it detached).
/shared/eclipse/builds/4I/siteDir/eclipse/downloads/drops4/I20161004-1000/eclipse.platform.releng.aggregator /shared/eclipse/builds/4I
Note: checking out 'e0be6d0ab431172c41c250f7b6c85d486a147c99'.

You are in 'detached HEAD' state. You can look around, make experimental
changes and commit them, and you can discard any commits you make in this
state without impacting any branches by performing another checkout.

If you want to create a new branch to retain commits you create, you may
do so (now or later) by using -b with the checkout command again. Example:

  git checkout -b new_branch_name

HEAD is now at e0be6d0... Build input for build I20161004-0800
/shared/eclipse/builds/4I

	DEBUG: About to create EBuilder zip: eclipse.platform.releng.aggregator-e0be6d0ab431172c41c250f7b6c85d486a147c99.zip
/shared/eclipse/builds/4I/siteDir/eclipse/downloads/drops4/I20161004-1000 /shared/eclipse/builds/4I
updating: eclipse.platform.releng.aggregator/production/testScripts/ (stored 0%)
updating: eclipse.platform.releng.aggregator/production/testScripts/runTests2.xml (deflated 78%)
updating: eclipse.platform.releng.aggregator/production/testScripts/invokeTestsJSON.xml (deflated 81%)
updating: eclipse.platform.releng.aggregator/production/testScripts/hudsonBootstrap/ (stored 0%)
updating: eclipse.platform.releng.aggregator/production/testScripts/hudsonBootstrap/getEBuilder.xml (deflated 70%)
updating: eclipse.platform.releng.aggregator/production/testScripts/hudsonBootstrap/getEBuilder.sh (deflated 51%)
updating: eclipse.platform.releng.aggregator/production/testScripts/genTestIndexes.xml (deflated 68%)
updating: eclipse.platform.releng.aggregator/production/testScripts/startTests.sh (deflated 60%)
updating: eclipse.platform.releng.aggregator/production/testScripts/configuration/ (stored 0%)
updating: eclipse.platform.releng.aggregator/production/testScripts/configuration/sdk.tests/ (stored 0%)
updating: eclipse.platform.releng.aggregator/production/testScripts/configuration/sdk.tests/testConfigs/ (stored 0%)
updating: eclipse.platform.releng.aggregator/production/testScripts/configuration/sdk.tests/testConfigs/macosx/ (stored 0%)
updating: eclipse.platform.releng.aggregator/production/testScripts/configuration/sdk.tests/testConfigs/macosx/testAll.sh (deflated 54%)
updating: eclipse.platform.releng.aggregator/production/testScripts/configuration/sdk.tests/testConfigs/macosx/platformSpecific.properties (deflated 51%)
updating: eclipse.platform.releng.aggregator/production/testScripts/configuration/sdk.tests/testConfigs/win7/ (stored 0%)
updating: eclipse.platform.releng.aggregator/production/testScripts/configuration/sdk.tests/testConfigs/win7/testAll.bat (deflated 52%)
updating: eclipse.platform.releng.aggregator/production/testScripts/configuration/sdk.tests/testConfigs/win7/platformSpecific.properties (deflated 50%)
updating: eclipse.platform.releng.aggregator/production/testScripts/configuration/sdk.tests/testConfigs/linux/ (stored 0%)
updating: eclipse.platform.releng.aggregator/production/testScripts/configuration/sdk.tests/testConfigs/linux/testAll.sh (deflated 60%)
updating: eclipse.platform.releng.aggregator/production/testScripts/configuration/sdk.tests/testConfigs/linux/platformSpecific.properties (deflated 50%)
updating: eclipse.platform.releng.aggregator/production/testScripts/configuration/sdk.tests/testConfigs/win7-64/ (stored 0%)
updating: eclipse.platform.releng.aggregator/production/testScripts/configuration/sdk.tests/testConfigs/win7-64/testAll.bat (deflated 51%)
updating: eclipse.platform.releng.aggregator/production/testScripts/configuration/sdk.tests/testConfigs/win7-64/platformSpecific.properties (deflated 50%)
updating: eclipse.platform.releng.aggregator/production/testScripts/configuration/sdk.tests/testConfigs/macmini/ (stored 0%)
updating: eclipse.platform.releng.aggregator/production/testScripts/configuration/sdk.tests/testConfigs/macmini/testAll.sh (deflated 53%)
updating: eclipse.platform.releng.aggregator/production/testScripts/configuration/sdk.tests/testConfigs/macmini/platformSpecific.properties (deflated 50%)
updating: eclipse.platform.releng.aggregator/production/testScripts/configuration/sdk.tests/testConfigs/linux32/ (stored 0%)
updating: eclipse.platform.releng.aggregator/production/testScripts/configuration/sdk.tests/testConfigs/linux32/testAll.sh (deflated 60%)
updating: eclipse.platform.releng.aggregator/production/testScripts/configuration/sdk.tests/testConfigs/linux32/platformSpecific.properties (deflated 51%)
updating: eclipse.platform.releng.aggregator/production/testScripts/configuration/sdk.tests/testScripts/ (stored 0%)
updating: eclipse.platform.releng.aggregator/production/testScripts/configuration/sdk.tests/testScripts/.gitignore (deflated 16%)
updating: eclipse.platform.releng.aggregator/production/testScripts/configuration/sdk.tests/testScripts/runtests (stored 0%)
updating: eclipse.platform.releng.aggregator/production/testScripts/configuration/sdk.tests/testScripts/test.xml (deflated 82%)
updating: eclipse.platform.releng.aggregator/production/testScripts/configuration/sdk.tests/testScripts/runtestsmac.sh (deflated 56%)
updating: eclipse.platform.releng.aggregator/production/testScripts/configuration/sdk.tests/testScripts/testTestXMLScript.sh (deflated 52%)
updating: eclipse.platform.releng.aggregator/production/testScripts/configuration/sdk.tests/testScripts/runtests.sh (deflated 63%)
updating: eclipse.platform.releng.aggregator/production/testScripts/configuration/sdk.tests/testScripts/runtests.bat (deflated 66%)
updating: eclipse.platform.releng.aggregator/production/testScripts/configuration/streamSpecific.properties (deflated 52%)
updating: eclipse.platform.releng.aggregator/production/testScripts/buildParams.shsource (stored 0%)
updating: eclipse.platform.releng.aggregator/production/testScripts/updateTestResultsPages.sh (deflated 66%)
updating: eclipse.platform.releng.aggregator/production/testScripts/test_runTests2.xml.sh (deflated 56%)
/shared/eclipse/builds/4I
A basic builder did not exist, so will fetch platform and tools.
Drop directory: /shared/eclipse/builds/4I/siteDir/eclipse/downloads/drops4/I20161004-1000
BUILDER_DIR: /shared/eclipse/builds/4I/siteDir/eclipse/downloads/drops4/I20161004-1000/org.eclipse.releng.basebuilder
EBuilderDir already existed, so no need to fetch that
Buildfile: /shared/eclipse/builds/4I/siteDir/eclipse/downloads/drops4/I20161004-1000/eclipse.platform.releng.aggregator/eclipse.platform.releng.tychoeclipsebuilder/eclipse/getBaseBuilderAndTools.xml

init:
     [echo] TMP: /shared/eclipse/builds/4I/tmp
     [echo] eclipserun-repo: http://download.eclipse.org/eclipse/updates/4.7milestones/S-4.7M2-201609150230/
     [echo] DEBUG: Before setting default, eclisperun-repo was found to be http://download.eclipse.org/eclipse/updates/4.7milestones/S-4.7M2-201609150230/
     [echo] eclipserun-repo: http://download.eclipse.org/eclipse/updates/4.7milestones/S-4.7M2-201609150230/
     [echo] WORKSPACE: /shared/eclipse/builds/4I/siteDir/eclipse/downloads/drops4/I20161004-1000

getBaseBuilder:
    [mkdir] Created dir: /shared/eclipse/builds/4I/siteDir/eclipse/downloads/drops4/I20161004-1000/org.eclipse.releng.basebuilder

init:

fetchBasePlatform:
      [get] Getting: http://download.eclipse.org/eclipse/downloads/drops4/S-4.7M2-201609150230/eclipse-platform-4.7M2-linux-gtk-x86_64.tar.gz
      [get] To: /shared/eclipse/builds/4I/tmp/eclipse-platform-4.7M2-linux-gtk-x86_64.tar.gz
      [get] Not modified - so not downloaded
    [untar] Expanding: /shared/eclipse/builds/4I/tmp/eclipse-platform-4.7M2-linux-gtk-x86_64.tar.gz into /shared/eclipse/builds/4I/tmp

installSettings:
     [exec] Install location:
     [exec]     file:/opt/public/eclipse/builds/4I/tmp/eclipse/
     [exec] Configuration file:
     [exec]     file:/opt/public/eclipse/builds/4I/tmp/eclipse/configuration/config.ini loaded
     [exec] Configuration location:
     [exec]     file:/opt/public/eclipse/builds/4I/tmp/eclipse/configuration/
     [exec] Framework located:
     [exec]     file:/opt/public/eclipse/builds/4I/tmp/eclipse/plugins/org.eclipse.osgi_3.12.0.v20160908-1235.jar
     [exec] Loading extension: reference:file:org.eclipse.osgi.compatibility.state_1.0.200.v20160908-1235.jar
     [exec] 	eclipse.properties not found
     [exec] Framework classpath:
     [exec]     file:/opt/public/eclipse/builds/4I/tmp/eclipse/plugins/org.eclipse.osgi_3.12.0.v20160908-1235.jar
     [exec]     file:/opt/public/eclipse/builds/4I/tmp/eclipse/plugins/
     [exec]     file:/opt/public/eclipse/builds/4I/tmp/eclipse/plugins/org.eclipse.osgi.compatibility.state_1.0.200.v20160908-1235.jar
     [exec] Debug options:
     [exec]     file:/opt/public/eclipse/builds/4I/tmp/eclipse/.options not found
     [exec] Time to load bundles: 4
     [exec] Starting application: 1179
     [exec] Unable to load repositories.
     [exec] Application failed, log file location: /opt/public/eclipse/builds/4I/siteDir/eclipse/downloads/drops4/I20161004-1000/workspace-toolsinstall/.metadata/.log
     [exec] !SESSION 2016-10-05 07:40:29.630 -----------------------------------------------
     [exec] eclipse.buildId=4.7.0.I20160915-0230
     [exec] java.version=1.8.0_102
     [exec] java.vendor=Oracle Corporation
     [exec] BootLoader constants: OS=linux, ARCH=x86_64, WS=gtk, NL=en_US
     [exec] Framework arguments:  -application org.eclipse.equinox.p2.director -repository http://download.eclipse.org/eclipse/updates/4.7milestones/S-4.7M2-201609150230/,http://build.eclipse.org/eclipse/buildtools/,http://download.eclipse.org/webtools/releng/repository/ -installIU org.eclipse.pde.api.tools/,org.eclipse.releng.build.tools.feature.feature.group/,org.eclipse.wtp.releng.tools.feature.feature.group/1.2.0.v201102200505-21-7w312213311616,org.apache.derby.core.feature.feature.group/
     [exec] Command-line arguments:  -os linux -ws gtk -arch x86_64 -debug -consolelog -data /shared/eclipse/builds/4I/siteDir/eclipse/downloads/drops4/I20161004-1000/workspace-toolsinstall -application org.eclipse.equinox.p2.director -repository http://download.eclipse.org/eclipse/updates/4.7milestones/S-4.7M2-201609150230/,http://build.eclipse.org/eclipse/buildtools/,http://download.eclipse.org/webtools/releng/repository/ -installIU org.eclipse.pde.api.tools/,org.eclipse.releng.build.tools.feature.feature.group/,org.eclipse.wtp.releng.tools.feature.feature.group/1.2.0.v201102200505-21-7w312213311616,org.apache.derby.core.feature.feature.group/
     [exec] 
     [exec] !ENTRY org.eclipse.equinox.p2.transport.ecf 4 1002 2016-10-05 07:40:31.143
     [exec] !MESSAGE Unable to read repository at http://download.eclipse.org/eclipse/updates/4.7milestones/S-4.7M2-201609150230/artifacts.xml.
     [exec] !STACK 0
     [exec] java.lang.IllegalArgumentException: Host name may not be blank
     [exec] 	at org.apache.http.util.Args.notBlank(Args.java:68)
     [exec] 	at org.apache.http.HttpHost.<init>(HttpHost.java:81)
     [exec] 	at org.apache.http.HttpHost.<init>(HttpHost.java:100)
     [exec] 	at org.eclipse.ecf.provider.filetransfer.httpclient4.HttpClientFileSystemBrowser.setupProxy(HttpClientFileSystemBrowser.java:361)
     [exec] 	at org.eclipse.ecf.provider.filetransfer.httpclient4.HttpClientFileSystemBrowser.setupProxies(HttpClientFileSystemBrowser.java:222)
     [exec] 	at org.eclipse.ecf.provider.filetransfer.httpclient4.HttpClientFileSystemBrowser.runRequest(HttpClientFileSystemBrowser.java:236)
     [exec] 	at org.eclipse.ecf.provider.filetransfer.browse.AbstractFileSystemBrowser$DirectoryJob.run(AbstractFileSystemBrowser.java:69)
     [exec] 	at org.eclipse.core.internal.jobs.Worker.run(Worker.java:55)
     [exec] 
     [exec] !ENTRY org.eclipse.equinox.p2.transport.ecf 4 1002 2016-10-05 07:40:31.147
     [exec] !MESSAGE Unable to read repository at http://build.eclipse.org/eclipse/buildtools/artifacts.xml.
     [exec] !STACK 0
     [exec] java.lang.IllegalArgumentException: Host name may not be blank
     [exec] 	at org.apache.http.util.Args.notBlank(Args.java:68)
     [exec] 	at org.apache.http.HttpHost.<init>(HttpHost.java:81)
     [exec] 	at org.apache.http.HttpHost.<init>(HttpHost.java:100)
     [exec] 	at org.eclipse.ecf.provider.filetransfer.httpclient4.HttpClientFileSystemBrowser.setupProxy(HttpClientFileSystemBrowser.java:361)
     [exec] 	at org.eclipse.ecf.provider.filetransfer.httpclient4.HttpClientFileSystemBrowser.setupProxies(HttpClientFileSystemBrowser.java:222)
     [exec] 	at org.eclipse.ecf.provider.filetransfer.httpclient4.HttpClientFileSystemBrowser.runRequest(HttpClientFileSystemBrowser.java:236)
     [exec] 	at org.eclipse.ecf.provider.filetransfer.browse.AbstractFileSystemBrowser$DirectoryJob.run(AbstractFileSystemBrowser.java:69)
     [exec] 	at org.eclipse.core.internal.jobs.Worker.run(Worker.java:55)
     [exec] 
     [exec] !ENTRY org.eclipse.equinox.p2.transport.ecf 4 1002 2016-10-05 07:40:31.150
     [exec] !MESSAGE Unable to read repository at http://download.eclipse.org/webtools/releng/repository/artifacts.xml.
     [exec] !STACK 0
     [exec] java.lang.IllegalArgumentException: Host name may not be blank
     [exec] 	at org.apache.http.util.Args.notBlank(Args.java:68)
     [exec] 	at org.apache.http.HttpHost.<init>(HttpHost.java:81)
     [exec] 	at org.apache.http.HttpHost.<init>(HttpHost.java:100)
     [exec] 	at org.eclipse.ecf.provider.filetransfer.httpclient4.HttpClientFileSystemBrowser.setupProxy(HttpClientFileSystemBrowser.java:361)
     [exec] 	at org.eclipse.ecf.provider.filetransfer.httpclient4.HttpClientFileSystemBrowser.setupProxies(HttpClientFileSystemBrowser.java:222)
     [exec] 	at org.eclipse.ecf.provider.filetransfer.httpclient4.HttpClientFileSystemBrowser.runRequest(HttpClientFileSystemBrowser.java:236)
     [exec] 	at org.eclipse.ecf.provider.filetransfer.browse.AbstractFileSystemBrowser$DirectoryJob.run(AbstractFileSystemBrowser.java:69)
     [exec] 	at org.eclipse.core.internal.jobs.Worker.run(Worker.java:55)
     [exec] 
     [exec] !ENTRY org.eclipse.equinox.p2.transport.ecf 4 1002 2016-10-05 07:40:31.153
     [exec] !MESSAGE Unable to read repository at http://download.eclipse.org/eclipse/updates/4.7milestones/S-4.7M2-201609150230/content.xml.
     [exec] !STACK 0
     [exec] java.lang.IllegalArgumentException: Host name may not be blank
     [exec] 	at org.apache.http.util.Args.notBlank(Args.java:68)
     [exec] 	at org.apache.http.HttpHost.<init>(HttpHost.java:81)
     [exec] 	at org.apache.http.HttpHost.<init>(HttpHost.java:100)
     [exec] 	at org.eclipse.ecf.provider.filetransfer.httpclient4.HttpClientFileSystemBrowser.setupProxy(HttpClientFileSystemBrowser.java:361)
     [exec] 	at org.eclipse.ecf.provider.filetransfer.httpclient4.HttpClientFileSystemBrowser.setupProxies(HttpClientFileSystemBrowser.java:222)
     [exec] 	at org.eclipse.ecf.provider.filetransfer.httpclient4.HttpClientFileSystemBrowser.runRequest(HttpClientFileSystemBrowser.java:236)
     [exec] 	at org.eclipse.ecf.provider.filetransfer.browse.AbstractFileSystemBrowser$DirectoryJob.run(AbstractFileSystemBrowser.java:69)
     [exec] 	at org.eclipse.core.internal.jobs.Worker.run(Worker.java:55)
     [exec] 
     [exec] !ENTRY org.eclipse.equinox.p2.transport.ecf 4 1002 2016-10-05 07:40:31.157
     [exec] !MESSAGE Unable to read repository at http://build.eclipse.org/eclipse/buildtools/content.xml.
     [exec] !STACK 0
     [exec] java.lang.IllegalArgumentException: Host name may not be blank
     [exec] 	at org.apache.http.util.Args.notBlank(Args.java:68)
     [exec] 	at org.apache.http.HttpHost.<init>(HttpHost.java:81)
     [exec] 	at org.apache.http.HttpHost.<init>(HttpHost.java:100)
     [exec] 	at org.eclipse.ecf.provider.filetransfer.httpclient4.HttpClientFileSystemBrowser.setupProxy(HttpClientFileSystemBrowser.java:361)
     [exec] 	at org.eclipse.ecf.provider.filetransfer.httpclient4.HttpClientFileSystemBrowser.setupProxies(HttpClientFileSystemBrowser.java:222)
     [exec] 	at org.eclipse.ecf.provider.filetransfer.httpclient4.HttpClientFileSystemBrowser.runRequest(HttpClientFileSystemBrowser.java:236)
     [exec] 	at org.eclipse.ecf.provider.filetransfer.browse.AbstractFileSystemBrowser$DirectoryJob.run(AbstractFileSystemBrowser.java:69)
     [exec] 	at org.eclipse.core.internal.jobs.Worker.run(Worker.java:55)
     [exec] 
     [exec] !ENTRY org.eclipse.equinox.p2.transport.ecf 4 1002 2016-10-05 07:40:31.160
     [exec] !MESSAGE Unable to read repository at http://download.eclipse.org/webtools/releng/repository/content.xml.
     [exec] !STACK 0
     [exec] java.lang.IllegalArgumentException: Host name may not be blank
     [exec] 	at org.apache.http.util.Args.notBlank(Args.java:68)
     [exec] 	at org.apache.http.HttpHost.<init>(HttpHost.java:81)
     [exec] 	at org.apache.http.HttpHost.<init>(HttpHost.java:100)
     [exec] 	at org.eclipse.ecf.provider.filetransfer.httpclient4.HttpClientFileSystemBrowser.setupProxy(HttpClientFileSystemBrowser.java:361)
     [exec] 	at org.eclipse.ecf.provider.filetransfer.httpclient4.HttpClientFileSystemBrowser.setupProxies(HttpClientFileSystemBrowser.java:222)
     [exec] 	at org.eclipse.ecf.provider.filetransfer.httpclient4.HttpClientFileSystemBrowser.runRequest(HttpClientFileSystemBrowser.java:236)
     [exec] 	at org.eclipse.ecf.provider.filetransfer.browse.AbstractFileSystemBrowser$DirectoryJob.run(AbstractFileSystemBrowser.java:69)
     [exec] 	at org.eclipse.core.internal.jobs.Worker.run(Worker.java:55)
     [exec] Installation failed.
     [exec] 
     [exec] !ENTRY org.eclipse.equinox.p2.core 4 0 2016-10-05 07:40:31.162
     [exec] !MESSAGE Unable to load repositories.
     [exec] Start VM: /shared/common/jdk1.8.0_x64-latest/bin/java
     [exec] -Dosgi.requiredJavaVersion=1.8
     [exec] -Xms40m
     [exec] -Xmx512m
     [exec] -Djava.io.tmpdir=/shared/eclipse/builds/4I/tmp
     [exec] -jar /opt/public/eclipse/builds/4I/tmp/eclipse//plugins/org.eclipse.equinox.launcher_1.3.200.v20160914-0716.jar
     [exec] -os linux
     [exec] -ws gtk
     [exec] -arch x86_64
     [exec] -launcher /opt/public/eclipse/builds/4I/tmp/eclipse/eclipse
     [exec] -name Eclipse
     [exec] --launcher.library /opt/public/eclipse/builds/4I/tmp/eclipse//plugins/org.eclipse.equinox.launcher.gtk.linux.x86_64_1.1.400.v20160914-0716/eclipse_1617.so
     [exec] -startup /opt/public/eclipse/builds/4I/tmp/eclipse//plugins/org.eclipse.equinox.launcher_1.3.200.v20160914-0716.jar
     [exec] --launcher.appendVmargs
     [exec] -exitdata 2972800b
     [exec] -debug
     [exec] -consolelog
     [exec] -data /shared/eclipse/builds/4I/siteDir/eclipse/downloads/drops4/I20161004-1000/workspace-toolsinstall
     [exec] -application org.eclipse.equinox.p2.director
     [exec] -repository http://download.eclipse.org/eclipse/updates/4.7milestones/S-4.7M2-201609150230/,http://build.eclipse.org/eclipse/buildtools/,http://download.eclipse.org/webtools/releng/repository/
     [exec] -installIU org.eclipse.pde.api.tools/,org.eclipse.releng.build.tools.feature.feature.group/,org.eclipse.wtp.releng.tools.feature.feature.group/1.2.0.v201102200505-21-7w312213311616,org.apache.derby.core.feature.feature.group/
     [exec] -vm /shared/common/jdk1.8.0_x64-latest/bin/java
     [exec] -vmargs
     [exec] -Dosgi.requiredJavaVersion=1.8
     [exec] -Xms40m
     [exec] -Xmx512m
     [exec] -Djava.io.tmpdir=/shared/eclipse/builds/4I/tmp
     [exec] -jar /opt/public/eclipse/builds/4I/tmp/eclipse//plugins/org.eclipse.equinox.launcher_1.3.200.v20160914-0716.jar 

BUILD FAILED
/shared/eclipse/builds/4I/siteDir/eclipse/downloads/drops4/I20161004-1000/eclipse.platform.releng.aggregator/eclipse.platform.releng.tychoeclipsebuilder/eclipse/getBaseBuilderAndTools.xml:238: The following error occurred while executing this line:
/shared/eclipse/builds/4I/siteDir/eclipse/downloads/drops4/I20161004-1000/eclipse.platform.releng.aggregator/eclipse.platform.releng.tychoeclipsebuilder/eclipse/getBaseBuilderAndTools.xml:275: exec returned: 13

Total time: 6 seconds
/shared/eclipse/builds/4I/gitCache/eclipse.platform.releng.aggregator/eclipse.platform.releng.tychoeclipsebuilder/sdk/target/products /shared/eclipse/builds/4I
/shared/eclipse/builds/4I
/shared/eclipse/builds/4I/gitCache/eclipse.platform.releng.aggregator/eclipse.platform.releng.tychoeclipsebuilder/platform/target/products /shared/eclipse/builds/4I
/shared/eclipse/builds/4I
/shared/eclipse/builds/4I/gitCache/eclipse.platform.releng.aggregator/eclipse.platform.swt.binaries/bundles /shared/eclipse/builds/4I
/shared/eclipse/builds/4I
/shared/eclipse/builds/4I/gitCache/eclipse.platform.releng.aggregator/eclipse.platform.releng.tychoeclipsebuilder/eclipse-junit-tests/target /shared/eclipse/builds/4I
/shared/eclipse/builds/4I/gitCache/eclipse.platform.releng.aggregator/eclipse.platform.releng.tychoeclipsebuilder/eclipse-junit-tests/target/eclipse-test-framework /shared/eclipse/builds/4I/gitCache/eclipse.platform.releng.aggregator/eclipse.platform.releng.tychoeclipsebuilder/eclipse-junit-tests/target /shared/eclipse/builds/4I
updating: artifacts.xml (deflated 82%)
updating: content.xml (deflated 87%)
updating: features/ (stored 0%)
updating: features/org.eclipse.test_3.7.100.v20160927-0658.jar (deflated 3%)
updating: plugins/ (stored 0%)
updating: plugins/org.eclipse.test.performance.win32_3.1.200.v20140518-1929.jar (deflated 1%)
updating: plugins/org.eclipse.test_3.3.200.v20160912-1145.jar (deflated 0%)
updating: plugins/org.eclipse.test.source_3.3.200.v20160912-1145.jar (deflated 6%)
updating: plugins/org.easymock_2.4.0.v20090202-0900.jar (deflated 11%)
updating: plugins/org.hamcrest.core_1.3.0.v201303031735.jar (deflated 11%)
updating: plugins/org.eclipse.ant.optional.junit_3.3.200.v20160315-2119.jar (deflated 5%)
updating: plugins/org.junit_4.12.0.v201504281640.jar (deflated 0%)
updating: plugins/org.eclipse.test.performance_3.13.0.v20160927-0658.jar (deflated 9%)
/shared/eclipse/builds/4I/gitCache/eclipse.platform.releng.aggregator/eclipse.platform.releng.tychoeclipsebuilder/eclipse-junit-tests/target /shared/eclipse/builds/4I
/shared/eclipse/builds/4I
/shared/eclipse/builds/4I/gitCache/eclipse.platform.releng.aggregator /shared/eclipse/builds/4I
/shared/eclipse/builds/4I
/shared/eclipse/builds/4I/gitCache/eclipse.platform.releng.aggregator/eclipse.jdt.core/org.eclipse.jdt.core/target /shared/eclipse/builds/4I
/shared/eclipse/builds/4I
collecting buildnotes
/shared/eclipse/builds/4I/gitCache/eclipse.platform.releng.aggregator /shared/eclipse/builds/4I
/shared/eclipse/builds/4I
collecting artifactcomparisons
/shared/eclipse/builds/4I/gitCache/eclipse.platform.releng.aggregator /shared/eclipse/builds/4I
/shared/eclipse/builds/4I
/shared/eclipse/builds/4I/gitCache/eclipse.platform.releng.aggregator /shared/eclipse/builds/4I
Error: Unable to access jarfile 
/shared/eclipse/builds/4I
Terminating xvnc.
Sending e-mails to: sravankumarl@in.ibm.com
Finished: FAILURE