Regression

org.eclipse.reddeer.eclipse.test.ui.problems.ProblemsViewTest.testShowProblemColumns no-configuration

Failing for the past 1 build (Since #31 )
Took 10 sec.

Error Message

Timeout after: 10 s.: control is enabled

Stacktrace

org.eclipse.reddeer.common.exception.WaitTimeoutExpiredException: Timeout after: 10 s.: control is enabled
	at org.eclipse.reddeer.eclipse.test.ui.problems.ProblemsViewTest.setUp(ProblemsViewTest.java:98)

Standard Output

13:28:39.169 ERROR [WorkbenchTestable][RequirementsRunner] Failed test: testHideProblemColumnsEmptyArrayArgument no-configuration(org.eclipse.reddeer.eclipse.test.ui.problems.ProblemsViewTest)
13:28:39.170 INFO [WorkbenchTestable][RequirementsRunner] Finished test: testHideProblemColumnsEmptyArrayArgument no-configuration(org.eclipse.reddeer.eclipse.test.ui.problems.ProblemsViewTest)
13:28:39.170 DEBUG [WorkbenchTestable][RequirementsRunner] Injecting fulfilled requirements into test instance: org.eclipse.reddeer.junit.internal.requirement.Requirements
13:28:39.170 INFO [WorkbenchTestable][RequirementsRunner] Started test: testShowProblemColumns no-configuration(org.eclipse.reddeer.eclipse.test.ui.problems.ProblemsViewTest)
13:28:39.170 DEBUG [WorkbenchTestable][RunIBeforeTestExtensions] Run before test extensions for test class org.eclipse.reddeer.eclipse.test.ui.problems.ProblemsViewTest
13:28:39.170 DEBUG [WorkbenchTestable][RunIBeforeTestExtensions] Run method runBeforeTest() of class org.eclipse.reddeer.junit.extension.before.test.impl.CloseWelcomeScreenExt
13:28:39.170 DEBUG [WorkbenchTestable][RunIBeforeTestExtensions] Run method runBeforeTest() of class org.eclipse.reddeer.junit.extension.before.test.impl.SetOpenAssociatedPerspectiveExt
13:28:39.170 DEBUG [WorkbenchTestable][RunIBeforeTestExtensions] Run method runBeforeTest() of class org.eclipse.reddeer.junit.extension.before.test.impl.DoNotDownloadMavenIndexesExt
13:28:39.170 DEBUG [WorkbenchTestable][WindowIsAvailable] Looking for Window matching Matcher matching when all matchers match: [Window matching class class org.eclipse.jface.wizard.WizardDialog, Matcher matching widget which text matches: Matcher matching text to regular expression 'New|Select a wizard']
13:28:39.170 DEBUG [WorkbenchTestable][WidgetHandler] Get widget data
13:28:39.170 DEBUG [WorkbenchTestable][WindowIsAvailable] Looking for Window matching Matcher matching when all matchers match: [Window matching class class org.eclipse.jface.wizard.WizardDialog, Matcher matching widget which text matches: Matcher matching text to regular expression 'New|Select a wizard']
13:28:39.170 DEBUG [WorkbenchTestable][WidgetHandler] Get widget data
13:28:39.170 DEBUG [WorkbenchTestable][WindowIsAvailable] Looking for Window matching Matcher matching when all matchers match: [Window matching class class org.eclipse.jface.wizard.WizardDialog, Matcher matching widget which text matches: "New Java Project"]
13:28:39.170 DEBUG [WorkbenchTestable][WidgetHandler] Get widget data
13:28:39.171 DEBUG [WorkbenchTestable][WindowIsAvailable] Looking for Window matching Matcher matching when all matchers match: [Window matching class class org.eclipse.jface.wizard.WizardDialog, Matcher matching widget which text matches: Matcher matching text to regular expression 'New|Select a wizard']
13:28:39.171 DEBUG [WorkbenchTestable][WidgetHandler] Get widget data
13:28:39.171 DEBUG [WorkbenchTestable][WindowIsAvailable] Looking for Window matching Matcher matching when all matchers match: [Window matching class class org.eclipse.jface.wizard.WizardDialog, Matcher matching widget which text matches: Matcher matching text to regular expression 'New|Select a wizard']
13:28:39.171 DEBUG [WorkbenchTestable][WidgetHandler] Get widget data
13:28:39.171 DEBUG [WorkbenchTestable][WindowIsAvailable] Looking for Window matching Matcher matching when all matchers match: [Window matching class class org.eclipse.jface.wizard.WizardDialog, Matcher matching widget which text matches: Matcher matching text to regular expression 'New|Select a wizard']
13:28:39.171 DEBUG [WorkbenchTestable][WidgetHandler] Get widget data
13:28:39.171 DEBUG [WorkbenchTestable][WindowIsAvailable] Looking for Window matching Matcher matching when all matchers match: [Window matching class class org.eclipse.jface.wizard.WizardDialog, Matcher matching widget which text matches: "New Java Project"]
13:28:39.171 DEBUG [WorkbenchTestable][WidgetHandler] Get widget data
13:28:39.171 DEBUG [WorkbenchTestable][WindowIsAvailable] Looking for Window matching Matcher matching when all matchers match: [Window matching class class org.eclipse.jface.wizard.WizardDialog, Matcher matching widget which text matches: Matcher matching text to regular expression 'New|Select a wizard']
13:28:39.171 DEBUG [WorkbenchTestable][WidgetHandler] Get widget data
13:28:39.171 DEBUG [WorkbenchTestable][WindowIsAvailable] Looking for Window matching Matcher matching when all matchers match: [Window matching class class org.eclipse.jface.wizard.WizardDialog, Matcher matching widget which text matches: Matcher matching text to regular expression 'New|Select a wizard']
13:28:39.171 DEBUG [WorkbenchTestable][WidgetHandler] Get widget data
13:28:39.171 DEBUG [WorkbenchTestable][AbstractShell] Set focus to Shell data - Eclipse Platform
13:28:39.172 DEBUG [WorkbenchTestable][AbstractWait] Waiting until shell is active...
13:28:39.254 DEBUG [WorkbenchTestable][AbstractWait] Waiting until shell is active finished successfully
13:28:39.254 DEBUG [WorkbenchTestable][WorkbenchShell] Workbench shell has title 'data - Eclipse Platform'
13:28:39.254 INFO [WorkbenchTestable][ShellHandler] Getting Menu Bar of shell 'data - Eclipse Platform'
13:28:39.254 DEBUG [main][MenuItemLookup] Found menu:'File'
13:28:39.255 DEBUG [main][MenuItemLookup] Item match:File
13:28:39.256 DEBUG [main][MenuItemLookup] Found menu:'New	Shift+Alt+N'
13:28:39.256 DEBUG [main][MenuItemLookup] Item match:New	Shift+Alt+N
13:28:39.259 DEBUG [main][MenuItemLookup] Found menu:'Java Project'
13:28:39.259 DEBUG [main][MenuItemLookup] Found menu:'Project...'
13:28:39.259 DEBUG [main][MenuItemLookup] Found menu:''
13:28:39.259 DEBUG [main][MenuItemLookup] Found menu:'Package'
13:28:39.259 DEBUG [main][MenuItemLookup] Found menu:'Class'
13:28:39.259 DEBUG [main][MenuItemLookup] Found menu:'Interface'
13:28:39.259 DEBUG [main][MenuItemLookup] Found menu:'Enum'
13:28:39.259 DEBUG [main][MenuItemLookup] Found menu:'Record'
13:28:39.259 DEBUG [main][MenuItemLookup] Found menu:'Annotation'
13:28:39.259 DEBUG [main][MenuItemLookup] Found menu:'Source Folder'
13:28:39.259 DEBUG [main][MenuItemLookup] Found menu:'Java Working Set'
13:28:39.259 DEBUG [main][MenuItemLookup] Found menu:'Folder'
13:28:39.259 DEBUG [main][MenuItemLookup] Found menu:'File'
13:28:39.259 DEBUG [main][MenuItemLookup] Found menu:'Untitled Text File'
13:28:39.259 DEBUG [main][MenuItemLookup] Found menu:'Task'
13:28:39.259 DEBUG [main][MenuItemLookup] Found menu:'JUnit Test Case'
13:28:39.259 DEBUG [main][MenuItemLookup] Found menu:''
13:28:39.259 DEBUG [main][MenuItemLookup] Found menu:'Example...'
13:28:39.259 DEBUG [main][MenuItemLookup] Found menu:''
13:28:39.259 DEBUG [main][MenuItemLookup] Found menu:'Other...	Ctrl+N'
13:28:39.259 DEBUG [main][MenuItemLookup] Item match:Other...	Ctrl+N
13:28:39.260 DEBUG [WorkbenchTestable][MenuItemHandler] Queried MenuItem text:"&Other...	Ctrl+N"
13:28:39.260 INFO [WorkbenchTestable][AbstractMenuItem] Select menu item with text Other...	Ctrl+N
13:28:39.260 INFO [main][MenuItemHandler] Select menu item: &Other...	Ctrl+N
13:28:39.343 DEBUG [WorkbenchTestable][AbstractWait] Waiting until shell matching Matcher matching when all matchers match: [Matcher matching widget which text matches: Matcher matching text to regular expression 'New|Select a wizard'] is available....
13:28:39.347 DEBUG [WorkbenchTestable][AbstractWait] Waiting until shell matching Matcher matching when all matchers match: [Matcher matching widget which text matches: Matcher matching text to regular expression 'New|Select a wizard'] is available. finished successfully
13:28:39.347 DEBUG [WorkbenchTestable][AbstractShell] Set focus to Shell Select a wizard
13:28:39.349 DEBUG [WorkbenchTestable][AbstractWait] Waiting until shell is active...
13:28:39.349 DEBUG [WorkbenchTestable][AbstractWait] Waiting until shell is active finished successfully
13:28:39.349 TRACE [WorkbenchTestable][NewWizard] Shell Select a wizard is not null and is not disposed
13:28:39.349 DEBUG [WorkbenchTestable][WidgetHandler] Get widget data
13:28:39.349 DEBUG [WorkbenchTestable][WidgetLookup] Looking up active widget with class type org.eclipse.swt.widgets.Tree with referenced composite class org.eclipse.reddeer.eclipse.selectionwizard.SelectionWizardOpenable$1, index 0 and no matchers specified
13:28:39.349 DEBUG [WorkbenchTestable][AbstractWait] Waiting until widget is found...
13:28:39.349 TRACE [WorkbenchTestable][WidgetLookup] Looking up widget with index 0 with specified parent and matchers
13:28:39.350 TRACE [WorkbenchTestable][WidgetLookup] widget with index 0 is found
13:28:39.350 DEBUG [WorkbenchTestable][AbstractWait] Waiting until widget is found finished successfully
13:28:39.350 DEBUG [WorkbenchTestable][WidgetLookup] Active widget with class type org.eclipse.swt.widgets.Tree and index 0 was found
13:28:39.351 DEBUG [WorkbenchTestable][AbstractWait] Waiting until tree has children...
13:28:39.359 DEBUG [WorkbenchTestable][AbstractWait] Waiting until tree has children finished successfully
13:28:39.359 DEBUG [WorkbenchTestable][AbstractWait] Waiting until treeItem Java has children...
13:28:39.360 DEBUG [WorkbenchTestable][TreeItemHandler] Expand Tree Item Java
13:28:39.360 DEBUG [WorkbenchTestable][AbstractWait] Waiting until tree heard expand notification...
13:28:39.360 DEBUG [WorkbenchTestable][TreeItemHandler] Tree Item Java is already expanded. No action performed
13:28:39.360 DEBUG [WorkbenchTestable][AbstractWait] Waiting until tree heard expand notification finished successfully
13:28:39.360 INFO [WorkbenchTestable][TreeItemHandler] Expanded: Java
13:28:39.360 DEBUG [WorkbenchTestable][AbstractWait] Waiting until treeItem Java has children finished successfully
13:28:39.360 DEBUG [WorkbenchTestable][TreeItemHandler] Expand Tree Item Java
13:28:39.360 DEBUG [WorkbenchTestable][AbstractWait] Waiting until tree heard expand notification...
13:28:39.360 DEBUG [WorkbenchTestable][TreeItemHandler] Tree Item Java is already expanded. No action performed
13:28:39.360 DEBUG [WorkbenchTestable][AbstractWait] Waiting until tree heard expand notification finished successfully
13:28:39.360 INFO [WorkbenchTestable][TreeItemHandler] Expanded: Java
13:28:39.361 INFO [WorkbenchTestable][AbstractTreeItem] Select tree item Java Project
13:28:39.361 DEBUG [main][TreeItemHandler] Selecting tree item: Java Project
13:28:39.361 DEBUG [WorkbenchTestable][TreeItemHandler] Notify tree item Java Project about selection
13:28:39.361 INFO [WorkbenchTestable][TreeItemHandler] Selected tree item: Java Project
13:28:39.361 TRACE [WorkbenchTestable][NewWizard] Shell Select a wizard is not null and is not disposed
13:28:39.361 INFO [WorkbenchTestable][NewWizard] Go to next wizard page
13:28:39.361 DEBUG [WorkbenchTestable][WidgetLookup] Looking up active widget with class type org.eclipse.swt.widgets.Button with referenced composite class org.eclipse.reddeer.eclipse.ui.dialogs.NewWizard, index 0 and following matchers specified (Widget matcher matching widgets with style: 8, Matcher matching widgets with text that without mnenomic matches: is "Next >", Widget matcher matching widgets with style: 8)
13:28:39.362 DEBUG [WorkbenchTestable][AbstractWait] Waiting until widget is found...
13:28:39.362 TRACE [WorkbenchTestable][WidgetLookup] Looking up widget with index 0 with specified parent and matchers
13:28:39.363 TRACE [WorkbenchTestable][WidgetLookup] widget with index 0 is found
13:28:39.364 DEBUG [WorkbenchTestable][AbstractWait] Waiting until widget is found finished successfully
13:28:39.364 DEBUG [WorkbenchTestable][WidgetLookup] Active widget with class type org.eclipse.swt.widgets.Button and index 0 was found
13:28:39.364 INFO [WorkbenchTestable][AbstractButton] Click button &Next >
13:28:39.364 DEBUG [WorkbenchTestable][AbstractWait] Waiting until control is enabled...
13:28:39.364 DEBUG [WorkbenchTestable][AbstractWait] Waiting until control is enabled finished successfully
13:28:39.364 TRACE [WorkbenchTestable][WidgetHandler] Notify Button with event 13
13:28:39.364 TRACE [WorkbenchTestable][WidgetHandler] Wait for synchronization
13:28:39.557 DEBUG [WorkbenchTestable][WindowIsAvailable] Looking for Window matching Matcher matching when all matchers match: [Window matching class class org.eclipse.jface.wizard.WizardDialog, Matcher matching widget which text matches: Matcher matching text to regular expression 'New|Select a wizard']
13:28:39.557 DEBUG [WorkbenchTestable][WidgetHandler] Get widget data
13:28:39.557 DEBUG [WorkbenchTestable][WidgetHandler] Get widget data
13:28:39.557 DEBUG [WorkbenchTestable][AbstractWait] Waiting until shell matching Matcher matching when all matchers match: [Matcher matching widget which text matches: "New Java Project"] is available....
13:28:39.557 DEBUG [WorkbenchTestable][AbstractWait] Waiting until shell matching Matcher matching when all matchers match: [Matcher matching widget which text matches: "New Java Project"] is available. finished successfully
13:28:39.557 DEBUG [WorkbenchTestable][AbstractShell] Set focus to Shell New Java Project
13:28:39.558 DEBUG [WorkbenchTestable][AbstractWait] Waiting until shell is active...
13:28:39.558 DEBUG [WorkbenchTestable][AbstractWait] Waiting until shell is active finished successfully
13:28:39.558 TRACE [WorkbenchTestable][JavaProjectWizard] Shell New Java Project is not null and is not disposed
13:28:39.558 DEBUG [WorkbenchTestable][WidgetHandler] Get widget data
13:28:39.558 DEBUG [WorkbenchTestable][NewJavaProjectWizardPageOne] Set General Project name to 'ProblemsViewTestProject'
13:28:39.558 DEBUG [WorkbenchTestable][WidgetLookup] Looking up active widget with class type org.eclipse.swt.widgets.Text with referenced composite class org.eclipse.reddeer.eclipse.jdt.ui.wizards.NewJavaProjectWizardPageOne, index 0 and following matchers specified (Matcher matching widget with label:
is "Project name:")
13:28:39.558 DEBUG [WorkbenchTestable][AbstractWait] Waiting until widget is found...
13:28:39.558 TRACE [WorkbenchTestable][WidgetLookup] Looking up widget with index 0 with specified parent and matchers
13:28:39.563 TRACE [WorkbenchTestable][WidgetLookup] widget with index 0 is found
13:28:39.563 DEBUG [WorkbenchTestable][AbstractWait] Waiting until widget is found finished successfully
13:28:39.563 DEBUG [WorkbenchTestable][WidgetLookup] Active widget with class type org.eclipse.swt.widgets.Text and index 0 was found
13:28:39.563 DEBUG [WorkbenchTestable][AbstractText] Set focus to Text
13:28:39.564 INFO [WorkbenchTestable][AbstractText] Text set to: ProblemsViewTestProject
13:28:39.596 TRACE [WorkbenchTestable][JavaProjectWizard] Shell New Java Project is not null and is not disposed
13:28:39.596 INFO [WorkbenchTestable][JavaProjectWizard] Finish wizard
13:28:39.596 DEBUG [WorkbenchTestable][WidgetLookup] Looking up active widget with class type org.eclipse.swt.widgets.Button with referenced composite class org.eclipse.reddeer.eclipse.jdt.ui.wizards.JavaProjectWizard, index 0 and following matchers specified (Widget matcher matching widgets with style: 8, Matcher matching widgets with text that without mnenomic matches: is "Finish", Widget matcher matching widgets with style: 8)
13:28:39.596 DEBUG [WorkbenchTestable][AbstractWait] Waiting until widget is found...
13:28:39.596 TRACE [WorkbenchTestable][WidgetLookup] Looking up widget with index 0 with specified parent and matchers
13:28:39.603 TRACE [WorkbenchTestable][WidgetLookup] widget with index 0 is found
13:28:39.603 DEBUG [WorkbenchTestable][AbstractWait] Waiting until widget is found finished successfully
13:28:39.603 DEBUG [WorkbenchTestable][WidgetLookup] Active widget with class type org.eclipse.swt.widgets.Button and index 0 was found
13:28:39.603 INFO [WorkbenchTestable][AbstractButton] Click button &Finish
13:28:39.603 DEBUG [WorkbenchTestable][AbstractWait] Waiting until control is enabled...
13:28:49.607 DEBUG [WorkbenchTestable][AbstractWait] Waiting until control is enabled failed, an exception will be thrown
13:28:49.608 DEBUG [main][ScreenshotCapturer] Capturing Screenshot: ./target/screenshots/no-configuration/org.eclipse.reddeer.eclipse.test.ui.problems.ProblemsViewTest.testShowProblemColumns@Before_setUp.png
13:28:49.706 DEBUG [main][ScreenshotCapturer] Screenshot successfully captured. Saved in /home/jenkins/agent/workspace/reddeer.verification.jdk11/tests/org.eclipse.reddeer.eclipse.test/./target/screenshots/no-configuration/org.eclipse.reddeer.eclipse.test.ui.problems.ProblemsViewTest.testShowProblemColumns@Before_setUp.png
13:28:49.707 DEBUG [main][ScreenshotCapturer] Capturing Screenshot: ./target/screenshots/no-configuration/org.eclipse.reddeer.eclipse.test.ui.problems.ProblemsViewTest.tearDown@After(2).png
13:28:49.808 DEBUG [main][ScreenshotCapturer] Screenshot successfully captured. Saved in /home/jenkins/agent/workspace/reddeer.verification.jdk11/tests/org.eclipse.reddeer.eclipse.test/./target/screenshots/no-configuration/org.eclipse.reddeer.eclipse.test.ui.problems.ProblemsViewTest.tearDown@After(2).png
13:28:49.809 DEBUG [WorkbenchTestable][RunIAfterTestExtensions] Run after test extensions for test class org.eclipse.reddeer.eclipse.test.ui.problems.ProblemsViewTest
13:28:49.809 DEBUG [WorkbenchTestable][RunIAfterTestExtensions] Run method runAfterTest() of class org.eclipse.reddeer.junit.extension.after.test.impl.CloseAllShellsExt
13:28:49.809 INFO [WorkbenchTestable][WorkbenchShellHandler] Closing all shells...
13:28:49.809 DEBUG [WorkbenchTestable][AbstractWait] Waiting until active shell exists...
13:28:49.809 DEBUG [WorkbenchTestable][AbstractWait] Waiting until active shell exists finished successfully
13:28:49.809 DEBUG [main][ScreenshotCapturer] Capturing Screenshot: ./target/screenshots/no-configuration/org.eclipse.reddeer.eclipse.test.ui.problems.ProblemsViewTest.testShowProblemColumns@CloseAllShellsExt_closing_New Java Project.png
13:28:49.897 DEBUG [main][ScreenshotCapturer] Screenshot successfully captured. Saved in /home/jenkins/agent/workspace/reddeer.verification.jdk11/tests/org.eclipse.reddeer.eclipse.test/./target/screenshots/no-configuration/org.eclipse.reddeer.eclipse.test.ui.problems.ProblemsViewTest.testShowProblemColumns@CloseAllShellsExt_closing_New Java Project.png
13:28:49.897 INFO [WorkbenchTestable][WorkbenchShellHandler] Close shell New Java Project
13:28:49.898 DEBUG [WorkbenchTestable][AbstractShell] Set focus to Shell New Java Project
13:28:49.899 DEBUG [WorkbenchTestable][AbstractWait] Waiting until shell is active...
13:28:49.912 DEBUG [WorkbenchTestable][AbstractWait] Waiting until shell is active finished successfully
13:28:49.912 DEBUG [WorkbenchTestable][WidgetLookup] Looking up active widget with class type org.eclipse.swt.widgets.Button with referenced composite class org.eclipse.reddeer.swt.impl.shell.DefaultShell, index 0 and following matchers specified (Widget matcher matching widgets with style: 8, Matcher matching widgets with text that without mnenomic matches: is "Cancel")
13:28:49.912 DEBUG [WorkbenchTestable][AbstractWait] Waiting until widget is found...
13:28:49.912 TRACE [WorkbenchTestable][WidgetLookup] Looking up widget with index 0 with specified parent and matchers
13:28:49.914 TRACE [WorkbenchTestable][WidgetLookup] widget with index 0 is found
13:28:49.914 DEBUG [WorkbenchTestable][AbstractWait] Waiting until widget is found finished successfully
13:28:49.914 DEBUG [WorkbenchTestable][WidgetLookup] Active widget with class type org.eclipse.swt.widgets.Button and index 0 was found
13:28:49.914 TRACE [WorkbenchTestable][WidgetHandler] Notify Button with event 13
13:28:49.914 TRACE [WorkbenchTestable][WidgetHandler] Wait for synchronization
13:28:49.984 ERROR [WorkbenchTestable][RunIAfterTestExtensions] Run method runAfterTest() of class org.eclipse.reddeer.junit.extension.after.test.impl.CloseAllShellsExt failed
13:28:49.985 DEBUG [main][ScreenshotCapturer] Capturing Screenshot: ./target/screenshots/no-configuration/org.eclipse.reddeer.eclipse.test.ui.problems.ProblemsViewTest.testShowProblemColumns@AfterTestExt_CloseAllShellsExt.png
13:28:50.073 DEBUG [main][ScreenshotCapturer] Screenshot successfully captured. Saved in /home/jenkins/agent/workspace/reddeer.verification.jdk11/tests/org.eclipse.reddeer.eclipse.test/./target/screenshots/no-configuration/org.eclipse.reddeer.eclipse.test.ui.problems.ProblemsViewTest.testShowProblemColumns@AfterTestExt_CloseAllShellsExt.png

Standard Error

java.lang.AssertionError: The following shells remained open [New module-info.java]
	at org.junit.Assert.fail(Assert.java:89)
	at org.eclipse.reddeer.junit.extension.after.test.impl.CloseAllShellsExt.run(CloseAllShellsExt.java:79)
	at org.eclipse.reddeer.junit.extension.after.test.impl.CloseAllShellsExt.runAfterTest(CloseAllShellsExt.java:72)
	at org.eclipse.reddeer.junit.internal.runner.statement.RunIAfterTestExtensions.evaluate(RunIAfterTestExtensions.java:72)
	at org.junit.runners.ParentRunner$3.evaluate(ParentRunner.java:306)
	at org.junit.runners.ParentRunner.runLeaf(ParentRunner.java:366)
	at org.eclipse.reddeer.junit.internal.runner.RequirementsRunner.runChild(RequirementsRunner.java:171)
	at org.junit.runners.BlockJUnit4ClassRunner.runChild(BlockJUnit4ClassRunner.java:63)
	at org.junit.runners.ParentRunner$4.run(ParentRunner.java:331)
	at org.junit.runners.ParentRunner$1.schedule(ParentRunner.java:79)
	at org.junit.runners.ParentRunner.runChildren(ParentRunner.java:329)
	at org.junit.runners.ParentRunner.access$100(ParentRunner.java:66)
	at org.junit.runners.ParentRunner$2.evaluate(ParentRunner.java:293)
	at org.eclipse.reddeer.junit.internal.runner.statement.RunBeforeClasses.evaluate(RunBeforeClasses.java:81)
	at org.eclipse.reddeer.junit.internal.runner.statement.FulfillRequirementsStatement.evaluate(FulfillRequirementsStatement.java:46)
	at org.eclipse.reddeer.junit.internal.runner.statement.RunIBeforeClassExtensions.evaluate(RunIBeforeClassExtensions.java:72)
	at org.eclipse.reddeer.junit.internal.runner.statement.RunAfterClasses.evaluate(RunAfterClasses.java:68)
	at org.eclipse.reddeer.junit.internal.runner.statement.CleanUpRequirementStatement.evaluate(CleanUpRequirementStatement.java:45)
	at org.eclipse.reddeer.junit.internal.runner.statement.RunIAfterClassExtensions.evaluate(RunIAfterClassExtensions.java:57)
	at org.junit.runners.ParentRunner$3.evaluate(ParentRunner.java:306)
	at org.junit.runners.ParentRunner.run(ParentRunner.java:413)
	at org.eclipse.reddeer.junit.internal.runner.RequirementsRunner.run(RequirementsRunner.java:153)
	at org.junit.runners.Suite.runChild(Suite.java:128)
	at org.junit.runners.Suite.runChild(Suite.java:27)
	at org.junit.runners.ParentRunner$4.run(ParentRunner.java:331)
	at org.junit.runners.ParentRunner$1.schedule(ParentRunner.java:79)
	at org.junit.runners.ParentRunner.runChildren(ParentRunner.java:329)
	at org.junit.runners.ParentRunner.access$100(ParentRunner.java:66)
	at org.junit.runners.ParentRunner$2.evaluate(ParentRunner.java:293)
	at org.junit.runners.ParentRunner$3.evaluate(ParentRunner.java:306)
	at org.junit.runners.ParentRunner.run(ParentRunner.java:413)
	at org.junit.runners.Suite.runChild(Suite.java:128)
	at org.junit.runners.Suite.runChild(Suite.java:27)
	at org.junit.runners.ParentRunner$4.run(ParentRunner.java:331)
	at org.junit.runners.ParentRunner$1.schedule(ParentRunner.java:79)
	at org.junit.runners.ParentRunner.runChildren(ParentRunner.java:329)
	at org.junit.runners.ParentRunner.access$100(ParentRunner.java:66)
	at org.junit.runners.ParentRunner$2.evaluate(ParentRunner.java:293)
	at org.junit.runners.ParentRunner$3.evaluate(ParentRunner.java:306)
	at org.junit.runners.ParentRunner.run(ParentRunner.java:413)
	at org.apache.maven.surefire.junit4.JUnit4Provider.execute(JUnit4Provider.java:365)
	at org.apache.maven.surefire.junit4.JUnit4Provider.executeWithRerun(JUnit4Provider.java:273)
	at org.apache.maven.surefire.junit4.JUnit4Provider.executeTestSet(JUnit4Provider.java:238)
	at org.apache.maven.surefire.junit4.JUnit4Provider.invoke(JUnit4Provider.java:159)
	at java.base/jdk.internal.reflect.NativeMethodAccessorImpl.invoke0(Native Method)
	at java.base/jdk.internal.reflect.NativeMethodAccessorImpl.invoke(NativeMethodAccessorImpl.java:62)
	at java.base/jdk.internal.reflect.DelegatingMethodAccessorImpl.invoke(DelegatingMethodAccessorImpl.java:43)
	at java.base/java.lang.reflect.Method.invoke(Method.java:566)
	at org.apache.maven.surefire.util.ReflectionUtils.invokeMethodWithArray2(ReflectionUtils.java:206)
	at org.apache.maven.surefire.booter.ProviderFactory$ProviderProxy.invoke(ProviderFactory.java:161)
	at org.apache.maven.surefire.booter.ProviderFactory.invokeProvider(ProviderFactory.java:84)
	at org.eclipse.tycho.surefire.osgibooter.OsgiSurefireBooter.run(OsgiSurefireBooter.java:116)
	at org.eclipse.tycho.surefire.osgibooter.AbstractUITestApplication.runTests(AbstractUITestApplication.java:46)
	at org.eclipse.e4.ui.internal.workbench.swt.E4Testable.lambda$0(E4Testable.java:76)
	at java.base/java.lang.Thread.run(Thread.java:834)
java.lang.AssertionError: The following shells remained open [New Java Project]
	at org.junit.Assert.fail(Assert.java:89)
	at org.eclipse.reddeer.junit.extension.after.test.impl.CloseAllShellsExt.run(CloseAllShellsExt.java:79)
	at org.eclipse.reddeer.junit.extension.after.test.impl.CloseAllShellsExt.runAfterTest(CloseAllShellsExt.java:72)
	at org.eclipse.reddeer.junit.internal.runner.statement.RunIAfterTestExtensions.evaluate(RunIAfterTestExtensions.java:72)
	at org.junit.runners.ParentRunner$3.evaluate(ParentRunner.java:306)
	at org.junit.runners.ParentRunner.runLeaf(ParentRunner.java:366)
	at org.eclipse.reddeer.junit.internal.runner.RequirementsRunner.runChild(RequirementsRunner.java:171)
	at org.junit.runners.BlockJUnit4ClassRunner.runChild(BlockJUnit4ClassRunner.java:63)
	at org.junit.runners.ParentRunner$4.run(ParentRunner.java:331)
	at org.junit.runners.ParentRunner$1.schedule(ParentRunner.java:79)
	at org.junit.runners.ParentRunner.runChildren(ParentRunner.java:329)
	at org.junit.runners.ParentRunner.access$100(ParentRunner.java:66)
	at org.junit.runners.ParentRunner$2.evaluate(ParentRunner.java:293)
	at org.eclipse.reddeer.junit.internal.runner.statement.RunBeforeClasses.evaluate(RunBeforeClasses.java:81)
	at org.eclipse.reddeer.junit.internal.runner.statement.FulfillRequirementsStatement.evaluate(FulfillRequirementsStatement.java:46)
	at org.eclipse.reddeer.junit.internal.runner.statement.RunIBeforeClassExtensions.evaluate(RunIBeforeClassExtensions.java:72)
	at org.eclipse.reddeer.junit.internal.runner.statement.RunAfterClasses.evaluate(RunAfterClasses.java:68)
	at org.eclipse.reddeer.junit.internal.runner.statement.CleanUpRequirementStatement.evaluate(CleanUpRequirementStatement.java:45)
	at org.eclipse.reddeer.junit.internal.runner.statement.RunIAfterClassExtensions.evaluate(RunIAfterClassExtensions.java:57)
	at org.junit.runners.ParentRunner$3.evaluate(ParentRunner.java:306)
	at org.junit.runners.ParentRunner.run(ParentRunner.java:413)
	at org.eclipse.reddeer.junit.internal.runner.RequirementsRunner.run(RequirementsRunner.java:153)
	at org.junit.runners.Suite.runChild(Suite.java:128)
	at org.junit.runners.Suite.runChild(Suite.java:27)
	at org.junit.runners.ParentRunner$4.run(ParentRunner.java:331)
	at org.junit.runners.ParentRunner$1.schedule(ParentRunner.java:79)
	at org.junit.runners.ParentRunner.runChildren(ParentRunner.java:329)
	at org.junit.runners.ParentRunner.access$100(ParentRunner.java:66)
	at org.junit.runners.ParentRunner$2.evaluate(ParentRunner.java:293)
	at org.junit.runners.ParentRunner$3.evaluate(ParentRunner.java:306)
	at org.junit.runners.ParentRunner.run(ParentRunner.java:413)
	at org.junit.runners.Suite.runChild(Suite.java:128)
	at org.junit.runners.Suite.runChild(Suite.java:27)
	at org.junit.runners.ParentRunner$4.run(ParentRunner.java:331)
	at org.junit.runners.ParentRunner$1.schedule(ParentRunner.java:79)
	at org.junit.runners.ParentRunner.runChildren(ParentRunner.java:329)
	at org.junit.runners.ParentRunner.access$100(ParentRunner.java:66)
	at org.junit.runners.ParentRunner$2.evaluate(ParentRunner.java:293)
	at org.junit.runners.ParentRunner$3.evaluate(ParentRunner.java:306)
	at org.junit.runners.ParentRunner.run(ParentRunner.java:413)
	at org.apache.maven.surefire.junit4.JUnit4Provider.execute(JUnit4Provider.java:365)
	at org.apache.maven.surefire.junit4.JUnit4Provider.executeWithRerun(JUnit4Provider.java:273)
	at org.apache.maven.surefire.junit4.JUnit4Provider.executeTestSet(JUnit4Provider.java:238)
	at org.apache.maven.surefire.junit4.JUnit4Provider.invoke(JUnit4Provider.java:159)
	at java.base/jdk.internal.reflect.NativeMethodAccessorImpl.invoke0(Native Method)
	at java.base/jdk.internal.reflect.NativeMethodAccessorImpl.invoke(NativeMethodAccessorImpl.java:62)
	at java.base/jdk.internal.reflect.DelegatingMethodAccessorImpl.invoke(DelegatingMethodAccessorImpl.java:43)
	at java.base/java.lang.reflect.Method.invoke(Method.java:566)
	at org.apache.maven.surefire.util.ReflectionUtils.invokeMethodWithArray2(ReflectionUtils.java:206)
	at org.apache.maven.surefire.booter.ProviderFactory$ProviderProxy.invoke(ProviderFactory.java:161)
	at org.apache.maven.surefire.booter.ProviderFactory.invokeProvider(ProviderFactory.java:84)
	at org.eclipse.tycho.surefire.osgibooter.OsgiSurefireBooter.run(OsgiSurefireBooter.java:116)
	at org.eclipse.tycho.surefire.osgibooter.AbstractUITestApplication.runTests(AbstractUITestApplication.java:46)
	at org.eclipse.e4.ui.internal.workbench.swt.E4Testable.lambda$0(E4Testable.java:76)
	at java.base/java.lang.Thread.run(Thread.java:834)