Regression

org.eclipse.reddeer.eclipse.test.ui.problems.ProblemsViewTest.testOneErrorOneWarning no-configuration

Failing for the past 1 build (Since #31 )
Took 10 sec.

Error Message

Timeout after: 10 s.: control is enabled

Stacktrace

org.eclipse.reddeer.common.exception.WaitTimeoutExpiredException: Timeout after: 10 s.: control is enabled
	at org.eclipse.reddeer.eclipse.test.ui.problems.ProblemsViewTest.setUp(ProblemsViewTest.java:98)

Standard Output

13:29:33.548 ERROR [WorkbenchTestable][RequirementsRunner] Failed test: testShowProblemColumnEmptyArrayArgument no-configuration(org.eclipse.reddeer.eclipse.test.ui.problems.ProblemsViewTest)
13:29:33.548 INFO [WorkbenchTestable][RequirementsRunner] Finished test: testShowProblemColumnEmptyArrayArgument no-configuration(org.eclipse.reddeer.eclipse.test.ui.problems.ProblemsViewTest)
13:29:33.548 DEBUG [WorkbenchTestable][RequirementsRunner] Injecting fulfilled requirements into test instance: org.eclipse.reddeer.junit.internal.requirement.Requirements
13:29:33.549 INFO [WorkbenchTestable][RequirementsRunner] Started test: testOneErrorOneWarning no-configuration(org.eclipse.reddeer.eclipse.test.ui.problems.ProblemsViewTest)
13:29:33.549 DEBUG [WorkbenchTestable][RunIBeforeTestExtensions] Run before test extensions for test class org.eclipse.reddeer.eclipse.test.ui.problems.ProblemsViewTest
13:29:33.549 DEBUG [WorkbenchTestable][RunIBeforeTestExtensions] Run method runBeforeTest() of class org.eclipse.reddeer.junit.extension.before.test.impl.CloseWelcomeScreenExt
13:29:33.549 DEBUG [WorkbenchTestable][RunIBeforeTestExtensions] Run method runBeforeTest() of class org.eclipse.reddeer.junit.extension.before.test.impl.SetOpenAssociatedPerspectiveExt
13:29:33.549 DEBUG [WorkbenchTestable][RunIBeforeTestExtensions] Run method runBeforeTest() of class org.eclipse.reddeer.junit.extension.before.test.impl.DoNotDownloadMavenIndexesExt
13:29:33.549 DEBUG [WorkbenchTestable][WindowIsAvailable] Looking for Window matching Matcher matching when all matchers match: [Window matching class class org.eclipse.jface.wizard.WizardDialog, Matcher matching widget which text matches: Matcher matching text to regular expression 'New|Select a wizard']
13:29:33.570 DEBUG [WorkbenchTestable][WidgetHandler] Get widget data
13:29:33.570 DEBUG [WorkbenchTestable][WindowIsAvailable] Looking for Window matching Matcher matching when all matchers match: [Window matching class class org.eclipse.jface.wizard.WizardDialog, Matcher matching widget which text matches: Matcher matching text to regular expression 'New|Select a wizard']
13:29:33.570 DEBUG [WorkbenchTestable][WidgetHandler] Get widget data
13:29:33.570 DEBUG [WorkbenchTestable][WindowIsAvailable] Looking for Window matching Matcher matching when all matchers match: [Window matching class class org.eclipse.jface.wizard.WizardDialog, Matcher matching widget which text matches: "New Java Project"]
13:29:33.570 DEBUG [WorkbenchTestable][WidgetHandler] Get widget data
13:29:33.571 DEBUG [WorkbenchTestable][WindowIsAvailable] Looking for Window matching Matcher matching when all matchers match: [Window matching class class org.eclipse.jface.wizard.WizardDialog, Matcher matching widget which text matches: Matcher matching text to regular expression 'New|Select a wizard']
13:29:33.571 DEBUG [WorkbenchTestable][WidgetHandler] Get widget data
13:29:33.571 DEBUG [WorkbenchTestable][WindowIsAvailable] Looking for Window matching Matcher matching when all matchers match: [Window matching class class org.eclipse.jface.wizard.WizardDialog, Matcher matching widget which text matches: Matcher matching text to regular expression 'New|Select a wizard']
13:29:33.571 DEBUG [WorkbenchTestable][WidgetHandler] Get widget data
13:29:33.571 DEBUG [WorkbenchTestable][WindowIsAvailable] Looking for Window matching Matcher matching when all matchers match: [Window matching class class org.eclipse.jface.wizard.WizardDialog, Matcher matching widget which text matches: Matcher matching text to regular expression 'New|Select a wizard']
13:29:33.571 DEBUG [WorkbenchTestable][WidgetHandler] Get widget data
13:29:33.571 DEBUG [WorkbenchTestable][WindowIsAvailable] Looking for Window matching Matcher matching when all matchers match: [Window matching class class org.eclipse.jface.wizard.WizardDialog, Matcher matching widget which text matches: "New Java Project"]
13:29:33.571 DEBUG [WorkbenchTestable][WidgetHandler] Get widget data
13:29:33.571 DEBUG [WorkbenchTestable][WindowIsAvailable] Looking for Window matching Matcher matching when all matchers match: [Window matching class class org.eclipse.jface.wizard.WizardDialog, Matcher matching widget which text matches: Matcher matching text to regular expression 'New|Select a wizard']
13:29:33.571 DEBUG [WorkbenchTestable][WidgetHandler] Get widget data
13:29:33.571 DEBUG [WorkbenchTestable][WindowIsAvailable] Looking for Window matching Matcher matching when all matchers match: [Window matching class class org.eclipse.jface.wizard.WizardDialog, Matcher matching widget which text matches: Matcher matching text to regular expression 'New|Select a wizard']
13:29:33.571 DEBUG [WorkbenchTestable][WidgetHandler] Get widget data
13:29:33.571 DEBUG [WorkbenchTestable][AbstractShell] Set focus to Shell data - Eclipse Platform
13:29:33.572 DEBUG [WorkbenchTestable][AbstractWait] Waiting until shell is active...
13:29:33.572 DEBUG [WorkbenchTestable][AbstractWait] Waiting until shell is active finished successfully
13:29:33.572 DEBUG [WorkbenchTestable][WorkbenchShell] Workbench shell has title 'data - Eclipse Platform'
13:29:33.572 INFO [WorkbenchTestable][ShellHandler] Getting Menu Bar of shell 'data - Eclipse Platform'
13:29:33.572 DEBUG [main][MenuItemLookup] Found menu:'File'
13:29:33.572 DEBUG [main][MenuItemLookup] Item match:File
13:29:33.573 DEBUG [main][MenuItemLookup] Found menu:'New	Shift+Alt+N'
13:29:33.573 DEBUG [main][MenuItemLookup] Item match:New	Shift+Alt+N
13:29:33.577 DEBUG [main][MenuItemLookup] Found menu:'Java Project'
13:29:33.577 DEBUG [main][MenuItemLookup] Found menu:'Project...'
13:29:33.577 DEBUG [main][MenuItemLookup] Found menu:''
13:29:33.577 DEBUG [main][MenuItemLookup] Found menu:'Package'
13:29:33.577 DEBUG [main][MenuItemLookup] Found menu:'Class'
13:29:33.577 DEBUG [main][MenuItemLookup] Found menu:'Interface'
13:29:33.577 DEBUG [main][MenuItemLookup] Found menu:'Enum'
13:29:33.577 DEBUG [main][MenuItemLookup] Found menu:'Record'
13:29:33.577 DEBUG [main][MenuItemLookup] Found menu:'Annotation'
13:29:33.577 DEBUG [main][MenuItemLookup] Found menu:'Source Folder'
13:29:33.577 DEBUG [main][MenuItemLookup] Found menu:'Java Working Set'
13:29:33.577 DEBUG [main][MenuItemLookup] Found menu:'Folder'
13:29:33.577 DEBUG [main][MenuItemLookup] Found menu:'File'
13:29:33.577 DEBUG [main][MenuItemLookup] Found menu:'Untitled Text File'
13:29:33.577 DEBUG [main][MenuItemLookup] Found menu:'Task'
13:29:33.577 DEBUG [main][MenuItemLookup] Found menu:'JUnit Test Case'
13:29:33.577 DEBUG [main][MenuItemLookup] Found menu:''
13:29:33.577 DEBUG [main][MenuItemLookup] Found menu:'Example...'
13:29:33.577 DEBUG [main][MenuItemLookup] Found menu:''
13:29:33.577 DEBUG [main][MenuItemLookup] Found menu:'Other...	Ctrl+N'
13:29:33.577 DEBUG [main][MenuItemLookup] Item match:Other...	Ctrl+N
13:29:33.577 DEBUG [WorkbenchTestable][MenuItemHandler] Queried MenuItem text:"&Other...	Ctrl+N"
13:29:33.577 INFO [WorkbenchTestable][AbstractMenuItem] Select menu item with text Other...	Ctrl+N
13:29:33.578 INFO [main][MenuItemHandler] Select menu item: &Other...	Ctrl+N
13:29:33.656 DEBUG [WorkbenchTestable][AbstractWait] Waiting until shell matching Matcher matching when all matchers match: [Matcher matching widget which text matches: Matcher matching text to regular expression 'New|Select a wizard'] is available....
13:29:33.660 DEBUG [WorkbenchTestable][AbstractWait] Waiting until shell matching Matcher matching when all matchers match: [Matcher matching widget which text matches: Matcher matching text to regular expression 'New|Select a wizard'] is available. finished successfully
13:29:33.661 DEBUG [WorkbenchTestable][AbstractShell] Set focus to Shell Select a wizard
13:29:33.662 DEBUG [WorkbenchTestable][AbstractWait] Waiting until shell is active...
13:29:33.662 DEBUG [WorkbenchTestable][AbstractWait] Waiting until shell is active finished successfully
13:29:33.662 TRACE [WorkbenchTestable][NewWizard] Shell Select a wizard is not null and is not disposed
13:29:33.662 DEBUG [WorkbenchTestable][WidgetHandler] Get widget data
13:29:33.662 DEBUG [WorkbenchTestable][WidgetLookup] Looking up active widget with class type org.eclipse.swt.widgets.Tree with referenced composite class org.eclipse.reddeer.eclipse.selectionwizard.SelectionWizardOpenable$1, index 0 and no matchers specified
13:29:33.662 DEBUG [WorkbenchTestable][AbstractWait] Waiting until widget is found...
13:29:33.662 TRACE [WorkbenchTestable][WidgetLookup] Looking up widget with index 0 with specified parent and matchers
13:29:33.663 TRACE [WorkbenchTestable][WidgetLookup] widget with index 0 is found
13:29:33.663 DEBUG [WorkbenchTestable][AbstractWait] Waiting until widget is found finished successfully
13:29:33.663 DEBUG [WorkbenchTestable][WidgetLookup] Active widget with class type org.eclipse.swt.widgets.Tree and index 0 was found
13:29:33.664 DEBUG [WorkbenchTestable][AbstractWait] Waiting until tree has children...
13:29:33.664 DEBUG [WorkbenchTestable][AbstractWait] Waiting until tree has children finished successfully
13:29:33.664 DEBUG [WorkbenchTestable][AbstractWait] Waiting until treeItem Java has children...
13:29:33.664 DEBUG [WorkbenchTestable][TreeItemHandler] Expand Tree Item Java
13:29:33.664 DEBUG [WorkbenchTestable][AbstractWait] Waiting until tree heard expand notification...
13:29:33.665 DEBUG [WorkbenchTestable][TreeItemHandler] Tree Item Java is already expanded. No action performed
13:29:33.665 DEBUG [WorkbenchTestable][AbstractWait] Waiting until tree heard expand notification finished successfully
13:29:33.665 INFO [WorkbenchTestable][TreeItemHandler] Expanded: Java
13:29:33.665 DEBUG [WorkbenchTestable][AbstractWait] Waiting until treeItem Java has children finished successfully
13:29:33.665 DEBUG [WorkbenchTestable][TreeItemHandler] Expand Tree Item Java
13:29:33.665 DEBUG [WorkbenchTestable][AbstractWait] Waiting until tree heard expand notification...
13:29:33.665 DEBUG [WorkbenchTestable][TreeItemHandler] Tree Item Java is already expanded. No action performed
13:29:33.665 DEBUG [WorkbenchTestable][AbstractWait] Waiting until tree heard expand notification finished successfully
13:29:33.665 INFO [WorkbenchTestable][TreeItemHandler] Expanded: Java
13:29:33.665 INFO [WorkbenchTestable][AbstractTreeItem] Select tree item Java Project
13:29:33.665 DEBUG [main][TreeItemHandler] Selecting tree item: Java Project
13:29:33.673 DEBUG [WorkbenchTestable][TreeItemHandler] Notify tree item Java Project about selection
13:29:33.673 INFO [WorkbenchTestable][TreeItemHandler] Selected tree item: Java Project
13:29:33.673 TRACE [WorkbenchTestable][NewWizard] Shell Select a wizard is not null and is not disposed
13:29:33.673 INFO [WorkbenchTestable][NewWizard] Go to next wizard page
13:29:33.673 DEBUG [WorkbenchTestable][WidgetLookup] Looking up active widget with class type org.eclipse.swt.widgets.Button with referenced composite class org.eclipse.reddeer.eclipse.ui.dialogs.NewWizard, index 0 and following matchers specified (Widget matcher matching widgets with style: 8, Matcher matching widgets with text that without mnenomic matches: is "Next >", Widget matcher matching widgets with style: 8)
13:29:33.673 DEBUG [WorkbenchTestable][AbstractWait] Waiting until widget is found...
13:29:33.673 TRACE [WorkbenchTestable][WidgetLookup] Looking up widget with index 0 with specified parent and matchers
13:29:33.675 TRACE [WorkbenchTestable][WidgetLookup] widget with index 0 is found
13:29:33.675 DEBUG [WorkbenchTestable][AbstractWait] Waiting until widget is found finished successfully
13:29:33.675 DEBUG [WorkbenchTestable][WidgetLookup] Active widget with class type org.eclipse.swt.widgets.Button and index 0 was found
13:29:33.675 INFO [WorkbenchTestable][AbstractButton] Click button &Next >
13:29:33.675 DEBUG [WorkbenchTestable][AbstractWait] Waiting until control is enabled...
13:29:33.675 DEBUG [WorkbenchTestable][AbstractWait] Waiting until control is enabled finished successfully
13:29:33.676 TRACE [WorkbenchTestable][WidgetHandler] Notify Button with event 13
13:29:33.676 TRACE [WorkbenchTestable][WidgetHandler] Wait for synchronization
13:29:33.872 DEBUG [WorkbenchTestable][WindowIsAvailable] Looking for Window matching Matcher matching when all matchers match: [Window matching class class org.eclipse.jface.wizard.WizardDialog, Matcher matching widget which text matches: Matcher matching text to regular expression 'New|Select a wizard']
13:29:33.878 DEBUG [WorkbenchTestable][WidgetHandler] Get widget data
13:29:33.878 DEBUG [WorkbenchTestable][WidgetHandler] Get widget data
13:29:33.878 DEBUG [WorkbenchTestable][AbstractWait] Waiting until shell matching Matcher matching when all matchers match: [Matcher matching widget which text matches: "New Java Project"] is available....
13:29:33.878 DEBUG [WorkbenchTestable][AbstractWait] Waiting until shell matching Matcher matching when all matchers match: [Matcher matching widget which text matches: "New Java Project"] is available. finished successfully
13:29:33.878 DEBUG [WorkbenchTestable][AbstractShell] Set focus to Shell New Java Project
13:29:33.879 DEBUG [WorkbenchTestable][AbstractWait] Waiting until shell is active...
13:29:33.879 DEBUG [WorkbenchTestable][AbstractWait] Waiting until shell is active finished successfully
13:29:33.879 TRACE [WorkbenchTestable][JavaProjectWizard] Shell New Java Project is not null and is not disposed
13:29:33.879 DEBUG [WorkbenchTestable][WidgetHandler] Get widget data
13:29:33.879 DEBUG [WorkbenchTestable][NewJavaProjectWizardPageOne] Set General Project name to 'ProblemsViewTestProject'
13:29:33.880 DEBUG [WorkbenchTestable][WidgetLookup] Looking up active widget with class type org.eclipse.swt.widgets.Text with referenced composite class org.eclipse.reddeer.eclipse.jdt.ui.wizards.NewJavaProjectWizardPageOne, index 0 and following matchers specified (Matcher matching widget with label:
is "Project name:")
13:29:33.880 DEBUG [WorkbenchTestable][AbstractWait] Waiting until widget is found...
13:29:33.880 TRACE [WorkbenchTestable][WidgetLookup] Looking up widget with index 0 with specified parent and matchers
13:29:33.884 TRACE [WorkbenchTestable][WidgetLookup] widget with index 0 is found
13:29:33.884 DEBUG [WorkbenchTestable][AbstractWait] Waiting until widget is found finished successfully
13:29:33.884 DEBUG [WorkbenchTestable][WidgetLookup] Active widget with class type org.eclipse.swt.widgets.Text and index 0 was found
13:29:33.884 DEBUG [WorkbenchTestable][AbstractText] Set focus to Text
13:29:33.885 INFO [WorkbenchTestable][AbstractText] Text set to: ProblemsViewTestProject
13:29:33.920 TRACE [WorkbenchTestable][JavaProjectWizard] Shell New Java Project is not null and is not disposed
13:29:33.920 INFO [WorkbenchTestable][JavaProjectWizard] Finish wizard
13:29:33.920 DEBUG [WorkbenchTestable][WidgetLookup] Looking up active widget with class type org.eclipse.swt.widgets.Button with referenced composite class org.eclipse.reddeer.eclipse.jdt.ui.wizards.JavaProjectWizard, index 0 and following matchers specified (Widget matcher matching widgets with style: 8, Matcher matching widgets with text that without mnenomic matches: is "Finish", Widget matcher matching widgets with style: 8)
13:29:33.920 DEBUG [WorkbenchTestable][AbstractWait] Waiting until widget is found...
13:29:33.920 TRACE [WorkbenchTestable][WidgetLookup] Looking up widget with index 0 with specified parent and matchers
13:29:33.924 TRACE [WorkbenchTestable][WidgetLookup] widget with index 0 is found
13:29:33.924 DEBUG [WorkbenchTestable][AbstractWait] Waiting until widget is found finished successfully
13:29:33.924 DEBUG [WorkbenchTestable][WidgetLookup] Active widget with class type org.eclipse.swt.widgets.Button and index 0 was found
13:29:33.924 INFO [WorkbenchTestable][AbstractButton] Click button &Finish
13:29:33.924 DEBUG [WorkbenchTestable][AbstractWait] Waiting until control is enabled...
13:29:43.929 DEBUG [WorkbenchTestable][AbstractWait] Waiting until control is enabled failed, an exception will be thrown
13:29:43.929 DEBUG [main][ScreenshotCapturer] Capturing Screenshot: ./target/screenshots/no-configuration/org.eclipse.reddeer.eclipse.test.ui.problems.ProblemsViewTest.testOneErrorOneWarning@Before_setUp.png
13:29:44.018 DEBUG [main][ScreenshotCapturer] Screenshot successfully captured. Saved in /home/jenkins/agent/workspace/reddeer.verification.jdk11/tests/org.eclipse.reddeer.eclipse.test/./target/screenshots/no-configuration/org.eclipse.reddeer.eclipse.test.ui.problems.ProblemsViewTest.testOneErrorOneWarning@Before_setUp.png
13:29:44.019 DEBUG [main][ScreenshotCapturer] Capturing Screenshot: ./target/screenshots/no-configuration/org.eclipse.reddeer.eclipse.test.ui.problems.ProblemsViewTest.tearDown@After(7).png
13:29:44.107 DEBUG [main][ScreenshotCapturer] Screenshot successfully captured. Saved in /home/jenkins/agent/workspace/reddeer.verification.jdk11/tests/org.eclipse.reddeer.eclipse.test/./target/screenshots/no-configuration/org.eclipse.reddeer.eclipse.test.ui.problems.ProblemsViewTest.tearDown@After(7).png
13:29:44.107 DEBUG [WorkbenchTestable][RunIAfterTestExtensions] Run after test extensions for test class org.eclipse.reddeer.eclipse.test.ui.problems.ProblemsViewTest
13:29:44.107 DEBUG [WorkbenchTestable][RunIAfterTestExtensions] Run method runAfterTest() of class org.eclipse.reddeer.junit.extension.after.test.impl.CloseAllShellsExt
13:29:44.107 INFO [WorkbenchTestable][WorkbenchShellHandler] Closing all shells...
13:29:44.107 DEBUG [WorkbenchTestable][AbstractWait] Waiting until active shell exists...
13:29:44.107 DEBUG [WorkbenchTestable][AbstractWait] Waiting until active shell exists finished successfully
13:29:44.108 DEBUG [main][ScreenshotCapturer] Capturing Screenshot: ./target/screenshots/no-configuration/org.eclipse.reddeer.eclipse.test.ui.problems.ProblemsViewTest.testOneErrorOneWarning@CloseAllShellsExt_closing_New Java Project.png
13:29:44.194 DEBUG [main][ScreenshotCapturer] Screenshot successfully captured. Saved in /home/jenkins/agent/workspace/reddeer.verification.jdk11/tests/org.eclipse.reddeer.eclipse.test/./target/screenshots/no-configuration/org.eclipse.reddeer.eclipse.test.ui.problems.ProblemsViewTest.testOneErrorOneWarning@CloseAllShellsExt_closing_New Java Project.png
13:29:44.194 INFO [WorkbenchTestable][WorkbenchShellHandler] Close shell New Java Project
13:29:44.194 DEBUG [WorkbenchTestable][AbstractShell] Set focus to Shell New Java Project
13:29:44.195 DEBUG [WorkbenchTestable][AbstractWait] Waiting until shell is active...
13:29:44.208 DEBUG [WorkbenchTestable][AbstractWait] Waiting until shell is active finished successfully
13:29:44.208 DEBUG [WorkbenchTestable][WidgetLookup] Looking up active widget with class type org.eclipse.swt.widgets.Button with referenced composite class org.eclipse.reddeer.swt.impl.shell.DefaultShell, index 0 and following matchers specified (Widget matcher matching widgets with style: 8, Matcher matching widgets with text that without mnenomic matches: is "Cancel")
13:29:44.208 DEBUG [WorkbenchTestable][AbstractWait] Waiting until widget is found...
13:29:44.208 TRACE [WorkbenchTestable][WidgetLookup] Looking up widget with index 0 with specified parent and matchers
13:29:44.210 TRACE [WorkbenchTestable][WidgetLookup] widget with index 0 is found
13:29:44.210 DEBUG [WorkbenchTestable][AbstractWait] Waiting until widget is found finished successfully
13:29:44.210 DEBUG [WorkbenchTestable][WidgetLookup] Active widget with class type org.eclipse.swt.widgets.Button and index 0 was found
13:29:44.210 TRACE [WorkbenchTestable][WidgetHandler] Notify Button with event 13
13:29:44.210 TRACE [WorkbenchTestable][WidgetHandler] Wait for synchronization
13:29:44.274 ERROR [WorkbenchTestable][RunIAfterTestExtensions] Run method runAfterTest() of class org.eclipse.reddeer.junit.extension.after.test.impl.CloseAllShellsExt failed
13:29:44.275 DEBUG [main][ScreenshotCapturer] Capturing Screenshot: ./target/screenshots/no-configuration/org.eclipse.reddeer.eclipse.test.ui.problems.ProblemsViewTest.testOneErrorOneWarning@AfterTestExt_CloseAllShellsExt.png
13:29:44.357 DEBUG [main][ScreenshotCapturer] Screenshot successfully captured. Saved in /home/jenkins/agent/workspace/reddeer.verification.jdk11/tests/org.eclipse.reddeer.eclipse.test/./target/screenshots/no-configuration/org.eclipse.reddeer.eclipse.test.ui.problems.ProblemsViewTest.testOneErrorOneWarning@AfterTestExt_CloseAllShellsExt.png

Standard Error

java.lang.AssertionError: The following shells remained open [New Java Project]
	at org.junit.Assert.fail(Assert.java:89)
	at org.eclipse.reddeer.junit.extension.after.test.impl.CloseAllShellsExt.run(CloseAllShellsExt.java:79)
	at org.eclipse.reddeer.junit.extension.after.test.impl.CloseAllShellsExt.runAfterTest(CloseAllShellsExt.java:72)
	at org.eclipse.reddeer.junit.internal.runner.statement.RunIAfterTestExtensions.evaluate(RunIAfterTestExtensions.java:72)
	at org.junit.runners.ParentRunner$3.evaluate(ParentRunner.java:306)
	at org.junit.runners.ParentRunner.runLeaf(ParentRunner.java:366)
	at org.eclipse.reddeer.junit.internal.runner.RequirementsRunner.runChild(RequirementsRunner.java:171)
	at org.junit.runners.BlockJUnit4ClassRunner.runChild(BlockJUnit4ClassRunner.java:63)
	at org.junit.runners.ParentRunner$4.run(ParentRunner.java:331)
	at org.junit.runners.ParentRunner$1.schedule(ParentRunner.java:79)
	at org.junit.runners.ParentRunner.runChildren(ParentRunner.java:329)
	at org.junit.runners.ParentRunner.access$100(ParentRunner.java:66)
	at org.junit.runners.ParentRunner$2.evaluate(ParentRunner.java:293)
	at org.eclipse.reddeer.junit.internal.runner.statement.RunBeforeClasses.evaluate(RunBeforeClasses.java:81)
	at org.eclipse.reddeer.junit.internal.runner.statement.FulfillRequirementsStatement.evaluate(FulfillRequirementsStatement.java:46)
	at org.eclipse.reddeer.junit.internal.runner.statement.RunIBeforeClassExtensions.evaluate(RunIBeforeClassExtensions.java:72)
	at org.eclipse.reddeer.junit.internal.runner.statement.RunAfterClasses.evaluate(RunAfterClasses.java:68)
	at org.eclipse.reddeer.junit.internal.runner.statement.CleanUpRequirementStatement.evaluate(CleanUpRequirementStatement.java:45)
	at org.eclipse.reddeer.junit.internal.runner.statement.RunIAfterClassExtensions.evaluate(RunIAfterClassExtensions.java:57)
	at org.junit.runners.ParentRunner$3.evaluate(ParentRunner.java:306)
	at org.junit.runners.ParentRunner.run(ParentRunner.java:413)
	at org.eclipse.reddeer.junit.internal.runner.RequirementsRunner.run(RequirementsRunner.java:153)
	at org.junit.runners.Suite.runChild(Suite.java:128)
	at org.junit.runners.Suite.runChild(Suite.java:27)
	at org.junit.runners.ParentRunner$4.run(ParentRunner.java:331)
	at org.junit.runners.ParentRunner$1.schedule(ParentRunner.java:79)
	at org.junit.runners.ParentRunner.runChildren(ParentRunner.java:329)
	at org.junit.runners.ParentRunner.access$100(ParentRunner.java:66)
	at org.junit.runners.ParentRunner$2.evaluate(ParentRunner.java:293)
	at org.junit.runners.ParentRunner$3.evaluate(ParentRunner.java:306)
	at org.junit.runners.ParentRunner.run(ParentRunner.java:413)
	at org.junit.runners.Suite.runChild(Suite.java:128)
	at org.junit.runners.Suite.runChild(Suite.java:27)
	at org.junit.runners.ParentRunner$4.run(ParentRunner.java:331)
	at org.junit.runners.ParentRunner$1.schedule(ParentRunner.java:79)
	at org.junit.runners.ParentRunner.runChildren(ParentRunner.java:329)
	at org.junit.runners.ParentRunner.access$100(ParentRunner.java:66)
	at org.junit.runners.ParentRunner$2.evaluate(ParentRunner.java:293)
	at org.junit.runners.ParentRunner$3.evaluate(ParentRunner.java:306)
	at org.junit.runners.ParentRunner.run(ParentRunner.java:413)
	at org.apache.maven.surefire.junit4.JUnit4Provider.execute(JUnit4Provider.java:365)
	at org.apache.maven.surefire.junit4.JUnit4Provider.executeWithRerun(JUnit4Provider.java:273)
	at org.apache.maven.surefire.junit4.JUnit4Provider.executeTestSet(JUnit4Provider.java:238)
	at org.apache.maven.surefire.junit4.JUnit4Provider.invoke(JUnit4Provider.java:159)
	at java.base/jdk.internal.reflect.NativeMethodAccessorImpl.invoke0(Native Method)
	at java.base/jdk.internal.reflect.NativeMethodAccessorImpl.invoke(NativeMethodAccessorImpl.java:62)
	at java.base/jdk.internal.reflect.DelegatingMethodAccessorImpl.invoke(DelegatingMethodAccessorImpl.java:43)
	at java.base/java.lang.reflect.Method.invoke(Method.java:566)
	at org.apache.maven.surefire.util.ReflectionUtils.invokeMethodWithArray2(ReflectionUtils.java:206)
	at org.apache.maven.surefire.booter.ProviderFactory$ProviderProxy.invoke(ProviderFactory.java:161)
	at org.apache.maven.surefire.booter.ProviderFactory.invokeProvider(ProviderFactory.java:84)
	at org.eclipse.tycho.surefire.osgibooter.OsgiSurefireBooter.run(OsgiSurefireBooter.java:116)
	at org.eclipse.tycho.surefire.osgibooter.AbstractUITestApplication.runTests(AbstractUITestApplication.java:46)
	at org.eclipse.e4.ui.internal.workbench.swt.E4Testable.lambda$0(E4Testable.java:76)
	at java.base/java.lang.Thread.run(Thread.java:834)
java.lang.AssertionError: The following shells remained open [New Java Project]
	at org.junit.Assert.fail(Assert.java:89)
	at org.eclipse.reddeer.junit.extension.after.test.impl.CloseAllShellsExt.run(CloseAllShellsExt.java:79)
	at org.eclipse.reddeer.junit.extension.after.test.impl.CloseAllShellsExt.runAfterTest(CloseAllShellsExt.java:72)
	at org.eclipse.reddeer.junit.internal.runner.statement.RunIAfterTestExtensions.evaluate(RunIAfterTestExtensions.java:72)
	at org.junit.runners.ParentRunner$3.evaluate(ParentRunner.java:306)
	at org.junit.runners.ParentRunner.runLeaf(ParentRunner.java:366)
	at org.eclipse.reddeer.junit.internal.runner.RequirementsRunner.runChild(RequirementsRunner.java:171)
	at org.junit.runners.BlockJUnit4ClassRunner.runChild(BlockJUnit4ClassRunner.java:63)
	at org.junit.runners.ParentRunner$4.run(ParentRunner.java:331)
	at org.junit.runners.ParentRunner$1.schedule(ParentRunner.java:79)
	at org.junit.runners.ParentRunner.runChildren(ParentRunner.java:329)
	at org.junit.runners.ParentRunner.access$100(ParentRunner.java:66)
	at org.junit.runners.ParentRunner$2.evaluate(ParentRunner.java:293)
	at org.eclipse.reddeer.junit.internal.runner.statement.RunBeforeClasses.evaluate(RunBeforeClasses.java:81)
	at org.eclipse.reddeer.junit.internal.runner.statement.FulfillRequirementsStatement.evaluate(FulfillRequirementsStatement.java:46)
	at org.eclipse.reddeer.junit.internal.runner.statement.RunIBeforeClassExtensions.evaluate(RunIBeforeClassExtensions.java:72)
	at org.eclipse.reddeer.junit.internal.runner.statement.RunAfterClasses.evaluate(RunAfterClasses.java:68)
	at org.eclipse.reddeer.junit.internal.runner.statement.CleanUpRequirementStatement.evaluate(CleanUpRequirementStatement.java:45)
	at org.eclipse.reddeer.junit.internal.runner.statement.RunIAfterClassExtensions.evaluate(RunIAfterClassExtensions.java:57)
	at org.junit.runners.ParentRunner$3.evaluate(ParentRunner.java:306)
	at org.junit.runners.ParentRunner.run(ParentRunner.java:413)
	at org.eclipse.reddeer.junit.internal.runner.RequirementsRunner.run(RequirementsRunner.java:153)
	at org.junit.runners.Suite.runChild(Suite.java:128)
	at org.junit.runners.Suite.runChild(Suite.java:27)
	at org.junit.runners.ParentRunner$4.run(ParentRunner.java:331)
	at org.junit.runners.ParentRunner$1.schedule(ParentRunner.java:79)
	at org.junit.runners.ParentRunner.runChildren(ParentRunner.java:329)
	at org.junit.runners.ParentRunner.access$100(ParentRunner.java:66)
	at org.junit.runners.ParentRunner$2.evaluate(ParentRunner.java:293)
	at org.junit.runners.ParentRunner$3.evaluate(ParentRunner.java:306)
	at org.junit.runners.ParentRunner.run(ParentRunner.java:413)
	at org.junit.runners.Suite.runChild(Suite.java:128)
	at org.junit.runners.Suite.runChild(Suite.java:27)
	at org.junit.runners.ParentRunner$4.run(ParentRunner.java:331)
	at org.junit.runners.ParentRunner$1.schedule(ParentRunner.java:79)
	at org.junit.runners.ParentRunner.runChildren(ParentRunner.java:329)
	at org.junit.runners.ParentRunner.access$100(ParentRunner.java:66)
	at org.junit.runners.ParentRunner$2.evaluate(ParentRunner.java:293)
	at org.junit.runners.ParentRunner$3.evaluate(ParentRunner.java:306)
	at org.junit.runners.ParentRunner.run(ParentRunner.java:413)
	at org.apache.maven.surefire.junit4.JUnit4Provider.execute(JUnit4Provider.java:365)
	at org.apache.maven.surefire.junit4.JUnit4Provider.executeWithRerun(JUnit4Provider.java:273)
	at org.apache.maven.surefire.junit4.JUnit4Provider.executeTestSet(JUnit4Provider.java:238)
	at org.apache.maven.surefire.junit4.JUnit4Provider.invoke(JUnit4Provider.java:159)
	at java.base/jdk.internal.reflect.NativeMethodAccessorImpl.invoke0(Native Method)
	at java.base/jdk.internal.reflect.NativeMethodAccessorImpl.invoke(NativeMethodAccessorImpl.java:62)
	at java.base/jdk.internal.reflect.DelegatingMethodAccessorImpl.invoke(DelegatingMethodAccessorImpl.java:43)
	at java.base/java.lang.reflect.Method.invoke(Method.java:566)
	at org.apache.maven.surefire.util.ReflectionUtils.invokeMethodWithArray2(ReflectionUtils.java:206)
	at org.apache.maven.surefire.booter.ProviderFactory$ProviderProxy.invoke(ProviderFactory.java:161)
	at org.apache.maven.surefire.booter.ProviderFactory.invokeProvider(ProviderFactory.java:84)
	at org.eclipse.tycho.surefire.osgibooter.OsgiSurefireBooter.run(OsgiSurefireBooter.java:116)
	at org.eclipse.tycho.surefire.osgibooter.AbstractUITestApplication.runTests(AbstractUITestApplication.java:46)
	at org.eclipse.e4.ui.internal.workbench.swt.E4Testable.lambda$0(E4Testable.java:76)
	at java.base/java.lang.Thread.run(Thread.java:834)