UnstableConsole Output

Skipping 24,346 KB.. Full Log
impl.part.DefaultWorkbenchPart.<init>(DefaultWorkbenchPart.java:23)
04:28:14 	at org.eclipse.reddeer.e4.workbench.test.part.WorkbenchPartTest.testDirtyablePart(WorkbenchPartTest.java:117)
04:28:14 	at java.base/jdk.internal.reflect.NativeMethodAccessorImpl.invoke0(Native Method)
04:28:14 	at java.base/jdk.internal.reflect.NativeMethodAccessorImpl.invoke(NativeMethodAccessorImpl.java:62)
04:28:14 	at java.base/jdk.internal.reflect.DelegatingMethodAccessorImpl.invoke(DelegatingMethodAccessorImpl.java:43)
04:28:14 	at java.base/java.lang.reflect.Method.invoke(Method.java:566)
04:28:14 	at org.junit.runners.model.FrameworkMethod$1.runReflectiveCall(FrameworkMethod.java:50)
04:28:14 	at org.junit.internal.runners.model.ReflectiveCallable.run(ReflectiveCallable.java:12)
04:28:14 	at org.junit.runners.model.FrameworkMethod.invokeExplosively(FrameworkMethod.java:47)
04:28:14 	at org.eclipse.reddeer.junit.internal.runner.statement.RunTestMethod.evaluate(RunTestMethod.java:48)
04:28:14 	at org.eclipse.reddeer.junit.internal.runner.statement.RunBefores.evaluate(RunBefores.java:85)
04:28:14 	at org.eclipse.reddeer.junit.internal.runner.statement.RunIBeforeTestExtensions.evaluate(RunIBeforeTestExtensions.java:73)
04:28:14 	at org.eclipse.reddeer.junit.internal.runner.statement.RunAfters.evaluate(RunAfters.java:72)
04:28:14 	at org.eclipse.reddeer.junit.internal.runner.statement.RunIAfterTestExtensions.evaluate(RunIAfterTestExtensions.java:59)
04:28:14 	at org.junit.runners.ParentRunner.runLeaf(ParentRunner.java:325)
04:28:14 	at org.eclipse.reddeer.junit.internal.runner.RequirementsRunner.runChild(RequirementsRunner.java:171)
04:28:14 	at org.junit.runners.BlockJUnit4ClassRunner.runChild(BlockJUnit4ClassRunner.java:57)
04:28:14 	at org.junit.runners.ParentRunner$3.run(ParentRunner.java:290)
04:28:14 	at org.junit.runners.ParentRunner$1.schedule(ParentRunner.java:71)
04:28:14 	at org.junit.runners.ParentRunner.runChildren(ParentRunner.java:288)
04:28:14 	at org.junit.runners.ParentRunner.access$000(ParentRunner.java:58)
04:28:14 	at org.junit.runners.ParentRunner$2.evaluate(ParentRunner.java:268)
04:28:14 	at org.eclipse.reddeer.junit.internal.runner.statement.RunBeforeClasses.evaluate(RunBeforeClasses.java:81)
04:28:14 	at org.eclipse.reddeer.junit.internal.runner.statement.FulfillRequirementsStatement.evaluate(FulfillRequirementsStatement.java:46)
04:28:14 	at org.eclipse.reddeer.junit.internal.runner.statement.RunIBeforeClassExtensions.evaluate(RunIBeforeClassExtensions.java:72)
04:28:14 	at org.eclipse.reddeer.junit.internal.runner.statement.RunAfterClasses.evaluate(RunAfterClasses.java:68)
04:28:14 	at org.eclipse.reddeer.junit.internal.runner.statement.CleanUpRequirementStatement.evaluate(CleanUpRequirementStatement.java:45)
04:28:14 	at org.eclipse.reddeer.junit.internal.runner.statement.RunIAfterClassExtensions.evaluate(RunIAfterClassExtensions.java:57)
04:28:14 	at org.junit.runners.ParentRunner.run(ParentRunner.java:363)
04:28:14 	at org.eclipse.reddeer.junit.internal.runner.RequirementsRunner.run(RequirementsRunner.java:153)
04:28:14 	at org.junit.runners.Suite.runChild(Suite.java:128)
04:28:14 	at org.junit.runners.Suite.runChild(Suite.java:27)
04:28:14 	at org.junit.runners.ParentRunner$3.run(ParentRunner.java:290)
04:28:14 	at org.junit.runners.ParentRunner$1.schedule(ParentRunner.java:71)
04:28:14 	at org.junit.runners.ParentRunner.runChildren(ParentRunner.java:288)
04:28:14 	at org.junit.runners.ParentRunner.access$000(ParentRunner.java:58)
04:28:14 	at org.junit.runners.ParentRunner$2.evaluate(ParentRunner.java:268)
04:28:14 	at org.junit.runners.ParentRunner.run(ParentRunner.java:363)
04:28:14 	at org.junit.runners.Suite.runChild(Suite.java:128)
04:28:14 	at org.junit.runners.Suite.runChild(Suite.java:27)
04:28:14 	at org.junit.runners.ParentRunner$3.run(ParentRunner.java:290)
04:28:14 	at org.junit.runners.ParentRunner$1.schedule(ParentRunner.java:71)
04:28:14 	at org.junit.runners.ParentRunner.runChildren(ParentRunner.java:288)
04:28:14 	at org.junit.runners.ParentRunner.access$000(ParentRunner.java:58)
04:28:14 	at org.junit.runners.ParentRunner$2.evaluate(ParentRunner.java:268)
04:28:14 	at org.junit.runners.ParentRunner.run(ParentRunner.java:363)
04:28:14 	at org.apache.maven.surefire.junit4.JUnit4Provider.execute(JUnit4Provider.java:365)
04:28:14 	at org.apache.maven.surefire.junit4.JUnit4Provider.executeWithRerun(JUnit4Provider.java:273)
04:28:14 	at org.apache.maven.surefire.junit4.JUnit4Provider.executeTestSet(JUnit4Provider.java:238)
04:28:14 	at org.apache.maven.surefire.junit4.JUnit4Provider.invoke(JUnit4Provider.java:159)
04:28:14 	at java.base/jdk.internal.reflect.NativeMethodAccessorImpl.invoke0(Native Method)
04:28:14 	at java.base/jdk.internal.reflect.NativeMethodAccessorImpl.invoke(NativeMethodAccessorImpl.java:62)
04:28:14 	at java.base/jdk.internal.reflect.DelegatingMethodAccessorImpl.invoke(DelegatingMethodAccessorImpl.java:43)
04:28:14 	at java.base/java.lang.reflect.Method.invoke(Method.java:566)
04:28:14 	at org.apache.maven.surefire.util.ReflectionUtils.invokeMethodWithArray2(ReflectionUtils.java:206)
04:28:14 	at org.apache.maven.surefire.booter.ProviderFactory$ProviderProxy.invoke(ProviderFactory.java:161)
04:28:14 	at org.apache.maven.surefire.booter.ProviderFactory.invokeProvider(ProviderFactory.java:84)
04:28:14 	at org.eclipse.tycho.surefire.osgibooter.OsgiSurefireBooter.run(OsgiSurefireBooter.java:108)
04:28:14 	at org.eclipse.tycho.surefire.osgibooter.AbstractUITestApplication.runTests(AbstractUITestApplication.java:44)
04:28:14 	at org.eclipse.e4.ui.internal.workbench.swt.E4Testable.lambda$0(E4Testable.java:76)
04:28:14 	at java.base/java.lang.Thread.run(Thread.java:834)
04:28:14 08:28:14.656 INFO [WorkbenchTestable][RequirementsRunner] Finished test: testDirtyablePart no-configuration(org.eclipse.reddeer.e4.workbench.test.part.WorkbenchPartTest)
04:28:14 08:28:14.656 DEBUG [WorkbenchTestable][RequirementsRunner] Injecting fulfilled requirements into test instance: org.eclipse.reddeer.junit.internal.requirement.Requirements
04:28:14 08:28:14.656 INFO [WorkbenchTestable][RequirementsRunner] Started test: closeWorkbenchPart no-configuration(org.eclipse.reddeer.e4.workbench.test.part.WorkbenchPartTest)
04:28:14 08:28:14.656 DEBUG [WorkbenchTestable][RunIBeforeTestExtensions] Run before test extensions for test class org.eclipse.reddeer.e4.workbench.test.part.WorkbenchPartTest
04:28:14 08:28:14.656 ERROR [WorkbenchTestable][RunTestMethod] Test org.eclipse.reddeer.e4.workbench.test.part.WorkbenchPartTest.closeWorkbenchPart throws exception: 
04:28:14 java.lang.IllegalStateException: Application does not have an active window
04:28:14 	at org.eclipse.e4.ui.internal.workbench.ApplicationPartServiceImpl.getActiveWindowService(ApplicationPartServiceImpl.java:42)
04:28:14 	at org.eclipse.e4.ui.internal.workbench.ApplicationPartServiceImpl.getParts(ApplicationPartServiceImpl.java:108)
04:28:14 	at org.eclipse.reddeer.workbench.core.lookup.WorkbenchPartLookup.getWorkbenchPartWithLabel(WorkbenchPartLookup.java:66)
04:28:14 	at org.eclipse.reddeer.workbench.impl.part.DefaultWorkbenchPart.<init>(DefaultWorkbenchPart.java:23)
04:28:14 	at org.eclipse.reddeer.e4.workbench.test.part.WorkbenchPartTest.closeWorkbenchPart(WorkbenchPartTest.java:55)
04:28:14 	at java.base/jdk.internal.reflect.NativeMethodAccessorImpl.invoke0(Native Method)
04:28:14 	at java.base/jdk.internal.reflect.NativeMethodAccessorImpl.invoke(NativeMethodAccessorImpl.java:62)
04:28:14 	at java.base/jdk.internal.reflect.DelegatingMethodAccessorImpl.invoke(DelegatingMethodAccessorImpl.java:43)
04:28:14 	at java.base/java.lang.reflect.Method.invoke(Method.java:566)
04:28:14 	at org.junit.runners.model.FrameworkMethod$1.runReflectiveCall(FrameworkMethod.java:50)
04:28:14 	at org.junit.internal.runners.model.ReflectiveCallable.run(ReflectiveCallable.java:12)
04:28:14 	at org.junit.runners.model.FrameworkMethod.invokeExplosively(FrameworkMethod.java:47)
04:28:14 	at org.eclipse.reddeer.junit.internal.runner.statement.RunTestMethod.evaluate(RunTestMethod.java:48)
04:28:14 	at org.eclipse.reddeer.junit.internal.runner.statement.RunBefores.evaluate(RunBefores.java:85)
04:28:14 	at org.eclipse.reddeer.junit.internal.runner.statement.RunIBeforeTestExtensions.evaluate(RunIBeforeTestExtensions.java:73)
04:28:14 	at org.eclipse.reddeer.junit.internal.runner.statement.RunAfters.evaluate(RunAfters.java:72)
04:28:14 	at org.eclipse.reddeer.junit.internal.runner.statement.RunIAfterTestExtensions.evaluate(RunIAfterTestExtensions.java:59)
04:28:14 	at org.junit.runners.ParentRunner.runLeaf(ParentRunner.java:325)
04:28:14 	at org.eclipse.reddeer.junit.internal.runner.RequirementsRunner.runChild(RequirementsRunner.java:171)
04:28:14 	at org.junit.runners.BlockJUnit4ClassRunner.runChild(BlockJUnit4ClassRunner.java:57)
04:28:14 	at org.junit.runners.ParentRunner$3.run(ParentRunner.java:290)
04:28:14 	at org.junit.runners.ParentRunner$1.schedule(ParentRunner.java:71)
04:28:14 	at org.junit.runners.ParentRunner.runChildren(ParentRunner.java:288)
04:28:14 	at org.junit.runners.ParentRunner.access$000(ParentRunner.java:58)
04:28:14 	at org.junit.runners.ParentRunner$2.evaluate(ParentRunner.java:268)
04:28:14 	at org.eclipse.reddeer.junit.internal.runner.statement.RunBeforeClasses.evaluate(RunBeforeClasses.java:81)
04:28:14 	at org.eclipse.reddeer.junit.internal.runner.statement.FulfillRequirementsStatement.evaluate(FulfillRequirementsStatement.java:46)
04:28:14 	at org.eclipse.reddeer.junit.internal.runner.statement.RunIBeforeClassExtensions.evaluate(RunIBeforeClassExtensions.java:72)
04:28:14 	at org.eclipse.reddeer.junit.internal.runner.statement.RunAfterClasses.evaluate(RunAfterClasses.java:68)
04:28:14 	at org.eclipse.reddeer.junit.internal.runner.statement.CleanUpRequirementStatement.evaluate(CleanUpRequirementStatement.java:45)
04:28:14 	at org.eclipse.reddeer.junit.internal.runner.statement.RunIAfterClassExtensions.evaluate(RunIAfterClassExtensions.java:57)
04:28:14 	at org.junit.runners.ParentRunner.run(ParentRunner.java:363)
04:28:14 	at org.eclipse.reddeer.junit.internal.runner.RequirementsRunner.run(RequirementsRunner.java:153)
04:28:14 	at org.junit.runners.Suite.runChild(Suite.java:128)
04:28:14 	at org.junit.runners.Suite.runChild(Suite.java:27)
04:28:14 	at org.junit.runners.ParentRunner$3.run(ParentRunner.java:290)
04:28:14 	at org.junit.runners.ParentRunner$1.schedule(ParentRunner.java:71)
04:28:14 	at org.junit.runners.ParentRunner.runChildren(ParentRunner.java:288)
04:28:14 	at org.junit.runners.ParentRunner.access$000(ParentRunner.java:58)
04:28:14 	at org.junit.runners.ParentRunner$2.evaluate(ParentRunner.java:268)
04:28:14 	at org.junit.runners.ParentRunner.run(ParentRunner.java:363)
04:28:14 	at org.junit.runners.Suite.runChild(Suite.java:128)
04:28:14 	at org.junit.runners.Suite.runChild(Suite.java:27)
04:28:14 	at org.junit.runners.ParentRunner$3.run(ParentRunner.java:290)
04:28:14 	at org.junit.runners.ParentRunner$1.schedule(ParentRunner.java:71)
04:28:14 	at org.junit.runners.ParentRunner.runChildren(ParentRunner.java:288)
04:28:14 	at org.junit.runners.ParentRunner.access$000(ParentRunner.java:58)
04:28:14 	at org.junit.runners.ParentRunner$2.evaluate(ParentRunner.java:268)
04:28:14 	at org.junit.runners.ParentRunner.run(ParentRunner.java:363)
04:28:14 	at org.apache.maven.surefire.junit4.JUnit4Provider.execute(JUnit4Provider.java:365)
04:28:14 	at org.apache.maven.surefire.junit4.JUnit4Provider.executeWithRerun(JUnit4Provider.java:273)
04:28:14 	at org.apache.maven.surefire.junit4.JUnit4Provider.executeTestSet(JUnit4Provider.java:238)
04:28:14 	at org.apache.maven.surefire.junit4.JUnit4Provider.invoke(JUnit4Provider.java:159)
04:28:14 	at java.base/jdk.internal.reflect.NativeMethodAccessorImpl.invoke0(Native Method)
04:28:14 	at java.base/jdk.internal.reflect.NativeMethodAccessorImpl.invoke(NativeMethodAccessorImpl.java:62)
04:28:14 	at java.base/jdk.internal.reflect.DelegatingMethodAccessorImpl.invoke(DelegatingMethodAccessorImpl.java:43)
04:28:14 	at java.base/java.lang.reflect.Method.invoke(Method.java:566)
04:28:14 	at org.apache.maven.surefire.util.ReflectionUtils.invokeMethodWithArray2(ReflectionUtils.java:206)
04:28:14 	at org.apache.maven.surefire.booter.ProviderFactory$ProviderProxy.invoke(ProviderFactory.java:161)
04:28:14 	at org.apache.maven.surefire.booter.ProviderFactory.invokeProvider(ProviderFactory.java:84)
04:28:14 	at org.eclipse.tycho.surefire.osgibooter.OsgiSurefireBooter.run(OsgiSurefireBooter.java:108)
04:28:14 	at org.eclipse.tycho.surefire.osgibooter.AbstractUITestApplication.runTests(AbstractUITestApplication.java:44)
04:28:14 	at org.eclipse.e4.ui.internal.workbench.swt.E4Testable.lambda$0(E4Testable.java:76)
04:28:14 	at java.base/java.lang.Thread.run(Thread.java:834)
04:28:14 08:28:14.658 DEBUG [main][ScreenshotCapturer] Capturing Screenshot: ./target/screenshots/no-configuration/org.eclipse.reddeer.e4.workbench.test.part.WorkbenchPartTest.closeWorkbenchPart.png
04:28:14 08:28:14.726 DEBUG [main][ScreenshotCapturer] Screenshot successfully captured. Saved in /home/jenkins/agent/workspace/reddeer.verification.jdk11/tests/org.eclipse.reddeer.e4.workbench.test/./target/screenshots/no-configuration/org.eclipse.reddeer.e4.workbench.test.part.WorkbenchPartTest.closeWorkbenchPart.png
04:28:14 08:28:14.727 DEBUG [WorkbenchTestable][RunIAfterTestExtensions] Run after test extensions for test class org.eclipse.reddeer.e4.workbench.test.part.WorkbenchPartTest
04:28:14 08:28:14.727 ERROR [WorkbenchTestable][RequirementsRunner] Exception in test: closeWorkbenchPart no-configuration(org.eclipse.reddeer.e4.workbench.test.part.WorkbenchPartTest)
04:28:14 java.lang.IllegalStateException: Application does not have an active window
04:28:14 	at org.eclipse.e4.ui.internal.workbench.ApplicationPartServiceImpl.getActiveWindowService(ApplicationPartServiceImpl.java:42)
04:28:14 	at org.eclipse.e4.ui.internal.workbench.ApplicationPartServiceImpl.getParts(ApplicationPartServiceImpl.java:108)
04:28:14 	at org.eclipse.reddeer.workbench.core.lookup.WorkbenchPartLookup.getWorkbenchPartWithLabel(WorkbenchPartLookup.java:66)
04:28:14 	at org.eclipse.reddeer.workbench.impl.part.DefaultWorkbenchPart.<init>(DefaultWorkbenchPart.java:23)
04:28:14 	at org.eclipse.reddeer.e4.workbench.test.part.WorkbenchPartTest.closeWorkbenchPart(WorkbenchPartTest.java:55)
04:28:14 	at java.base/jdk.internal.reflect.NativeMethodAccessorImpl.invoke0(Native Method)
04:28:14 	at java.base/jdk.internal.reflect.NativeMethodAccessorImpl.invoke(NativeMethodAccessorImpl.java:62)
04:28:14 	at java.base/jdk.internal.reflect.DelegatingMethodAccessorImpl.invoke(DelegatingMethodAccessorImpl.java:43)
04:28:14 	at java.base/java.lang.reflect.Method.invoke(Method.java:566)
04:28:14 	at org.junit.runners.model.FrameworkMethod$1.runReflectiveCall(FrameworkMethod.java:50)
04:28:14 	at org.junit.internal.runners.model.ReflectiveCallable.run(ReflectiveCallable.java:12)
04:28:14 	at org.junit.runners.model.FrameworkMethod.invokeExplosively(FrameworkMethod.java:47)
04:28:14 	at org.eclipse.reddeer.junit.internal.runner.statement.RunTestMethod.evaluate(RunTestMethod.java:48)
04:28:14 	at org.eclipse.reddeer.junit.internal.runner.statement.RunBefores.evaluate(RunBefores.java:85)
04:28:14 	at org.eclipse.reddeer.junit.internal.runner.statement.RunIBeforeTestExtensions.evaluate(RunIBeforeTestExtensions.java:73)
04:28:14 	at org.eclipse.reddeer.junit.internal.runner.statement.RunAfters.evaluate(RunAfters.java:72)
04:28:14 	at org.eclipse.reddeer.junit.internal.runner.statement.RunIAfterTestExtensions.evaluate(RunIAfterTestExtensions.java:59)
04:28:14 	at org.junit.runners.ParentRunner.runLeaf(ParentRunner.java:325)
04:28:14 	at org.eclipse.reddeer.junit.internal.runner.RequirementsRunner.runChild(RequirementsRunner.java:171)
04:28:14 	at org.junit.runners.BlockJUnit4ClassRunner.runChild(BlockJUnit4ClassRunner.java:57)
04:28:14 	at org.junit.runners.ParentRunner$3.run(ParentRunner.java:290)
04:28:14 	at org.junit.runners.ParentRunner$1.schedule(ParentRunner.java:71)
04:28:14 	at org.junit.runners.ParentRunner.runChildren(ParentRunner.java:288)
04:28:14 	at org.junit.runners.ParentRunner.access$000(ParentRunner.java:58)
04:28:14 	at org.junit.runners.ParentRunner$2.evaluate(ParentRunner.java:268)
04:28:14 	at org.eclipse.reddeer.junit.internal.runner.statement.RunBeforeClasses.evaluate(RunBeforeClasses.java:81)
04:28:14 	at org.eclipse.reddeer.junit.internal.runner.statement.FulfillRequirementsStatement.evaluate(FulfillRequirementsStatement.java:46)
04:28:14 	at org.eclipse.reddeer.junit.internal.runner.statement.RunIBeforeClassExtensions.evaluate(RunIBeforeClassExtensions.java:72)
04:28:14 	at org.eclipse.reddeer.junit.internal.runner.statement.RunAfterClasses.evaluate(RunAfterClasses.java:68)
04:28:14 	at org.eclipse.reddeer.junit.internal.runner.statement.CleanUpRequirementStatement.evaluate(CleanUpRequirementStatement.java:45)
04:28:14 	at org.eclipse.reddeer.junit.internal.runner.statement.RunIAfterClassExtensions.evaluate(RunIAfterClassExtensions.java:57)
04:28:14 	at org.junit.runners.ParentRunner.run(ParentRunner.java:363)
04:28:14 	at org.eclipse.reddeer.junit.internal.runner.RequirementsRunner.run(RequirementsRunner.java:153)
04:28:14 	at org.junit.runners.Suite.runChild(Suite.java:128)
04:28:14 	at org.junit.runners.Suite.runChild(Suite.java:27)
04:28:14 	at org.junit.runners.ParentRunner$3.run(ParentRunner.java:290)
04:28:14 	at org.junit.runners.ParentRunner$1.schedule(ParentRunner.java:71)
04:28:14 	at org.junit.runners.ParentRunner.runChildren(ParentRunner.java:288)
04:28:14 	at org.junit.runners.ParentRunner.access$000(ParentRunner.java:58)
04:28:14 	at org.junit.runners.ParentRunner$2.evaluate(ParentRunner.java:268)
04:28:14 	at org.junit.runners.ParentRunner.run(ParentRunner.java:363)
04:28:14 	at org.junit.runners.Suite.runChild(Suite.java:128)
04:28:14 	at org.junit.runners.Suite.runChild(Suite.java:27)
04:28:14 	at org.junit.runners.ParentRunner$3.run(ParentRunner.java:290)
04:28:14 	at org.junit.runners.ParentRunner$1.schedule(ParentRunner.java:71)
04:28:14 	at org.junit.runners.ParentRunner.runChildren(ParentRunner.java:288)
04:28:14 	at org.junit.runners.ParentRunner.access$000(ParentRunner.java:58)
04:28:14 	at org.junit.runners.ParentRunner$2.evaluate(ParentRunner.java:268)
04:28:14 	at org.junit.runners.ParentRunner.run(ParentRunner.java:363)
04:28:14 	at org.apache.maven.surefire.junit4.JUnit4Provider.execute(JUnit4Provider.java:365)
04:28:14 	at org.apache.maven.surefire.junit4.JUnit4Provider.executeWithRerun(JUnit4Provider.java:273)
04:28:14 	at org.apache.maven.surefire.junit4.JUnit4Provider.executeTestSet(JUnit4Provider.java:238)
04:28:14 	at org.apache.maven.surefire.junit4.JUnit4Provider.invoke(JUnit4Provider.java:159)
04:28:14 	at java.base/jdk.internal.reflect.NativeMethodAccessorImpl.invoke0(Native Method)
04:28:14 	at java.base/jdk.internal.reflect.NativeMethodAccessorImpl.invoke(NativeMethodAccessorImpl.java:62)
04:28:14 	at java.base/jdk.internal.reflect.DelegatingMethodAccessorImpl.invoke(DelegatingMethodAccessorImpl.java:43)
04:28:14 	at java.base/java.lang.reflect.Method.invoke(Method.java:566)
04:28:14 	at org.apache.maven.surefire.util.ReflectionUtils.invokeMethodWithArray2(ReflectionUtils.java:206)
04:28:14 	at org.apache.maven.surefire.booter.ProviderFactory$ProviderProxy.invoke(ProviderFactory.java:161)
04:28:14 	at org.apache.maven.surefire.booter.ProviderFactory.invokeProvider(ProviderFactory.java:84)
04:28:14 	at org.eclipse.tycho.surefire.osgibooter.OsgiSurefireBooter.run(OsgiSurefireBooter.java:108)
04:28:14 	at org.eclipse.tycho.surefire.osgibooter.AbstractUITestApplication.runTests(AbstractUITestApplication.java:44)
04:28:14 	at org.eclipse.e4.ui.internal.workbench.swt.E4Testable.lambda$0(E4Testable.java:76)
04:28:14 	at java.base/java.lang.Thread.run(Thread.java:834)
04:28:14 08:28:14.728 INFO [WorkbenchTestable][RequirementsRunner] Finished test: closeWorkbenchPart no-configuration(org.eclipse.reddeer.e4.workbench.test.part.WorkbenchPartTest)
04:28:14 08:28:14.728 DEBUG [WorkbenchTestable][RequirementsRunner] Injecting fulfilled requirements into test instance: org.eclipse.reddeer.junit.internal.requirement.Requirements
04:28:14 08:28:14.729 INFO [WorkbenchTestable][RequirementsRunner] Started test: testSampleWorkbenchPart no-configuration(org.eclipse.reddeer.e4.workbench.test.part.WorkbenchPartTest)
04:28:14 08:28:14.729 DEBUG [WorkbenchTestable][RunIBeforeTestExtensions] Run before test extensions for test class org.eclipse.reddeer.e4.workbench.test.part.WorkbenchPartTest
04:28:14 08:28:14.729 ERROR [WorkbenchTestable][RunTestMethod] Test org.eclipse.reddeer.e4.workbench.test.part.WorkbenchPartTest.testSampleWorkbenchPart throws exception: 
04:28:14 java.lang.IllegalStateException: Application does not have an active window
04:28:14 	at org.eclipse.e4.ui.internal.workbench.ApplicationPartServiceImpl.getActiveWindowService(ApplicationPartServiceImpl.java:42)
04:28:14 	at org.eclipse.e4.ui.internal.workbench.ApplicationPartServiceImpl.getParts(ApplicationPartServiceImpl.java:108)
04:28:14 	at org.eclipse.reddeer.workbench.core.lookup.WorkbenchPartLookup.getWorkbenchPartWithLabel(WorkbenchPartLookup.java:66)
04:28:14 	at org.eclipse.reddeer.workbench.impl.part.DefaultWorkbenchPart.<init>(DefaultWorkbenchPart.java:23)
04:28:14 	at org.eclipse.reddeer.e4.workbench.test.part.WorkbenchPartTest.testSampleWorkbenchPart(WorkbenchPartTest.java:37)
04:28:14 	at java.base/jdk.internal.reflect.NativeMethodAccessorImpl.invoke0(Native Method)
04:28:14 	at java.base/jdk.internal.reflect.NativeMethodAccessorImpl.invoke(NativeMethodAccessorImpl.java:62)
04:28:14 	at java.base/jdk.internal.reflect.DelegatingMethodAccessorImpl.invoke(DelegatingMethodAccessorImpl.java:43)
04:28:14 	at java.base/java.lang.reflect.Method.invoke(Method.java:566)
04:28:14 	at org.junit.runners.model.FrameworkMethod$1.runReflectiveCall(FrameworkMethod.java:50)
04:28:14 	at org.junit.internal.runners.model.ReflectiveCallable.run(ReflectiveCallable.java:12)
04:28:14 	at org.junit.runners.model.FrameworkMethod.invokeExplosively(FrameworkMethod.java:47)
04:28:14 	at org.eclipse.reddeer.junit.internal.runner.statement.RunTestMethod.evaluate(RunTestMethod.java:48)
04:28:14 	at org.eclipse.reddeer.junit.internal.runner.statement.RunBefores.evaluate(RunBefores.java:85)
04:28:14 	at org.eclipse.reddeer.junit.internal.runner.statement.RunIBeforeTestExtensions.evaluate(RunIBeforeTestExtensions.java:73)
04:28:14 	at org.eclipse.reddeer.junit.internal.runner.statement.RunAfters.evaluate(RunAfters.java:72)
04:28:14 	at org.eclipse.reddeer.junit.internal.runner.statement.RunIAfterTestExtensions.evaluate(RunIAfterTestExtensions.java:59)
04:28:14 	at org.junit.runners.ParentRunner.runLeaf(ParentRunner.java:325)
04:28:14 	at org.eclipse.reddeer.junit.internal.runner.RequirementsRunner.runChild(RequirementsRunner.java:171)
04:28:14 	at org.junit.runners.BlockJUnit4ClassRunner.runChild(BlockJUnit4ClassRunner.java:57)
04:28:14 	at org.junit.runners.ParentRunner$3.run(ParentRunner.java:290)
04:28:14 	at org.junit.runners.ParentRunner$1.schedule(ParentRunner.java:71)
04:28:14 	at org.junit.runners.ParentRunner.runChildren(ParentRunner.java:288)
04:28:14 	at org.junit.runners.ParentRunner.access$000(ParentRunner.java:58)
04:28:14 	at org.junit.runners.ParentRunner$2.evaluate(ParentRunner.java:268)
04:28:14 	at org.eclipse.reddeer.junit.internal.runner.statement.RunBeforeClasses.evaluate(RunBeforeClasses.java:81)
04:28:14 	at org.eclipse.reddeer.junit.internal.runner.statement.FulfillRequirementsStatement.evaluate(FulfillRequirementsStatement.java:46)
04:28:14 	at org.eclipse.reddeer.junit.internal.runner.statement.RunIBeforeClassExtensions.evaluate(RunIBeforeClassExtensions.java:72)
04:28:14 	at org.eclipse.reddeer.junit.internal.runner.statement.RunAfterClasses.evaluate(RunAfterClasses.java:68)
04:28:14 	at org.eclipse.reddeer.junit.internal.runner.statement.CleanUpRequirementStatement.evaluate(CleanUpRequirementStatement.java:45)
04:28:14 	at org.eclipse.reddeer.junit.internal.runner.statement.RunIAfterClassExtensions.evaluate(RunIAfterClassExtensions.java:57)
04:28:14 	at org.junit.runners.ParentRunner.run(ParentRunner.java:363)
04:28:14 	at org.eclipse.reddeer.junit.internal.runner.RequirementsRunner.run(RequirementsRunner.java:153)
04:28:14 	at org.junit.runners.Suite.runChild(Suite.java:128)
04:28:14 	at org.junit.runners.Suite.runChild(Suite.java:27)
04:28:14 	at org.junit.runners.ParentRunner$3.run(ParentRunner.java:290)
04:28:14 	at org.junit.runners.ParentRunner$1.schedule(ParentRunner.java:71)
04:28:14 	at org.junit.runners.ParentRunner.runChildren(ParentRunner.java:288)
04:28:14 	at org.junit.runners.ParentRunner.access$000(ParentRunner.java:58)
04:28:14 	at org.junit.runners.ParentRunner$2.evaluate(ParentRunner.java:268)
04:28:14 	at org.junit.runners.ParentRunner.run(ParentRunner.java:363)
04:28:14 	at org.junit.runners.Suite.runChild(Suite.java:128)
04:28:14 	at org.junit.runners.Suite.runChild(Suite.java:27)
04:28:14 	at org.junit.runners.ParentRunner$3.run(ParentRunner.java:290)
04:28:14 	at org.junit.runners.ParentRunner$1.schedule(ParentRunner.java:71)
04:28:14 	at org.junit.runners.ParentRunner.runChildren(ParentRunner.java:288)
04:28:14 	at org.junit.runners.ParentRunner.access$000(ParentRunner.java:58)
04:28:14 	at org.junit.runners.ParentRunner$2.evaluate(ParentRunner.java:268)
04:28:14 	at org.junit.runners.ParentRunner.run(ParentRunner.java:363)
04:28:14 	at org.apache.maven.surefire.junit4.JUnit4Provider.execute(JUnit4Provider.java:365)
04:28:14 	at org.apache.maven.surefire.junit4.JUnit4Provider.executeWithRerun(JUnit4Provider.java:273)
04:28:14 	at org.apache.maven.surefire.junit4.JUnit4Provider.executeTestSet(JUnit4Provider.java:238)
04:28:14 	at org.apache.maven.surefire.junit4.JUnit4Provider.invoke(JUnit4Provider.java:159)
04:28:14 	at java.base/jdk.internal.reflect.NativeMethodAccessorImpl.invoke0(Native Method)
04:28:14 	at java.base/jdk.internal.reflect.NativeMethodAccessorImpl.invoke(NativeMethodAccessorImpl.java:62)
04:28:14 	at java.base/jdk.internal.reflect.DelegatingMethodAccessorImpl.invoke(DelegatingMethodAccessorImpl.java:43)
04:28:14 	at java.base/java.lang.reflect.Method.invoke(Method.java:566)
04:28:14 	at org.apache.maven.surefire.util.ReflectionUtils.invokeMethodWithArray2(ReflectionUtils.java:206)
04:28:14 	at org.apache.maven.surefire.booter.ProviderFactory$ProviderProxy.invoke(ProviderFactory.java:161)
04:28:14 	at org.apache.maven.surefire.booter.ProviderFactory.invokeProvider(ProviderFactory.java:84)
04:28:14 	at org.eclipse.tycho.surefire.osgibooter.OsgiSurefireBooter.run(OsgiSurefireBooter.java:108)
04:28:14 	at org.eclipse.tycho.surefire.osgibooter.AbstractUITestApplication.runTests(AbstractUITestApplication.java:44)
04:28:14 	at org.eclipse.e4.ui.internal.workbench.swt.E4Testable.lambda$0(E4Testable.java:76)
04:28:14 	at java.base/java.lang.Thread.run(Thread.java:834)
04:28:14 08:28:14.730 DEBUG [main][ScreenshotCapturer] Capturing Screenshot: ./target/screenshots/no-configuration/org.eclipse.reddeer.e4.workbench.test.part.WorkbenchPartTest.testSampleWorkbenchPart.png
04:28:14 08:28:14.786 DEBUG [main][ScreenshotCapturer] Screenshot successfully captured. Saved in /home/jenkins/agent/workspace/reddeer.verification.jdk11/tests/org.eclipse.reddeer.e4.workbench.test/./target/screenshots/no-configuration/org.eclipse.reddeer.e4.workbench.test.part.WorkbenchPartTest.testSampleWorkbenchPart.png
04:28:14 08:28:14.786 DEBUG [WorkbenchTestable][RunIAfterTestExtensions] Run after test extensions for test class org.eclipse.reddeer.e4.workbench.test.part.WorkbenchPartTest
04:28:14 08:28:14.786 ERROR [WorkbenchTestable][RequirementsRunner] Exception in test: testSampleWorkbenchPart no-configuration(org.eclipse.reddeer.e4.workbench.test.part.WorkbenchPartTest)
04:28:14 java.lang.IllegalStateException: Application does not have an active window
04:28:14 	at org.eclipse.e4.ui.internal.workbench.ApplicationPartServiceImpl.getActiveWindowService(ApplicationPartServiceImpl.java:42)
04:28:14 	at org.eclipse.e4.ui.internal.workbench.ApplicationPartServiceImpl.getParts(ApplicationPartServiceImpl.java:108)
04:28:14 	at org.eclipse.reddeer.workbench.core.lookup.WorkbenchPartLookup.getWorkbenchPartWithLabel(WorkbenchPartLookup.java:66)
04:28:14 	at org.eclipse.reddeer.workbench.impl.part.DefaultWorkbenchPart.<init>(DefaultWorkbenchPart.java:23)
04:28:14 	at org.eclipse.reddeer.e4.workbench.test.part.WorkbenchPartTest.testSampleWorkbenchPart(WorkbenchPartTest.java:37)
04:28:14 	at java.base/jdk.internal.reflect.NativeMethodAccessorImpl.invoke0(Native Method)
04:28:14 	at java.base/jdk.internal.reflect.NativeMethodAccessorImpl.invoke(NativeMethodAccessorImpl.java:62)
04:28:14 	at java.base/jdk.internal.reflect.DelegatingMethodAccessorImpl.invoke(DelegatingMethodAccessorImpl.java:43)
04:28:14 	at java.base/java.lang.reflect.Method.invoke(Method.java:566)
04:28:14 	at org.junit.runners.model.FrameworkMethod$1.runReflectiveCall(FrameworkMethod.java:50)
04:28:14 	at org.junit.internal.runners.model.ReflectiveCallable.run(ReflectiveCallable.java:12)
04:28:14 	at org.junit.runners.model.FrameworkMethod.invokeExplosively(FrameworkMethod.java:47)
04:28:14 	at org.eclipse.reddeer.junit.internal.runner.statement.RunTestMethod.evaluate(RunTestMethod.java:48)
04:28:14 	at org.eclipse.reddeer.junit.internal.runner.statement.RunBefores.evaluate(RunBefores.java:85)
04:28:14 	at org.eclipse.reddeer.junit.internal.runner.statement.RunIBeforeTestExtensions.evaluate(RunIBeforeTestExtensions.java:73)
04:28:14 	at org.eclipse.reddeer.junit.internal.runner.statement.RunAfters.evaluate(RunAfters.java:72)
04:28:14 	at org.eclipse.reddeer.junit.internal.runner.statement.RunIAfterTestExtensions.evaluate(RunIAfterTestExtensions.java:59)
04:28:14 	at org.junit.runners.ParentRunner.runLeaf(ParentRunner.java:325)
04:28:14 	at org.eclipse.reddeer.junit.internal.runner.RequirementsRunner.runChild(RequirementsRunner.java:171)
04:28:14 	at org.junit.runners.BlockJUnit4ClassRunner.runChild(BlockJUnit4ClassRunner.java:57)
04:28:14 	at org.junit.runners.ParentRunner$3.run(ParentRunner.java:290)
04:28:14 	at org.junit.runners.ParentRunner$1.schedule(ParentRunner.java:71)
04:28:14 	at org.junit.runners.ParentRunner.runChildren(ParentRunner.java:288)
04:28:14 	at org.junit.runners.ParentRunner.access$000(ParentRunner.java:58)
04:28:14 	at org.junit.runners.ParentRunner$2.evaluate(ParentRunner.java:268)
04:28:14 	at org.eclipse.reddeer.junit.internal.runner.statement.RunBeforeClasses.evaluate(RunBeforeClasses.java:81)
04:28:14 	at org.eclipse.reddeer.junit.internal.runner.statement.FulfillRequirementsStatement.evaluate(FulfillRequirementsStatement.java:46)
04:28:14 	at org.eclipse.reddeer.junit.internal.runner.statement.RunIBeforeClassExtensions.evaluate(RunIBeforeClassExtensions.java:72)
04:28:14 	at org.eclipse.reddeer.junit.internal.runner.statement.RunAfterClasses.evaluate(RunAfterClasses.java:68)
04:28:14 	at org.eclipse.reddeer.junit.internal.runner.statement.CleanUpRequirementStatement.evaluate(CleanUpRequirementStatement.java:45)
04:28:14 	at org.eclipse.reddeer.junit.internal.runner.statement.RunIAfterClassExtensions.evaluate(RunIAfterClassExtensions.java:57)
04:28:14 	at org.junit.runners.ParentRunner.run(ParentRunner.java:363)
04:28:14 	at org.eclipse.reddeer.junit.internal.runner.RequirementsRunner.run(RequirementsRunner.java:153)
04:28:14 	at org.junit.runners.Suite.runChild(Suite.java:128)
04:28:14 	at org.junit.runners.Suite.runChild(Suite.java:27)
04:28:14 	at org.junit.runners.ParentRunner$3.run(ParentRunner.java:290)
04:28:14 	at org.junit.runners.ParentRunner$1.schedule(ParentRunner.java:71)
04:28:14 	at org.junit.runners.ParentRunner.runChildren(ParentRunner.java:288)
04:28:14 	at org.junit.runners.ParentRunner.access$000(ParentRunner.java:58)
04:28:14 	at org.junit.runners.ParentRunner$2.evaluate(ParentRunner.java:268)
04:28:14 	at org.junit.runners.ParentRunner.run(ParentRunner.java:363)
04:28:14 	at org.junit.runners.Suite.runChild(Suite.java:128)
04:28:14 	at org.junit.runners.Suite.runChild(Suite.java:27)
04:28:14 	at org.junit.runners.ParentRunner$3.run(ParentRunner.java:290)
04:28:14 	at org.junit.runners.ParentRunner$1.schedule(ParentRunner.java:71)
04:28:14 	at org.junit.runners.ParentRunner.runChildren(ParentRunner.java:288)
04:28:14 	at org.junit.runners.ParentRunner.access$000(ParentRunner.java:58)
04:28:14 	at org.junit.runners.ParentRunner$2.evaluate(ParentRunner.java:268)
04:28:14 	at org.junit.runners.ParentRunner.run(ParentRunner.java:363)
04:28:14 	at org.apache.maven.surefire.junit4.JUnit4Provider.execute(JUnit4Provider.java:365)
04:28:14 	at org.apache.maven.surefire.junit4.JUnit4Provider.executeWithRerun(JUnit4Provider.java:273)
04:28:14 	at org.apache.maven.surefire.junit4.JUnit4Provider.executeTestSet(JUnit4Provider.java:238)
04:28:14 	at org.apache.maven.surefire.junit4.JUnit4Provider.invoke(JUnit4Provider.java:159)
04:28:14 	at java.base/jdk.internal.reflect.NativeMethodAccessorImpl.invoke0(Native Method)
04:28:14 	at java.base/jdk.internal.reflect.NativeMethodAccessorImpl.invoke(NativeMethodAccessorImpl.java:62)
04:28:14 	at java.base/jdk.internal.reflect.DelegatingMethodAccessorImpl.invoke(DelegatingMethodAccessorImpl.java:43)
04:28:14 	at java.base/java.lang.reflect.Method.invoke(Method.java:566)
04:28:14 	at org.apache.maven.surefire.util.ReflectionUtils.invokeMethodWithArray2(ReflectionUtils.java:206)
04:28:14 	at org.apache.maven.surefire.booter.ProviderFactory$ProviderProxy.invoke(ProviderFactory.java:161)
04:28:14 	at org.apache.maven.surefire.booter.ProviderFactory.invokeProvider(ProviderFactory.java:84)
04:28:14 	at org.eclipse.tycho.surefire.osgibooter.OsgiSurefireBooter.run(OsgiSurefireBooter.java:108)
04:28:14 	at org.eclipse.tycho.surefire.osgibooter.AbstractUITestApplication.runTests(AbstractUITestApplication.java:44)
04:28:14 	at org.eclipse.e4.ui.internal.workbench.swt.E4Testable.lambda$0(E4Testable.java:76)
04:28:14 	at java.base/java.lang.Thread.run(Thread.java:834)
04:28:14 08:28:14.787 INFO [WorkbenchTestable][RequirementsRunner] Finished test: testSampleWorkbenchPart no-configuration(org.eclipse.reddeer.e4.workbench.test.part.WorkbenchPartTest)
04:28:14 08:28:14.788 DEBUG [WorkbenchTestable][RunIAfterClassExtensions] Run after class extensions for test class org.eclipse.reddeer.e4.workbench.test.part.WorkbenchPartTest
04:28:14 Tests run: 7, Failures: 1, Errors: 6, Skipped: 0, Time elapsed: 4.818 s <<< FAILURE! - in org.eclipse.reddeer.e4.workbench.test.part.WorkbenchPartTest
04:28:14 getWidgetFromPartWhenOtherShellIsActive no-configuration(org.eclipse.reddeer.e4.workbench.test.part.WorkbenchPartTest)  Time elapsed: 4.224 s  <<< FAILURE!
04:28:14 java.lang.AssertionError
04:28:14 	at org.eclipse.reddeer.e4.workbench.test.part.WorkbenchPartTest.getWidgetFromPartWhenOtherShellIsActive(WorkbenchPartTest.java:110)
04:28:14 
04:28:14 getWidgetFromPartWhenOtherPartIsActive no-configuration(org.eclipse.reddeer.e4.workbench.test.part.WorkbenchPartTest)  Time elapsed: 0.081 s  <<< ERROR!
04:28:14 java.lang.IllegalStateException: Application does not have an active window
04:28:14 	at org.eclipse.reddeer.e4.workbench.test.part.WorkbenchPartTest.getWidgetFromPartWhenOtherPartIsActive(WorkbenchPartTest.java:80)
04:28:14 
04:28:14 activateWorkbenchParts no-configuration(org.eclipse.reddeer.e4.workbench.test.part.WorkbenchPartTest)  Time elapsed: 0.09 s  <<< ERROR!
04:28:14 java.lang.IllegalStateException: Application does not have an active window
04:28:14 	at org.eclipse.reddeer.e4.workbench.test.part.WorkbenchPartTest.activateWorkbenchParts(WorkbenchPartTest.java:67)
04:28:14 
04:28:14 testPartAsReferencedComposite no-configuration(org.eclipse.reddeer.e4.workbench.test.part.WorkbenchPartTest)  Time elapsed: 0.06 s  <<< ERROR!
04:28:14 java.lang.IllegalStateException: Application does not have an active window
04:28:14 	at org.eclipse.reddeer.e4.workbench.test.part.WorkbenchPartTest.testPartAsReferencedComposite(WorkbenchPartTest.java:94)
04:28:14 
04:28:14 testDirtyablePart no-configuration(org.eclipse.reddeer.e4.workbench.test.part.WorkbenchPartTest)  Time elapsed: 0.057 s  <<< ERROR!
04:28:14 java.lang.IllegalStateException: Application does not have an active window
04:28:14 	at org.eclipse.reddeer.e4.workbench.test.part.WorkbenchPartTest.testDirtyablePart(WorkbenchPartTest.java:117)
04:28:14 
04:28:14 closeWorkbenchPart no-configuration(org.eclipse.reddeer.e4.workbench.test.part.WorkbenchPartTest)  Time elapsed: 0.071 s  <<< ERROR!
04:28:14 java.lang.IllegalStateException: Application does not have an active window
04:28:14 	at org.eclipse.reddeer.e4.workbench.test.part.WorkbenchPartTest.closeWorkbenchPart(WorkbenchPartTest.java:55)
04:28:14 
04:28:14 testSampleWorkbenchPart no-configuration(org.eclipse.reddeer.e4.workbench.test.part.WorkbenchPartTest)  Time elapsed: 0.057 s  <<< ERROR!
04:28:14 java.lang.IllegalStateException: Application does not have an active window
04:28:14 	at org.eclipse.reddeer.e4.workbench.test.part.WorkbenchPartTest.testSampleWorkbenchPart(WorkbenchPartTest.java:37)
04:28:14 
04:28:14 Running org.eclipse.reddeer.e4.workbench.test.shell.WorkbenchShellTest
04:28:14 Tests run: 2, Failures: 0, Errors: 2, Skipped: 0, Time elapsed: 0.009 s <<< FAILURE! - in org.eclipse.reddeer.e4.workbench.test.shell.WorkbenchShellTest
04:28:14 findWorkbenchShellMenu(org.eclipse.reddeer.e4.workbench.test.shell.WorkbenchShellTest)  Time elapsed: 0.006 s  <<< ERROR!
04:28:14 org.eclipse.reddeer.swt.exception.SWTLayerException: SWT widget provided is null
04:28:14 	at org.eclipse.reddeer.e4.workbench.test.shell.WorkbenchShellTest.findWorkbenchShellMenu(WorkbenchShellTest.java:33)
04:28:14 
04:28:14 findWorkbenchShell(org.eclipse.reddeer.e4.workbench.test.shell.WorkbenchShellTest)  Time elapsed: 0.001 s  <<< ERROR!
04:28:14 org.eclipse.reddeer.swt.exception.SWTLayerException: SWT widget provided is null
04:28:14 	at org.eclipse.reddeer.e4.workbench.test.shell.WorkbenchShellTest.findWorkbenchShell(WorkbenchShellTest.java:27)
04:28:14 
04:28:14 
04:28:14 Results:
04:28:14 
04:28:14 Failures: 
04:28:14   WorkbenchPartTest.getWidgetFromPartWhenOtherShellIsActive:110
04:28:14 Errors: 
04:28:14   WorkbenchPartTest.activateWorkbenchParts:67 ? IllegalState Application does no...
04:28:14   WorkbenchPartTest.closeWorkbenchPart:55 ? IllegalState Application does not ha...
04:28:14   WorkbenchPartTest.getWidgetFromPartWhenOtherPartIsActive:80 ? IllegalState App...
04:28:14   WorkbenchPartTest.testDirtyablePart:117 ? IllegalState Application does not ha...
04:28:14   WorkbenchPartTest.testPartAsReferencedComposite:94 ? IllegalState Application ...
04:28:14   WorkbenchPartTest.testSampleWorkbenchPart:37 ? IllegalState Application does n...
04:28:14   WorkbenchShellTest.findWorkbenchShell:27 ? SWTLayer SWT widget provided is nul...
04:28:14   WorkbenchShellTest.findWorkbenchShellMenu:33 ? SWTLayer SWT widget provided is...
04:28:14 
04:28:14 Tests run: 9, Failures: 1, Errors: 8, Skipped: 0
04:28:14 
04:28:15 [ERROR] There are test failures.
04:28:15 
04:28:15 Please refer to /home/jenkins/agent/workspace/reddeer.verification.jdk11/tests/org.eclipse.reddeer.e4.workbench.test/target/surefire-reports for the individual test results.
04:28:15 [INFO] 
04:28:15 [INFO] --- jacoco-maven-plugin:0.8.2:report-aggregate (generate-jacoco-report) @ org.eclipse.reddeer.e4.workbench.test ---
04:28:15 [INFO] Loading execution data file /home/jenkins/agent/workspace/reddeer.verification.jdk11/tests/org.eclipse.reddeer.e4.workbench.test/target/jacoco.exec
04:28:15 [INFO] Analyzed bundle 'org.eclipse.reddeer.common' with 37 classes
04:28:15 [INFO] Analyzed bundle 'org.eclipse.reddeer.core' with 303 classes
04:28:16 [INFO] Analyzed bundle 'org.eclipse.reddeer.e4' with 9 classes
04:28:16 [INFO] Analyzed bundle 'org.eclipse.reddeer.e4.workbench' with 11 classes
04:28:16 [INFO] Analyzed bundle 'org.eclipse.reddeer.swt' with 126 classes
04:28:16 [INFO] Analyzed bundle 'org.eclipse.reddeer.jface' with 18 classes
04:28:16 [INFO] Analyzed bundle 'org.eclipse.reddeer.e4.workbench.core' with 7 classes
04:28:16 [INFO] Analyzed bundle 'org.eclipse.reddeer.junit' with 61 classes
04:28:16 [INFO] Analyzed bundle 'org.eclipse.reddeer.jdt.junit' with 4 classes
04:28:16 [INFO] 
04:28:16 [INFO] --------------------< org.eclipse.reddeer:features >--------------------
04:28:16 [INFO] Building RedDeer Features 2.8.0-SNAPSHOT                         [45/59]
04:28:16 [INFO] --------------------------------[ pom ]---------------------------------
04:28:16 [INFO] 
04:28:16 [INFO] --- maven-clean-plugin:2.5:clean (default-clean) @ features ---
04:28:16 [INFO] 
04:28:16 [INFO] --- jacoco-maven-plugin:0.8.2:prepare-agent (prepare-agent-for-reddeer-tests) @ features ---
04:28:16 [INFO] argLine set to -javaagent:/home/jenkins/.m2/repository/org/jacoco/org.jacoco.agent/0.8.2/org.jacoco.agent-0.8.2-runtime.jar=destfile=/home/jenkins/agent/workspace/reddeer.verification.jdk11/features/target/jacoco.exec,append=true,includes=org.eclipse.reddeer.*,excludes=org.eclipse.reddeer.e4.workbench.core/**/*
04:28:16 [INFO] 
04:28:16 [INFO] --- tycho-source-plugin:1.4.0:plugin-source (plugin-source) @ features ---
04:28:16 [INFO] 
04:28:16 [INFO] ---------< org.eclipse.reddeer:org.eclipse.reddeer.e4.feature >---------
04:28:16 [INFO] Building RedDeer E4 Feature 2.8.0-SNAPSHOT                       [46/59]
04:28:16 [INFO] --------------------------[ eclipse-feature ]---------------------------
04:28:16 [INFO] 
04:28:16 [INFO] --- maven-clean-plugin:2.5:clean (default-clean) @ org.eclipse.reddeer.e4.feature ---
04:28:16 [INFO] Deleting /home/jenkins/agent/workspace/reddeer.verification.jdk11/features/org.eclipse.reddeer.e4.feature/target
04:28:16 [INFO] 
04:28:16 [INFO] --- tycho-packaging-plugin:1.4.0:build-qualifier-aggregator (default-build-qualifier-aggregator) @ org.eclipse.reddeer.e4.feature ---
04:28:16 [INFO] The project's OSGi version is 2.8.0.v20191015-0658
04:28:16 [INFO] 
04:28:16 [INFO] --- tycho-packaging-plugin:1.4.0:validate-id (default-validate-id) @ org.eclipse.reddeer.e4.feature ---
04:28:16 [INFO] 
04:28:16 [INFO] --- tycho-packaging-plugin:1.4.0:validate-version (default-validate-version) @ org.eclipse.reddeer.e4.feature ---
04:28:16 [INFO] 
04:28:16 [INFO] --- jacoco-maven-plugin:0.8.2:prepare-agent (prepare-agent-for-reddeer-tests) @ org.eclipse.reddeer.e4.feature ---
04:28:16 [INFO] argLine set to -javaagent:/home/jenkins/.m2/repository/org/jacoco/org.jacoco.agent/0.8.2/org.jacoco.agent-0.8.2-runtime.jar=destfile=/home/jenkins/agent/workspace/reddeer.verification.jdk11/features/org.eclipse.reddeer.e4.feature/target/jacoco.exec,append=true,includes=org.eclipse.reddeer.*,excludes=org.eclipse.reddeer.e4.workbench.core/**/*
04:28:16 [INFO] 
04:28:16 [INFO] --- tycho-source-plugin:1.4.0:plugin-source (plugin-source) @ org.eclipse.reddeer.e4.feature ---
04:28:16 [INFO] 
04:28:16 [INFO] --- target-platform-configuration:1.4.0:target-platform (default-target-platform) @ org.eclipse.reddeer.e4.feature ---
04:28:16 [INFO] 
04:28:16 [INFO] --- tycho-packaging-plugin:1.4.0:package-feature (default-package-feature) @ org.eclipse.reddeer.e4.feature ---
04:28:16 [INFO] Building jar: /home/jenkins/agent/workspace/reddeer.verification.jdk11/features/org.eclipse.reddeer.e4.feature/target/org.eclipse.reddeer.e4.feature-2.8.0-SNAPSHOT.jar
04:28:16 [INFO] 
04:28:16 [INFO] --- tycho-p2-plugin:1.4.0:p2-metadata-default (default-p2-metadata-default) @ org.eclipse.reddeer.e4.feature ---
04:28:16 [INFO] 
04:28:16 [INFO] --- tycho-p2-plugin:1.4.0:feature-p2-metadata (default-feature-p2-metadata) @ org.eclipse.reddeer.e4.feature ---
04:28:16 [INFO] 
04:28:16 [INFO] --- tycho-source-feature-plugin:1.4.0:source-feature (source-feature) @ org.eclipse.reddeer.e4.feature ---
04:28:16 [INFO] Building jar: /home/jenkins/agent/workspace/reddeer.verification.jdk11/features/org.eclipse.reddeer.e4.feature/target/org.eclipse.reddeer.e4.feature-2.8.0-SNAPSHOT-sources-feature.jar
04:28:16 [INFO] 
04:28:16 [INFO] --- tycho-p2-plugin:1.4.0:p2-metadata (attached-p2-metadata) @ org.eclipse.reddeer.e4.feature ---
04:28:16 [INFO] 
04:28:16 [INFO] ------< org.eclipse.reddeer:org.eclipse.reddeer.eclipse.feature >-------
04:28:16 [INFO] Building RedDeer Eclipse Feature 2.8.0-SNAPSHOT                  [47/59]
04:28:16 [INFO] --------------------------[ eclipse-feature ]---------------------------
04:28:16 [INFO] 
04:28:16 [INFO] --- maven-clean-plugin:2.5:clean (default-clean) @ org.eclipse.reddeer.eclipse.feature ---
04:28:16 [INFO] Deleting /home/jenkins/agent/workspace/reddeer.verification.jdk11/features/org.eclipse.reddeer.eclipse.feature/target
04:28:16 [INFO] 
04:28:16 [INFO] --- tycho-packaging-plugin:1.4.0:build-qualifier-aggregator (default-build-qualifier-aggregator) @ org.eclipse.reddeer.eclipse.feature ---
04:28:16 [INFO] The project's OSGi version is 2.8.0.v20191015-0658
04:28:16 [INFO] 
04:28:16 [INFO] --- tycho-packaging-plugin:1.4.0:validate-id (default-validate-id) @ org.eclipse.reddeer.eclipse.feature ---
04:28:16 [INFO] 
04:28:16 [INFO] --- tycho-packaging-plugin:1.4.0:validate-version (default-validate-version) @ org.eclipse.reddeer.eclipse.feature ---
04:28:16 [INFO] 
04:28:16 [INFO] --- jacoco-maven-plugin:0.8.2:prepare-agent (prepare-agent-for-reddeer-tests) @ org.eclipse.reddeer.eclipse.feature ---
04:28:16 [INFO] argLine set to -javaagent:/home/jenkins/.m2/repository/org/jacoco/org.jacoco.agent/0.8.2/org.jacoco.agent-0.8.2-runtime.jar=destfile=/home/jenkins/agent/workspace/reddeer.verification.jdk11/features/org.eclipse.reddeer.eclipse.feature/target/jacoco.exec,append=true,includes=org.eclipse.reddeer.*,excludes=org.eclipse.reddeer.e4.workbench.core/**/*
04:28:16 [INFO] 
04:28:16 [INFO] --- tycho-source-plugin:1.4.0:plugin-source (plugin-source) @ org.eclipse.reddeer.eclipse.feature ---
04:28:16 [INFO] 
04:28:16 [INFO] --- target-platform-configuration:1.4.0:target-platform (default-target-platform) @ org.eclipse.reddeer.eclipse.feature ---
04:28:16 [INFO] 
04:28:16 [INFO] --- tycho-packaging-plugin:1.4.0:package-feature (default-package-feature) @ org.eclipse.reddeer.eclipse.feature ---
04:28:16 [INFO] Building jar: /home/jenkins/agent/workspace/reddeer.verification.jdk11/features/org.eclipse.reddeer.eclipse.feature/target/org.eclipse.reddeer.eclipse.feature-2.8.0-SNAPSHOT.jar
04:28:16 [INFO] 
04:28:16 [INFO] --- tycho-p2-plugin:1.4.0:p2-metadata-default (default-p2-metadata-default) @ org.eclipse.reddeer.eclipse.feature ---
04:28:16 [INFO] 
04:28:16 [INFO] --- tycho-p2-plugin:1.4.0:feature-p2-metadata (default-feature-p2-metadata) @ org.eclipse.reddeer.eclipse.feature ---
04:28:16 [INFO] 
04:28:16 [INFO] --- tycho-source-feature-plugin:1.4.0:source-feature (source-feature) @ org.eclipse.reddeer.eclipse.feature ---
04:28:17 [INFO] Building jar: /home/jenkins/agent/workspace/reddeer.verification.jdk11/features/org.eclipse.reddeer.eclipse.feature/target/org.eclipse.reddeer.eclipse.feature-2.8.0-SNAPSHOT-sources-feature.jar
04:28:17 [INFO] 
04:28:17 [INFO] --- tycho-p2-plugin:1.4.0:p2-metadata (attached-p2-metadata) @ org.eclipse.reddeer.eclipse.feature ---
04:28:17 [INFO] 
04:28:17 [INFO] ------< org.eclipse.reddeer:org.eclipse.reddeer.gef.spy.feature >-------
04:28:17 [INFO] Building RedDeer GEF Spy Feature 2.8.0-SNAPSHOT                  [48/59]
04:28:17 [INFO] --------------------------[ eclipse-feature ]---------------------------
04:28:17 [INFO] 
04:28:17 [INFO] --- maven-clean-plugin:2.5:clean (default-clean) @ org.eclipse.reddeer.gef.spy.feature ---
04:28:17 [INFO] Deleting /home/jenkins/agent/workspace/reddeer.verification.jdk11/features/org.eclipse.reddeer.gef.spy.feature/target
04:28:17 [INFO] 
04:28:17 [INFO] --- tycho-packaging-plugin:1.4.0:build-qualifier-aggregator (default-build-qualifier-aggregator) @ org.eclipse.reddeer.gef.spy.feature ---
04:28:17 [INFO] The project's OSGi version is 2.8.0.v20191015-0658
04:28:17 [INFO] 
04:28:17 [INFO] --- tycho-packaging-plugin:1.4.0:validate-id (default-validate-id) @ org.eclipse.reddeer.gef.spy.feature ---
04:28:17 [INFO] 
04:28:17 [INFO] --- tycho-packaging-plugin:1.4.0:validate-version (default-validate-version) @ org.eclipse.reddeer.gef.spy.feature ---
04:28:17 [INFO] 
04:28:17 [INFO] --- jacoco-maven-plugin:0.8.2:prepare-agent (prepare-agent-for-reddeer-tests) @ org.eclipse.reddeer.gef.spy.feature ---
04:28:17 [INFO] argLine set to -javaagent:/home/jenkins/.m2/repository/org/jacoco/org.jacoco.agent/0.8.2/org.jacoco.agent-0.8.2-runtime.jar=destfile=/home/jenkins/agent/workspace/reddeer.verification.jdk11/features/org.eclipse.reddeer.gef.spy.feature/target/jacoco.exec,append=true,includes=org.eclipse.reddeer.*,excludes=org.eclipse.reddeer.e4.workbench.core/**/*
04:28:17 [INFO] 
04:28:17 [INFO] --- tycho-source-plugin:1.4.0:plugin-source (plugin-source) @ org.eclipse.reddeer.gef.spy.feature ---
04:28:17 [INFO] 
04:28:17 [INFO] --- target-platform-configuration:1.4.0:target-platform (default-target-platform) @ org.eclipse.reddeer.gef.spy.feature ---
04:28:17 [INFO] 
04:28:17 [INFO] --- tycho-packaging-plugin:1.4.0:package-feature (default-package-feature) @ org.eclipse.reddeer.gef.spy.feature ---
04:28:17 [INFO] Building jar: /home/jenkins/agent/workspace/reddeer.verification.jdk11/features/org.eclipse.reddeer.gef.spy.feature/target/org.eclipse.reddeer.gef.spy.feature-2.8.0-SNAPSHOT.jar
04:28:17 [INFO] 
04:28:17 [INFO] --- tycho-p2-plugin:1.4.0:p2-metadata-default (default-p2-metadata-default) @ org.eclipse.reddeer.gef.spy.feature ---
04:28:17 [INFO] 
04:28:17 [INFO] --- tycho-p2-plugin:1.4.0:feature-p2-metadata (default-feature-p2-metadata) @ org.eclipse.reddeer.gef.spy.feature ---
04:28:17 [INFO] 
04:28:17 [INFO] --- tycho-source-feature-plugin:1.4.0:source-feature (source-feature) @ org.eclipse.reddeer.gef.spy.feature ---
04:28:17 [INFO] Building jar: /home/jenkins/agent/workspace/reddeer.verification.jdk11/features/org.eclipse.reddeer.gef.spy.feature/target/org.eclipse.reddeer.gef.spy.feature-2.8.0-SNAPSHOT-sources-feature.jar
04:28:17 [INFO] 
04:28:17 [INFO] --- tycho-p2-plugin:1.4.0:p2-metadata (attached-p2-metadata) @ org.eclipse.reddeer.gef.spy.feature ---
04:28:17 [INFO] 
04:28:17 [INFO] --------< org.eclipse.reddeer:org.eclipse.reddeer.swt.feature >---------
04:28:17 [INFO] Building RedDeer SWT Feature 2.8.0-SNAPSHOT                      [49/59]
04:28:17 [INFO] --------------------------[ eclipse-feature ]---------------------------
04:28:17 [INFO] 
04:28:17 [INFO] --- maven-clean-plugin:2.5:clean (default-clean) @ org.eclipse.reddeer.swt.feature ---
04:28:17 [INFO] Deleting /home/jenkins/agent/workspace/reddeer.verification.jdk11/features/org.eclipse.reddeer.swt.feature/target
04:28:17 [INFO] 
04:28:17 [INFO] --- tycho-packaging-plugin:1.4.0:build-qualifier-aggregator (default-build-qualifier-aggregator) @ org.eclipse.reddeer.swt.feature ---
04:28:17 [INFO] The project's OSGi version is 2.8.0.v20191015-0658
04:28:17 [INFO] 
04:28:17 [INFO] --- tycho-packaging-plugin:1.4.0:validate-id (default-validate-id) @ org.eclipse.reddeer.swt.feature ---
04:28:17 [INFO] 
04:28:17 [INFO] --- tycho-packaging-plugin:1.4.0:validate-version (default-validate-version) @ org.eclipse.reddeer.swt.feature ---
04:28:17 [INFO] 
04:28:17 [INFO] --- jacoco-maven-plugin:0.8.2:prepare-agent (prepare-agent-for-reddeer-tests) @ org.eclipse.reddeer.swt.feature ---
04:28:17 [INFO] argLine set to -javaagent:/home/jenkins/.m2/repository/org/jacoco/org.jacoco.agent/0.8.2/org.jacoco.agent-0.8.2-runtime.jar=destfile=/home/jenkins/agent/workspace/reddeer.verification.jdk11/features/org.eclipse.reddeer.swt.feature/target/jacoco.exec,append=true,includes=org.eclipse.reddeer.*,excludes=org.eclipse.reddeer.e4.workbench.core/**/*
04:28:17 [INFO] 
04:28:17 [INFO] --- tycho-source-plugin:1.4.0:plugin-source (plugin-source) @ org.eclipse.reddeer.swt.feature ---
04:28:17 [INFO] 
04:28:17 [INFO] --- target-platform-configuration:1.4.0:target-platform (default-target-platform) @ org.eclipse.reddeer.swt.feature ---
04:28:17 [INFO] 
04:28:17 [INFO] --- tycho-packaging-plugin:1.4.0:package-feature (default-package-feature) @ org.eclipse.reddeer.swt.feature ---
04:28:17 [INFO] Building jar: /home/jenkins/agent/workspace/reddeer.verification.jdk11/features/org.eclipse.reddeer.swt.feature/target/org.eclipse.reddeer.swt.feature-2.8.0-SNAPSHOT.jar
04:28:17 [INFO] 
04:28:17 [INFO] --- tycho-p2-plugin:1.4.0:p2-metadata-default (default-p2-metadata-default) @ org.eclipse.reddeer.swt.feature ---
04:28:17 [INFO] 
04:28:17 [INFO] --- tycho-p2-plugin:1.4.0:feature-p2-metadata (default-feature-p2-metadata) @ org.eclipse.reddeer.swt.feature ---
04:28:17 [INFO] 
04:28:17 [INFO] --- tycho-source-feature-plugin:1.4.0:source-feature (source-feature) @ org.eclipse.reddeer.swt.feature ---
04:28:17 [INFO] Building jar: /home/jenkins/agent/workspace/reddeer.verification.jdk11/features/org.eclipse.reddeer.swt.feature/target/org.eclipse.reddeer.swt.feature-2.8.0-SNAPSHOT-sources-feature.jar
04:28:17 [INFO] 
04:28:17 [INFO] --- tycho-p2-plugin:1.4.0:p2-metadata (attached-p2-metadata) @ org.eclipse.reddeer.swt.feature ---
04:28:17 [INFO] 
04:28:17 [INFO] -------< org.eclipse.reddeer:org.eclipse.reddeer.tests.feature >--------
04:28:17 [INFO] Building RedDeer Tests Feature 2.8.0-SNAPSHOT                    [50/59]
04:28:17 [INFO] --------------------------[ eclipse-feature ]---------------------------
04:28:18 [INFO] 
04:28:18 [INFO] --- maven-clean-plugin:2.5:clean (default-clean) @ org.eclipse.reddeer.tests.feature ---
04:28:18 [INFO] Deleting /home/jenkins/agent/workspace/reddeer.verification.jdk11/features/org.eclipse.reddeer.tests.feature/target
04:28:18 [INFO] 
04:28:18 [INFO] --- tycho-packaging-plugin:1.4.0:build-qualifier-aggregator (default-build-qualifier-aggregator) @ org.eclipse.reddeer.tests.feature ---
04:28:18 [INFO] The project's OSGi version is 2.8.0.v20191015-0658
04:28:18 [INFO] 
04:28:18 [INFO] --- tycho-packaging-plugin:1.4.0:validate-id (default-validate-id) @ org.eclipse.reddeer.tests.feature ---
04:28:18 [INFO] 
04:28:18 [INFO] --- tycho-packaging-plugin:1.4.0:validate-version (default-validate-version) @ org.eclipse.reddeer.tests.feature ---
04:28:18 [INFO] 
04:28:18 [INFO] --- jacoco-maven-plugin:0.8.2:prepare-agent (prepare-agent-for-reddeer-tests) @ org.eclipse.reddeer.tests.feature ---
04:28:18 [INFO] argLine set to -javaagent:/home/jenkins/.m2/repository/org/jacoco/org.jacoco.agent/0.8.2/org.jacoco.agent-0.8.2-runtime.jar=destfile=/home/jenkins/agent/workspace/reddeer.verification.jdk11/features/org.eclipse.reddeer.tests.feature/target/jacoco.exec,append=true,includes=org.eclipse.reddeer.*,excludes=org.eclipse.reddeer.e4.workbench.core/**/*
04:28:18 [INFO] 
04:28:18 [INFO] --- tycho-source-plugin:1.4.0:plugin-source (plugin-source) @ org.eclipse.reddeer.tests.feature ---
04:28:18 [INFO] 
04:28:18 [INFO] --- target-platform-configuration:1.4.0:target-platform (default-target-platform) @ org.eclipse.reddeer.tests.feature ---
04:28:18 [INFO] 
04:28:18 [INFO] --- tycho-packaging-plugin:1.4.0:package-feature (default-package-feature) @ org.eclipse.reddeer.tests.feature ---
04:28:18 [INFO] Building jar: /home/jenkins/agent/workspace/reddeer.verification.jdk11/features/org.eclipse.reddeer.tests.feature/target/org.eclipse.reddeer.tests.feature-2.8.0-SNAPSHOT.jar
04:28:18 [INFO] 
04:28:18 [INFO] --- tycho-p2-plugin:1.4.0:p2-metadata-default (default-p2-metadata-default) @ org.eclipse.reddeer.tests.feature ---
04:28:18 [INFO] 
04:28:18 [INFO] --- tycho-p2-plugin:1.4.0:feature-p2-metadata (default-feature-p2-metadata) @ org.eclipse.reddeer.tests.feature ---
04:28:18 [INFO] 
04:28:18 [INFO] --- tycho-source-feature-plugin:1.4.0:source-feature (source-feature) @ org.eclipse.reddeer.tests.feature ---
04:28:18 [INFO] Building jar: /home/jenkins/agent/workspace/reddeer.verification.jdk11/features/org.eclipse.reddeer.tests.feature/target/org.eclipse.reddeer.tests.feature-2.8.0-SNAPSHOT-sources-feature.jar
04:28:18 [INFO] 
04:28:18 [INFO] --- tycho-p2-plugin:1.4.0:p2-metadata (attached-p2-metadata) @ org.eclipse.reddeer.tests.feature ---
04:28:18 [INFO] 
04:28:18 [INFO] ---------< org.eclipse.reddeer:org.eclipse.reddeer.ui.feature >---------
04:28:18 [INFO] Building RedDeer UI Feature 2.8.0-SNAPSHOT                       [51/59]
04:28:18 [INFO] --------------------------[ eclipse-feature ]---------------------------
04:28:18 [INFO] 
04:28:18 [INFO] --- maven-clean-plugin:2.5:clean (default-clean) @ org.eclipse.reddeer.ui.feature ---
04:28:18 [INFO] Deleting /home/jenkins/agent/workspace/reddeer.verification.jdk11/features/org.eclipse.reddeer.ui.feature/target
04:28:18 [INFO] 
04:28:18 [INFO] --- tycho-packaging-plugin:1.4.0:build-qualifier-aggregator (default-build-qualifier-aggregator) @ org.eclipse.reddeer.ui.feature ---
04:28:18 [INFO] The project's OSGi version is 2.8.0.v20191015-0658
04:28:18 [INFO] 
04:28:18 [INFO] --- tycho-packaging-plugin:1.4.0:validate-id (default-validate-id) @ org.eclipse.reddeer.ui.feature ---
04:28:18 [INFO] 
04:28:18 [INFO] --- tycho-packaging-plugin:1.4.0:validate-version (default-validate-version) @ org.eclipse.reddeer.ui.feature ---
04:28:18 [INFO] 
04:28:18 [INFO] --- jacoco-maven-plugin:0.8.2:prepare-agent (prepare-agent-for-reddeer-tests) @ org.eclipse.reddeer.ui.feature ---
04:28:18 [INFO] argLine set to -javaagent:/home/jenkins/.m2/repository/org/jacoco/org.jacoco.agent/0.8.2/org.jacoco.agent-0.8.2-runtime.jar=destfile=/home/jenkins/agent/workspace/reddeer.verification.jdk11/features/org.eclipse.reddeer.ui.feature/target/jacoco.exec,append=true,includes=org.eclipse.reddeer.*,excludes=org.eclipse.reddeer.e4.workbench.core/**/*
04:28:18 [INFO] 
04:28:18 [INFO] --- tycho-source-plugin:1.4.0:plugin-source (plugin-source) @ org.eclipse.reddeer.ui.feature ---
04:28:18 [INFO] 
04:28:18 [INFO] --- target-platform-configuration:1.4.0:target-platform (default-target-platform) @ org.eclipse.reddeer.ui.feature ---
04:28:18 [INFO] 
04:28:18 [INFO] --- tycho-packaging-plugin:1.4.0:package-feature (default-package-feature) @ org.eclipse.reddeer.ui.feature ---
04:28:18 [INFO] Building jar: /home/jenkins/agent/workspace/reddeer.verification.jdk11/features/org.eclipse.reddeer.ui.feature/target/org.eclipse.reddeer.ui.feature-2.8.0-SNAPSHOT.jar
04:28:18 [INFO] 
04:28:18 [INFO] --- tycho-p2-plugin:1.4.0:p2-metadata-default (default-p2-metadata-default) @ org.eclipse.reddeer.ui.feature ---
04:28:18 [INFO] 
04:28:18 [INFO] --- tycho-p2-plugin:1.4.0:feature-p2-metadata (default-feature-p2-metadata) @ org.eclipse.reddeer.ui.feature ---
04:28:18 [INFO] 
04:28:18 [INFO] --- tycho-source-feature-plugin:1.4.0:source-feature (source-feature) @ org.eclipse.reddeer.ui.feature ---
04:28:18 [INFO] Building jar: /home/jenkins/agent/workspace/reddeer.verification.jdk11/features/org.eclipse.reddeer.ui.feature/target/org.eclipse.reddeer.ui.feature-2.8.0-SNAPSHOT-sources-feature.jar
04:28:18 [INFO] 
04:28:18 [INFO] --- tycho-p2-plugin:1.4.0:p2-metadata (attached-p2-metadata) @ org.eclipse.reddeer.ui.feature ---
04:28:18 [INFO] 
04:28:18 [INFO] ------< org.eclipse.reddeer:org.eclipse.reddeer.recorder.feature >------
04:28:18 [INFO] Building RedDeer Recorder Feature 2.8.0-SNAPSHOT                 [52/59]
04:28:18 [INFO] --------------------------[ eclipse-feature ]---------------------------
04:28:18 [INFO] 
04:28:18 [INFO] --- maven-clean-plugin:2.5:clean (default-clean) @ org.eclipse.reddeer.recorder.feature ---
04:28:18 [INFO] Deleting /home/jenkins/agent/workspace/reddeer.verification.jdk11/features/org.eclipse.reddeer.recorder.feature/target
04:28:18 [INFO] 
04:28:18 [INFO] --- tycho-packaging-plugin:1.4.0:build-qualifier-aggregator (default-build-qualifier-aggregator) @ org.eclipse.reddeer.recorder.feature ---
04:28:18 [INFO] The project's OSGi version is 2.8.0.v20191015-0658
04:28:18 [INFO] 
04:28:18 [INFO] --- tycho-packaging-plugin:1.4.0:validate-id (default-validate-id) @ org.eclipse.reddeer.recorder.feature ---
04:28:18 [INFO] 
04:28:18 [INFO] --- tycho-packaging-plugin:1.4.0:validate-version (default-validate-version) @ org.eclipse.reddeer.recorder.feature ---
04:28:18 [INFO] 
04:28:18 [INFO] --- jacoco-maven-plugin:0.8.2:prepare-agent (prepare-agent-for-reddeer-tests) @ org.eclipse.reddeer.recorder.feature ---
04:28:18 [INFO] argLine set to -javaagent:/home/jenkins/.m2/repository/org/jacoco/org.jacoco.agent/0.8.2/org.jacoco.agent-0.8.2-runtime.jar=destfile=/home/jenkins/agent/workspace/reddeer.verification.jdk11/features/org.eclipse.reddeer.recorder.feature/target/jacoco.exec,append=true,includes=org.eclipse.reddeer.*,excludes=org.eclipse.reddeer.e4.workbench.core/**/*
04:28:18 [INFO] 
04:28:18 [INFO] --- tycho-source-plugin:1.4.0:plugin-source (plugin-source) @ org.eclipse.reddeer.recorder.feature ---
04:28:18 [INFO] 
04:28:18 [INFO] --- target-platform-configuration:1.4.0:target-platform (default-target-platform) @ org.eclipse.reddeer.recorder.feature ---
04:28:18 [INFO] 
04:28:18 [INFO] --- tycho-packaging-plugin:1.4.0:package-feature (default-package-feature) @ org.eclipse.reddeer.recorder.feature ---
04:28:18 [INFO] Building jar: /home/jenkins/agent/workspace/reddeer.verification.jdk11/features/org.eclipse.reddeer.recorder.feature/target/org.eclipse.reddeer.recorder.feature-2.8.0-SNAPSHOT.jar
04:28:18 [INFO] 
04:28:18 [INFO] --- tycho-p2-plugin:1.4.0:p2-metadata-default (default-p2-metadata-default) @ org.eclipse.reddeer.recorder.feature ---
04:28:18 [INFO] 
04:28:18 [INFO] --- tycho-p2-plugin:1.4.0:feature-p2-metadata (default-feature-p2-metadata) @ org.eclipse.reddeer.recorder.feature ---
04:28:18 [INFO] 
04:28:18 [INFO] --- tycho-source-feature-plugin:1.4.0:source-feature (source-feature) @ org.eclipse.reddeer.recorder.feature ---
04:28:18 [INFO] Building jar: /home/jenkins/agent/workspace/reddeer.verification.jdk11/features/org.eclipse.reddeer.recorder.feature/target/org.eclipse.reddeer.recorder.feature-2.8.0-SNAPSHOT-sources-feature.jar
04:28:18 [INFO] 
04:28:18 [INFO] --- tycho-p2-plugin:1.4.0:p2-metadata (attached-p2-metadata) @ org.eclipse.reddeer.recorder.feature ---
04:28:18 [INFO] 
04:28:18 [INFO] ------< org.eclipse.reddeer:org.eclipse.reddeer.graphiti.feature >------
04:28:18 [INFO] Building RedDeer GEF/Graphiti Feature 2.8.0-SNAPSHOT             [53/59]
04:28:18 [INFO] --------------------------[ eclipse-feature ]---------------------------
04:28:18 [INFO] 
04:28:18 [INFO] --- maven-clean-plugin:2.5:clean (default-clean) @ org.eclipse.reddeer.graphiti.feature ---
04:28:18 [INFO] Deleting /home/jenkins/agent/workspace/reddeer.verification.jdk11/features/org.eclipse.reddeer.graphiti.feature/target
04:28:18 [INFO] 
04:28:18 [INFO] --- tycho-packaging-plugin:1.4.0:build-qualifier-aggregator (default-build-qualifier-aggregator) @ org.eclipse.reddeer.graphiti.feature ---
04:28:18 [INFO] The project's OSGi version is 2.8.0.v20191015-0658
04:28:18 [INFO] 
04:28:18 [INFO] --- tycho-packaging-plugin:1.4.0:validate-id (default-validate-id) @ org.eclipse.reddeer.graphiti.feature ---
04:28:18 [INFO] 
04:28:18 [INFO] --- tycho-packaging-plugin:1.4.0:validate-version (default-validate-version) @ org.eclipse.reddeer.graphiti.feature ---
04:28:18 [INFO] 
04:28:18 [INFO] --- jacoco-maven-plugin:0.8.2:prepare-agent (prepare-agent-for-reddeer-tests) @ org.eclipse.reddeer.graphiti.feature ---
04:28:19 [INFO] argLine set to -javaagent:/home/jenkins/.m2/repository/org/jacoco/org.jacoco.agent/0.8.2/org.jacoco.agent-0.8.2-runtime.jar=destfile=/home/jenkins/agent/workspace/reddeer.verification.jdk11/features/org.eclipse.reddeer.graphiti.feature/target/jacoco.exec,append=true,includes=org.eclipse.reddeer.*,excludes=org.eclipse.reddeer.e4.workbench.core/**/*
04:28:19 [INFO] 
04:28:19 [INFO] --- tycho-source-plugin:1.4.0:plugin-source (plugin-source) @ org.eclipse.reddeer.graphiti.feature ---
04:28:19 [INFO] 
04:28:19 [INFO] --- target-platform-configuration:1.4.0:target-platform (default-target-platform) @ org.eclipse.reddeer.graphiti.feature ---
04:28:19 [INFO] 
04:28:19 [INFO] --- tycho-packaging-plugin:1.4.0:package-feature (default-package-feature) @ org.eclipse.reddeer.graphiti.feature ---
04:28:19 [INFO] Building jar: /home/jenkins/agent/workspace/reddeer.verification.jdk11/features/org.eclipse.reddeer.graphiti.feature/target/org.eclipse.reddeer.graphiti.feature-2.8.0-SNAPSHOT.jar
04:28:19 [INFO] 
04:28:19 [INFO] --- tycho-p2-plugin:1.4.0:p2-metadata-default (default-p2-metadata-default) @ org.eclipse.reddeer.graphiti.feature ---
04:28:19 [INFO] 
04:28:19 [INFO] --- tycho-p2-plugin:1.4.0:feature-p2-metadata (default-feature-p2-metadata) @ org.eclipse.reddeer.graphiti.feature ---
04:28:19 [INFO] 
04:28:19 [INFO] --- tycho-source-feature-plugin:1.4.0:source-feature (source-feature) @ org.eclipse.reddeer.graphiti.feature ---
04:28:19 [INFO] Building jar: /home/jenkins/agent/workspace/reddeer.verification.jdk11/features/org.eclipse.reddeer.graphiti.feature/target/org.eclipse.reddeer.graphiti.feature-2.8.0-SNAPSHOT-sources-feature.jar
04:28:19 [INFO] 
04:28:19 [INFO] --- tycho-p2-plugin:1.4.0:p2-metadata (attached-p2-metadata) @ org.eclipse.reddeer.graphiti.feature ---
04:28:19 [INFO] 
04:28:19 [INFO] --------< org.eclipse.reddeer:org.eclipse.reddeer.spy.feature >---------
04:28:19 [INFO] Building RedDeer Spy Feature 2.8.0-SNAPSHOT                      [54/59]
04:28:19 [INFO] --------------------------[ eclipse-feature ]---------------------------
04:28:19 [INFO] 
04:28:19 [INFO] --- maven-clean-plugin:2.5:clean (default-clean) @ org.eclipse.reddeer.spy.feature ---
04:28:19 [INFO] Deleting /home/jenkins/agent/workspace/reddeer.verification.jdk11/features/org.eclipse.reddeer.spy.feature/target
04:28:19 [INFO] 
04:28:19 [INFO] --- tycho-packaging-plugin:1.4.0:build-qualifier-aggregator (default-build-qualifier-aggregator) @ org.eclipse.reddeer.spy.feature ---
04:28:19 [INFO] The project's OSGi version is 2.8.0.v20191015-0658
04:28:19 [INFO] 
04:28:19 [INFO] --- tycho-packaging-plugin:1.4.0:validate-id (default-validate-id) @ org.eclipse.reddeer.spy.feature ---
04:28:19 [INFO] 
04:28:19 [INFO] --- tycho-packaging-plugin:1.4.0:validate-version (default-validate-version) @ org.eclipse.reddeer.spy.feature ---
04:28:19 [INFO] 
04:28:19 [INFO] --- jacoco-maven-plugin:0.8.2:prepare-agent (prepare-agent-for-reddeer-tests) @ org.eclipse.reddeer.spy.feature ---
04:28:19 [INFO] argLine set to -javaagent:/home/jenkins/.m2/repository/org/jacoco/org.jacoco.agent/0.8.2/org.jacoco.agent-0.8.2-runtime.jar=destfile=/home/jenkins/agent/workspace/reddeer.verification.jdk11/features/org.eclipse.reddeer.spy.feature/target/jacoco.exec,append=true,includes=org.eclipse.reddeer.*,excludes=org.eclipse.reddeer.e4.workbench.core/**/*
04:28:19 [INFO] 
04:28:19 [INFO] --- tycho-source-plugin:1.4.0:plugin-source (plugin-source) @ org.eclipse.reddeer.spy.feature ---
04:28:19 [INFO] 
04:28:19 [INFO] --- target-platform-configuration:1.4.0:target-platform (default-target-platform) @ org.eclipse.reddeer.spy.feature ---
04:28:19 [INFO] 
04:28:19 [INFO] --- tycho-packaging-plugin:1.4.0:package-feature (default-package-feature) @ org.eclipse.reddeer.spy.feature ---
04:28:19 [INFO] Building jar: /home/jenkins/agent/workspace/reddeer.verification.jdk11/features/org.eclipse.reddeer.spy.feature/target/org.eclipse.reddeer.spy.feature-2.8.0-SNAPSHOT.jar
04:28:19 [INFO] 
04:28:19 [INFO] --- tycho-p2-plugin:1.4.0:p2-metadata-default (default-p2-metadata-default) @ org.eclipse.reddeer.spy.feature ---
04:28:19 [INFO] 
04:28:19 [INFO] --- tycho-p2-plugin:1.4.0:feature-p2-metadata (default-feature-p2-metadata) @ org.eclipse.reddeer.spy.feature ---
04:28:19 [INFO] 
04:28:19 [INFO] --- tycho-source-feature-plugin:1.4.0:source-feature (source-feature) @ org.eclipse.reddeer.spy.feature ---
04:28:19 [INFO] Building jar: /home/jenkins/agent/workspace/reddeer.verification.jdk11/features/org.eclipse.reddeer.spy.feature/target/org.eclipse.reddeer.spy.feature-2.8.0-SNAPSHOT-sources-feature.jar
04:28:19 [INFO] 
04:28:19 [INFO] --- tycho-p2-plugin:1.4.0:p2-metadata (attached-p2-metadata) @ org.eclipse.reddeer.spy.feature ---
04:28:19 [INFO] 
04:28:19 [INFO] -----< org.eclipse.reddeer:org.eclipse.reddeer.logparser.feature >------
04:28:19 [INFO] Building RedDeer Log Parser Feature 2.8.0-SNAPSHOT               [55/59]
04:28:19 [INFO] --------------------------[ eclipse-feature ]---------------------------
04:28:19 [INFO] 
04:28:19 [INFO] --- maven-clean-plugin:2.5:clean (default-clean) @ org.eclipse.reddeer.logparser.feature ---
04:28:19 [INFO] Deleting /home/jenkins/agent/workspace/reddeer.verification.jdk11/features/org.eclipse.reddeer.logparser.feature/target
04:28:19 [INFO] 
04:28:19 [INFO] --- tycho-packaging-plugin:1.4.0:build-qualifier-aggregator (default-build-qualifier-aggregator) @ org.eclipse.reddeer.logparser.feature ---
04:28:19 [INFO] The project's OSGi version is 2.8.0.v20191015-0658
04:28:19 [INFO] 
04:28:19 [INFO] --- tycho-packaging-plugin:1.4.0:validate-id (default-validate-id) @ org.eclipse.reddeer.logparser.feature ---
04:28:19 [INFO] 
04:28:19 [INFO] --- tycho-packaging-plugin:1.4.0:validate-version (default-validate-version) @ org.eclipse.reddeer.logparser.feature ---
04:28:19 [INFO] 
04:28:19 [INFO] --- jacoco-maven-plugin:0.8.2:prepare-agent (prepare-agent-for-reddeer-tests) @ org.eclipse.reddeer.logparser.feature ---
04:28:19 [INFO] argLine set to -javaagent:/home/jenkins/.m2/repository/org/jacoco/org.jacoco.agent/0.8.2/org.jacoco.agent-0.8.2-runtime.jar=destfile=/home/jenkins/agent/workspace/reddeer.verification.jdk11/features/org.eclipse.reddeer.logparser.feature/target/jacoco.exec,append=true,includes=org.eclipse.reddeer.*,excludes=org.eclipse.reddeer.e4.workbench.core/**/*
04:28:19 [INFO] 
04:28:19 [INFO] --- tycho-source-plugin:1.4.0:plugin-source (plugin-source) @ org.eclipse.reddeer.logparser.feature ---
04:28:19 [INFO] 
04:28:19 [INFO] --- target-platform-configuration:1.4.0:target-platform (default-target-platform) @ org.eclipse.reddeer.logparser.feature ---
04:28:19 [INFO] 
04:28:19 [INFO] --- tycho-packaging-plugin:1.4.0:package-feature (default-package-feature) @ org.eclipse.reddeer.logparser.feature ---
04:28:19 [INFO] Building jar: /home/jenkins/agent/workspace/reddeer.verification.jdk11/features/org.eclipse.reddeer.logparser.feature/target/org.eclipse.reddeer.logparser.feature-2.8.0-SNAPSHOT.jar
04:28:19 [INFO] 
04:28:19 [INFO] --- tycho-p2-plugin:1.4.0:p2-metadata-default (default-p2-metadata-default) @ org.eclipse.reddeer.logparser.feature ---
04:28:19 [INFO] 
04:28:19 [INFO] --- tycho-p2-plugin:1.4.0:feature-p2-metadata (default-feature-p2-metadata) @ org.eclipse.reddeer.logparser.feature ---
04:28:19 [INFO] 
04:28:19 [INFO] --- tycho-source-feature-plugin:1.4.0:source-feature (source-feature) @ org.eclipse.reddeer.logparser.feature ---
04:28:19 [INFO] Building jar: /home/jenkins/agent/workspace/reddeer.verification.jdk11/features/org.eclipse.reddeer.logparser.feature/target/org.eclipse.reddeer.logparser.feature-2.8.0-SNAPSHOT-sources-feature.jar
04:28:19 [INFO] 
04:28:19 [INFO] --- tycho-p2-plugin:1.4.0:p2-metadata (attached-p2-metadata) @ org.eclipse.reddeer.logparser.feature ---
04:28:19 [INFO] 
04:28:19 [INFO] ------< org.eclipse.reddeer:org.eclipse.reddeer.selenium.feature >------
04:28:19 [INFO] Building RedDeer Selenium Feature 2.8.0-SNAPSHOT                 [56/59]
04:28:19 [INFO] --------------------------[ eclipse-feature ]---------------------------
04:28:19 [INFO] 
04:28:19 [INFO] --- maven-clean-plugin:2.5:clean (default-clean) @ org.eclipse.reddeer.selenium.feature ---
04:28:19 [INFO] Deleting /home/jenkins/agent/workspace/reddeer.verification.jdk11/features/org.eclipse.reddeer.selenium.feature/target
04:28:19 [INFO] 
04:28:19 [INFO] --- tycho-packaging-plugin:1.4.0:build-qualifier-aggregator (default-build-qualifier-aggregator) @ org.eclipse.reddeer.selenium.feature ---
04:28:19 [INFO] The project's OSGi version is 2.8.0.v20191015-0658
04:28:19 [INFO] 
04:28:19 [INFO] --- tycho-packaging-plugin:1.4.0:validate-id (default-validate-id) @ org.eclipse.reddeer.selenium.feature ---
04:28:19 [INFO] 
04:28:19 [INFO] --- tycho-packaging-plugin:1.4.0:validate-version (default-validate-version) @ org.eclipse.reddeer.selenium.feature ---
04:28:19 [INFO] 
04:28:19 [INFO] --- jacoco-maven-plugin:0.8.2:prepare-agent (prepare-agent-for-reddeer-tests) @ org.eclipse.reddeer.selenium.feature ---
04:28:19 [INFO] argLine set to -javaagent:/home/jenkins/.m2/repository/org/jacoco/org.jacoco.agent/0.8.2/org.jacoco.agent-0.8.2-runtime.jar=destfile=/home/jenkins/agent/workspace/reddeer.verification.jdk11/features/org.eclipse.reddeer.selenium.feature/target/jacoco.exec,append=true,includes=org.eclipse.reddeer.*,excludes=org.eclipse.reddeer.e4.workbench.core/**/*
04:28:19 [INFO] 
04:28:19 [INFO] --- tycho-source-plugin:1.4.0:plugin-source (plugin-source) @ org.eclipse.reddeer.selenium.feature ---
04:28:19 [INFO] 
04:28:19 [INFO] --- target-platform-configuration:1.4.0:target-platform (default-target-platform) @ org.eclipse.reddeer.selenium.feature ---
04:28:19 [INFO] 
04:28:19 [INFO] --- tycho-packaging-plugin:1.4.0:package-feature (default-package-feature) @ org.eclipse.reddeer.selenium.feature ---
04:28:19 [INFO] Building jar: /home/jenkins/agent/workspace/reddeer.verification.jdk11/features/org.eclipse.reddeer.selenium.feature/target/org.eclipse.reddeer.selenium.feature-2.8.0-SNAPSHOT.jar
04:28:19 [INFO] 
04:28:19 [INFO] --- tycho-p2-plugin:1.4.0:p2-metadata-default (default-p2-metadata-default) @ org.eclipse.reddeer.selenium.feature ---
04:28:19 [INFO] 
04:28:19 [INFO] --- tycho-p2-plugin:1.4.0:feature-p2-metadata (default-feature-p2-metadata) @ org.eclipse.reddeer.selenium.feature ---
04:28:19 [INFO] 
04:28:19 [INFO] --- tycho-source-feature-plugin:1.4.0:source-feature (source-feature) @ org.eclipse.reddeer.selenium.feature ---
04:28:20 [INFO] Building jar: /home/jenkins/agent/workspace/reddeer.verification.jdk11/features/org.eclipse.reddeer.selenium.feature/target/org.eclipse.reddeer.selenium.feature-2.8.0-SNAPSHOT-sources-feature.jar
04:28:20 [INFO] 
04:28:20 [INFO] --- tycho-p2-plugin:1.4.0:p2-metadata (attached-p2-metadata) @ org.eclipse.reddeer.selenium.feature ---
04:28:20 [INFO] 
04:28:20 [INFO] ------< org.eclipse.reddeer:org.eclipse.reddeer.codegen.feature >-------
04:28:20 [INFO] Building RedDeer CodeGen Feature 2.8.0-SNAPSHOT                  [57/59]
04:28:20 [INFO] --------------------------[ eclipse-feature ]---------------------------
04:28:20 [INFO] 
04:28:20 [INFO] --- maven-clean-plugin:2.5:clean (default-clean) @ org.eclipse.reddeer.codegen.feature ---
04:28:20 [INFO] Deleting /home/jenkins/agent/workspace/reddeer.verification.jdk11/features/org.eclipse.reddeer.codegen.feature/target
04:28:20 [INFO] 
04:28:20 [INFO] --- tycho-packaging-plugin:1.4.0:build-qualifier-aggregator (default-build-qualifier-aggregator) @ org.eclipse.reddeer.codegen.feature ---
04:28:20 [INFO] The project's OSGi version is 2.8.0.v20191015-0658
04:28:20 [INFO] 
04:28:20 [INFO] --- tycho-packaging-plugin:1.4.0:validate-id (default-validate-id) @ org.eclipse.reddeer.codegen.feature ---
04:28:20 [INFO] 
04:28:20 [INFO] --- tycho-packaging-plugin:1.4.0:validate-version (default-validate-version) @ org.eclipse.reddeer.codegen.feature ---
04:28:20 [INFO] 
04:28:20 [INFO] --- jacoco-maven-plugin:0.8.2:prepare-agent (prepare-agent-for-reddeer-tests) @ org.eclipse.reddeer.codegen.feature ---
04:28:20 [INFO] argLine set to -javaagent:/home/jenkins/.m2/repository/org/jacoco/org.jacoco.agent/0.8.2/org.jacoco.agent-0.8.2-runtime.jar=destfile=/home/jenkins/agent/workspace/reddeer.verification.jdk11/features/org.eclipse.reddeer.codegen.feature/target/jacoco.exec,append=true,includes=org.eclipse.reddeer.*,excludes=org.eclipse.reddeer.e4.workbench.core/**/*
04:28:20 [INFO] 
04:28:20 [INFO] --- tycho-source-plugin:1.4.0:plugin-source (plugin-source) @ org.eclipse.reddeer.codegen.feature ---
04:28:20 [INFO] 
04:28:20 [INFO] --- target-platform-configuration:1.4.0:target-platform (default-target-platform) @ org.eclipse.reddeer.codegen.feature ---
04:28:20 [INFO] 
04:28:20 [INFO] --- tycho-packaging-plugin:1.4.0:package-feature (default-package-feature) @ org.eclipse.reddeer.codegen.feature ---
04:28:20 [INFO] Building jar: /home/jenkins/agent/workspace/reddeer.verification.jdk11/features/org.eclipse.reddeer.codegen.feature/target/org.eclipse.reddeer.codegen.feature-2.8.0-SNAPSHOT.jar
04:28:20 [INFO] 
04:28:20 [INFO] --- tycho-p2-plugin:1.4.0:p2-metadata-default (default-p2-metadata-default) @ org.eclipse.reddeer.codegen.feature ---
04:28:20 [INFO] 
04:28:20 [INFO] --- tycho-p2-plugin:1.4.0:feature-p2-metadata (default-feature-p2-metadata) @ org.eclipse.reddeer.codegen.feature ---
04:28:20 [INFO] 
04:28:20 [INFO] --- tycho-source-feature-plugin:1.4.0:source-feature (source-feature) @ org.eclipse.reddeer.codegen.feature ---
04:28:20 [INFO] Building jar: /home/jenkins/agent/workspace/reddeer.verification.jdk11/features/org.eclipse.reddeer.codegen.feature/target/org.eclipse.reddeer.codegen.feature-2.8.0-SNAPSHOT-sources-feature.jar
04:28:20 [INFO] 
04:28:20 [INFO] --- tycho-p2-plugin:1.4.0:p2-metadata (attached-p2-metadata) @ org.eclipse.reddeer.codegen.feature ---
04:28:20 [INFO] 
04:28:20 [INFO] ------------< org.eclipse.reddeer:org.eclipse.reddeer.site >------------
04:28:20 [INFO] Building RedDeer Site 2.8.0-SNAPSHOT                             [58/59]
04:28:20 [INFO] -------------------------[ eclipse-repository ]-------------------------
04:28:20 [INFO] 
04:28:20 [INFO] --- maven-clean-plugin:2.5:clean (default-clean) @ org.eclipse.reddeer.site ---
04:28:20 [INFO] 
04:28:20 [INFO] --- tycho-packaging-plugin:1.4.0:build-qualifier-aggregator (default-build-qualifier-aggregator) @ org.eclipse.reddeer.site ---
04:28:20 [INFO] The project's OSGi version is 2.8.0.v20191015-0658
04:28:20 [INFO] 
04:28:20 [INFO] --- maven-clean-plugin:2.5:clean (default-clean-1) @ org.eclipse.reddeer.site ---
04:28:20 [INFO] 
04:28:20 [INFO] --- jacoco-maven-plugin:0.8.2:prepare-agent (prepare-agent-for-reddeer-tests) @ org.eclipse.reddeer.site ---
04:28:20 [INFO] argLine set to -javaagent:/home/jenkins/.m2/repository/org/jacoco/org.jacoco.agent/0.8.2/org.jacoco.agent-0.8.2-runtime.jar=destfile=/home/jenkins/agent/workspace/reddeer.verification.jdk11/site/target/jacoco.exec,append=true,includes=org.eclipse.reddeer.*,excludes=org.eclipse.reddeer.e4.workbench.core/**/*
04:28:20 [INFO] 
04:28:20 [INFO] --- maven-resources-plugin:2.4.3:resources (default-resources) @ org.eclipse.reddeer.site ---
04:28:20 [INFO] Using 'UTF-8' encoding to copy filtered resources.
04:28:20 [INFO] skip non existing resourceDirectory /home/jenkins/agent/workspace/reddeer.verification.jdk11/site/resources
04:28:20 [INFO] 
04:28:20 [INFO] --- tycho-source-plugin:1.4.0:plugin-source (plugin-source) @ org.eclipse.reddeer.site ---
04:28:20 [INFO] 
04:28:20 [INFO] --- target-platform-configuration:1.4.0:target-platform (default-target-platform) @ org.eclipse.reddeer.site ---
04:28:20 [INFO] 
04:28:20 [INFO] --- tycho-p2-publisher-plugin:1.4.0:publish-osgi-ee (default-publish-osgi-ee) @ org.eclipse.reddeer.site ---
04:28:20 [INFO] Published profile IUs: [a.jre.javase 10.0.0, config.a.jre.javase 10.0.0]
04:28:20 [INFO] Published profile IUs: [a.jre.javase 11.0.0, config.a.jre.javase 11.0.0]
04:28:20 [INFO] 
04:28:20 [INFO] --- tycho-p2-publisher-plugin:1.4.0:publish-products (default-publish-products) @ org.eclipse.reddeer.site ---
04:28:20 [INFO] 
04:28:20 [INFO] --- tycho-p2-publisher-plugin:1.4.0:publish-categories (default-publish-categories) @ org.eclipse.reddeer.site ---
04:28:20 [INFO] 
04:28:20 [INFO] --- tycho-p2-publisher-plugin:1.4.0:attach-artifacts (default-attach-artifacts) @ org.eclipse.reddeer.site ---
04:28:20 [INFO] 
04:28:20 [INFO] --- tycho-p2-repository-plugin:1.4.0:assemble-repository (default-assemble-repository) @ org.eclipse.reddeer.site ---
04:28:34 [INFO] 
04:28:34 [INFO] --- tycho-p2-repository-plugin:1.4.0:archive-repository (default-archive-repository) @ org.eclipse.reddeer.site ---
04:28:34 [INFO] Building zip: /home/jenkins/agent/workspace/reddeer.verification.jdk11/site/target/org.eclipse.reddeer.site-2.8.0-SNAPSHOT.zip
04:28:39 [INFO] 
04:28:39 [INFO] -----------< org.eclipse.reddeer:eclipse-reddeer-archetype >------------
04:28:39 [INFO] Building RedDeer Archetype 2.8.0-SNAPSHOT                        [59/59]
04:28:39 [INFO] --------------------------[ maven-archetype ]---------------------------
04:28:39 Downloading from eclipse.maven.central.mirror: https://repo.eclipse.org/content/repositories/maven_central/org/apache/maven/plugins/maven-resources-plugin/maven-metadata.xml
04:28:44 Progress (1): 843 B
                   
Downloaded from eclipse.maven.central.mirror: https://repo.eclipse.org/content/repositories/maven_central/org/apache/maven/plugins/maven-resources-plugin/maven-metadata.xml (843 B at 164 B/s)
04:28:44 Downloading from eclipse.maven.central.mirror: https://repo.eclipse.org/content/repositories/maven_central/org/apache/maven/plugins/maven-resources-plugin/3.1.0/maven-resources-plugin-3.1.0.pom
04:28:44 Progress (1): 4.1/7.2 kB
Progress (1): 7.2 kB    
                    
Downloaded from eclipse.maven.central.mirror: https://repo.eclipse.org/content/repositories/maven_central/org/apache/maven/plugins/maven-resources-plugin/3.1.0/maven-resources-plugin-3.1.0.pom (7.2 kB at 478 kB/s)
04:28:44 Downloading from eclipse.maven.central.mirror: https://repo.eclipse.org/content/repositories/maven_central/org/apache/maven/plugins/maven-plugins/31/maven-plugins-31.pom
04:28:44 Progress (1): 4.1/10 kB
Progress (1): 7.7/10 kB
Progress (1): 10 kB    
                   
Downloaded from eclipse.maven.central.mirror: https://repo.eclipse.org/content/repositories/maven_central/org/apache/maven/plugins/maven-plugins/31/maven-plugins-31.pom (10 kB at 650 kB/s)
04:28:44 Downloading from eclipse.maven.central.mirror: https://repo.eclipse.org/content/repositories/maven_central/org/apache/maven/plugins/maven-resources-plugin/3.1.0/maven-resources-plugin-3.1.0.jar
04:28:44 Progress (1): 4.1/32 kB
Progress (1): 7.7/32 kB
Progress (1): 12/32 kB 
Progress (1): 16/32 kB
Progress (1): 20/32 kB
Progress (1): 24/32 kB
Progress (1): 28/32 kB
Progress (1): 32 kB   
                   
Downloaded from eclipse.maven.central.mirror: https://repo.eclipse.org/content/repositories/maven_central/org/apache/maven/plugins/maven-resources-plugin/3.1.0/maven-resources-plugin-3.1.0.jar (32 kB at 1.6 MB/s)
04:28:44 Downloading from eclipse.maven.central.mirror: https://repo.eclipse.org/content/repositories/maven_central/org/apache/maven/plugins/maven-install-plugin/maven-metadata.xml
04:28:44 Progress (1): 663 B
                   
Downloaded from eclipse.maven.central.mirror: https://repo.eclipse.org/content/repositories/maven_central/org/apache/maven/plugins/maven-install-plugin/maven-metadata.xml (663 B at 47 kB/s)
04:28:44 Downloading from eclipse.maven.central.mirror: https://repo.eclipse.org/content/repositories/maven_central/org/apache/maven/plugins/maven-install-plugin/3.0.0-M1/maven-install-plugin-3.0.0-M1.pom
04:28:44 Progress (1): 4.1/6.2 kB
Progress (1): 6.2 kB    
                    
Downloaded from eclipse.maven.central.mirror: https://repo.eclipse.org/content/repositories/maven_central/org/apache/maven/plugins/maven-install-plugin/3.0.0-M1/maven-install-plugin-3.0.0-M1.pom (6.2 kB at 387 kB/s)
04:28:44 Downloading from eclipse.maven.central.mirror: https://repo.eclipse.org/content/repositories/maven_central/org/apache/maven/plugins/maven-plugins/33/maven-plugins-33.pom
04:28:44 Progress (1): 4.1/11 kB
Progress (1): 7.7/11 kB
Progress (1): 11 kB    
                   
Downloaded from eclipse.maven.central.mirror: https://repo.eclipse.org/content/repositories/maven_central/org/apache/maven/plugins/maven-plugins/33/maven-plugins-33.pom (11 kB at 668 kB/s)
04:28:44 Downloading from eclipse.maven.central.mirror: https://repo.eclipse.org/content/repositories/maven_central/org/apache/maven/maven-parent/33/maven-parent-33.pom
04:28:44 Progress (1): 4.1/44 kB
Progress (1): 7.7/44 kB
Progress (1): 12/44 kB 
Progress (1): 16/44 kB
Progress (1): 20/44 kB
Progress (1): 24/44 kB
Progress (1): 28/44 kB
Progress (1): 32/44 kB
Progress (1): 36/44 kB
Progress (1): 40/44 kB
Progress (1): 44/44 kB
Progress (1): 44 kB   
                   
Downloaded from eclipse.maven.central.mirror: https://repo.eclipse.org/content/repositories/maven_central/org/apache/maven/maven-parent/33/maven-parent-33.pom (44 kB at 2.3 MB/s)
04:28:44 Downloading from eclipse.maven.central.mirror: https://repo.eclipse.org/content/repositories/maven_central/org/apache/apache/21/apache-21.pom
04:28:44 Progress (1): 4.1/17 kB
Progress (1): 7.7/17 kB
Progress (1): 12/17 kB 
Progress (1): 16/17 kB
Progress (1): 17 kB   
                   
Downloaded from eclipse.maven.central.mirror: https://repo.eclipse.org/content/repositories/maven_central/org/apache/apache/21/apache-21.pom (17 kB at 1.1 MB/s)
04:28:44 Downloading from eclipse.maven.central.mirror: https://repo.eclipse.org/content/repositories/maven_central/org/apache/maven/plugins/maven-install-plugin/3.0.0-M1/maven-install-plugin-3.0.0-M1.jar
04:28:44 Progress (1): 4.1/29 kB
Progress (1): 7.7/29 kB
Progress (1): 12/29 kB 
Progress (1): 16/29 kB
Progress (1): 20/29 kB
Progress (1): 24/29 kB
Progress (1): 28/29 kB
Progress (1): 29 kB   
                   
Downloaded from eclipse.maven.central.mirror: https://repo.eclipse.org/content/repositories/maven_central/org/apache/maven/plugins/maven-install-plugin/3.0.0-M1/maven-install-plugin-3.0.0-M1.jar (29 kB at 517 kB/s)
04:28:44 Downloading from eclipse.maven.central.mirror: https://repo.eclipse.org/content/repositories/maven_central/org/apache/maven/plugins/maven-deploy-plugin/maven-metadata.xml
04:28:44 Progress (1): 749 B
                   
Downloaded from eclipse.maven.central.mirror: https://repo.eclipse.org/content/repositories/maven_central/org/apache/maven/plugins/maven-deploy-plugin/maven-metadata.xml (749 B at 50 kB/s)
04:28:44 Downloading from eclipse.maven.central.mirror: https://repo.eclipse.org/content/repositories/maven_central/org/apache/maven/plugins/maven-deploy-plugin/3.0.0-M1/maven-deploy-plugin-3.0.0-M1.pom
04:28:44 Progress (1): 4.1/7.8 kB
Progress (1): 7.7/7.8 kB
Progress (1): 7.8 kB    
                    
Downloaded from eclipse.maven.central.mirror: https://repo.eclipse.org/content/repositories/maven_central/org/apache/maven/plugins/maven-deploy-plugin/3.0.0-M1/maven-deploy-plugin-3.0.0-M1.pom (7.8 kB at 30 kB/s)
04:28:44 Downloading from eclipse.maven.central.mirror: https://repo.eclipse.org/content/repositories/maven_central/org/apache/maven/plugins/maven-deploy-plugin/3.0.0-M1/maven-deploy-plugin-3.0.0-M1.jar
04:28:44 Progress (1): 4.1/34 kB
Progress (1): 7.7/34 kB
Progress (1): 12/34 kB 
Progress (1): 16/34 kB
Progress (1): 20/34 kB
Progress (1): 24/34 kB
Progress (1): 28/34 kB
Progress (1): 32/34 kB
Progress (1): 34 kB   
                   
Downloaded from eclipse.maven.central.mirror: https://repo.eclipse.org/content/repositories/maven_central/org/apache/maven/plugins/maven-deploy-plugin/3.0.0-M1/maven-deploy-plugin-3.0.0-M1.jar (34 kB at 2.0 MB/s)
04:28:44 [INFO] 
04:28:44 [INFO] --- maven-clean-plugin:2.5:clean (default-clean) @ eclipse-reddeer-archetype ---
04:28:44 [INFO] 
04:28:44 [INFO] --- maven-resources-plugin:3.1.0:resources (default-resources) @ eclipse-reddeer-archetype ---
04:28:44 Downloading from eclipse.maven.central.mirror: https://repo.eclipse.org/content/repositories/maven_central/org/codehaus/plexus/plexus-utils/2.0.4/plexus-utils-2.0.4.pom
04:28:44 Progress (1): 3.3 kB
                    
Downloaded from eclipse.maven.central.mirror: https://repo.eclipse.org/content/repositories/maven_central/org/codehaus/plexus/plexus-utils/2.0.4/plexus-utils-2.0.4.pom (3.3 kB at 222 kB/s)
04:28:44 Downloading from eclipse.maven.central.mirror: https://repo.eclipse.org/content/repositories/maven_central/org/codehaus/plexus/plexus-utils/3.1.0/plexus-utils-3.1.0.pom
04:28:44 Progress (1): 4.1/4.7 kB
Progress (1): 4.7 kB    
                    
Downloaded from eclipse.maven.central.mirror: https://repo.eclipse.org/content/repositories/maven_central/org/codehaus/plexus/plexus-utils/3.1.0/plexus-utils-3.1.0.pom (4.7 kB at 358 kB/s)
04:28:44 Downloading from eclipse.maven.central.mirror: https://repo.eclipse.org/content/repositories/maven_central/org/apache/maven/shared/maven-filtering/3.1.1/maven-filtering-3.1.1.pom
04:28:44 Progress (1): 4.1/5.7 kB
Progress (1): 5.7 kB    
                    
Downloaded from eclipse.maven.central.mirror: https://repo.eclipse.org/content/repositories/maven_central/org/apache/maven/shared/maven-filtering/3.1.1/maven-filtering-3.1.1.pom (5.7 kB at 355 kB/s)
04:28:44 Downloading from eclipse.maven.central.mirror: https://repo.eclipse.org/content/repositories/maven_central/commons-io/commons-io/2.4/commons-io-2.4.pom
04:28:45 Progress (1): 4.1/10 kB
Progress (1): 7.7/10 kB
Progress (1): 10 kB    
                   
Downloaded from eclipse.maven.central.mirror: https://repo.eclipse.org/content/repositories/maven_central/commons-io/commons-io/2.4/commons-io-2.4.pom (10 kB at 565 kB/s)
04:28:45 Downloading from eclipse.maven.central.mirror: https://repo.eclipse.org/content/repositories/maven_central/org/apache/commons/commons-parent/25/commons-parent-25.pom
04:28:45 Progress (1): 4.1/48 kB
Progress (1): 7.7/48 kB
Progress (1): 12/48 kB 
Progress (1): 16/48 kB
Progress (1): 20/48 kB
Progress (1): 24/48 kB
Progress (1): 28/48 kB
Progress (1): 32/48 kB
Progress (1): 33/48 kB
Progress (1): 37/48 kB
Progress (1): 41/48 kB
Progress (1): 45/48 kB
Progress (1): 48 kB   
                   
Downloaded from eclipse.maven.central.mirror: https://repo.eclipse.org/content/repositories/maven_central/org/apache/commons/commons-parent/25/commons-parent-25.pom (48 kB at 1.7 MB/s)
04:28:45 Downloading from eclipse.maven.central.mirror: https://repo.eclipse.org/content/repositories/maven_central/org/codehaus/plexus/plexus-interpolation/1.22/plexus-interpolation-1.22.pom
04:28:45 Progress (1): 1.5 kB
                    
Downloaded from eclipse.maven.central.mirror: https://repo.eclipse.org/content/repositories/maven_central/org/codehaus/plexus/plexus-interpolation/1.22/plexus-interpolation-1.22.pom (1.5 kB at 86 kB/s)
04:28:45 Downloading from eclipse.maven.central.mirror: https://repo.eclipse.org/content/repositories/maven_central/org/sonatype/plexus/plexus-build-api/0.0.7/plexus-build-api-0.0.7.pom
04:28:45 Progress (1): 3.2 kB
                    
Downloaded from eclipse.maven.central.mirror: https://repo.eclipse.org/content/repositories/maven_central/org/sonatype/plexus/plexus-build-api/0.0.7/plexus-build-api-0.0.7.pom (3.2 kB at 160 kB/s)
04:28:45 Downloading from eclipse.maven.central.mirror: https://repo.eclipse.org/content/repositories/maven_central/org/codehaus/plexus/plexus-interpolation/1.24/plexus-interpolation-1.24.pom
04:28:45 Progress (1): 2.6 kB
                    
Downloaded from eclipse.maven.central.mirror: https://repo.eclipse.org/content/repositories/maven_central/org/codehaus/plexus/plexus-interpolation/1.24/plexus-interpolation-1.24.pom (2.6 kB at 187 kB/s)
04:28:45 Downloading from eclipse.maven.central.mirror: https://repo.eclipse.org/content/repositories/maven_central/org/codehaus/plexus/plexus-utils/3.1.0/plexus-utils-3.1.0.jar
04:28:45 Downloading from eclipse.maven.central.mirror: https://repo.eclipse.org/content/repositories/maven_central/org/sonatype/plexus/plexus-build-api/0.0.7/plexus-build-api-0.0.7.jar
04:28:45 Downloading from eclipse.maven.central.mirror: https://repo.eclipse.org/content/repositories/maven_central/org/apache/maven/shared/maven-filtering/3.1.1/maven-filtering-3.1.1.jar
04:28:45 Downloading from eclipse.maven.central.mirror: https://repo.eclipse.org/content/repositories/maven_central/org/codehaus/plexus/plexus-interpolation/1.24/plexus-interpolation-1.24.jar
04:28:45 Progress (1): 4.1/262 kB
Progress (1): 7.7/262 kB
Progress (1): 12/262 kB 
Progress (1): 16/262 kB
Progress (1): 20/262 kB
Progress (1): 24/262 kB
Progress (1): 28/262 kB
Progress (1): 32/262 kB
Progress (1): 33/262 kB
Progress (1): 37/262 kB
Progress (1): 41/262 kB
Progress (1): 45/262 kB
Progress (1): 49/262 kB
Progress (1): 53/262 kB
Progress (1): 57/262 kB
Progress (1): 61/262 kB
Progress (1): 65/262 kB
Progress (1): 66/262 kB
Progress (1): 70/262 kB
Progress (1): 74/262 kB
Progress (1): 78/262 kB
Progress (1): 82/262 kB
Progress (1): 86/262 kB
Progress (1): 90/262 kB
Progress (1): 94/262 kB
Progress (1): 98/262 kB
Progress (1): 98/262 kB
Progress (1): 102/262 kB
Progress (1): 106/262 kB
Progress (1): 110/262 kB
Progress (1): 114/262 kB
Progress (1): 118/262 kB
Progress (1): 122/262 kB
Progress (1): 126/262 kB
Progress (1): 130/262 kB
Progress (1): 131/262 kB
Progress (1): 135/262 kB
Progress (1): 139/262 kB
Progress (1): 143/262 kB
Progress (1): 147/262 kB
Progress (1): 151/262 kB
Progress (1): 155/262 kB
Progress (1): 159/262 kB
Progress (1): 163/262 kB
Progress (1): 164/262 kB
Progress (1): 168/262 kB
Progress (1): 172/262 kB
Progress (1): 176/262 kB
Progress (1): 180/262 kB
Progress (1): 184/262 kB
Progress (1): 188/262 kB
Progress (1): 192/262 kB
Progress (1): 196/262 kB
Progress (1): 197/262 kB
Progress (1): 201/262 kB
Progress (1): 205/262 kB
Progress (1): 209/262 kB
Progress (1): 213/262 kB
Progress (1): 217/262 kB
Progress (1): 221/262 kB
Progress (1): 225/262 kB
Progress (1): 229/262 kB
Progress (1): 233/262 kB
Progress (1): 237/262 kB
Progress (1): 241/262 kB
Progress (1): 245/262 kB
Progress (1): 249/262 kB
Progress (1): 253/262 kB
Progress (1): 257/262 kB
Progress (1): 261/262 kB
Progress (1): 262 kB    
Progress (2): 262 kB | 4.1/8.5 kB
Progress (2): 262 kB | 7.7/8.5 kB
Progress (2): 262 kB | 8.5 kB    
Progress (3): 262 kB | 8.5 kB | 4.1/79 kB
Progress (3): 262 kB | 8.5 kB | 7.7/79 kB
Progress (3): 262 kB | 8.5 kB | 12/79 kB 
Progress (3): 262 kB | 8.5 kB | 16/79 kB
                                        
Downloaded from eclipse.maven.central.mirror: https://repo.eclipse.org/content/repositories/maven_central/org/codehaus/plexus/plexus-utils/3.1.0/plexus-utils-3.1.0.jar (262 kB at 7.3 MB/s)
04:28:45 Progress (2): 8.5 kB | 20/79 kB
Progress (2): 8.5 kB | 24/79 kB
Progress (2): 8.5 kB | 28/79 kB
Progress (2): 8.5 kB | 32/79 kB
Progress (2): 8.5 kB | 36/79 kB
Progress (2): 8.5 kB | 40/79 kB
Progress (2): 8.5 kB | 44/79 kB
Progress (2): 8.5 kB | 48/79 kB
Progress (2): 8.5 kB | 52/79 kB
Progress (2): 8.5 kB | 56/79 kB
Progress (2): 8.5 kB | 60/79 kB
Progress (2): 8.5 kB | 64/79 kB
Progress (2): 8.5 kB | 68/79 kB
Progress (3): 8.5 kB | 68/79 kB | 4.1/51 kB
Progress (3): 8.5 kB | 72/79 kB | 4.1/51 kB
Progress (3): 8.5 kB | 72/79 kB | 7.7/51 kB
                                           
Downloaded from eclipse.maven.central.mirror: https://repo.eclipse.org/content/repositories/maven_central/org/sonatype/plexus/plexus-build-api/0.0.7/plexus-build-api-0.0.7.jar (8.5 kB at 217 kB/s)
04:28:45 Progress (2): 72/79 kB | 12/51 kB
Progress (2): 76/79 kB | 12/51 kB
Progress (2): 76/79 kB | 16/51 kB
Progress (2): 79 kB | 16/51 kB   
Progress (2): 79 kB | 20/51 kB
Progress (2): 79 kB | 24/51 kB
Progress (2): 79 kB | 28/51 kB
Progress (2): 79 kB | 32/51 kB
Progress (2): 79 kB | 36/51 kB
Progress (2): 79 kB | 40/51 kB
Progress (2): 79 kB | 44/51 kB
Progress (2): 79 kB | 48/51 kB
Progress (2): 79 kB | 51 kB   
                           
Downloaded from eclipse.maven.central.mirror: https://repo.eclipse.org/content/repositories/maven_central/org/codehaus/plexus/plexus-interpolation/1.24/plexus-interpolation-1.24.jar (79 kB at 1.8 MB/s)
04:28:45 Downloaded from eclipse.maven.central.mirror: https://repo.eclipse.org/content/repositories/maven_central/org/apache/maven/shared/maven-filtering/3.1.1/maven-filtering-3.1.1.jar (51 kB at 1.1 MB/s)
04:28:45 [WARNING] Using platform encoding (ANSI_X3.4-1968 actually) to copy filtered resources, i.e. build is platform dependent!
04:28:45 [INFO] Copying 8 resources
04:28:45 [INFO] 
04:28:45 [INFO] --- maven-resources-plugin:3.1.0:testResources (default-testResources) @ eclipse-reddeer-archetype ---
04:28:45 [WARNING] Using platform encoding (ANSI_X3.4-1968 actually) to copy filtered resources, i.e. build is platform dependent!
04:28:45 [INFO] Copying 2 resources
04:28:45 [INFO] 
04:28:45 [INFO] --- maven-archetype-plugin:3.0.0:jar (default-jar) @ eclipse-reddeer-archetype ---
04:28:45 [INFO] Building archetype jar: /home/jenkins/agent/workspace/reddeer.verification.jdk11/archetype/target/eclipse-reddeer-archetype-2.8.0-SNAPSHOT
04:28:45 [INFO] 
04:28:45 [INFO] --- maven-archetype-plugin:3.0.0:integration-test (default-integration-test) @ eclipse-reddeer-archetype ---
04:28:45 [INFO] Processing Archetype IT project: eclipse-reddeer-archetype
04:28:45 [INFO] ----------------------------------------------------------------------------
04:28:45 [INFO] Using following parameters for creating project from Archetype: eclipse-reddeer-archetype:2.8.0-SNAPSHOT
04:28:45 [INFO] ----------------------------------------------------------------------------
04:28:45 [INFO] Parameter: groupId, Value: foo.bar.myplugin
04:28:45 [INFO] Parameter: artifactId, Value: reddeer.archetype
04:28:45 [INFO] Parameter: version, Value: 1.0.0-SNAPSHOT
04:28:45 [INFO] Parameter: package, Value: foo.bar.myplugin.simrel
04:28:45 [INFO] Parameter: packageInPathFormat, Value: foo/bar/myplugin/simrel
04:28:45 [INFO] Parameter: tycho_version, Value: 1.4.0
04:28:45 [INFO] Parameter: package, Value: foo.bar.myplugin.simrel
04:28:45 [INFO] Parameter: reddeer_version, Value: master
04:28:45 [INFO] Parameter: groupId, Value: foo.bar.myplugin
04:28:45 [INFO] Parameter: artifactId, Value: reddeer.archetype
04:28:45 [INFO] Parameter: version, Value: 1.0.0-SNAPSHOT
04:28:45 [INFO] Parameter: eclipse_platform, Value: 2019-06
04:28:45 [INFO] Project created from Archetype in dir: /home/jenkins/agent/workspace/reddeer.verification.jdk11/archetype/target/test-classes/projects/eclipse-reddeer-archetype/project/reddeer.archetype
04:28:45 [INFO] Invoking post-archetype-generation goals: clean verify
04:28:45 [INFO] Picked up JAVA_TOOL_OPTIONS: -XX:+IgnoreUnrecognizedVMOptions -XX:+UseContainerSupport -XX:+UnlockExperimentalVMOptions -XX:+UseCGroupMemoryLimitForHeap
04:28:45 [INFO] Picked up _JAVA_OPTIONS: -XX:MaxRAMPercentage=64.0
04:28:45 [INFO] OpenJDK 64-Bit Server VM warning: Ignoring option PermSize; support was removed in 8.0
04:28:45 [INFO] OpenJDK 64-Bit Server VM warning: Ignoring option MaxPermSize; support was removed in 8.0
04:28:46 [INFO] [INFO] Error stacktraces are turned on.
04:28:46 [INFO] [INFO] Scanning for projects...
04:28:47 [INFO] [WARNING] No explicit target runtime environment configuration. Build is platform dependent.
04:28:50 [INFO] [INFO] Computing target platform for MavenProject: foo.bar.myplugin:reddeer.archetype:1.0.0-SNAPSHOT @ /home/jenkins/agent/workspace/reddeer.verification.jdk11/archetype/target/test-classes/projects/eclipse-reddeer-archetype/project/reddeer.archetype/pom.xml
04:28:50 [INFO] [INFO] Fetching p2.index from http://download.eclipse.org/releases/2019-06/
04:28:50 [INFO] [INFO] Fetching p2.index from http://download.eclipse.org/releases/2019-06/
04:28:50 [INFO] [INFO] Adding repository http://download.eclipse.org/releases/2019-06
04:28:50 [INFO] [INFO] Fetching compositeContent.jar from http://download.eclipse.org/releases/2019-06/ (492B)
04:28:50 [INFO] [INFO] Fetching compositeContent.jar from http://download.eclipse.org/releases/2019-06/ (492B)
04:28:50 [INFO] [INFO] Fetching p2.index from https://download.eclipse.org/technology/epp/packages/2019-06/
04:28:50 [INFO] [INFO] Fetching p2.index from https://download.eclipse.org/technology/epp/packages/2019-06/
04:28:51 [INFO] [INFO] Fetching content.xml.xz from https://download.eclipse.org/technology/epp/packages/2019-06/
04:28:51 [INFO] [INFO] Fetching content.xml.xz from https://download.eclipse.org/technology/epp/packages/2019-06/
04:28:51 [INFO] [INFO] Fetching p2.index from http://download.eclipse.org/releases/2019-06/201906191000/
04:28:51 [INFO] [INFO] Fetching p2.index from http://download.eclipse.org/releases/2019-06/201906191000/
04:28:51 [INFO] [INFO] Fetching content.xml.xz from http://download.eclipse.org/releases/2019-06/201906191000/
04:28:51 [INFO] [INFO] Fetching content.xml.xz from http://download.eclipse.org/releases/2019-06/201906191000/
04:28:53 [INFO] [INFO] Fetching p2.index from http://download.eclipse.org/reddeer/snapshots/
04:28:53 [INFO] [INFO] Fetching p2.index from http://download.eclipse.org/reddeer/snapshots/
04:28:53 [INFO] [INFO] Adding repository http://download.eclipse.org/reddeer/snapshots
04:28:54 [INFO] [INFO] Fetching content.xml.xz from http://download.eclipse.org/reddeer/snapshots/
04:28:54 [INFO] [INFO] Fetching content.xml.xz from http://download.eclipse.org/reddeer/snapshots/
04:28:54 [INFO] [INFO] Resolving dependencies of MavenProject: foo.bar.myplugin:reddeer.archetype:1.0.0-SNAPSHOT @ /home/jenkins/agent/workspace/reddeer.verification.jdk11/archetype/target/test-classes/projects/eclipse-reddeer-archetype/project/reddeer.archetype/pom.xml
04:28:57 [INFO] [INFO] Fetching 201906191000&countryCode=us&timeZone=0&format=xml from http://www.eclipse.org/downloads/download.php?format=xml&file=/releases/2019-06/
04:28:57 [INFO] [INFO] Fetching org.eclipse.equinox.ds_1.6.0.v20190122-0806.jar.pack.gz from http://download.eclipse.org/releases/2019-06/201906191000/plugins/ (17.55kB)
04:28:57 [INFO] [INFO] Fetching org.eclipse.equinox.ds_1.6.0.v20190122-0806.jar.pack.gz from http://download.eclipse.org/releases/2019-06/201906191000/plugins/ (17.55kB)
04:28:57 [INFO] [INFO] Fetching org.eclipse.equinox.launcher_1.5.400.v20190515-0925.jar.pack.gz from http://download.eclipse.org/releases/2019-06/201906191000/plugins/ (29.81kB)
04:28:57 [INFO] [INFO] Fetching org.eclipse.equinox.launcher_1.5.400.v20190515-0925.jar.pack.gz from http://download.eclipse.org/releases/2019-06/201906191000/plugins/ (29.81kB)
04:28:57 [INFO] [INFO] Fetching org.eclipse.reddeer.common_2.8.0.v20191014-0747.jar from http://download.eclipse.org/reddeer/snapshots/plugins/ (64.25kB)
04:28:57 [INFO] [INFO] Fetching org.eclipse.reddeer.common_2.8.0.v20191014-0747.jar from http://download.eclipse.org/reddeer/snapshots/plugins/ (64.25kB)
04:28:57 [INFO] [INFO] Fetching org.eclipse.reddeer.core_2.8.0.v20191014-0747.jar from http://download.eclipse.org/reddeer/snapshots/plugins/ (312.6kB)
04:28:57 [INFO] [INFO] Fetching org.eclipse.reddeer.core_2.8.0.v20191014-0747.jar from http://download.eclipse.org/reddeer/snapshots/plugins/ (312.6kB)
04:28:57 [INFO] [INFO] Fetching org.eclipse.reddeer.direct_2.8.0.v20191014-0747.jar from http://download.eclipse.org/reddeer/snapshots/plugins/ (17.19kB)
04:28:57 [INFO] [INFO] Fetching org.eclipse.reddeer.direct_2.8.0.v20191014-0747.jar from http://download.eclipse.org/reddeer/snapshots/plugins/ (17.19kB)
04:28:58 [INFO] [INFO] Fetching org.eclipse.reddeer.uiforms_2.8.0.v20191014-0747.jar from http://download.eclipse.org/reddeer/snapshots/plugins/ (40.39kB)
04:28:58 [INFO] [INFO] Fetching org.eclipse.reddeer.uiforms_2.8.0.v20191014-0747.jar from http://download.eclipse.org/reddeer/snapshots/plugins/ (40.39kB)
04:28:58 [INFO] [INFO] Fetching org.eclipse.reddeer.eclipse_2.8.0.v20191014-0747.jar from http://download.eclipse.org/reddeer/snapshots/plugins/ (413.54kB)
04:28:58 [INFO] [INFO] Fetching org.eclipse.reddeer.eclipse_2.8.0.v20191014-0747.jar from http://download.eclipse.org/reddeer/snapshots/plugins/ (413.54kB)
04:28:58 [INFO] [INFO] Fetching org.eclipse.reddeer.jface_2.8.0.v20191014-0747.jar from http://download.eclipse.org/reddeer/snapshots/plugins/ (39.22kB)
04:28:58 [INFO] [INFO] Fetching org.eclipse.reddeer.jface_2.8.0.v20191014-0747.jar from http://download.eclipse.org/reddeer/snapshots/plugins/ (39.22kB)
04:28:58 [INFO] [INFO] Fetching org.eclipse.reddeer.swt_2.8.0.v20191014-0747.jar from http://download.eclipse.org/reddeer/snapshots/plugins/ (181.21kB)
04:28:58 [INFO] [INFO] Fetching org.eclipse.reddeer.swt_2.8.0.v20191014-0747.jar from http://download.eclipse.org/reddeer/snapshots/plugins/ (181.21kB)
04:28:58 [INFO] [INFO] Fetching org.eclipse.reddeer.workbench_2.8.0.v20191014-0747.jar from http://download.eclipse.org/reddeer/snapshots/plugins/ (107.8kB)
04:28:58 [INFO] [INFO] Fetching org.eclipse.reddeer.workbench_2.8.0.v20191014-0747.jar from http://download.eclipse.org/reddeer/snapshots/plugins/ (107.8kB)
04:28:58 [INFO] [INFO] Fetching org.eclipse.reddeer.workbench.core_2.8.0.v20191014-0747.jar from http://download.eclipse.org/reddeer/snapshots/plugins/ (37.43kB)
04:28:58 [INFO] [INFO] Fetching org.eclipse.reddeer.workbench.core_2.8.0.v20191014-0747.jar from http://download.eclipse.org/reddeer/snapshots/plugins/ (37.43kB)
04:28:58 [INFO] [INFO] Fetching org.eclipse.reddeer.junit_2.8.0.v20191014-0747.jar from http://download.eclipse.org/reddeer/snapshots/plugins/ (117.02kB)
04:28:58 [INFO] [INFO] Fetching org.eclipse.reddeer.junit_2.8.0.v20191014-0747.jar from http://download.eclipse.org/reddeer/snapshots/plugins/ (117.02kB)
04:28:58 [INFO] [INFO] Fetching org.eclipse.reddeer.go_2.8.0.v20191014-0747.jar from http://download.eclipse.org/reddeer/snapshots/plugins/ (8.77kB)
04:28:58 [INFO] [INFO] Fetching org.eclipse.reddeer.go_2.8.0.v20191014-0747.jar from http://download.eclipse.org/reddeer/snapshots/plugins/ (8.77kB)
04:28:59 [INFO] [INFO] Fetching org.eclipse.reddeer.junit.extension_2.8.0.v20191014-0747.jar from http://download.eclipse.org/reddeer/snapshots/plugins/ (33.29kB)
04:28:59 [INFO] [INFO] Fetching org.eclipse.reddeer.junit.extension_2.8.0.v20191014-0747.jar from http://download.eclipse.org/reddeer/snapshots/plugins/ (33.29kB)
04:28:59 [INFO] [INFO] Fetching org.eclipse.reddeer.requirements_2.8.0.v20191014-0747.jar from http://download.eclipse.org/reddeer/snapshots/plugins/ (43.61kB)
04:28:59 [INFO] [INFO] Fetching org.eclipse.reddeer.requirements_2.8.0.v20191014-0747.jar from http://download.eclipse.org/reddeer/snapshots/plugins/ (43.61kB)
04:28:59 [INFO] [INFO] Fetching org.eclipse.ui.ide.application_1.3.300.v20190513-2118.jar.pack.gz from http://download.eclipse.org/releases/2019-06/201906191000/plugins/ (54.69kB)
04:28:59 [INFO] [INFO] Fetching org.eclipse.ui.ide.application_1.3.300.v20190513-2118.jar.pack.gz from http://download.eclipse.org/releases/2019-06/201906191000/plugins/ (54.69kB)
04:29:00 [INFO] [INFO] Fetching org.eclipse.urischeme_1.0.300.v20190514-0858.jar.pack.gz from http://download.eclipse.org/releases/2019-06/201906191000/plugins/ (21.42kB)
04:29:00 [INFO] [INFO] Fetching org.eclipse.urischeme_1.0.300.v20190514-0858.jar.pack.gz from http://download.eclipse.org/releases/2019-06/201906191000/plugins/ (21.42kB)
04:29:00 [INFO] [INFO] Resolving class path of MavenProject: foo.bar.myplugin:reddeer.archetype:1.0.0-SNAPSHOT @ /home/jenkins/agent/workspace/reddeer.verification.jdk11/archetype/target/test-classes/projects/eclipse-reddeer-archetype/project/reddeer.archetype/pom.xml
04:29:00 [INFO] [WARNING] The project foo.bar.myplugin:reddeer.archetype:eclipse-test-plugin:1.0.0-SNAPSHOT uses prerequisites which is only intended for maven-plugin projects but not for non maven-plugin projects. For such purposes you should use the maven-enforcer-plugin. See https://maven.apache.org/enforcer/enforcer-rules/requireMavenVersion.html
04:29:00 [INFO] [INFO] 
04:29:00 [INFO] [INFO] -----------------< foo.bar.myplugin:reddeer.archetype >-----------------
04:29:00 [INFO] [INFO] Building reddeer.archetype :: test 1.0.0-SNAPSHOT
04:29:00 [INFO] [INFO] ------------------------[ eclipse-test-plugin ]-------------------------
04:29:00 [INFO] [INFO] 
04:29:00 [INFO] [INFO] --- maven-clean-plugin:2.5:clean (default-clean) @ reddeer.archetype ---
04:29:00 [INFO] [INFO] 
04:29:00 [INFO] [INFO] --- tycho-packaging-plugin:1.4.0:build-qualifier (default-build-qualifier) @ reddeer.archetype ---
04:29:00 [INFO] [INFO] The project's OSGi version is 1.0.0.20191015-0828
04:29:00 [INFO] [INFO] 
04:29:00 [INFO] [INFO] --- tycho-packaging-plugin:1.4.0:validate-id (default-validate-id) @ reddeer.archetype ---
04:29:00 [INFO] [INFO] 
04:29:00 [INFO] [INFO] --- tycho-packaging-plugin:1.4.0:validate-version (default-validate-version) @ reddeer.archetype ---
04:29:00 [INFO] [INFO] 
04:29:00 [INFO] [INFO] --- maven-resources-plugin:2.4.3:resources (default-resources) @ reddeer.archetype ---
04:29:01 [INFO] [WARNING] Using platform encoding (ANSI_X3.4-1968 actually) to copy filtered resources, i.e. build is platform dependent!
04:29:01 [INFO] [INFO] skip non existing resourceDirectory /home/jenkins/agent/workspace/reddeer.verification.jdk11/archetype/target/test-classes/projects/eclipse-reddeer-archetype/project/reddeer.archetype/src/main/resources
04:29:01 [INFO] [INFO] 
04:29:01 [INFO] [INFO] --- tycho-compiler-plugin:1.4.0:compile (default-compile) @ reddeer.archetype ---
04:29:01 [INFO] [WARNING] Parameter 'useProjectSettings' is set to true, but preferences file '/home/jenkins/agent/workspace/reddeer.verification.jdk11/archetype/target/test-classes/projects/eclipse-reddeer-archetype/project/reddeer.archetype/.settings/org.eclipse.jdt.core.prefs' could not be found!
04:29:01 [INFO] [INFO] Compiling 3 source files to /home/jenkins/agent/workspace/reddeer.verification.jdk11/archetype/target/test-classes/projects/eclipse-reddeer-archetype/project/reddeer.archetype/target/classes
04:29:02 [INFO] [INFO] 
04:29:02 [INFO] [INFO] --- maven-resources-plugin:2.4.3:testResources (default-testResources) @ reddeer.archetype ---
04:29:02 [INFO] [WARNING] Using platform encoding (ANSI_X3.4-1968 actually) to copy filtered resources, i.e. build is platform dependent!
04:29:02 [INFO] [INFO] skip non existing resourceDirectory /home/jenkins/agent/workspace/reddeer.verification.jdk11/archetype/target/test-classes/projects/eclipse-reddeer-archetype/project/reddeer.archetype/src/test/resources
04:29:02 [INFO] [INFO] 
04:29:02 [INFO] [INFO] --- target-platform-configuration:1.4.0:target-platform (default-target-platform) @ reddeer.archetype ---
04:29:02 [INFO] [INFO] 
04:29:02 [INFO] [INFO] --- tycho-packaging-plugin:1.4.0:package-plugin (default-package-plugin) @ reddeer.archetype ---
04:29:02 [INFO] [INFO] Building jar: /home/jenkins/agent/workspace/reddeer.verification.jdk11/archetype/target/test-classes/projects/eclipse-reddeer-archetype/project/reddeer.archetype/target/reddeer.archetype-1.0.0-SNAPSHOT.jar
04:29:02 [INFO] [INFO] 
04:29:02 [INFO] [INFO] --- tycho-p2-plugin:1.4.0:p2-metadata-default (default-p2-metadata-default) @ reddeer.archetype ---
04:29:02 [INFO] [INFO] 
04:29:02 [INFO] [INFO] --- tycho-surefire-plugin:1.4.0:test (default-test) @ reddeer.archetype ---
04:29:04 [INFO] [INFO] Expected eclipse log file: /home/jenkins/agent/workspace/reddeer.verification.jdk11/archetype/target/test-classes/projects/eclipse-reddeer-archetype/project/reddeer.archetype/target/work/data/.metadata/.log
04:29:04 [INFO] [INFO] Command line:
04:29:04 [INFO] 	[/opt/tools/java/openjdk/jdk-11/11.0.4/bin/java, -Dosgi.noShutdown=false, -Dosgi.os=linux, -Dosgi.ws=gtk, -Dosgi.arch=x86_64, -Xmx512m, -Dosgi.clean=true, -jar, /home/jenkins/.m2/repository/p2/osgi/bundle/org.eclipse.equinox.launcher/1.5.400.v20190515-0925/org.eclipse.equinox.launcher-1.5.400.v20190515-0925.jar, -data, /home/jenkins/agent/workspace/reddeer.verification.jdk11/archetype/target/test-classes/projects/eclipse-reddeer-archetype/project/reddeer.archetype/target/work/data, -install, /home/jenkins/agent/workspace/reddeer.verification.jdk11/archetype/target/test-classes/projects/eclipse-reddeer-archetype/project/reddeer.archetype/target/work, -configuration, /home/jenkins/agent/workspace/reddeer.verification.jdk11/archetype/target/test-classes/projects/eclipse-reddeer-archetype/project/reddeer.archetype/target/work/configuration, -application, org.eclipse.tycho.surefire.osgibooter.uitest, -testproperties, /home/jenkins/agent/workspace/reddeer.verification.jdk11/archetype/target/test-classes/projects/eclipse-reddeer-archetype/project/reddeer.archetype/target/surefire.properties, -nouithread]
04:29:04 [INFO] Picked up JAVA_TOOL_OPTIONS: -XX:+IgnoreUnrecognizedVMOptions -XX:+UseContainerSupport -XX:+UnlockExperimentalVMOptions -XX:+UseCGroupMemoryLimitForHeap
04:29:04 [INFO] Picked up _JAVA_OPTIONS: -XX:MaxRAMPercentage=64.0
04:29:06 [INFO] SWT SessionManagerDBus: Failed to connect to org.gnome.SessionManager: Error spawning command line ?dbus-launch --autolaunch= --binary-syntax --close-stderr?: Child process exited with code 1
04:29:06 [INFO] SWT SessionManagerDBus: Failed to connect to org.xfce.SessionManager: Error spawning command line ?dbus-launch --autolaunch= --binary-syntax --close-stderr?: Child process exited with code 1
04:29:09 [INFO] Running foo.bar.myplugin.simrel.AllRedDeerTests
04:29:09 [INFO] 08:29:09.518 DEBUG [WorkbenchTestable][RedDeerSuite] Eclipse is running
04:29:09 [INFO] 08:29:09.520 DEBUG [WorkbenchTestable][BeforeTestInitialization] Number of found extensions for extension point org.eclipse.reddeer.junit.before.test=6
04:29:09 [INFO] 08:29:09.526 DEBUG [WorkbenchTestable][RedDeerSuite] Eclipse is running
04:29:09 [INFO] 08:29:09.527 DEBUG [WorkbenchTestable][AfterTestInitialization] Number of found extensions for extension point org.eclipse.reddeer.junit.after.test=2
04:29:09 [INFO] 08:29:09.537 INFO [WorkbenchTestable][RequirementsRunnerBuilder] Found test class foo.bar.myplugin.simrel.BasicTest
04:29:09 [INFO] 08:29:09.552 INFO [WorkbenchTestable][RedDeerSuite] RedDeer suite created
04:29:09 [INFO] 08:29:09.554 DEBUG [WorkbenchTestable][RequirementsRunner] Injecting fulfilled requirements into static fields of test class: org.eclipse.reddeer.junit.internal.requirement.Requirements
04:29:09 [INFO] 08:29:09.556 DEBUG [WorkbenchTestable][RunIBeforeClassExtensions] Run before class extensions for test class foo.bar.myplugin.simrel.BasicTest
04:29:09 [INFO] 08:29:09.558 DEBUG [WorkbenchTestable][RunIBeforeClassExtensions] Run method runBeforeTestClass() of class org.eclipse.reddeer.junit.extension.before.test.impl.DisableAERI
04:29:09 [INFO] 08:29:09.607 INFO [WorkbenchTestable][PreferencesUtil] Setting the aeri reporting to never send.
04:29:09 [INFO] 08:29:09.610 DEBUG [WorkbenchTestable][RunIBeforeClassExtensions] Run method runBeforeTestClass() of class org.eclipse.reddeer.junit.extension.before.test.impl.MaximizeAndFocusWorkbench
04:29:09 [INFO] 08:29:09.647 INFO [WorkbenchTestable][ShellHandler] Maximize shell 'data'
04:29:09 [INFO] 08:29:09.649 DEBUG [WorkbenchTestable][RunIBeforeClassExtensions] Run method runBeforeTestClass() of class org.eclipse.reddeer.junit.extension.before.test.impl.CloseWelcomeScreenExt
04:29:09 [INFO] 08:29:09.649 DEBUG [WorkbenchTestable][CloseWelcomeScreenExt] Trying to close Welcome Screen
04:29:09 [INFO] 08:29:09.650 DEBUG [WorkbenchTestable][RunIBeforeClassExtensions] Run method runBeforeTestClass() of class org.eclipse.reddeer.junit.extension.before.test.impl.SetOpenAssociatedPerspectiveExt
04:29:09 [INFO] 08:29:09.651 DEBUG [WorkbenchTestable][SetOpenAssociatedPerspectiveExt] Setting open associated perspective to: 'never'
04:29:09 [INFO] 08:29:09.653 DEBUG [WorkbenchTestable][RunIBeforeClassExtensions] Run method runBeforeTestClass() of class org.eclipse.reddeer.junit.extension.before.test.impl.DoNotDownloadMavenIndexesExt
04:29:09 [INFO] 08:29:09.654 DEBUG [WorkbenchTestable][DoNotDownloadMavenIndexesExt] Trying to disable downloading maven repo indexes on startup via Windows > Preferences > Maven
04:29:09 [INFO] 08:29:09.662 DEBUG [WorkbenchTestable][WindowIsAvailable] Looking for Window matching Matcher matching when all matchers match: [Window matching class class org.eclipse.ui.internal.dialogs.WorkbenchPreferenceDialog, Matcher matching widget which text matches: Matcher matching text to regular expression 'Preferences.*']
04:29:09 [INFO] 08:29:09.675 DEBUG [WorkbenchTestable][WidgetHandler] Get widget data
04:29:09 [INFO] 08:29:09.677 DEBUG [WorkbenchTestable][WindowIsAvailable] Looking for Window matching Matcher matching when all matchers match: [Window matching class class org.eclipse.ui.internal.dialogs.WorkbenchPreferenceDialog, Matcher matching widget which text matches: Matcher matching text to regular expression 'Preferences.*']
04:29:09 [INFO] 08:29:09.677 DEBUG [WorkbenchTestable][WidgetHandler] Get widget data
04:29:09 [INFO] 08:29:09.707 DEBUG [WorkbenchTestable][WindowIsAvailable] Looking for Window matching Matcher matching when all matchers match: [Window matching class class org.eclipse.ui.internal.dialogs.WorkbenchPreferenceDialog, Matcher matching widget which text matches: Matcher matching text to regular expression 'Preferences.*']
04:29:09 [INFO] 08:29:09.707 DEBUG [WorkbenchTestable][WidgetHandler] Get widget data
04:29:09 [INFO] 08:29:09.710 DEBUG [WorkbenchTestable][AbstractShell] Set focus to Shell data
04:29:09 [INFO] 08:29:09.712 DEBUG [WorkbenchTestable][AbstractWait] Waiting until shell is active...
04:29:09 [INFO] 08:29:09.713 DEBUG [WorkbenchTestable][AbstractWait] Waiting until shell is active finished successfully
04:29:09 [INFO] 08:29:09.713 DEBUG [WorkbenchTestable][WorkbenchShell] Workbench shell has title 'data'
04:29:09 [INFO] 08:29:09.715 INFO [WorkbenchTestable][ShellHandler] Getting Menu Bar of shell 'data'
04:29:09 [INFO] 08:29:09.718 DEBUG [main][MenuItemLookup] Found menu:'File'
04:29:09 [INFO] 08:29:09.718 DEBUG [main][MenuItemLookup] Found menu:'Edit'
04:29:09 [INFO] 08:29:09.718 DEBUG [main][MenuItemLookup] Found menu:'Navigate'
04:29:09 [INFO] 08:29:09.719 DEBUG [main][MenuItemLookup] Found menu:'Project'
04:29:09 [INFO] 08:29:09.719 DEBUG [main][MenuItemLookup] Found menu:'Window'
04:29:09 [INFO] 08:29:09.719 DEBUG [main][MenuItemLookup] Item match:Window
04:29:09 [INFO] 08:29:09.722 DEBUG [main][MenuItemLookup] Found menu:'New Window'
04:29:09 [INFO] 08:29:09.722 DEBUG [main][MenuItemLookup] Found menu:'Editor'
04:29:09 [INFO] 08:29:09.722 DEBUG [main][MenuItemLookup] Found menu:'Appearance'
04:29:09 [INFO] 08:29:09.722 DEBUG [main][MenuItemLookup] Found menu:''
04:29:09 [INFO] 08:29:09.722 DEBUG [main][MenuItemLookup] Found menu:'Show View'
04:29:09 [INFO] 08:29:09.722 DEBUG [main][MenuItemLookup] Found menu:'Perspective'
04:29:09 [INFO] 08:29:09.722 DEBUG [main][MenuItemLookup] Found menu:''
04:29:09 [INFO] 08:29:09.723 DEBUG [main][MenuItemLookup] Found menu:'Navigation'
04:29:09 [INFO] 08:29:09.723 DEBUG [main][MenuItemLookup] Found menu:''
04:29:09 [INFO] 08:29:09.723 DEBUG [main][MenuItemLookup] Found menu:'Preferences'
04:29:09 [INFO] 08:29:09.723 DEBUG [main][MenuItemLookup] Item match:Preferences
04:29:09 [INFO] 08:29:09.724 DEBUG [WorkbenchTestable][MenuItemHandler] Queried MenuItem text:"&Preferences"
04:29:09 [INFO] 08:29:09.724 INFO [WorkbenchTestable][AbstractMenuItem] Select menu item with text Preferences
04:29:09 [INFO] 08:29:09.725 INFO [main][MenuItemHandler] Select menu item: &Preferences
04:29:09 [INFO] 
04:29:09 [INFO] (SWT:4580): Gtk-WARNING **: 08:29:09.848: Could not load a pixbuf from /org/gtk/libgtk/theme/Adwaita/assets/check-symbolic.svg.
04:29:09 [INFO] This may indicate that pixbuf loaders or the mime database could not be found.
04:29:09 [INFO] 08:29:09.910 DEBUG [WorkbenchTestable][AbstractWait] Waiting until shell matching Matcher matching when all matchers match: [Matcher matching widget which text matches: Matcher matching text to regular expression 'Preferences.*'] is available....
04:29:09 [INFO] 08:29:09.914 DEBUG [WorkbenchTestable][AbstractWait] Waiting until shell matching Matcher matching when all matchers match: [Matcher matching widget which text matches: Matcher matching text to regular expression 'Preferences.*'] is available. finished successfully
04:29:09 [INFO] 08:29:09.914 DEBUG [WorkbenchTestable][AbstractShell] Set focus to Shell Preferences
04:29:09 [INFO] 08:29:09.915 DEBUG [WorkbenchTestable][AbstractWait] Waiting until shell is active...
04:29:09 [INFO] 08:29:09.925 DEBUG [WorkbenchTestable][AbstractWait] Waiting until shell is active finished successfully
04:29:09 [INFO] 08:29:09.926 TRACE [WorkbenchTestable][WorkbenchPreferenceDialog] Shell Preferences is not null and is not disposed
04:29:09 [INFO] 08:29:09.926 DEBUG [WorkbenchTestable][WidgetHandler] Get widget data
04:29:09 [INFO] 08:29:09.929 DEBUG [WorkbenchTestable][WidgetLookup] Looking up active widget with class type org.eclipse.swt.widgets.Tree with referenced composite class org.eclipse.reddeer.workbench.ui.dialogs.WorkbenchPreferenceDialog, index 0 and no matchers specified
04:29:09 [INFO] 08:29:09.930 DEBUG [WorkbenchTestable][AbstractWait] Waiting until widget is found...
04:29:09 [INFO] 08:29:09.930 TRACE [WorkbenchTestable][WidgetLookup] Looking up widget with index 0 with specified parent and matchers
04:29:09 [INFO] 08:29:09.935 TRACE [WorkbenchTestable][WidgetLookup] widget with index 0 is found
04:29:09 [INFO] 08:29:09.936 DEBUG [WorkbenchTestable][AbstractWait] Waiting until widget is found finished successfully
04:29:09 [INFO] 08:29:09.936 DEBUG [WorkbenchTestable][WidgetLookup] Active widget with class type org.eclipse.swt.widgets.Tree and index 0 was found
04:29:09 [INFO] 08:29:09.938 DEBUG [WorkbenchTestable][AbstractWait] Waiting until tree has children...
04:29:09 [INFO] 08:29:09.939 DEBUG [WorkbenchTestable][AbstractWait] Waiting until tree has children finished successfully
04:29:09 [INFO] 08:29:09.949 DEBUG [WorkbenchTestable][WidgetLookup] Looking up active widget with class type org.eclipse.swt.widgets.Button with referenced composite class org.eclipse.reddeer.workbench.ui.dialogs.WorkbenchPreferenceDialog, index 0 and following matchers specified (Widget matcher matching widgets with style: 8, Matcher matching widgets with text that without mnenomic matches: is "Cancel", Widget matcher matching widgets with style: 8)
04:29:09 [INFO] 08:29:09.950 DEBUG [WorkbenchTestable][AbstractWait] Waiting until widget is found...
04:29:09 [INFO] 08:29:09.950 TRACE [WorkbenchTestable][WidgetLookup] Looking up widget with index 0 with specified parent and matchers
04:29:09 [INFO] 08:29:09.955 TRACE [WorkbenchTestable][WidgetLookup] widget with index 0 is found
04:29:09 [INFO] 08:29:09.955 DEBUG [WorkbenchTestable][AbstractWait] Waiting until widget is found finished successfully
04:29:09 [INFO] 08:29:09.955 DEBUG [WorkbenchTestable][WidgetLookup] Active widget with class type org.eclipse.swt.widgets.Button and index 0 was found
04:29:09 [INFO] 08:29:09.961 INFO [WorkbenchTestable][AbstractButton] Click button Cancel
04:29:09 [INFO] 08:29:09.961 DEBUG [WorkbenchTestable][AbstractWait] Waiting until control is enabled...
04:29:09 [INFO] 08:29:09.961 DEBUG [WorkbenchTestable][AbstractWait] Waiting until control is enabled finished successfully
04:29:09 [INFO] 08:29:09.962 TRACE [WorkbenchTestable][WidgetHandler] Notify Button with event 13
04:29:09 [INFO] 08:29:09.962 TRACE [WorkbenchTestable][WidgetHandler] Wait for synchronization
04:29:10 [INFO] 08:29:10.035 DEBUG [WorkbenchTestable][AbstractWait] Waiting while window is available...
04:29:10 [INFO] 08:29:10.035 DEBUG [WorkbenchTestable][AbstractWait] Waiting while window is available finished successfully
04:29:10 [INFO] 08:29:10.035 DEBUG [WorkbenchTestable][AbstractShell] Set focus to Shell data
04:29:10 [INFO] 08:29:10.035 DEBUG [WorkbenchTestable][AbstractWait] Waiting until shell is active...
04:29:10 [INFO] 08:29:10.035 DEBUG [WorkbenchTestable][AbstractWait] Waiting until shell is active finished successfully
04:29:10 [INFO] 08:29:10.037 DEBUG [WorkbenchTestable][RequirementsRunner] Injecting fulfilled requirements into test instance: org.eclipse.reddeer.junit.internal.requirement.Requirements
04:29:10 [INFO] 08:29:10.039 INFO [WorkbenchTestable][RequirementsRunner] Started test: test no-configuration(foo.bar.myplugin.simrel.BasicTest)
04:29:10 [INFO] 08:29:10.039 DEBUG [WorkbenchTestable][RunIBeforeTestExtensions] Run before test extensions for test class foo.bar.myplugin.simrel.BasicTest
04:29:10 [INFO] 08:29:10.039 DEBUG [WorkbenchTestable][RunIBeforeTestExtensions] Run method runBeforeTest() of class org.eclipse.reddeer.junit.extension.before.test.impl.DisableAERI
04:29:10 [INFO] 08:29:10.039 DEBUG [WorkbenchTestable][RunIBeforeTestExtensions] Run method runBeforeTest() of class org.eclipse.reddeer.junit.extension.before.test.impl.CloseWelcomeScreenExt
04:29:10 [INFO] 08:29:10.039 DEBUG [WorkbenchTestable][RunIBeforeTestExtensions] Run method runBeforeTest() of class org.eclipse.reddeer.junit.extension.before.test.impl.SetOpenAssociatedPerspectiveExt
04:29:10 [INFO] 08:29:10.039 DEBUG [WorkbenchTestable][RunIBeforeTestExtensions] Run method runBeforeTest() of class org.eclipse.reddeer.junit.extension.before.test.impl.DoNotDownloadMavenIndexesExt
04:29:10 [INFO] 08:29:10.040 DEBUG [WorkbenchTestable][AbstractWait] Waiting until active shell exists...
04:29:10 [INFO] 08:29:10.040 DEBUG [WorkbenchTestable][AbstractWait] Waiting until active shell exists finished successfully
04:29:10 [INFO] 08:29:10.040 DEBUG [WorkbenchTestable][AbstractShell] Set focus to Shell data
04:29:10 [INFO] 08:29:10.040 DEBUG [WorkbenchTestable][AbstractWait] Waiting until shell is active...
04:29:10 [INFO] 08:29:10.040 DEBUG [WorkbenchTestable][AbstractWait] Waiting until shell is active finished successfully
04:29:10 [INFO] 08:29:10.041 DEBUG [WorkbenchTestable][RunIAfterTestExtensions] Run after test extensions for test class foo.bar.myplugin.simrel.BasicTest
04:29:10 [INFO] 08:29:10.041 DEBUG [WorkbenchTestable][RunIAfterTestExtensions] Run method runAfterTest() of class org.eclipse.reddeer.junit.extension.after.test.impl.CloseAllShellsExt
04:29:10 [INFO] 08:29:10.043 INFO [WorkbenchTestable][WorkbenchShellHandler] Closing all shells...
04:29:10 [INFO] 08:29:10.043 DEBUG [WorkbenchTestable][AbstractWait] Waiting until active shell exists...
04:29:10 [INFO] 08:29:10.043 DEBUG [WorkbenchTestable][AbstractWait] Waiting until active shell exists finished successfully
04:29:10 [INFO] 08:29:10.045 INFO [WorkbenchTestable][RequirementsRunner] Finished test: test no-configuration(foo.bar.myplugin.simrel.BasicTest)
04:29:10 [INFO] 08:29:10.046 DEBUG [WorkbenchTestable][RunIAfterClassExtensions] Run after class extensions for test class foo.bar.myplugin.simrel.BasicTest
04:29:10 [INFO] 08:29:10.046 DEBUG [WorkbenchTestable][RunIAfterClassExtensions] Run method runAfterTestClass() of class org.eclipse.reddeer.junit.extension.after.test.impl.CloseAllShellsExt
04:29:10 [INFO] 08:29:10.046 INFO [WorkbenchTestable][WorkbenchShellHandler] Closing all shells...
04:29:10 [INFO] 08:29:10.046 DEBUG [WorkbenchTestable][AbstractWait] Waiting until active shell exists...
04:29:10 [INFO] 08:29:10.046 DEBUG [WorkbenchTestable][AbstractWait] Waiting until active shell exists finished successfully
04:29:10 [INFO] Tests run: 1, Failures: 0, Errors: 0, Skipped: 0, Time elapsed: 0.61 s - in foo.bar.myplugin.simrel.AllRedDeerTests
04:29:10 [INFO] test no-configuration(foo.bar.myplugin.simrel.BasicTest)  Time elapsed: 0.006 s
04:29:10 [INFO] 
04:29:10 [INFO] Results:
04:29:10 [INFO] 
04:29:10 [INFO] Tests run: 1, Failures: 0, Errors: 0, Skipped: 0
04:29:10 [INFO] 
04:29:11 [INFO] [INFO] All tests passed!
04:29:11 [INFO] [INFO] ------------------------------------------------------------------------
04:29:11 [INFO] [INFO] BUILD SUCCESS
04:29:11 [INFO] [INFO] ------------------------------------------------------------------------
04:29:11 [INFO] [INFO] Total time:  24.845 s
04:29:11 [INFO] [INFO] Finished at: 2019-10-15T08:29:11Z
04:29:11 [INFO] [INFO] ------------------------------------------------------------------------
04:29:12 [INFO] Post-archetype-generation invoker exit code: 0
04:29:12 [INFO] ------------------------------------------------------------------------
04:29:12 [INFO] Reactor Summary for RedDeer Parent POM File 2.8.0-SNAPSHOT:
04:29:12 [INFO] 
04:29:12 [INFO] RedDeer Parent POM File ............................ SUCCESS [  8.468 s]
04:29:12 [INFO] RedDeer Plugins .................................... SUCCESS [  0.006 s]
04:29:12 [INFO] RedDeer Common ..................................... SUCCESS [  5.398 s]
04:29:12 [INFO] RedDeer Workbench Core ............................. SUCCESS [  0.536 s]
04:29:12 [INFO] RedDeer E4 Workbench Core .......................... SUCCESS [  0.355 s]
04:29:12 [INFO] RedDeer Core ....................................... SUCCESS [  1.574 s]
04:29:12 [INFO] RedDeer SWT ........................................ SUCCESS [  1.271 s]
04:29:12 [INFO] RedDeer JFace ...................................... SUCCESS [  0.437 s]
04:29:12 [INFO] RedDeer Workbench .................................. SUCCESS [  0.881 s]
04:29:12 [INFO] RedDeer E4 Workbench ............................... SUCCESS [  0.421 s]
04:29:12 [INFO] RedDeer UIForms .................................... SUCCESS [  0.457 s]
04:29:12 [INFO] RedDeer Direct ..................................... SUCCESS [  0.341 s]
04:29:12 [INFO] RedDeer JUnit ...................................... SUCCESS [  0.707 s]
04:29:12 [INFO] RedDeer Eclipse .................................... SUCCESS [  2.834 s]
04:29:12 [INFO] RedDeer GEF ........................................ SUCCESS [  0.359 s]
04:29:12 [INFO] RedDeer GEF Spy .................................... SUCCESS [  0.397 s]
04:29:12 [INFO] RedDeer Graphiti ................................... SUCCESS [  0.510 s]
04:29:12 [INFO] RedDeer JDT Junit .................................. SUCCESS [  0.354 s]
04:29:12 [INFO] RedDeer JUnit Extensions ........................... SUCCESS [  0.308 s]
04:29:12 [INFO] RedDeer Selenium ................................... SUCCESS [  0.221 s]
04:29:12 [INFO] RedDeer Requirements ............................... SUCCESS [  0.499 s]
04:29:12 [INFO] RedDeer UI ......................................... SUCCESS [  0.682 s]
04:29:12 [INFO] RedDeer Spy ........................................ SUCCESS [  0.324 s]
04:29:12 [INFO] RedDeer Recorder ................................... SUCCESS [  0.704 s]
04:29:12 [INFO] RedDeer Go ......................................... SUCCESS [  0.195 s]
04:29:12 [INFO] RedDeer Log Parser ................................. SUCCESS [  0.501 s]
04:29:12 [INFO] RedDeer CodeGen .................................... SUCCESS [  0.485 s]
04:29:12 [INFO] RedDeer Test-Apps .................................. SUCCESS [  0.005 s]
04:29:12 [INFO] RedDeer E4 Test App ................................ SUCCESS [  0.377 s]
04:29:12 [INFO] RedDeer Tests ...................................... SUCCESS [  0.296 s]
04:29:12 [INFO] RedDeer Common Tests ............................... SUCCESS [01:12 min]
04:29:12 [INFO] RedDeer SWT Tests .................................. SUCCESS [27:45 min]
04:29:12 [INFO] RedDeer Core Tests ................................. SUCCESS [04:21 min]
04:29:12 [INFO] RedDeer Workbench Tests ............................ SUCCESS [04:50 min]
04:29:12 [INFO] RedDeer UIForms Test ............................... SUCCESS [ 23.073 s]
04:29:12 [INFO] RedDeer JFace Tests ................................ SUCCESS [02:17 min]
04:29:12 [INFO] RedDeer Eclipse Tests .............................. SUCCESS [33:30 min]
04:29:12 [INFO] RedDeer GEF Tests .................................. SUCCESS [01:04 min]
04:29:12 [INFO] RedDeer Graphiti Tests ............................. SUCCESS [ 40.789 s]
04:29:12 [INFO] RedDeer Direct Tests ............................... SUCCESS [ 33.477 s]
04:29:12 [INFO] RedDeer JUnit Tests ................................ SUCCESS [ 21.784 s]
04:29:12 [INFO] RedDeer Requirements Tests ......................... SUCCESS [05:23 min]
04:29:12 [INFO] RedDeer UI Tests ................................... SUCCESS [02:56 min]
04:29:12 [INFO] RedDeer E4 Workbench Tests ......................... SUCCESS [ 11.094 s]
04:29:12 [INFO] RedDeer Features ................................... SUCCESS [  0.005 s]
04:29:12 [INFO] RedDeer E4 Feature ................................. SUCCESS [  0.384 s]
04:29:12 [INFO] RedDeer Eclipse Feature ............................ SUCCESS [  0.689 s]
04:29:12 [INFO] RedDeer GEF Spy Feature ............................ SUCCESS [  0.181 s]
04:29:12 [INFO] RedDeer SWT Feature ................................ SUCCESS [  0.319 s]
04:29:12 [INFO] RedDeer Tests Feature .............................. SUCCESS [  0.806 s]
04:29:12 [INFO] RedDeer UI Feature ................................. SUCCESS [  0.135 s]
04:29:12 [INFO] RedDeer Recorder Feature ........................... SUCCESS [  0.144 s]
04:29:12 [INFO] RedDeer GEF/Graphiti Feature ....................... SUCCESS [  0.577 s]
04:29:12 [INFO] RedDeer Spy Feature ................................ SUCCESS [  0.224 s]
04:29:12 [INFO] RedDeer Log Parser Feature ......................... SUCCESS [  0.132 s]
04:29:12 [INFO] RedDeer Selenium Feature ........................... SUCCESS [  0.181 s]
04:29:12 [INFO] RedDeer CodeGen Feature ............................ SUCCESS [  0.210 s]
04:29:12 [INFO] RedDeer Site ....................................... SUCCESS [ 19.030 s]
04:29:12 [INFO] RedDeer Archetype .................................. SUCCESS [ 33.106 s]
04:29:12 [INFO] ------------------------------------------------------------------------
04:29:12 [INFO] BUILD SUCCESS
04:29:12 [INFO] ------------------------------------------------------------------------
04:29:12 [INFO] Total time:  01:31 h
04:29:12 [INFO] Finished at: 2019-10-15T08:29:12Z
04:29:12 [INFO] ------------------------------------------------------------------------
04:29:13 Terminating xvnc.
04:29:14 
04:29:14 Tue Oct 15 08:29:14 2019
04:29:14  ComparingUpdateTracker: 0 pixels in / 0 pixels out
04:29:14  ComparingUpdateTracker: (1:-nan ratio)
04:29:14 Archiving artifacts
04:29:31 Recording test results
04:29:33 Build step 'Publish JUnit test result report' changed build result to UNSTABLE
04:29:33 [Set GitHub commit status (universal)] PENDING on repos [] (sha:14bff9e) with context:reddeer.verification.jdk11
04:29:33 Finished: UNSTABLE