FailedConsole Output

Skipping 1,937 KB.. Full Log
+LCAAAAAAAAP9b85aBtbiIQSWjNKU4P0+vJLE4u1gvPjexLDVPzxdEhicW5WXmpfvll6S2fNly5fzGzauYGBgqihikoFqS8/OK83NS9ZwhNEghAwQwghQWAACwxA+XYgAAAA==[WARNING] 
WARNING: 	TemplateProposalProvider.xtend - 
17: The import 'org.eclipse.xtext.ui.editor.contentassist.PrefixMatcher' is never used.
[INFO] 
[INFO] --- maven-resources-plugin:2.7:resources (default-resources) @ org.eclipse.recommenders.templates.rcp ---
[INFO] Using 'UTF-8' encoding to copy filtered resources.
[INFO] skip non existing resourceDirectory /jobs/genie.recommenders/org.eclipse.recommenders.snipmatch-gerrit/workspace/simrel/luna/toolchain/JavaSE-1.7/plugins/org.eclipse.recommenders.templates.rcp/resources
[INFO] 
[INFO] --- tycho-compiler-plugin:1.0.0:compile (default-compile) @ org.eclipse.recommenders.templates.rcp ---
[INFO] Compiling 19 source files to /jobs/genie.recommenders/org.eclipse.recommenders.snipmatch-gerrit/workspace/simrel/luna/toolchain/JavaSE-1.7/plugins/org.eclipse.recommenders.templates.rcp/target/classes
[INFO] 
[INFO] --- animal-sniffer-maven-plugin:1.14:check (check-signature) @ org.eclipse.recommenders.templates.rcp ---
[INFO] Checking unresolved references to org.codehaus.mojo.signature:java17:1.0
[INFO] 
[INFO] --- maven-resources-plugin:2.7:testResources (default-testResources) @ org.eclipse.recommenders.templates.rcp ---
[INFO] Using 'UTF-8' encoding to copy filtered resources.
[INFO] skip non existing resourceDirectory /jobs/genie.recommenders/org.eclipse.recommenders.snipmatch-gerrit/workspace/simrel/luna/toolchain/JavaSE-1.7/plugins/org.eclipse.recommenders.templates.rcp/src/test/resources
[INFO] 
[INFO] --- tycho-source-plugin:1.0.0:plugin-source (attach-source) @ org.eclipse.recommenders.templates.rcp ---
[WARNING] bundle localization file /jobs/genie.recommenders/org.eclipse.recommenders.snipmatch-gerrit/workspace/simrel/luna/toolchain/JavaSE-1.7/plugins/org.eclipse.recommenders.templates.rcp/plugin.properties not found
[INFO] Building jar: /jobs/genie.recommenders/org.eclipse.recommenders.snipmatch-gerrit/workspace/simrel/luna/toolchain/JavaSE-1.7/plugins/org.eclipse.recommenders.templates.rcp/target/org.eclipse.recommenders.templates.rcp-0.3.0-SNAPSHOT-sources.jar
[INFO] 
[INFO] --- target-platform-configuration:1.0.0:target-platform (default-target-platform) @ org.eclipse.recommenders.templates.rcp ---
[INFO] 
[INFO] --- tycho-packaging-plugin:1.0.0:package-plugin (default-package-plugin) @ org.eclipse.recommenders.templates.rcp ---
[INFO] Building jar: /jobs/genie.recommenders/org.eclipse.recommenders.snipmatch-gerrit/workspace/simrel/luna/toolchain/JavaSE-1.7/plugins/org.eclipse.recommenders.templates.rcp/target/org.eclipse.recommenders.templates.rcp-0.3.0-SNAPSHOT.jar
[INFO] 
[INFO] --- tycho-p2-plugin:1.0.0:p2-metadata-default (default-p2-metadata-default) @ org.eclipse.recommenders.templates.rcp ---
[INFO] 
[INFO] --- maven-checkstyle-plugin:2.12:check (check-coding-conventions) @ org.eclipse.recommenders.templates.rcp ---
[INFO] 
[INFO] 
[INFO] --- maven-license-plugin:1.9.0:check (check-license-headers) @ org.eclipse.recommenders.templates.rcp ---
[INFO] Checking licenses...
[WARNING] Property 'strictCheck' is not enabled. Please consider adding <strictCheck>true</strictCheck> in your pom.xml file.
[WARNING] See http://code.google.com/p/maven-license-plugin/wiki/Configuration for more information.
[INFO] 
[INFO] --- tidy-maven-plugin:1.0.0:check (check-pom) @ org.eclipse.recommenders.templates.rcp ---
[INFO] 
[INFO] ------------------------------------------------------------------------
[INFO] Building org.eclipse.recommenders.templates.snipmatch.rcp 0.3.0-SNAPSHOT
[INFO] ------------------------------------------------------------------------
[INFO] 
[INFO] --- maven-clean-plugin:3.0.0:clean (default-clean) @ org.eclipse.recommenders.templates.snipmatch.rcp ---
[INFO] 
[INFO] --- tycho-packaging-plugin:1.0.0:build-qualifier (default-build-qualifier) @ org.eclipse.recommenders.templates.snipmatch.rcp ---
[INFO] The project's OSGi version is 0.3.0.v20170502-1306
[INFO] 
[INFO] --- tycho-packaging-plugin:1.0.0:validate-id (default-validate-id) @ org.eclipse.recommenders.templates.snipmatch.rcp ---
[INFO] 
[INFO] --- tycho-packaging-plugin:1.0.0:validate-version (default-validate-version) @ org.eclipse.recommenders.templates.snipmatch.rcp ---
[INFO] 
[INFO] --- maven-enforcer-plugin:1.4.1:enforce (require-about-html) @ org.eclipse.recommenders.templates.snipmatch.rcp ---
[INFO] 
[INFO] --- maven-toolchains-plugin:1.1:toolchain (default) @ org.eclipse.recommenders.templates.snipmatch.rcp ---
[INFO] Required toolchain: jdk [ id='JavaSE-1.7' ]
[INFO] Found matching toolchain for type jdk: JDK[/opt/public/common/jdk1.7.0-latest/jre]
[INFO] 
[INFO] --- maven-resources-plugin:2.7:resources (default-resources) @ org.eclipse.recommenders.templates.snipmatch.rcp ---
[INFO] Using 'UTF-8' encoding to copy filtered resources.
[INFO] skip non existing resourceDirectory /jobs/genie.recommenders/org.eclipse.recommenders.snipmatch-gerrit/workspace/simrel/luna/toolchain/JavaSE-1.7/plugins/org.eclipse.recommenders.templates.snipmatch.rcp/resources
[INFO] 
[INFO] --- tycho-compiler-plugin:1.0.0:compile (default-compile) @ org.eclipse.recommenders.templates.snipmatch.rcp ---
[INFO] Compiling 2 source files to /jobs/genie.recommenders/org.eclipse.recommenders.snipmatch-gerrit/workspace/simrel/luna/toolchain/JavaSE-1.7/plugins/org.eclipse.recommenders.templates.snipmatch.rcp/target/classes
[INFO] 
[INFO] --- animal-sniffer-maven-plugin:1.14:check (check-signature) @ org.eclipse.recommenders.templates.snipmatch.rcp ---
[INFO] Checking unresolved references to org.codehaus.mojo.signature:java17:1.0
[INFO] 
[INFO] --- maven-resources-plugin:2.7:testResources (default-testResources) @ org.eclipse.recommenders.templates.snipmatch.rcp ---
[INFO] Using 'UTF-8' encoding to copy filtered resources.
[INFO] skip non existing resourceDirectory /jobs/genie.recommenders/org.eclipse.recommenders.snipmatch-gerrit/workspace/simrel/luna/toolchain/JavaSE-1.7/plugins/org.eclipse.recommenders.templates.snipmatch.rcp/src/test/resources
[INFO] 
[INFO] --- tycho-source-plugin:1.0.0:plugin-source (attach-source) @ org.eclipse.recommenders.templates.snipmatch.rcp ---
[WARNING] bundle localization file /jobs/genie.recommenders/org.eclipse.recommenders.snipmatch-gerrit/workspace/simrel/luna/toolchain/JavaSE-1.7/plugins/org.eclipse.recommenders.templates.snipmatch.rcp/plugin.properties not found
[INFO] Building jar: /jobs/genie.recommenders/org.eclipse.recommenders.snipmatch-gerrit/workspace/simrel/luna/toolchain/JavaSE-1.7/plugins/org.eclipse.recommenders.templates.snipmatch.rcp/target/org.eclipse.recommenders.templates.snipmatch.rcp-0.3.0-SNAPSHOT-sources.jar
[INFO] 
[INFO] --- target-platform-configuration:1.0.0:target-platform (default-target-platform) @ org.eclipse.recommenders.templates.snipmatch.rcp ---
[INFO] 
[INFO] --- tycho-packaging-plugin:1.0.0:package-plugin (default-package-plugin) @ org.eclipse.recommenders.templates.snipmatch.rcp ---
[INFO] Building jar: /jobs/genie.recommenders/org.eclipse.recommenders.snipmatch-gerrit/workspace/simrel/luna/toolchain/JavaSE-1.7/plugins/org.eclipse.recommenders.templates.snipmatch.rcp/target/org.eclipse.recommenders.templates.snipmatch.rcp-0.3.0-SNAPSHOT.jar
[INFO] 
[INFO] --- tycho-p2-plugin:1.0.0:p2-metadata-default (default-p2-metadata-default) @ org.eclipse.recommenders.templates.snipmatch.rcp ---
[INFO] 
[INFO] --- maven-checkstyle-plugin:2.12:check (check-coding-conventions) @ org.eclipse.recommenders.templates.snipmatch.rcp ---
[INFO] 
[INFO] 
[INFO] --- maven-license-plugin:1.9.0:check (check-license-headers) @ org.eclipse.recommenders.templates.snipmatch.rcp ---
[INFO] Checking licenses...
[WARNING] Property 'strictCheck' is not enabled. Please consider adding <strictCheck>true</strictCheck> in your pom.xml file.
[WARNING] See http://code.google.com/p/maven-license-plugin/wiki/Configuration for more information.
[INFO] 
[INFO] --- tidy-maven-plugin:1.0.0:check (check-pom) @ org.eclipse.recommenders.templates.snipmatch.rcp ---
[INFO] 
[INFO] ------------------------------------------------------------------------
[INFO] Building Tests 0.3.0-SNAPSHOT
[INFO] ------------------------------------------------------------------------
[INFO] 
[INFO] --- maven-clean-plugin:3.0.0:clean (default-clean) @ tests ---
[INFO] 
[INFO] --- maven-enforcer-plugin:1.4.1:enforce (require-maven-version) @ tests ---
[INFO] 
[INFO] --- maven-enforcer-plugin:1.4.1:enforce (require-plugin-versions) @ tests ---
[INFO] 
[INFO] --- maven-toolchains-plugin:1.1:toolchain (default) @ tests ---
[INFO] Required toolchain: jdk [ id='JavaSE-1.7' ]
[INFO] Found matching toolchain for type jdk: JDK[/opt/public/common/jdk1.7.0-latest/jre]
[INFO] 
[INFO] --- jacoco-maven-plugin:0.7.9:prepare-agent (prepare-agent) @ tests ---
Downloading from recommenders-releases: https://repo.eclipse.org/content/repositories/recommenders-releases/junit/junit/4.8.2/junit-4.8.2.pom
Downloading from eclipse-cbi-releases: https://repo.eclipse.org/content/groups/cbi/junit/junit/4.8.2/junit-4.8.2.pom
Downloading from eclipse.maven.central.mirror: https://repo.eclipse.org/content/repositories/maven_central/junit/junit/4.8.2/junit-4.8.2.pom
Progress (1): 1.5 kB
                    
Downloaded from eclipse.maven.central.mirror: https://repo.eclipse.org/content/repositories/maven_central/junit/junit/4.8.2/junit-4.8.2.pom (1.5 kB at 67 kB/s)
Downloading from recommenders-releases: https://repo.eclipse.org/content/repositories/recommenders-releases/org/apache/maven/shared/file-management/1.2.1/file-management-1.2.1.pom
Downloading from eclipse-cbi-releases: https://repo.eclipse.org/content/groups/cbi/org/apache/maven/shared/file-management/1.2.1/file-management-1.2.1.pom
Downloading from eclipse.maven.central.mirror: https://repo.eclipse.org/content/repositories/maven_central/org/apache/maven/shared/file-management/1.2.1/file-management-1.2.1.pom
Progress (1): 3.9 kB
                    
Downloaded from eclipse.maven.central.mirror: https://repo.eclipse.org/content/repositories/maven_central/org/apache/maven/shared/file-management/1.2.1/file-management-1.2.1.pom (3.9 kB at 86 kB/s)
Downloading from recommenders-releases: https://repo.eclipse.org/content/repositories/recommenders-releases/org/apache/maven/shared/maven-shared-components/10/maven-shared-components-10.pom
Downloading from eclipse-cbi-releases: https://repo.eclipse.org/content/groups/cbi/org/apache/maven/shared/maven-shared-components/10/maven-shared-components-10.pom
Downloading from eclipse.maven.central.mirror: https://repo.eclipse.org/content/repositories/maven_central/org/apache/maven/shared/maven-shared-components/10/maven-shared-components-10.pom
Progress (1): 4.1/8.4 kB
Progress (1): 7.7/8.4 kB
Progress (1): 8.4 kB    
                    
Downloaded from eclipse.maven.central.mirror: https://repo.eclipse.org/content/repositories/maven_central/org/apache/maven/shared/maven-shared-components/10/maven-shared-components-10.pom (8.4 kB at 422 kB/s)
Downloading from recommenders-releases: https://repo.eclipse.org/content/repositories/recommenders-releases/org/apache/maven/maven-parent/9/maven-parent-9.pom
Downloading from eclipse-cbi-releases: https://repo.eclipse.org/content/groups/cbi/org/apache/maven/maven-parent/9/maven-parent-9.pom
Downloading from eclipse.maven.central.mirror: https://repo.eclipse.org/content/repositories/maven_central/org/apache/maven/maven-parent/9/maven-parent-9.pom
Progress (1): 4.1/33 kB
Progress (1): 7.7/33 kB
Progress (1): 12/33 kB 
Progress (1): 16/33 kB
Progress (1): 20/33 kB
Progress (1): 24/33 kB
Progress (1): 28/33 kB
Progress (1): 32/33 kB
Progress (1): 33 kB   
                   
Downloaded from eclipse.maven.central.mirror: https://repo.eclipse.org/content/repositories/maven_central/org/apache/maven/maven-parent/9/maven-parent-9.pom (33 kB at 1.5 MB/s)
Downloading from recommenders-releases: https://repo.eclipse.org/content/repositories/recommenders-releases/org/apache/maven/shared/maven-shared-io/1.1/maven-shared-io-1.1.pom
Downloading from eclipse-cbi-releases: https://repo.eclipse.org/content/groups/cbi/org/apache/maven/shared/maven-shared-io/1.1/maven-shared-io-1.1.pom
Downloading from eclipse.maven.central.mirror: https://repo.eclipse.org/content/repositories/maven_central/org/apache/maven/shared/maven-shared-io/1.1/maven-shared-io-1.1.pom
Progress (1): 4.1 kB
                    
Downloaded from eclipse.maven.central.mirror: https://repo.eclipse.org/content/repositories/maven_central/org/apache/maven/shared/maven-shared-io/1.1/maven-shared-io-1.1.pom (4.1 kB at 226 kB/s)
Downloading from recommenders-releases: https://repo.eclipse.org/content/repositories/recommenders-releases/org/apache/maven/shared/maven-shared-components/8/maven-shared-components-8.pom
Downloading from eclipse-cbi-releases: https://repo.eclipse.org/content/groups/cbi/org/apache/maven/shared/maven-shared-components/8/maven-shared-components-8.pom
Downloading from eclipse.maven.central.mirror: https://repo.eclipse.org/content/repositories/maven_central/org/apache/maven/shared/maven-shared-components/8/maven-shared-components-8.pom
Progress (1): 2.7 kB
                    
Downloaded from eclipse.maven.central.mirror: https://repo.eclipse.org/content/repositories/maven_central/org/apache/maven/shared/maven-shared-components/8/maven-shared-components-8.pom (2.7 kB at 149 kB/s)
Downloading from recommenders-releases: https://repo.eclipse.org/content/repositories/recommenders-releases/org/apache/maven/maven-parent/7/maven-parent-7.pom
Downloading from eclipse-cbi-releases: https://repo.eclipse.org/content/groups/cbi/org/apache/maven/maven-parent/7/maven-parent-7.pom
Downloading from eclipse.maven.central.mirror: https://repo.eclipse.org/content/repositories/maven_central/org/apache/maven/maven-parent/7/maven-parent-7.pom
Progress (1): 4.1/21 kB
Progress (1): 7.7/21 kB
Progress (1): 12/21 kB 
Progress (1): 16/21 kB
Progress (1): 20/21 kB
Progress (1): 21 kB   
                   
Downloaded from eclipse.maven.central.mirror: https://repo.eclipse.org/content/repositories/maven_central/org/apache/maven/maven-parent/7/maven-parent-7.pom (21 kB at 1.1 MB/s)
Downloading from recommenders-releases: https://repo.eclipse.org/content/repositories/recommenders-releases/org/apache/maven/maven-artifact/2.0.2/maven-artifact-2.0.2.pom
Downloading from eclipse-cbi-releases: https://repo.eclipse.org/content/groups/cbi/org/apache/maven/maven-artifact/2.0.2/maven-artifact-2.0.2.pom
Downloading from eclipse.maven.central.mirror: https://repo.eclipse.org/content/repositories/maven_central/org/apache/maven/maven-artifact/2.0.2/maven-artifact-2.0.2.pom
Progress (1): 765 B
                   
Downloaded from eclipse.maven.central.mirror: https://repo.eclipse.org/content/repositories/maven_central/org/apache/maven/maven-artifact/2.0.2/maven-artifact-2.0.2.pom (765 B at 42 kB/s)
Downloading from recommenders-releases: https://repo.eclipse.org/content/repositories/recommenders-releases/org/apache/maven/maven/2.0.2/maven-2.0.2.pom
Downloading from eclipse-cbi-releases: https://repo.eclipse.org/content/groups/cbi/org/apache/maven/maven/2.0.2/maven-2.0.2.pom
Downloading from eclipse.maven.central.mirror: https://repo.eclipse.org/content/repositories/maven_central/org/apache/maven/maven/2.0.2/maven-2.0.2.pom
Progress (1): 4.1/13 kB
Progress (1): 7.7/13 kB
Progress (1): 12/13 kB 
Progress (1): 13 kB   
                   
Downloaded from eclipse.maven.central.mirror: https://repo.eclipse.org/content/repositories/maven_central/org/apache/maven/maven/2.0.2/maven-2.0.2.pom (13 kB at 693 kB/s)
Downloading from recommenders-releases: https://repo.eclipse.org/content/repositories/recommenders-releases/org/codehaus/plexus/plexus-utils/1.1/plexus-utils-1.1.pom
Downloading from eclipse-cbi-releases: https://repo.eclipse.org/content/groups/cbi/org/codehaus/plexus/plexus-utils/1.1/plexus-utils-1.1.pom
Downloading from eclipse.maven.central.mirror: https://repo.eclipse.org/content/repositories/maven_central/org/codehaus/plexus/plexus-utils/1.1/plexus-utils-1.1.pom
Progress (1): 767 B
                   
Downloaded from eclipse.maven.central.mirror: https://repo.eclipse.org/content/repositories/maven_central/org/codehaus/plexus/plexus-utils/1.1/plexus-utils-1.1.pom (767 B at 38 kB/s)
Downloading from recommenders-releases: https://repo.eclipse.org/content/repositories/recommenders-releases/org/apache/maven/maven-artifact-manager/2.0.2/maven-artifact-manager-2.0.2.pom
Downloading from eclipse-cbi-releases: https://repo.eclipse.org/content/groups/cbi/org/apache/maven/maven-artifact-manager/2.0.2/maven-artifact-manager-2.0.2.pom
Downloading from eclipse.maven.central.mirror: https://repo.eclipse.org/content/repositories/maven_central/org/apache/maven/maven-artifact-manager/2.0.2/maven-artifact-manager-2.0.2.pom
Progress (1): 1.4 kB
                    
Downloaded from eclipse.maven.central.mirror: https://repo.eclipse.org/content/repositories/maven_central/org/apache/maven/maven-artifact-manager/2.0.2/maven-artifact-manager-2.0.2.pom (1.4 kB at 73 kB/s)
Downloading from recommenders-releases: https://repo.eclipse.org/content/repositories/recommenders-releases/org/apache/maven/maven-repository-metadata/2.0.2/maven-repository-metadata-2.0.2.pom
Downloading from eclipse-cbi-releases: https://repo.eclipse.org/content/groups/cbi/org/apache/maven/maven-repository-metadata/2.0.2/maven-repository-metadata-2.0.2.pom
Downloading from eclipse.maven.central.mirror: https://repo.eclipse.org/content/repositories/maven_central/org/apache/maven/maven-repository-metadata/2.0.2/maven-repository-metadata-2.0.2.pom
Progress (1): 1.3 kB
                    
Downloaded from eclipse.maven.central.mirror: https://repo.eclipse.org/content/repositories/maven_central/org/apache/maven/maven-repository-metadata/2.0.2/maven-repository-metadata-2.0.2.pom (1.3 kB at 77 kB/s)
Downloading from recommenders-releases: https://repo.eclipse.org/content/repositories/recommenders-releases/org/apache/maven/wagon/wagon-provider-api/1.0-alpha-6/wagon-provider-api-1.0-alpha-6.pom
Downloading from eclipse-cbi-releases: https://repo.eclipse.org/content/groups/cbi/org/apache/maven/wagon/wagon-provider-api/1.0-alpha-6/wagon-provider-api-1.0-alpha-6.pom
Downloading from eclipse.maven.central.mirror: https://repo.eclipse.org/content/repositories/maven_central/org/apache/maven/wagon/wagon-provider-api/1.0-alpha-6/wagon-provider-api-1.0-alpha-6.pom
Progress (1): 588 B
                   
Downloaded from eclipse.maven.central.mirror: https://repo.eclipse.org/content/repositories/maven_central/org/apache/maven/wagon/wagon-provider-api/1.0-alpha-6/wagon-provider-api-1.0-alpha-6.pom (588 B at 28 kB/s)
Downloading from recommenders-releases: https://repo.eclipse.org/content/repositories/recommenders-releases/org/apache/maven/wagon/wagon/1.0-alpha-6/wagon-1.0-alpha-6.pom
Downloading from eclipse-cbi-releases: https://repo.eclipse.org/content/groups/cbi/org/apache/maven/wagon/wagon/1.0-alpha-6/wagon-1.0-alpha-6.pom
Downloading from eclipse.maven.central.mirror: https://repo.eclipse.org/content/repositories/maven_central/org/apache/maven/wagon/wagon/1.0-alpha-6/wagon-1.0-alpha-6.pom
Progress (1): 4.1/6.4 kB
Progress (1): 6.4 kB    
                    
Downloaded from eclipse.maven.central.mirror: https://repo.eclipse.org/content/repositories/maven_central/org/apache/maven/wagon/wagon/1.0-alpha-6/wagon-1.0-alpha-6.pom (6.4 kB at 337 kB/s)
Downloading from recommenders-releases: https://repo.eclipse.org/content/repositories/recommenders-releases/org/apache/maven/reporting/maven-reporting-impl/2.1/maven-reporting-impl-2.1.pom
Downloading from eclipse-cbi-releases: https://repo.eclipse.org/content/groups/cbi/org/apache/maven/reporting/maven-reporting-impl/2.1/maven-reporting-impl-2.1.pom
Downloading from eclipse.maven.central.mirror: https://repo.eclipse.org/content/repositories/maven_central/org/apache/maven/reporting/maven-reporting-impl/2.1/maven-reporting-impl-2.1.pom
Progress (1): 4.1/4.5 kB
Progress (1): 4.5 kB    
                    
Downloaded from eclipse.maven.central.mirror: https://repo.eclipse.org/content/repositories/maven_central/org/apache/maven/reporting/maven-reporting-impl/2.1/maven-reporting-impl-2.1.pom (4.5 kB at 238 kB/s)
Downloading from recommenders-releases: https://repo.eclipse.org/content/repositories/recommenders-releases/org/apache/maven/maven-project/2.0.10/maven-project-2.0.10.pom
Downloading from eclipse-cbi-releases: https://repo.eclipse.org/content/groups/cbi/org/apache/maven/maven-project/2.0.10/maven-project-2.0.10.pom
Downloading from eclipse.maven.central.mirror: https://repo.eclipse.org/content/repositories/maven_central/org/apache/maven/maven-project/2.0.10/maven-project-2.0.10.pom
Progress (1): 2.8 kB
                    
Downloaded from eclipse.maven.central.mirror: https://repo.eclipse.org/content/repositories/maven_central/org/apache/maven/maven-project/2.0.10/maven-project-2.0.10.pom (2.8 kB at 158 kB/s)
Downloading from recommenders-releases: https://repo.eclipse.org/content/repositories/recommenders-releases/org/apache/maven/maven/2.0.10/maven-2.0.10.pom
Downloading from eclipse-cbi-releases: https://repo.eclipse.org/content/groups/cbi/org/apache/maven/maven/2.0.10/maven-2.0.10.pom
Downloading from eclipse.maven.central.mirror: https://repo.eclipse.org/content/repositories/maven_central/org/apache/maven/maven/2.0.10/maven-2.0.10.pom
Progress (1): 4.1/24 kB
Progress (1): 7.7/24 kB
Progress (1): 12/24 kB 
Progress (1): 16/24 kB
Progress (1): 20/24 kB
Progress (1): 24/24 kB
Progress (1): 24 kB   
                   
Downloaded from eclipse.maven.central.mirror: https://repo.eclipse.org/content/repositories/maven_central/org/apache/maven/maven/2.0.10/maven-2.0.10.pom (24 kB at 1.0 MB/s)
Downloading from recommenders-releases: https://repo.eclipse.org/content/repositories/recommenders-releases/org/apache/maven/maven-settings/2.0.10/maven-settings-2.0.10.pom
Downloading from eclipse-cbi-releases: https://repo.eclipse.org/content/groups/cbi/org/apache/maven/maven-settings/2.0.10/maven-settings-2.0.10.pom
Downloading from eclipse.maven.central.mirror: https://repo.eclipse.org/content/repositories/maven_central/org/apache/maven/maven-settings/2.0.10/maven-settings-2.0.10.pom
Progress (1): 2.2 kB
                    
Downloaded from eclipse.maven.central.mirror: https://repo.eclipse.org/content/repositories/maven_central/org/apache/maven/maven-settings/2.0.10/maven-settings-2.0.10.pom (2.2 kB at 118 kB/s)
Downloading from recommenders-releases: https://repo.eclipse.org/content/repositories/recommenders-releases/org/apache/maven/maven-model/2.0.10/maven-model-2.0.10.pom
Downloading from eclipse-cbi-releases: https://repo.eclipse.org/content/groups/cbi/org/apache/maven/maven-model/2.0.10/maven-model-2.0.10.pom
Downloading from eclipse.maven.central.mirror: https://repo.eclipse.org/content/repositories/maven_central/org/apache/maven/maven-model/2.0.10/maven-model-2.0.10.pom
Progress (1): 3.3 kB
                    
Downloaded from eclipse.maven.central.mirror: https://repo.eclipse.org/content/repositories/maven_central/org/apache/maven/maven-model/2.0.10/maven-model-2.0.10.pom (3.3 kB at 185 kB/s)
Downloading from recommenders-releases: https://repo.eclipse.org/content/repositories/recommenders-releases/org/apache/maven/maven-profile/2.0.10/maven-profile-2.0.10.pom
Downloading from eclipse-cbi-releases: https://repo.eclipse.org/content/groups/cbi/org/apache/maven/maven-profile/2.0.10/maven-profile-2.0.10.pom
Downloading from eclipse.maven.central.mirror: https://repo.eclipse.org/content/repositories/maven_central/org/apache/maven/maven-profile/2.0.10/maven-profile-2.0.10.pom
Progress (1): 2.1 kB
                    
Downloaded from eclipse.maven.central.mirror: https://repo.eclipse.org/content/repositories/maven_central/org/apache/maven/maven-profile/2.0.10/maven-profile-2.0.10.pom (2.1 kB at 110 kB/s)
Downloading from recommenders-releases: https://repo.eclipse.org/content/repositories/recommenders-releases/org/apache/maven/maven-artifact-manager/2.0.10/maven-artifact-manager-2.0.10.pom
Downloading from eclipse-cbi-releases: https://repo.eclipse.org/content/groups/cbi/org/apache/maven/maven-artifact-manager/2.0.10/maven-artifact-manager-2.0.10.pom
Downloading from eclipse.maven.central.mirror: https://repo.eclipse.org/content/repositories/maven_central/org/apache/maven/maven-artifact-manager/2.0.10/maven-artifact-manager-2.0.10.pom
Progress (1): 2.7 kB
                    
Downloaded from eclipse.maven.central.mirror: https://repo.eclipse.org/content/repositories/maven_central/org/apache/maven/maven-artifact-manager/2.0.10/maven-artifact-manager-2.0.10.pom (2.7 kB at 150 kB/s)
Downloading from recommenders-releases: https://repo.eclipse.org/content/repositories/recommenders-releases/org/apache/maven/maven-repository-metadata/2.0.10/maven-repository-metadata-2.0.10.pom
Downloading from eclipse-cbi-releases: https://repo.eclipse.org/content/groups/cbi/org/apache/maven/maven-repository-metadata/2.0.10/maven-repository-metadata-2.0.10.pom
Downloading from eclipse.maven.central.mirror: https://repo.eclipse.org/content/repositories/maven_central/org/apache/maven/maven-repository-metadata/2.0.10/maven-repository-metadata-2.0.10.pom
Progress (1): 2.3 kB
                    
Downloaded from eclipse.maven.central.mirror: https://repo.eclipse.org/content/repositories/maven_central/org/apache/maven/maven-repository-metadata/2.0.10/maven-repository-metadata-2.0.10.pom (2.3 kB at 116 kB/s)
Downloading from recommenders-releases: https://repo.eclipse.org/content/repositories/recommenders-releases/org/apache/maven/maven-artifact/2.0.10/maven-artifact-2.0.10.pom
Downloading from eclipse-cbi-releases: https://repo.eclipse.org/content/groups/cbi/org/apache/maven/maven-artifact/2.0.10/maven-artifact-2.0.10.pom
Downloading from eclipse.maven.central.mirror: https://repo.eclipse.org/content/repositories/maven_central/org/apache/maven/maven-artifact/2.0.10/maven-artifact-2.0.10.pom
Progress (1): 1.6 kB
                    
Downloaded from eclipse.maven.central.mirror: https://repo.eclipse.org/content/repositories/maven_central/org/apache/maven/maven-artifact/2.0.10/maven-artifact-2.0.10.pom (1.6 kB at 101 kB/s)
Downloading from recommenders-releases: https://repo.eclipse.org/content/repositories/recommenders-releases/org/apache/maven/maven-plugin-registry/2.0.10/maven-plugin-registry-2.0.10.pom
Downloading from eclipse-cbi-releases: https://repo.eclipse.org/content/groups/cbi/org/apache/maven/maven-plugin-registry/2.0.10/maven-plugin-registry-2.0.10.pom
Downloading from eclipse.maven.central.mirror: https://repo.eclipse.org/content/repositories/maven_central/org/apache/maven/maven-plugin-registry/2.0.10/maven-plugin-registry-2.0.10.pom
Progress (1): 2.0 kB
                    
Downloaded from eclipse.maven.central.mirror: https://repo.eclipse.org/content/repositories/maven_central/org/apache/maven/maven-plugin-registry/2.0.10/maven-plugin-registry-2.0.10.pom (2.0 kB at 119 kB/s)
Downloading from recommenders-releases: https://repo.eclipse.org/content/repositories/recommenders-releases/org/apache/maven/maven-plugin-api/2.0.10/maven-plugin-api-2.0.10.pom
Downloading from eclipse-cbi-releases: https://repo.eclipse.org/content/groups/cbi/org/apache/maven/maven-plugin-api/2.0.10/maven-plugin-api-2.0.10.pom
Downloading from eclipse.maven.central.mirror: https://repo.eclipse.org/content/repositories/maven_central/org/apache/maven/maven-plugin-api/2.0.10/maven-plugin-api-2.0.10.pom
Progress (1): 1.5 kB
                    
Downloaded from eclipse.maven.central.mirror: https://repo.eclipse.org/content/repositories/maven_central/org/apache/maven/maven-plugin-api/2.0.10/maven-plugin-api-2.0.10.pom (1.5 kB at 88 kB/s)
Downloading from recommenders-releases: https://repo.eclipse.org/content/repositories/recommenders-releases/org/apache/maven/doxia/doxia-sink-api/1.1.2/doxia-sink-api-1.1.2.pom
Downloading from eclipse-cbi-releases: https://repo.eclipse.org/content/groups/cbi/org/apache/maven/doxia/doxia-sink-api/1.1.2/doxia-sink-api-1.1.2.pom
Downloading from eclipse.maven.central.mirror: https://repo.eclipse.org/content/repositories/maven_central/org/apache/maven/doxia/doxia-sink-api/1.1.2/doxia-sink-api-1.1.2.pom
Progress (1): 1.6 kB
                    
Downloaded from eclipse.maven.central.mirror: https://repo.eclipse.org/content/repositories/maven_central/org/apache/maven/doxia/doxia-sink-api/1.1.2/doxia-sink-api-1.1.2.pom (1.6 kB at 75 kB/s)
Downloading from recommenders-releases: https://repo.eclipse.org/content/repositories/recommenders-releases/org/apache/maven/doxia/doxia/1.1.2/doxia-1.1.2.pom
Downloading from eclipse-cbi-releases: https://repo.eclipse.org/content/groups/cbi/org/apache/maven/doxia/doxia/1.1.2/doxia-1.1.2.pom
Downloading from eclipse.maven.central.mirror: https://repo.eclipse.org/content/repositories/maven_central/org/apache/maven/doxia/doxia/1.1.2/doxia-1.1.2.pom
Progress (1): 4.1/18 kB
Progress (1): 7.7/18 kB
Progress (1): 12/18 kB 
Progress (1): 16/18 kB
Progress (1): 18 kB   
                   
Downloaded from eclipse.maven.central.mirror: https://repo.eclipse.org/content/repositories/maven_central/org/apache/maven/doxia/doxia/1.1.2/doxia-1.1.2.pom (18 kB at 1.0 MB/s)
Downloading from recommenders-releases: https://repo.eclipse.org/content/repositories/recommenders-releases/org/apache/maven/doxia/doxia-logging-api/1.1.2/doxia-logging-api-1.1.2.pom
Downloading from eclipse-cbi-releases: https://repo.eclipse.org/content/groups/cbi/org/apache/maven/doxia/doxia-logging-api/1.1.2/doxia-logging-api-1.1.2.pom
Downloading from eclipse.maven.central.mirror: https://repo.eclipse.org/content/repositories/maven_central/org/apache/maven/doxia/doxia-logging-api/1.1.2/doxia-logging-api-1.1.2.pom
Progress (1): 1.6 kB
                    
Downloaded from eclipse.maven.central.mirror: https://repo.eclipse.org/content/repositories/maven_central/org/apache/maven/doxia/doxia-logging-api/1.1.2/doxia-logging-api-1.1.2.pom (1.6 kB at 88 kB/s)
Downloading from recommenders-releases: https://repo.eclipse.org/content/repositories/recommenders-releases/org/apache/maven/doxia/doxia-core/1.1.2/doxia-core-1.1.2.pom
Downloading from eclipse-cbi-releases: https://repo.eclipse.org/content/groups/cbi/org/apache/maven/doxia/doxia-core/1.1.2/doxia-core-1.1.2.pom
Downloading from eclipse.maven.central.mirror: https://repo.eclipse.org/content/repositories/maven_central/org/apache/maven/doxia/doxia-core/1.1.2/doxia-core-1.1.2.pom
Progress (1): 3.7 kB
                    
Downloaded from eclipse.maven.central.mirror: https://repo.eclipse.org/content/repositories/maven_central/org/apache/maven/doxia/doxia-core/1.1.2/doxia-core-1.1.2.pom (3.7 kB at 177 kB/s)
Downloading from recommenders-releases: https://repo.eclipse.org/content/repositories/recommenders-releases/xerces/xercesImpl/2.8.1/xercesImpl-2.8.1.pom
Downloading from eclipse-cbi-releases: https://repo.eclipse.org/content/groups/cbi/xerces/xercesImpl/2.8.1/xercesImpl-2.8.1.pom
Downloading from eclipse.maven.central.mirror: https://repo.eclipse.org/content/repositories/maven_central/xerces/xercesImpl/2.8.1/xercesImpl-2.8.1.pom
Progress (1): 2.2 kB
                    
Downloaded from eclipse.maven.central.mirror: https://repo.eclipse.org/content/repositories/maven_central/xerces/xercesImpl/2.8.1/xercesImpl-2.8.1.pom (2.2 kB at 123 kB/s)
Downloading from recommenders-releases: https://repo.eclipse.org/content/repositories/recommenders-releases/xml-apis/xml-apis/1.3.03/xml-apis-1.3.03.pom
Downloading from eclipse-cbi-releases: https://repo.eclipse.org/content/groups/cbi/xml-apis/xml-apis/1.3.03/xml-apis-1.3.03.pom
Downloading from eclipse.maven.central.mirror: https://repo.eclipse.org/content/repositories/maven_central/xml-apis/xml-apis/1.3.03/xml-apis-1.3.03.pom
Progress (1): 738 B
                   
Downloaded from eclipse.maven.central.mirror: https://repo.eclipse.org/content/repositories/maven_central/xml-apis/xml-apis/1.3.03/xml-apis-1.3.03.pom (738 B at 41 kB/s)
Downloading from recommenders-releases: https://repo.eclipse.org/content/repositories/recommenders-releases/org/apache/apache/1/apache-1.pom
Downloading from eclipse-cbi-releases: https://repo.eclipse.org/content/groups/cbi/org/apache/apache/1/apache-1.pom
Downloading from eclipse.maven.central.mirror: https://repo.eclipse.org/content/repositories/maven_central/org/apache/apache/1/apache-1.pom
Progress (1): 3.4 kB
                    
Downloaded from eclipse.maven.central.mirror: https://repo.eclipse.org/content/repositories/maven_central/org/apache/apache/1/apache-1.pom (3.4 kB at 155 kB/s)
Downloading from recommenders-releases: https://repo.eclipse.org/content/repositories/recommenders-releases/commons-httpclient/commons-httpclient/3.1/commons-httpclient-3.1.pom
Downloading from eclipse-cbi-releases: https://repo.eclipse.org/content/groups/cbi/commons-httpclient/commons-httpclient/3.1/commons-httpclient-3.1.pom
Downloading from eclipse.maven.central.mirror: https://repo.eclipse.org/content/repositories/maven_central/commons-httpclient/commons-httpclient/3.1/commons-httpclient-3.1.pom
Progress (1): 4.1/7.8 kB
Progress (1): 7.7/7.8 kB
Progress (1): 7.8 kB    
                    
Downloaded from eclipse.maven.central.mirror: https://repo.eclipse.org/content/repositories/maven_central/commons-httpclient/commons-httpclient/3.1/commons-httpclient-3.1.pom (7.8 kB at 431 kB/s)
Downloading from recommenders-releases: https://repo.eclipse.org/content/repositories/recommenders-releases/commons-codec/commons-codec/1.2/commons-codec-1.2.pom
Downloading from eclipse-cbi-releases: https://repo.eclipse.org/content/groups/cbi/commons-codec/commons-codec/1.2/commons-codec-1.2.pom
Downloading from eclipse.maven.central.mirror: https://repo.eclipse.org/content/repositories/maven_central/commons-codec/commons-codec/1.2/commons-codec-1.2.pom
Progress (1): 3.8 kB
                    
Downloaded from eclipse.maven.central.mirror: https://repo.eclipse.org/content/repositories/maven_central/commons-codec/commons-codec/1.2/commons-codec-1.2.pom (3.8 kB at 239 kB/s)
Downloading from recommenders-releases: https://repo.eclipse.org/content/repositories/recommenders-releases/org/apache/maven/doxia/doxia-site-renderer/1.1.2/doxia-site-renderer-1.1.2.pom
Downloading from eclipse-cbi-releases: https://repo.eclipse.org/content/groups/cbi/org/apache/maven/doxia/doxia-site-renderer/1.1.2/doxia-site-renderer-1.1.2.pom
Downloading from eclipse.maven.central.mirror: https://repo.eclipse.org/content/repositories/maven_central/org/apache/maven/doxia/doxia-site-renderer/1.1.2/doxia-site-renderer-1.1.2.pom
Progress (1): 4.1/6.1 kB
Progress (1): 6.1 kB    
                    
Downloaded from eclipse.maven.central.mirror: https://repo.eclipse.org/content/repositories/maven_central/org/apache/maven/doxia/doxia-site-renderer/1.1.2/doxia-site-renderer-1.1.2.pom (6.1 kB at 382 kB/s)
Downloading from recommenders-releases: https://repo.eclipse.org/content/repositories/recommenders-releases/org/apache/maven/doxia/doxia-sitetools/1.1.2/doxia-sitetools-1.1.2.pom
Downloading from eclipse-cbi-releases: https://repo.eclipse.org/content/groups/cbi/org/apache/maven/doxia/doxia-sitetools/1.1.2/doxia-sitetools-1.1.2.pom
Downloading from eclipse.maven.central.mirror: https://repo.eclipse.org/content/repositories/maven_central/org/apache/maven/doxia/doxia-sitetools/1.1.2/doxia-sitetools-1.1.2.pom
Progress (1): 4.1/15 kB
Progress (1): 7.7/15 kB
Progress (1): 12/15 kB 
Progress (1): 15 kB   
                   
Downloaded from eclipse.maven.central.mirror: https://repo.eclipse.org/content/repositories/maven_central/org/apache/maven/doxia/doxia-sitetools/1.1.2/doxia-sitetools-1.1.2.pom (15 kB at 804 kB/s)
Downloading from recommenders-releases: https://repo.eclipse.org/content/repositories/recommenders-releases/org/apache/maven/doxia/doxia-decoration-model/1.1.2/doxia-decoration-model-1.1.2.pom
Downloading from eclipse-cbi-releases: https://repo.eclipse.org/content/groups/cbi/org/apache/maven/doxia/doxia-decoration-model/1.1.2/doxia-decoration-model-1.1.2.pom
Downloading from eclipse.maven.central.mirror: https://repo.eclipse.org/content/repositories/maven_central/org/apache/maven/doxia/doxia-decoration-model/1.1.2/doxia-decoration-model-1.1.2.pom
Progress (1): 3.0 kB
                    
Downloaded from eclipse.maven.central.mirror: https://repo.eclipse.org/content/repositories/maven_central/org/apache/maven/doxia/doxia-decoration-model/1.1.2/doxia-decoration-model-1.1.2.pom (3.0 kB at 149 kB/s)
Downloading from recommenders-releases: https://repo.eclipse.org/content/repositories/recommenders-releases/org/apache/maven/doxia/doxia-module-xhtml/1.1.2/doxia-module-xhtml-1.1.2.pom
Downloading from eclipse-cbi-releases: https://repo.eclipse.org/content/groups/cbi/org/apache/maven/doxia/doxia-module-xhtml/1.1.2/doxia-module-xhtml-1.1.2.pom
Downloading from eclipse.maven.central.mirror: https://repo.eclipse.org/content/repositories/maven_central/org/apache/maven/doxia/doxia-module-xhtml/1.1.2/doxia-module-xhtml-1.1.2.pom
Progress (1): 1.6 kB
                    
Downloaded from eclipse.maven.central.mirror: https://repo.eclipse.org/content/repositories/maven_central/org/apache/maven/doxia/doxia-module-xhtml/1.1.2/doxia-module-xhtml-1.1.2.pom (1.6 kB at 89 kB/s)
Downloading from recommenders-releases: https://repo.eclipse.org/content/repositories/recommenders-releases/org/apache/maven/doxia/doxia-modules/1.1.2/doxia-modules-1.1.2.pom
Downloading from eclipse-cbi-releases: https://repo.eclipse.org/content/groups/cbi/org/apache/maven/doxia/doxia-modules/1.1.2/doxia-modules-1.1.2.pom
Downloading from eclipse.maven.central.mirror: https://repo.eclipse.org/content/repositories/maven_central/org/apache/maven/doxia/doxia-modules/1.1.2/doxia-modules-1.1.2.pom
Progress (1): 2.4 kB
                    
Downloaded from eclipse.maven.central.mirror: https://repo.eclipse.org/content/repositories/maven_central/org/apache/maven/doxia/doxia-modules/1.1.2/doxia-modules-1.1.2.pom (2.4 kB at 143 kB/s)
Downloading from recommenders-releases: https://repo.eclipse.org/content/repositories/recommenders-releases/org/apache/maven/doxia/doxia-module-fml/1.1.2/doxia-module-fml-1.1.2.pom
Downloading from eclipse-cbi-releases: https://repo.eclipse.org/content/groups/cbi/org/apache/maven/doxia/doxia-module-fml/1.1.2/doxia-module-fml-1.1.2.pom
Downloading from eclipse.maven.central.mirror: https://repo.eclipse.org/content/repositories/maven_central/org/apache/maven/doxia/doxia-module-fml/1.1.2/doxia-module-fml-1.1.2.pom
Progress (1): 4.1/5.5 kB
Progress (1): 5.5 kB    
                    
Downloaded from eclipse.maven.central.mirror: https://repo.eclipse.org/content/repositories/maven_central/org/apache/maven/doxia/doxia-module-fml/1.1.2/doxia-module-fml-1.1.2.pom (5.5 kB at 323 kB/s)
Downloading from recommenders-releases: https://repo.eclipse.org/content/repositories/recommenders-releases/commons-validator/commons-validator/1.2.0/commons-validator-1.2.0.pom
Downloading from eclipse-cbi-releases: https://repo.eclipse.org/content/groups/cbi/commons-validator/commons-validator/1.2.0/commons-validator-1.2.0.pom
Downloading from eclipse.maven.central.mirror: https://repo.eclipse.org/content/repositories/maven_central/commons-validator/commons-validator/1.2.0/commons-validator-1.2.0.pom
Progress (1): 4.1/9.1 kB
Progress (1): 7.7/9.1 kB
Progress (1): 9.1 kB    
                    
Downloaded from eclipse.maven.central.mirror: https://repo.eclipse.org/content/repositories/maven_central/commons-validator/commons-validator/1.2.0/commons-validator-1.2.0.pom (9.1 kB at 454 kB/s)
Downloading from recommenders-releases: https://repo.eclipse.org/content/repositories/recommenders-releases/xml-apis/xml-apis/2.0.2/xml-apis-2.0.2.pom
Downloading from eclipse-cbi-releases: https://repo.eclipse.org/content/groups/cbi/xml-apis/xml-apis/2.0.2/xml-apis-2.0.2.pom
Downloading from eclipse.maven.central.mirror: https://repo.eclipse.org/content/repositories/maven_central/xml-apis/xml-apis/2.0.2/xml-apis-2.0.2.pom
Progress (1): 346 B
                   
Downloaded from eclipse.maven.central.mirror: https://repo.eclipse.org/content/repositories/maven_central/xml-apis/xml-apis/2.0.2/xml-apis-2.0.2.pom (346 B at 16 kB/s)
Downloading from recommenders-releases: https://repo.eclipse.org/content/repositories/recommenders-releases/org/jacoco/org.jacoco.agent/0.7.9/org.jacoco.agent-0.7.9.pom
Downloading from eclipse-cbi-releases: https://repo.eclipse.org/content/groups/cbi/org/jacoco/org.jacoco.agent/0.7.9/org.jacoco.agent-0.7.9.pom
Downloading from eclipse.maven.central.mirror: https://repo.eclipse.org/content/repositories/maven_central/org/jacoco/org.jacoco.agent/0.7.9/org.jacoco.agent-0.7.9.pom
Progress (1): 3.5 kB
                    
Downloaded from eclipse.maven.central.mirror: https://repo.eclipse.org/content/repositories/maven_central/org/jacoco/org.jacoco.agent/0.7.9/org.jacoco.agent-0.7.9.pom (3.5 kB at 208 kB/s)
Downloading from recommenders-releases: https://repo.eclipse.org/content/repositories/recommenders-releases/org/jacoco/org.jacoco.core/0.7.9/org.jacoco.core-0.7.9.pom
Downloading from eclipse-cbi-releases: https://repo.eclipse.org/content/groups/cbi/org/jacoco/org.jacoco.core/0.7.9/org.jacoco.core-0.7.9.pom
Downloading from eclipse.maven.central.mirror: https://repo.eclipse.org/content/repositories/maven_central/org/jacoco/org.jacoco.core/0.7.9/org.jacoco.core-0.7.9.pom
Progress (1): 1.9 kB
                    
Downloaded from eclipse.maven.central.mirror: https://repo.eclipse.org/content/repositories/maven_central/org/jacoco/org.jacoco.core/0.7.9/org.jacoco.core-0.7.9.pom (1.9 kB at 105 kB/s)
Downloading from recommenders-releases: https://repo.eclipse.org/content/repositories/recommenders-releases/org/ow2/asm/asm-debug-all/5.2/asm-debug-all-5.2.pom
Downloading from eclipse-cbi-releases: https://repo.eclipse.org/content/groups/cbi/org/ow2/asm/asm-debug-all/5.2/asm-debug-all-5.2.pom
Downloading from eclipse.maven.central.mirror: https://repo.eclipse.org/content/repositories/maven_central/org/ow2/asm/asm-debug-all/5.2/asm-debug-all-5.2.pom
Progress (1): 2.0 kB
                    
Downloaded from eclipse.maven.central.mirror: https://repo.eclipse.org/content/repositories/maven_central/org/ow2/asm/asm-debug-all/5.2/asm-debug-all-5.2.pom (2.0 kB at 99 kB/s)
Downloading from recommenders-releases: https://repo.eclipse.org/content/repositories/recommenders-releases/org/ow2/asm/asm-parent/5.2/asm-parent-5.2.pom
Downloading from eclipse-cbi-releases: https://repo.eclipse.org/content/groups/cbi/org/ow2/asm/asm-parent/5.2/asm-parent-5.2.pom
Downloading from eclipse.maven.central.mirror: https://repo.eclipse.org/content/repositories/maven_central/org/ow2/asm/asm-parent/5.2/asm-parent-5.2.pom
Progress (1): 4.1/5.5 kB
Progress (1): 5.5 kB    
                    
Downloaded from eclipse.maven.central.mirror: https://repo.eclipse.org/content/repositories/maven_central/org/ow2/asm/asm-parent/5.2/asm-parent-5.2.pom (5.5 kB at 239 kB/s)
Downloading from recommenders-releases: https://repo.eclipse.org/content/repositories/recommenders-releases/org/jacoco/org.jacoco.report/0.7.9/org.jacoco.report-0.7.9.pom
Downloading from eclipse-cbi-releases: https://repo.eclipse.org/content/groups/cbi/org/jacoco/org.jacoco.report/0.7.9/org.jacoco.report-0.7.9.pom
Downloading from eclipse.maven.central.mirror: https://repo.eclipse.org/content/repositories/maven_central/org/jacoco/org.jacoco.report/0.7.9/org.jacoco.report-0.7.9.pom
Progress (1): 2.0 kB
                    
Downloaded from eclipse.maven.central.mirror: https://repo.eclipse.org/content/repositories/maven_central/org/jacoco/org.jacoco.report/0.7.9/org.jacoco.report-0.7.9.pom (2.0 kB at 119 kB/s)
Downloading from recommenders-releases: https://repo.eclipse.org/content/repositories/recommenders-releases/junit/junit/4.8.2/junit-4.8.2.jar
Downloading from recommenders-releases: https://repo.eclipse.org/content/repositories/recommenders-releases/org/apache/maven/shared/file-management/1.2.1/file-management-1.2.1.jar
Downloading from recommenders-releases: https://repo.eclipse.org/content/repositories/recommenders-releases/org/apache/maven/shared/maven-shared-io/1.1/maven-shared-io-1.1.jar
Downloading from recommenders-releases: https://repo.eclipse.org/content/repositories/recommenders-releases/org/apache/maven/wagon/wagon-provider-api/1.0-alpha-6/wagon-provider-api-1.0-alpha-6.jar
Downloading from recommenders-releases: https://repo.eclipse.org/content/repositories/recommenders-releases/org/apache/maven/reporting/maven-reporting-impl/2.1/maven-reporting-impl-2.1.jar
Downloading from recommenders-releases: https://repo.eclipse.org/content/repositories/recommenders-releases/org/apache/maven/doxia/doxia-core/1.1.2/doxia-core-1.1.2.jar
Downloading from recommenders-releases: https://repo.eclipse.org/content/repositories/recommenders-releases/xerces/xercesImpl/2.8.1/xercesImpl-2.8.1.jar
Downloading from recommenders-releases: https://repo.eclipse.org/content/repositories/recommenders-releases/commons-lang/commons-lang/2.4/commons-lang-2.4.jar
Downloading from recommenders-releases: https://repo.eclipse.org/content/repositories/recommenders-releases/commons-httpclient/commons-httpclient/3.1/commons-httpclient-3.1.jar
Downloading from recommenders-releases: https://repo.eclipse.org/content/repositories/recommenders-releases/commons-codec/commons-codec/1.2/commons-codec-1.2.jar
Downloading from recommenders-releases: https://repo.eclipse.org/content/repositories/recommenders-releases/org/apache/maven/doxia/doxia-site-renderer/1.1.2/doxia-site-renderer-1.1.2.jar
Downloading from recommenders-releases: https://repo.eclipse.org/content/repositories/recommenders-releases/org/apache/maven/doxia/doxia-decoration-model/1.1.2/doxia-decoration-model-1.1.2.jar
Downloading from recommenders-releases: https://repo.eclipse.org/content/repositories/recommenders-releases/org/apache/maven/doxia/doxia-module-xhtml/1.1.2/doxia-module-xhtml-1.1.2.jar
Downloading from recommenders-releases: https://repo.eclipse.org/content/repositories/recommenders-releases/org/apache/maven/doxia/doxia-module-fml/1.1.2/doxia-module-fml-1.1.2.jar
Downloading from recommenders-releases: https://repo.eclipse.org/content/repositories/recommenders-releases/org/codehaus/plexus/plexus-velocity/1.1.7/plexus-velocity-1.1.7.jar
Downloading from recommenders-releases: https://repo.eclipse.org/content/repositories/recommenders-releases/commons-collections/commons-collections/3.2/commons-collections-3.2.jar
Downloading from recommenders-releases: https://repo.eclipse.org/content/repositories/recommenders-releases/commons-validator/commons-validator/1.2.0/commons-validator-1.2.0.jar
Downloading from recommenders-releases: https://repo.eclipse.org/content/repositories/recommenders-releases/xml-apis/xml-apis/1.0.b2/xml-apis-1.0.b2.jar
Downloading from recommenders-releases: https://repo.eclipse.org/content/repositories/recommenders-releases/org/jacoco/org.jacoco.agent/0.7.9/org.jacoco.agent-0.7.9-runtime.jar
Downloading from recommenders-releases: https://repo.eclipse.org/content/repositories/recommenders-releases/org/jacoco/org.jacoco.core/0.7.9/org.jacoco.core-0.7.9.jar
Downloading from recommenders-releases: https://repo.eclipse.org/content/repositories/recommenders-releases/org/ow2/asm/asm-debug-all/5.2/asm-debug-all-5.2.jar
Downloading from recommenders-releases: https://repo.eclipse.org/content/repositories/recommenders-releases/org/jacoco/org.jacoco.report/0.7.9/org.jacoco.report-0.7.9.jar
Downloading from eclipse-cbi-releases: https://repo.eclipse.org/content/groups/cbi/junit/junit/4.8.2/junit-4.8.2.jar
Downloading from eclipse-cbi-releases: https://repo.eclipse.org/content/groups/cbi/org/apache/maven/shared/file-management/1.2.1/file-management-1.2.1.jar
Downloading from eclipse-cbi-releases: https://repo.eclipse.org/content/groups/cbi/org/apache/maven/shared/maven-shared-io/1.1/maven-shared-io-1.1.jar
Downloading from eclipse-cbi-releases: https://repo.eclipse.org/content/groups/cbi/org/apache/maven/wagon/wagon-provider-api/1.0-alpha-6/wagon-provider-api-1.0-alpha-6.jar
Downloading from eclipse-cbi-releases: https://repo.eclipse.org/content/groups/cbi/org/apache/maven/reporting/maven-reporting-impl/2.1/maven-reporting-impl-2.1.jar
Downloading from eclipse-cbi-releases: https://repo.eclipse.org/content/groups/cbi/org/apache/maven/doxia/doxia-core/1.1.2/doxia-core-1.1.2.jar
Downloading from eclipse-cbi-releases: https://repo.eclipse.org/content/groups/cbi/xerces/xercesImpl/2.8.1/xercesImpl-2.8.1.jar
Downloading from eclipse-cbi-releases: https://repo.eclipse.org/content/groups/cbi/commons-lang/commons-lang/2.4/commons-lang-2.4.jar
Downloading from eclipse-cbi-releases: https://repo.eclipse.org/content/groups/cbi/commons-httpclient/commons-httpclient/3.1/commons-httpclient-3.1.jar
Downloading from eclipse-cbi-releases: https://repo.eclipse.org/content/groups/cbi/commons-codec/commons-codec/1.2/commons-codec-1.2.jar
Downloading from eclipse-cbi-releases: https://repo.eclipse.org/content/groups/cbi/org/apache/maven/doxia/doxia-site-renderer/1.1.2/doxia-site-renderer-1.1.2.jar
Downloading from eclipse-cbi-releases: https://repo.eclipse.org/content/groups/cbi/org/apache/maven/doxia/doxia-decoration-model/1.1.2/doxia-decoration-model-1.1.2.jar
Downloading from eclipse-cbi-releases: https://repo.eclipse.org/content/groups/cbi/org/apache/maven/doxia/doxia-module-xhtml/1.1.2/doxia-module-xhtml-1.1.2.jar
Downloading from eclipse-cbi-releases: https://repo.eclipse.org/content/groups/cbi/org/apache/maven/doxia/doxia-module-fml/1.1.2/doxia-module-fml-1.1.2.jar
Downloading from eclipse-cbi-releases: https://repo.eclipse.org/content/groups/cbi/org/codehaus/plexus/plexus-velocity/1.1.7/plexus-velocity-1.1.7.jar
Downloading from eclipse-cbi-releases: https://repo.eclipse.org/content/groups/cbi/commons-collections/commons-collections/3.2/commons-collections-3.2.jar
Downloading from eclipse-cbi-releases: https://repo.eclipse.org/content/groups/cbi/commons-validator/commons-validator/1.2.0/commons-validator-1.2.0.jar
Downloading from eclipse-cbi-releases: https://repo.eclipse.org/content/groups/cbi/xml-apis/xml-apis/1.0.b2/xml-apis-1.0.b2.jar
Downloading from eclipse-cbi-releases: https://repo.eclipse.org/content/groups/cbi/org/jacoco/org.jacoco.agent/0.7.9/org.jacoco.agent-0.7.9-runtime.jar
Downloading from eclipse-cbi-releases: https://repo.eclipse.org/content/groups/cbi/org/jacoco/org.jacoco.core/0.7.9/org.jacoco.core-0.7.9.jar
Downloading from eclipse-cbi-releases: https://repo.eclipse.org/content/groups/cbi/org/ow2/asm/asm-debug-all/5.2/asm-debug-all-5.2.jar
Downloading from eclipse-cbi-releases: https://repo.eclipse.org/content/groups/cbi/org/jacoco/org.jacoco.report/0.7.9/org.jacoco.report-0.7.9.jar
Downloading from eclipse.maven.central.mirror: https://repo.eclipse.org/content/repositories/maven_central/junit/junit/4.8.2/junit-4.8.2.jar
Downloading from eclipse.maven.central.mirror: https://repo.eclipse.org/content/repositories/maven_central/org/apache/maven/shared/file-management/1.2.1/file-management-1.2.1.jar
Downloading from eclipse.maven.central.mirror: https://repo.eclipse.org/content/repositories/maven_central/org/apache/maven/shared/maven-shared-io/1.1/maven-shared-io-1.1.jar
Downloading from eclipse.maven.central.mirror: https://repo.eclipse.org/content/repositories/maven_central/org/apache/maven/wagon/wagon-provider-api/1.0-alpha-6/wagon-provider-api-1.0-alpha-6.jar
Downloading from eclipse.maven.central.mirror: https://repo.eclipse.org/content/repositories/maven_central/org/apache/maven/reporting/maven-reporting-impl/2.1/maven-reporting-impl-2.1.jar
Progress (1): 4.1/38 kB
Progress (2): 4.1/38 kB | 4.1/17 kB
Progress (2): 7.7/38 kB | 4.1/17 kB
Progress (2): 7.7/38 kB | 7.7/17 kB
Progress (2): 12/38 kB | 7.7/17 kB 
Progress (2): 16/38 kB | 7.7/17 kB
Progress (2): 16/38 kB | 12/17 kB 
Progress (2): 20/38 kB | 12/17 kB
Progress (2): 20/38 kB | 16/17 kB
Progress (2): 24/38 kB | 16/17 kB
Progress (2): 24/38 kB | 17 kB   
Progress (2): 28/38 kB | 17 kB
Progress (2): 32/38 kB | 17 kB
Progress (2): 36/38 kB | 17 kB
Progress (2): 38 kB | 17 kB   
Progress (3): 38 kB | 17 kB | 4.1/39 kB
Progress (3): 38 kB | 17 kB | 7.7/39 kB
Progress (3): 38 kB | 17 kB | 12/39 kB 
Progress (3): 38 kB | 17 kB | 16/39 kB
Progress (3): 38 kB | 17 kB | 20/39 kB
Progress (3): 38 kB | 17 kB | 24/39 kB
Progress (3): 38 kB | 17 kB | 28/39 kB
Progress (4): 38 kB | 17 kB | 28/39 kB | 4.1/43 kB
Progress (4): 38 kB | 17 kB | 32/39 kB | 4.1/43 kB
Progress (4): 38 kB | 17 kB | 32/39 kB | 7.7/43 kB
Progress (4): 38 kB | 17 kB | 36/39 kB | 7.7/43 kB
Progress (4): 38 kB | 17 kB | 39 kB | 7.7/43 kB   
Progress (4): 38 kB | 17 kB | 39 kB | 12/43 kB 
Progress (4): 38 kB | 17 kB | 39 kB | 16/43 kB
Progress (4): 38 kB | 17 kB | 39 kB | 20/43 kB
Progress (4): 38 kB | 17 kB | 39 kB | 24/43 kB
Progress (4): 38 kB | 17 kB | 39 kB | 28/43 kB
Progress (4): 38 kB | 17 kB | 39 kB | 32/43 kB
Progress (4): 38 kB | 17 kB | 39 kB | 33/43 kB
Progress (4): 38 kB | 17 kB | 39 kB | 37/43 kB
Progress (4): 38 kB | 17 kB | 39 kB | 41/43 kB
Progress (4): 38 kB | 17 kB | 39 kB | 43 kB   
Progress (5): 38 kB | 17 kB | 39 kB | 43 kB | 4.1/237 kB
Progress (5): 38 kB | 17 kB | 39 kB | 43 kB | 7.7/237 kB
Progress (5): 38 kB | 17 kB | 39 kB | 43 kB | 12/237 kB 
Progress (5): 38 kB | 17 kB | 39 kB | 43 kB | 16/237 kB
Progress (5): 38 kB | 17 kB | 39 kB | 43 kB | 20/237 kB
Progress (5): 38 kB | 17 kB | 39 kB | 43 kB | 24/237 kB
Progress (5): 38 kB | 17 kB | 39 kB | 43 kB | 28/237 kB
Progress (5): 38 kB | 17 kB | 39 kB | 43 kB | 32/237 kB
Progress (5): 38 kB | 17 kB | 39 kB | 43 kB | 36/237 kB
Progress (5): 38 kB | 17 kB | 39 kB | 43 kB | 40/237 kB
Progress (5): 38 kB | 17 kB | 39 kB | 43 kB | 44/237 kB
Progress (5): 38 kB | 17 kB | 39 kB | 43 kB | 48/237 kB
Progress (5): 38 kB | 17 kB | 39 kB | 43 kB | 52/237 kB
Progress (5): 38 kB | 17 kB | 39 kB | 43 kB | 56/237 kB
Progress (5): 38 kB | 17 kB | 39 kB | 43 kB | 60/237 kB
Progress (5): 38 kB | 17 kB | 39 kB | 43 kB | 64/237 kB
Progress (5): 38 kB | 17 kB | 39 kB | 43 kB | 66/237 kB
Progress (5): 38 kB | 17 kB | 39 kB | 43 kB | 70/237 kB
Progress (5): 38 kB | 17 kB | 39 kB | 43 kB | 74/237 kB
Progress (5): 38 kB | 17 kB | 39 kB | 43 kB | 78/237 kB
Progress (5): 38 kB | 17 kB | 39 kB | 43 kB | 82/237 kB
Progress (5): 38 kB | 17 kB | 39 kB | 43 kB | 86/237 kB
Progress (5): 38 kB | 17 kB | 39 kB | 43 kB | 90/237 kB
Progress (5): 38 kB | 17 kB | 39 kB | 43 kB | 94/237 kB
Progress (5): 38 kB | 17 kB | 39 kB | 43 kB | 98/237 kB
Progress (5): 38 kB | 17 kB | 39 kB | 43 kB | 102/237 kB
Progress (5): 38 kB | 17 kB | 39 kB | 43 kB | 106/237 kB
Progress (5): 38 kB | 17 kB | 39 kB | 43 kB | 110/237 kB
Progress (5): 38 kB | 17 kB | 39 kB | 43 kB | 114/237 kB
Progress (5): 38 kB | 17 kB | 39 kB | 43 kB | 118/237 kB
Progress (5): 38 kB | 17 kB | 39 kB | 43 kB | 122/237 kB
Progress (5): 38 kB | 17 kB | 39 kB | 43 kB | 126/237 kB
Progress (5): 38 kB | 17 kB | 39 kB | 43 kB | 130/237 kB
Progress (5): 38 kB | 17 kB | 39 kB | 43 kB | 134/237 kB
Progress (5): 38 kB | 17 kB | 39 kB | 43 kB | 138/237 kB
Progress (5): 38 kB | 17 kB | 39 kB | 43 kB | 142/237 kB
Progress (5): 38 kB | 17 kB | 39 kB | 43 kB | 146/237 kB
                                                        
Downloaded from eclipse.maven.central.mirror: https://repo.eclipse.org/content/repositories/maven_central/org/apache/maven/shared/file-management/1.2.1/file-management-1.2.1.jar (38 kB at 1.3 MB/s)
Progress (4): 17 kB | 39 kB | 43 kB | 150/237 kB
                                                
Downloading from eclipse.maven.central.mirror: https://repo.eclipse.org/content/repositories/maven_central/org/apache/maven/doxia/doxia-core/1.1.2/doxia-core-1.1.2.jar
Progress (4): 17 kB | 39 kB | 43 kB | 154/237 kB
Progress (4): 17 kB | 39 kB | 43 kB | 158/237 kB
Progress (4): 17 kB | 39 kB | 43 kB | 162/237 kB
Progress (4): 17 kB | 39 kB | 43 kB | 164/237 kB
Progress (4): 17 kB | 39 kB | 43 kB | 168/237 kB
Progress (4): 17 kB | 39 kB | 43 kB | 172/237 kB
Progress (4): 17 kB | 39 kB | 43 kB | 176/237 kB
Progress (4): 17 kB | 39 kB | 43 kB | 180/237 kB
Progress (4): 17 kB | 39 kB | 43 kB | 184/237 kB
Progress (4): 17 kB | 39 kB | 43 kB | 188/237 kB
Progress (4): 17 kB | 39 kB | 43 kB | 192/237 kB
Progress (4): 17 kB | 39 kB | 43 kB | 196/237 kB
Progress (4): 17 kB | 39 kB | 43 kB | 197/237 kB
                                                
Downloaded from eclipse.maven.central.mirror: https://repo.eclipse.org/content/repositories/maven_central/org/apache/maven/reporting/maven-reporting-impl/2.1/maven-reporting-impl-2.1.jar (17 kB at 535 kB/s)
Downloading from eclipse.maven.central.mirror: https://repo.eclipse.org/content/repositories/maven_central/xerces/xercesImpl/2.8.1/xercesImpl-2.8.1.jar
Downloaded from eclipse.maven.central.mirror: https://repo.eclipse.org/content/repositories/maven_central/org/apache/maven/shared/maven-shared-io/1.1/maven-shared-io-1.1.jar (39 kB at 1.2 MB/s)
Downloading from eclipse.maven.central.mirror: https://repo.eclipse.org/content/repositories/maven_central/commons-lang/commons-lang/2.4/commons-lang-2.4.jar
Downloaded from eclipse.maven.central.mirror: https://repo.eclipse.org/content/repositories/maven_central/org/apache/maven/wagon/wagon-provider-api/1.0-alpha-6/wagon-provider-api-1.0-alpha-6.jar (43 kB at 1.3 MB/s)
Downloading from eclipse.maven.central.mirror: https://repo.eclipse.org/content/repositories/maven_central/commons-httpclient/commons-httpclient/3.1/commons-httpclient-3.1.jar
Progress (1): 201/237 kB
Progress (1): 205/237 kB
Progress (1): 209/237 kB
Progress (1): 213/237 kB
Progress (1): 217/237 kB
Progress (1): 221/237 kB
Progress (1): 225/237 kB
Progress (1): 229/237 kB
Progress (1): 233/237 kB
Progress (1): 237/237 kB
Progress (1): 237 kB    
Progress (2): 237 kB | 0/1.2 MB
                               
Downloaded from eclipse.maven.central.mirror: https://repo.eclipse.org/content/repositories/maven_central/junit/junit/4.8.2/junit-4.8.2.jar (237 kB at 5.5 MB/s)
Progress (1): 0/1.2 MB
                      
Downloading from eclipse.maven.central.mirror: https://repo.eclipse.org/content/repositories/maven_central/commons-codec/commons-codec/1.2/commons-codec-1.2.jar
Progress (2): 0/1.2 MB | 4.1/158 kB
Progress (2): 0/1.2 MB | 7.7/158 kB
Progress (2): 0/1.2 MB | 7.7/158 kB
Progress (2): 0/1.2 MB | 7.7/158 kB
Progress (2): 0/1.2 MB | 12/158 kB 
Progress (2): 0/1.2 MB | 16/158 kB
Progress (2): 0/1.2 MB | 16/158 kB
Progress (2): 0/1.2 MB | 20/158 kB
Progress (2): 0/1.2 MB | 20/158 kB
Progress (2): 0/1.2 MB | 24/158 kB
Progress (2): 0/1.2 MB | 28/158 kB
Progress (2): 0/1.2 MB | 28/158 kB
Progress (2): 0/1.2 MB | 32/158 kB
Progress (2): 0/1.2 MB | 32/158 kB
Progress (2): 0/1.2 MB | 36/158 kB
Progress (2): 0/1.2 MB | 36/158 kB
Progress (2): 0/1.2 MB | 40/158 kB
Progress (2): 0/1.2 MB | 44/158 kB
Progress (2): 0/1.2 MB | 44/158 kB
Progress (2): 0/1.2 MB | 48/158 kB
Progress (2): 0/1.2 MB | 48/158 kB
Progress (2): 0/1.2 MB | 52/158 kB
Progress (2): 0/1.2 MB | 56/158 kB
Progress (2): 0/1.2 MB | 56/158 kB
Progress (2): 0/1.2 MB | 56/158 kB
Progress (2): 0/1.2 MB | 60/158 kB
Progress (2): 0/1.2 MB | 64/158 kB
Progress (2): 0.1/1.2 MB | 64/158 kB
Progress (2): 0.1/1.2 MB | 68/158 kB
Progress (2): 0.1/1.2 MB | 68/158 kB
Progress (2): 0.1/1.2 MB | 72/158 kB
Progress (2): 0.1/1.2 MB | 76/158 kB
Progress (2): 0.1/1.2 MB | 76/158 kB
Progress (2): 0.1/1.2 MB | 80/158 kB
Progress (2): 0.1/1.2 MB | 80/158 kB
Progress (2): 0.1/1.2 MB | 84/158 kB
Progress (2): 0.1/1.2 MB | 84/158 kB
Progress (2): 0.1/1.2 MB | 88/158 kB
Progress (2): 0.1/1.2 MB | 92/158 kB
Progress (2): 0.1/1.2 MB | 92/158 kB
Progress (2): 0.1/1.2 MB | 96/158 kB
Progress (2): 0.1/1.2 MB | 96/158 kB
Progress (2): 0.1/1.2 MB | 100/158 kB
Progress (2): 0.1/1.2 MB | 104/158 kB
Progress (2): 0.1/1.2 MB | 104/158 kB
Progress (2): 0.1/1.2 MB | 104/158 kB
Progress (2): 0.1/1.2 MB | 108/158 kB
Progress (2): 0.1/1.2 MB | 112/158 kB
Progress (2): 0.1/1.2 MB | 112/158 kB
Progress (2): 0.1/1.2 MB | 116/158 kB
Progress (2): 0.1/1.2 MB | 116/158 kB
Progress (2): 0.1/1.2 MB | 120/158 kB
Progress (2): 0.1/1.2 MB | 124/158 kB
Progress (2): 0.1/1.2 MB | 124/158 kB
Progress (2): 0.1/1.2 MB | 128/158 kB
Progress (3): 0.1/1.2 MB | 128/158 kB | 4.1/305 kB
Progress (3): 0.1/1.2 MB | 128/158 kB | 4.1/305 kB
Progress (3): 0.1/1.2 MB | 128/158 kB | 7.7/305 kB
Progress (3): 0.1/1.2 MB | 132/158 kB | 7.7/305 kB
Progress (4): 0.1/1.2 MB | 132/158 kB | 7.7/305 kB | 4.1/262 kB
Progress (4): 0.1/1.2 MB | 136/158 kB | 7.7/305 kB | 4.1/262 kB
Progress (4): 0.1/1.2 MB | 136/158 kB | 7.7/305 kB | 4.1/262 kB
Progress (4): 0.1/1.2 MB | 136/158 kB | 12/305 kB | 4.1/262 kB 
Progress (4): 0.1/1.2 MB | 136/158 kB | 12/305 kB | 4.1/262 kB
Progress (4): 0.1/1.2 MB | 136/158 kB | 12/305 kB | 7.7/262 kB
Progress (4): 0.1/1.2 MB | 136/158 kB | 16/305 kB | 7.7/262 kB
Progress (4): 0.1/1.2 MB | 140/158 kB | 16/305 kB | 7.7/262 kB
Progress (4): 0.1/1.2 MB | 140/158 kB | 16/305 kB | 7.7/262 kB
Progress (4): 0.1/1.2 MB | 144/158 kB | 16/305 kB | 7.7/262 kB
Progress (4): 0.1/1.2 MB | 144/158 kB | 20/305 kB | 7.7/262 kB
Progress (4): 0.1/1.2 MB | 144/158 kB | 20/305 kB | 12/262 kB 
Progress (4): 0.1/1.2 MB | 144/158 kB | 20/305 kB | 12/262 kB
Progress (4): 0.1/1.2 MB | 144/158 kB | 24/305 kB | 12/262 kB
Progress (4): 0.1/1.2 MB | 148/158 kB | 24/305 kB | 12/262 kB
Progress (4): 0.1/1.2 MB | 148/158 kB | 24/305 kB | 16/262 kB
Progress (4): 0.1/1.2 MB | 152/158 kB | 24/305 kB | 16/262 kB
Progress (4): 0.1/1.2 MB | 152/158 kB | 28/305 kB | 16/262 kB
Progress (4): 0.1/1.2 MB | 152/158 kB | 28/305 kB | 16/262 kB
Progress (4): 0.1/1.2 MB | 152/158 kB | 32/305 kB | 16/262 kB
Progress (4): 0.1/1.2 MB | 152/158 kB | 32/305 kB | 20/262 kB
Progress (4): 0.1/1.2 MB | 152/158 kB | 33/305 kB | 20/262 kB
Progress (4): 0.1/1.2 MB | 152/158 kB | 33/305 kB | 20/262 kB
Progress (4): 0.1/1.2 MB | 156/158 kB | 33/305 kB | 20/262 kB
Progress (4): 0.1/1.2 MB | 156/158 kB | 33/305 kB | 24/262 kB
Progress (4): 0.1/1.2 MB | 156/158 kB | 37/305 kB | 24/262 kB
Progress (4): 0.1/1.2 MB | 158 kB | 37/305 kB | 24/262 kB    
Progress (4): 0.1/1.2 MB | 158 kB | 41/305 kB | 24/262 kB
Progress (4): 0.1/1.2 MB | 158 kB | 41/305 kB | 24/262 kB
Progress (4): 0.1/1.2 MB | 158 kB | 41/305 kB | 28/262 kB
Progress (4): 0.1/1.2 MB | 158 kB | 45/305 kB | 28/262 kB
Progress (4): 0.1/1.2 MB | 158 kB | 45/305 kB | 28/262 kB
Progress (4): 0.1/1.2 MB | 158 kB | 49/305 kB | 28/262 kB
Progress (4): 0.1/1.2 MB | 158 kB | 49/305 kB | 32/262 kB
Progress (4): 0.1/1.2 MB | 158 kB | 49/305 kB | 32/262 kB
Progress (4): 0.1/1.2 MB | 158 kB | 53/305 kB | 32/262 kB
Progress (4): 0.1/1.2 MB | 158 kB | 53/305 kB | 33/262 kB
Progress (4): 0.1/1.2 MB | 158 kB | 57/305 kB | 33/262 kB
Progress (4): 0.1/1.2 MB | 158 kB | 57/305 kB | 33/262 kB
Progress (4): 0.1/1.2 MB | 158 kB | 57/305 kB | 33/262 kB
Progress (4): 0.1/1.2 MB | 158 kB | 61/305 kB | 33/262 kB
Progress (4): 0.1/1.2 MB | 158 kB | 61/305 kB | 37/262 kB
Progress (4): 0.1/1.2 MB | 158 kB | 65/305 kB | 37/262 kB
Progress (4): 0.1/1.2 MB | 158 kB | 65/305 kB | 41/262 kB
Progress (4): 0.1/1.2 MB | 158 kB | 65/305 kB | 41/262 kB
Progress (4): 0.1/1.2 MB | 158 kB | 66/305 kB | 41/262 kB
Progress (4): 0.1/1.2 MB | 158 kB | 66/305 kB | 41/262 kB
Progress (4): 0.1/1.2 MB | 158 kB | 66/305 kB | 45/262 kB
Progress (4): 0.1/1.2 MB | 158 kB | 70/305 kB | 45/262 kB
Progress (4): 0.1/1.2 MB | 158 kB | 70/305 kB | 49/262 kB
Progress (4): 0.1/1.2 MB | 158 kB | 74/305 kB | 49/262 kB
Progress (4): 0.2/1.2 MB | 158 kB | 74/305 kB | 49/262 kB
Progress (4): 0.2/1.2 MB | 158 kB | 74/305 kB | 49/262 kB
Progress (4): 0.2/1.2 MB | 158 kB | 74/305 kB | 53/262 kB
Progress (4): 0.2/1.2 MB | 158 kB | 78/305 kB | 53/262 kB
Progress (4): 0.2/1.2 MB | 158 kB | 78/305 kB | 57/262 kB
Progress (4): 0.2/1.2 MB | 158 kB | 82/305 kB | 57/262 kB
Progress (4): 0.2/1.2 MB | 158 kB | 82/305 kB | 57/262 kB
Progress (4): 0.2/1.2 MB | 158 kB | 82/305 kB | 57/262 kB
Progress (4): 0.2/1.2 MB | 158 kB | 86/305 kB | 57/262 kB
Progress (4): 0.2/1.2 MB | 158 kB | 86/305 kB | 61/262 kB
Progress (4): 0.2/1.2 MB | 158 kB | 90/305 kB | 61/262 kB
Progress (4): 0.2/1.2 MB | 158 kB | 90/305 kB | 65/262 kB
Progress (4): 0.2/1.2 MB | 158 kB | 90/305 kB | 65/262 kB
Progress (4): 0.2/1.2 MB | 158 kB | 90/305 kB | 66/262 kB
Progress (4): 0.2/1.2 MB | 158 kB | 94/305 kB | 66/262 kB
Progress (4): 0.2/1.2 MB | 158 kB | 94/305 kB | 66/262 kB
Progress (4): 0.2/1.2 MB | 158 kB | 98/305 kB | 66/262 kB
Progress (4): 0.2/1.2 MB | 158 kB | 98/305 kB | 70/262 kB
Progress (4): 0.2/1.2 MB | 158 kB | 98/305 kB | 74/262 kB
Progress (4): 0.2/1.2 MB | 158 kB | 98/305 kB | 74/262 kB
Progress (4): 0.2/1.2 MB | 158 kB | 102/305 kB | 74/262 kB
Progress (4): 0.2/1.2 MB | 158 kB | 102/305 kB | 74/262 kB
Progress (4): 0.2/1.2 MB | 158 kB | 102/305 kB | 78/262 kB
Progress (4): 0.2/1.2 MB | 158 kB | 106/305 kB | 78/262 kB
Progress (4): 0.2/1.2 MB | 158 kB | 106/305 kB | 82/262 kB
Progress (4): 0.2/1.2 MB | 158 kB | 106/305 kB | 82/262 kB
Progress (4): 0.2/1.2 MB | 158 kB | 110/305 kB | 82/262 kB
Progress (4): 0.2/1.2 MB | 158 kB | 110/305 kB | 82/262 kB
Progress (4): 0.2/1.2 MB | 158 kB | 110/305 kB | 86/262 kB
Progress (5): 0.2/1.2 MB | 158 kB | 110/305 kB | 86/262 kB | 4.1/30 kB
Progress (5): 0.2/1.2 MB | 158 kB | 110/305 kB | 90/262 kB | 4.1/30 kB
Progress (5): 0.2/1.2 MB | 158 kB | 114/305 kB | 90/262 kB | 4.1/30 kB
Progress (5): 0.2/1.2 MB | 158 kB | 114/305 kB | 90/262 kB | 4.1/30 kB
Progress (5): 0.2/1.2 MB | 158 kB | 114/305 kB | 90/262 kB | 7.7/30 kB
Progress (5): 0.2/1.2 MB | 158 kB | 114/305 kB | 94/262 kB | 7.7/30 kB
Progress (5): 0.2/1.2 MB | 158 kB | 118/305 kB | 94/262 kB | 7.7/30 kB
Progress (5): 0.2/1.2 MB | 158 kB | 118/305 kB | 94/262 kB | 7.7/30 kB
Progress (5): 0.2/1.2 MB | 158 kB | 118/305 kB | 98/262 kB | 7.7/30 kB
Progress (5): 0.2/1.2 MB | 158 kB | 118/305 kB | 98/262 kB | 12/30 kB 
Progress (5): 0.2/1.2 MB | 158 kB | 122/305 kB | 98/262 kB | 12/30 kB
Progress (5): 0.2/1.2 MB | 158 kB | 122/305 kB | 98/262 kB | 12/30 kB
Progress (5): 0.2/1.2 MB | 158 kB | 122/305 kB | 98/262 kB | 16/30 kB
Progress (5): 0.2/1.2 MB | 158 kB | 122/305 kB | 102/262 kB | 16/30 kB
Progress (5): 0.2/1.2 MB | 158 kB | 126/305 kB | 102/262 kB | 16/30 kB
Progress (5): 0.2/1.2 MB | 158 kB | 126/305 kB | 102/262 kB | 16/30 kB
Progress (5): 0.2/1.2 MB | 158 kB | 130/305 kB | 102/262 kB | 16/30 kB
Progress (5): 0.2/1.2 MB | 158 kB | 130/305 kB | 102/262 kB | 20/30 kB
Progress (5): 0.2/1.2 MB | 158 kB | 130/305 kB | 106/262 kB | 20/30 kB
Progress (5): 0.2/1.2 MB | 158 kB | 130/305 kB | 106/262 kB | 20/30 kB
Progress (5): 0.2/1.2 MB | 158 kB | 130/305 kB | 106/262 kB | 24/30 kB
Progress (5): 0.2/1.2 MB | 158 kB | 134/305 kB | 106/262 kB | 24/30 kB
Progress (5): 0.2/1.2 MB | 158 kB | 134/305 kB | 106/262 kB | 24/30 kB
Progress (5): 0.2/1.2 MB | 158 kB | 134/305 kB | 110/262 kB | 24/30 kB
Progress (5): 0.2/1.2 MB | 158 kB | 134/305 kB | 110/262 kB | 28/30 kB
Progress (5): 0.2/1.2 MB | 158 kB | 138/305 kB | 110/262 kB | 28/30 kB
Progress (5): 0.2/1.2 MB | 158 kB | 138/305 kB | 114/262 kB | 28/30 kB
Progress (5): 0.2/1.2 MB | 158 kB | 138/305 kB | 114/262 kB | 28/30 kB
Progress (5): 0.2/1.2 MB | 158 kB | 138/305 kB | 114/262 kB | 30 kB   
Progress (5): 0.2/1.2 MB | 158 kB | 142/305 kB | 114/262 kB | 30 kB
Progress (5): 0.2/1.2 MB | 158 kB | 142/305 kB | 114/262 kB | 30 kB
Progress (5): 0.2/1.2 MB | 158 kB | 142/305 kB | 118/262 kB | 30 kB
Progress (5): 0.2/1.2 MB | 158 kB | 146/305 kB | 118/262 kB | 30 kB
Progress (5): 0.2/1.2 MB | 158 kB | 146/305 kB | 122/262 kB | 30 kB
Progress (5): 0.2/1.2 MB | 158 kB | 146/305 kB | 122/262 kB | 30 kB
Progress (5): 0.2/1.2 MB | 158 kB | 150/305 kB | 122/262 kB | 30 kB
Progress (5): 0.2/1.2 MB | 158 kB | 150/305 kB | 122/262 kB | 30 kB
Progress (5): 0.2/1.2 MB | 158 kB | 154/305 kB | 122/262 kB | 30 kB
Progress (5): 0.2/1.2 MB | 158 kB | 154/305 kB | 126/262 kB | 30 kB
Progress (5): 0.2/1.2 MB | 158 kB | 154/305 kB | 130/262 kB | 30 kB
Progress (5): 0.2/1.2 MB | 158 kB | 158/305 kB | 130/262 kB | 30 kB
Progress (5): 0.2/1.2 MB | 158 kB | 158/305 kB | 130/262 kB | 30 kB
Progress (5): 0.2/1.2 MB | 158 kB | 162/305 kB | 130/262 kB | 30 kB
Progress (5): 0.2/1.2 MB | 158 kB | 162/305 kB | 131/262 kB | 30 kB
Progress (5): 0.2/1.2 MB | 158 kB | 162/305 kB | 131/262 kB | 30 kB
Progress (5): 0.2/1.2 MB | 158 kB | 166/305 kB | 131/262 kB | 30 kB
Progress (5): 0.2/1.2 MB | 158 kB | 166/305 kB | 135/262 kB | 30 kB
Progress (5): 0.2/1.2 MB | 158 kB | 170/305 kB | 135/262 kB | 30 kB
Progress (5): 0.2/1.2 MB | 158 kB | 170/305 kB | 139/262 kB | 30 kB
Progress (5): 0.2/1.2 MB | 158 kB | 170/305 kB | 139/262 kB | 30 kB
Progress (5): 0.2/1.2 MB | 158 kB | 174/305 kB | 139/262 kB | 30 kB
Progress (5): 0.2/1.2 MB | 158 kB | 174/305 kB | 139/262 kB | 30 kB
Progress (5): 0.2/1.2 MB | 158 kB | 174/305 kB | 143/262 kB | 30 kB
Progress (5): 0.2/1.2 MB | 158 kB | 178/305 kB | 143/262 kB | 30 kB
Progress (5): 0.2/1.2 MB | 158 kB | 178/305 kB | 147/262 kB | 30 kB
Progress (5): 0.2/1.2 MB | 158 kB | 178/305 kB | 147/262 kB | 30 kB
Progress (5): 0.2/1.2 MB | 158 kB | 182/305 kB | 147/262 kB | 30 kB
Progress (5): 0.3/1.2 MB | 158 kB | 182/305 kB | 147/262 kB | 30 kB
Progress (5): 0.3/1.2 MB | 158 kB | 186/305 kB | 147/262 kB | 30 kB
Progress (5): 0.3/1.2 MB | 158 kB | 186/305 kB | 151/262 kB | 30 kB
Progress (5): 0.3/1.2 MB | 158 kB | 186/305 kB | 151/262 kB | 30 kB
Progress (5): 0.3/1.2 MB | 158 kB | 190/305 kB | 151/262 kB | 30 kB
                                                                   
Downloaded from eclipse.maven.central.mirror: https://repo.eclipse.org/content/repositories/maven_central/org/apache/maven/doxia/doxia-core/1.1.2/doxia-core-1.1.2.jar (158 kB at 2.8 MB/s)
Progress (4): 0.3/1.2 MB | 190/305 kB | 155/262 kB | 30 kB
                                                          
Downloading from eclipse.maven.central.mirror: https://repo.eclipse.org/content/repositories/maven_central/org/apache/maven/doxia/doxia-site-renderer/1.1.2/doxia-site-renderer-1.1.2.jar
Progress (4): 0.3/1.2 MB | 194/305 kB | 155/262 kB | 30 kB
Progress (4): 0.3/1.2 MB | 194/305 kB | 155/262 kB | 30 kB
Progress (4): 0.3/1.2 MB | 197/305 kB | 155/262 kB | 30 kB
Progress (4): 0.3/1.2 MB | 197/305 kB | 159/262 kB | 30 kB
Progress (4): 0.3/1.2 MB | 197/305 kB | 159/262 kB | 30 kB
Progress (4): 0.3/1.2 MB | 197/305 kB | 163/262 kB | 30 kB
Progress (4): 0.3/1.2 MB | 197/305 kB | 163/262 kB | 30 kB
Progress (4): 0.3/1.2 MB | 201/305 kB | 163/262 kB | 30 kB
Progress (4): 0.3/1.2 MB | 205/305 kB | 163/262 kB | 30 kB
Progress (4): 0.3/1.2 MB | 205/305 kB | 167/262 kB | 30 kB
Progress (4): 0.3/1.2 MB | 205/305 kB | 167/262 kB | 30 kB
Progress (4): 0.3/1.2 MB | 205/305 kB | 171/262 kB | 30 kB
Progress (4): 0.3/1.2 MB | 205/305 kB | 171/262 kB | 30 kB
Progress (4): 0.3/1.2 MB | 209/305 kB | 171/262 kB | 30 kB
Progress (4): 0.3/1.2 MB | 213/305 kB | 171/262 kB | 30 kB
Progress (4): 0.3/1.2 MB | 213/305 kB | 175/262 kB | 30 kB
Progress (4): 0.3/1.2 MB | 213/305 kB | 175/262 kB | 30 kB
Progress (4): 0.3/1.2 MB | 213/305 kB | 179/262 kB | 30 kB
Progress (4): 0.3/1.2 MB | 217/305 kB | 179/262 kB | 30 kB
Progress (4): 0.3/1.2 MB | 217/305 kB | 179/262 kB | 30 kB
Progress (4): 0.3/1.2 MB | 221/305 kB | 179/262 kB | 30 kB
Progress (4): 0.3/1.2 MB | 221/305 kB | 183/262 kB | 30 kB
Progress (4): 0.3/1.2 MB | 221/305 kB | 187/262 kB | 30 kB
Progress (4): 0.3/1.2 MB | 221/305 kB | 187/262 kB | 30 kB
Progress (4): 0.3/1.2 MB | 225/305 kB | 187/262 kB | 30 kB
Progress (4): 0.3/1.2 MB | 225/305 kB | 191/262 kB | 30 kB
Progress (4): 0.3/1.2 MB | 225/305 kB | 191/262 kB | 30 kB
Progress (4): 0.3/1.2 MB | 229/305 kB | 191/262 kB | 30 kB
Progress (4): 0.3/1.2 MB | 229/305 kB | 195/262 kB | 30 kB
Progress (4): 0.3/1.2 MB | 229/305 kB | 195/262 kB | 30 kB
Progress (4): 0.3/1.2 MB | 229/305 kB | 195/262 kB | 30 kB
Progress (4): 0.3/1.2 MB | 229/305 kB | 195/262 kB | 30 kB
Progress (4): 0.3/1.2 MB | 229/305 kB | 199/262 kB | 30 kB
Progress (4): 0.3/1.2 MB | 229/305 kB | 203/262 kB | 30 kB
Progress (4): 0.3/1.2 MB | 229/305 kB | 203/262 kB | 30 kB
Progress (4): 0.3/1.2 MB | 229/305 kB | 203/262 kB | 30 kB
Progress (4): 0.3/1.2 MB | 229/305 kB | 207/262 kB | 30 kB
Progress (4): 0.3/1.2 MB | 229/305 kB | 211/262 kB | 30 kB
Progress (4): 0.3/1.2 MB | 229/305 kB | 211/262 kB | 30 kB
Progress (4): 0.3/1.2 MB | 229/305 kB | 211/262 kB | 30 kB
Progress (4): 0.3/1.2 MB | 229/305 kB | 215/262 kB | 30 kB
Progress (4): 0.3/1.2 MB | 229/305 kB | 219/262 kB | 30 kB
Progress (4): 0.3/1.2 MB | 229/305 kB | 219/262 kB | 30 kB
Progress (4): 0.3/1.2 MB | 229/305 kB | 219/262 kB | 30 kB
Progress (4): 0.3/1.2 MB | 229/305 kB | 223/262 kB | 30 kB
Progress (4): 0.3/1.2 MB | 229/305 kB | 227/262 kB | 30 kB
Progress (4): 0.3/1.2 MB | 229/305 kB | 227/262 kB | 30 kB
Progress (4): 0.3/1.2 MB | 229/305 kB | 227/262 kB | 30 kB
Progress (4): 0.3/1.2 MB | 229/305 kB | 231/262 kB | 30 kB
Progress (4): 0.3/1.2 MB | 229/305 kB | 235/262 kB | 30 kB
Progress (4): 0.3/1.2 MB | 229/305 kB | 235/262 kB | 30 kB
Progress (4): 0.3/1.2 MB | 229/305 kB | 235/262 kB | 30 kB
Progress (4): 0.3/1.2 MB | 229/305 kB | 239/262 kB | 30 kB
Progress (4): 0.3/1.2 MB | 229/305 kB | 243/262 kB | 30 kB
Progress (4): 0.3/1.2 MB | 229/305 kB | 243/262 kB | 30 kB
Progress (4): 0.3/1.2 MB | 229/305 kB | 243/262 kB | 30 kB
Progress (4): 0.3/1.2 MB | 229/305 kB | 247/262 kB | 30 kB
Progress (4): 0.3/1.2 MB | 229/305 kB | 251/262 kB | 30 kB
Progress (4): 0.4/1.2 MB | 229/305 kB | 251/262 kB | 30 kB
Progress (4): 0.4/1.2 MB | 229/305 kB | 251/262 kB | 30 kB
Progress (4): 0.4/1.2 MB | 229/305 kB | 255/262 kB | 30 kB
Progress (4): 0.4/1.2 MB | 229/305 kB | 259/262 kB | 30 kB
Progress (4): 0.4/1.2 MB | 229/305 kB | 259/262 kB | 30 kB
Progress (4): 0.4/1.2 MB | 229/305 kB | 262 kB | 30 kB    
Progress (4): 0.4/1.2 MB | 229/305 kB | 262 kB | 30 kB
Progress (4): 0.4/1.2 MB | 233/305 kB | 262 kB | 30 kB
Progress (4): 0.4/1.2 MB | 233/305 kB | 262 kB | 30 kB
Progress (4): 0.4/1.2 MB | 237/305 kB | 262 kB | 30 kB
Progress (4): 0.4/1.2 MB | 237/305 kB | 262 kB | 30 kB
Progress (4): 0.4/1.2 MB | 241/305 kB | 262 kB | 30 kB
Progress (4): 0.4/1.2 MB | 241/305 kB | 262 kB | 30 kB
Progress (4): 0.4/1.2 MB | 245/305 kB | 262 kB | 30 kB
Progress (4): 0.4/1.2 MB | 245/305 kB | 262 kB | 30 kB
Progress (4): 0.4/1.2 MB | 249/305 kB | 262 kB | 30 kB
Progress (4): 0.4/1.2 MB | 249/305 kB | 262 kB | 30 kB
Progress (4): 0.4/1.2 MB | 253/305 kB | 262 kB | 30 kB
Progress (4): 0.4/1.2 MB | 253/305 kB | 262 kB | 30 kB
Progress (4): 0.4/1.2 MB | 257/305 kB | 262 kB | 30 kB
Progress (4): 0.4/1.2 MB | 257/305 kB | 262 kB | 30 kB
Progress (4): 0.4/1.2 MB | 261/305 kB | 262 kB | 30 kB
Progress (4): 0.4/1.2 MB | 261/305 kB | 262 kB | 30 kB
Progress (4): 0.4/1.2 MB | 262/305 kB | 262 kB | 30 kB
Progress (4): 0.4/1.2 MB | 262/305 kB | 262 kB | 30 kB
Progress (4): 0.4/1.2 MB | 266/305 kB | 262 kB | 30 kB
Progress (4): 0.4/1.2 MB | 266/305 kB | 262 kB | 30 kB
Progress (4): 0.4/1.2 MB | 270/305 kB | 262 kB | 30 kB
Progress (4): 0.4/1.2 MB | 270/305 kB | 262 kB | 30 kB
Progress (4): 0.4/1.2 MB | 274/305 kB | 262 kB | 30 kB
Progress (4): 0.4/1.2 MB | 274/305 kB | 262 kB | 30 kB
Progress (4): 0.4/1.2 MB | 278/305 kB | 262 kB | 30 kB
Progress (4): 0.4/1.2 MB | 278/305 kB | 262 kB | 30 kB
Progress (4): 0.4/1.2 MB | 282/305 kB | 262 kB | 30 kB
Progress (4): 0.4/1.2 MB | 282/305 kB | 262 kB | 30 kB
Progress (4): 0.4/1.2 MB | 286/305 kB | 262 kB | 30 kB
Progress (4): 0.4/1.2 MB | 286/305 kB | 262 kB | 30 kB
Progress (4): 0.4/1.2 MB | 290/305 kB | 262 kB | 30 kB
Progress (4): 0.4/1.2 MB | 290/305 kB | 262 kB | 30 kB
Progress (4): 0.4/1.2 MB | 294/305 kB | 262 kB | 30 kB
Progress (4): 0.4/1.2 MB | 294/305 kB | 262 kB | 30 kB
Progress (4): 0.4/1.2 MB | 298/305 kB | 262 kB | 30 kB
Progress (4): 0.4/1.2 MB | 298/305 kB | 262 kB | 30 kB
Progress (4): 0.4/1.2 MB | 302/305 kB | 262 kB | 30 kB
Progress (4): 0.4/1.2 MB | 305 kB | 262 kB | 30 kB    
Progress (4): 0.4/1.2 MB | 305 kB | 262 kB | 30 kB
Progress (4): 0.4/1.2 MB | 305 kB | 262 kB | 30 kB
Progress (4): 0.4/1.2 MB | 305 kB | 262 kB | 30 kB
Progress (4): 0.5/1.2 MB | 305 kB | 262 kB | 30 kB
Progress (4): 0.5/1.2 MB | 305 kB | 262 kB | 30 kB
Progress (4): 0.5/1.2 MB | 305 kB | 262 kB | 30 kB
Progress (4): 0.5/1.2 MB | 305 kB | 262 kB | 30 kB
Progress (4): 0.5/1.2 MB | 305 kB | 262 kB | 30 kB
Progress (4): 0.5/1.2 MB | 305 kB | 262 kB | 30 kB
Progress (4): 0.5/1.2 MB | 305 kB | 262 kB | 30 kB
                                                  
Downloaded from eclipse.maven.central.mirror: https://repo.eclipse.org/content/repositories/maven_central/commons-codec/commons-codec/1.2/commons-codec-1.2.jar (30 kB at 470 kB/s)
Progress (3): 0.5/1.2 MB | 305 kB | 262 kB
                                          
Downloading from eclipse.maven.central.mirror: https://repo.eclipse.org/content/repositories/maven_central/org/apache/maven/doxia/doxia-decoration-model/1.1.2/doxia-decoration-model-1.1.2.jar
Progress (3): 0.5/1.2 MB | 305 kB | 262 kB
Progress (3): 0.5/1.2 MB | 305 kB | 262 kB
Progress (3): 0.5/1.2 MB | 305 kB | 262 kB
Progress (3): 0.5/1.2 MB | 305 kB | 262 kB
Progress (3): 0.5/1.2 MB | 305 kB | 262 kB
Progress (3): 0.5/1.2 MB | 305 kB | 262 kB
Progress (3): 0.5/1.2 MB | 305 kB | 262 kB
Progress (3): 0.5/1.2 MB | 305 kB | 262 kB
Progress (3): 0.5/1.2 MB | 305 kB | 262 kB
Progress (3): 0.5/1.2 MB | 305 kB | 262 kB
Progress (3): 0.5/1.2 MB | 305 kB | 262 kB
Progress (3): 0.5/1.2 MB | 305 kB | 262 kB
Progress (3): 0.5/1.2 MB | 305 kB | 262 kB
Progress (3): 0.5/1.2 MB | 305 kB | 262 kB
Progress (3): 0.5/1.2 MB | 305 kB | 262 kB
Progress (3): 0.5/1.2 MB | 305 kB | 262 kB
Progress (3): 0.5/1.2 MB | 305 kB | 262 kB
Progress (3): 0.6/1.2 MB | 305 kB | 262 kB
Progress (3): 0.6/1.2 MB | 305 kB | 262 kB
Progress (3): 0.6/1.2 MB | 305 kB | 262 kB
                                          
Downloaded from eclipse.maven.central.mirror: https://repo.eclipse.org/content/repositories/maven_central/commons-lang/commons-lang/2.4/commons-lang-2.4.jar (262 kB at 3.9 MB/s)
Progress (2): 0.6/1.2 MB | 305 kB
                                 
Downloading from eclipse.maven.central.mirror: https://repo.eclipse.org/content/repositories/maven_central/org/apache/maven/doxia/doxia-module-xhtml/1.1.2/doxia-module-xhtml-1.1.2.jar
Progress (2): 0.6/1.2 MB | 305 kB
Progress (2): 0.6/1.2 MB | 305 kB
                                 
Downloaded from eclipse.maven.central.mirror: https://repo.eclipse.org/content/repositories/maven_central/commons-httpclient/commons-httpclient/3.1/commons-httpclient-3.1.jar (305 kB at 4.5 MB/s)
Progress (1): 0.6/1.2 MB
                        
Downloading from eclipse.maven.central.mirror: https://repo.eclipse.org/content/repositories/maven_central/org/apache/maven/doxia/doxia-module-fml/1.1.2/doxia-module-fml-1.1.2.jar
Progress (1): 0.6/1.2 MB
Progress (1): 0.6/1.2 MB
Progress (1): 0.6/1.2 MB
Progress (1): 0.6/1.2 MB
Progress (1): 0.6/1.2 MB
Progress (1): 0.6/1.2 MB
Progress (1): 0.6/1.2 MB
Progress (1): 0.6/1.2 MB
Progress (1): 0.6/1.2 MB
Progress (2): 0.6/1.2 MB | 4.1/50 kB
Progress (2): 0.6/1.2 MB | 4.1/50 kB
Progress (2): 0.6/1.2 MB | 4.1/50 kB
Progress (2): 0.6/1.2 MB | 7.7/50 kB
Progress (2): 0.6/1.2 MB | 7.7/50 kB
Progress (2): 0.6/1.2 MB | 7.7/50 kB
Progress (2): 0.6/1.2 MB | 7.7/50 kB
Progress (2): 0.6/1.2 MB | 7.7/50 kB
Progress (2): 0.6/1.2 MB | 12/50 kB 
Progress (2): 0.6/1.2 MB | 12/50 kB
Progress (2): 0.6/1.2 MB | 16/50 kB
Progress (2): 0.6/1.2 MB | 16/50 kB
Progress (2): 0.6/1.2 MB | 16/50 kB
Progress (2): 0.6/1.2 MB | 20/50 kB
Progress (2): 0.7/1.2 MB | 20/50 kB
Progress (2): 0.7/1.2 MB | 24/50 kB
Progress (2): 0.7/1.2 MB | 24/50 kB
Progress (2): 0.7/1.2 MB | 28/50 kB
Progress (2): 0.7/1.2 MB | 28/50 kB
Progress (2): 0.7/1.2 MB | 32/50 kB
Progress (2): 0.7/1.2 MB | 33/50 kB
Progress (2): 0.7/1.2 MB | 33/50 kB
Progress (2): 0.7/1.2 MB | 33/50 kB
Progress (2): 0.7/1.2 MB | 37/50 kB
Progress (2): 0.7/1.2 MB | 41/50 kB
Progress (2): 0.7/1.2 MB | 41/50 kB
Progress (2): 0.7/1.2 MB | 41/50 kB
Progress (2): 0.7/1.2 MB | 45/50 kB
Progress (2): 0.7/1.2 MB | 49/50 kB
Progress (2): 0.7/1.2 MB | 49/50 kB
Progress (2): 0.7/1.2 MB | 50 kB   
Progress (2): 0.7/1.2 MB | 50 kB
Progress (3): 0.7/1.2 MB | 50 kB | 4.1/52 kB
Progress (3): 0.7/1.2 MB | 50 kB | 4.1/52 kB
Progress (3): 0.7/1.2 MB | 50 kB | 7.7/52 kB
Progress (3): 0.7/1.2 MB | 50 kB | 7.7/52 kB
Progress (3): 0.7/1.2 MB | 50 kB | 12/52 kB 
Progress (3): 0.7/1.2 MB | 50 kB | 12/52 kB
Progress (3): 0.7/1.2 MB | 50 kB | 16/52 kB
Progress (3): 0.7/1.2 MB | 50 kB | 16/52 kB
Progress (3): 0.7/1.2 MB | 50 kB | 20/52 kB
Progress (3): 0.7/1.2 MB | 50 kB | 20/52 kB
Progress (3): 0.7/1.2 MB | 50 kB | 24/52 kB
Progress (3): 0.7/1.2 MB | 50 kB | 24/52 kB
Progress (3): 0.7/1.2 MB | 50 kB | 28/52 kB
Progress (3): 0.7/1.2 MB | 50 kB | 28/52 kB
Progress (3): 0.7/1.2 MB | 50 kB | 32/52 kB
Progress (3): 0.7/1.2 MB | 50 kB | 32/52 kB
Progress (3): 0.7/1.2 MB | 50 kB | 33/52 kB
Progress (3): 0.7/1.2 MB | 50 kB | 33/52 kB
Progress (3): 0.7/1.2 MB | 50 kB | 37/52 kB
Progress (3): 0.7/1.2 MB | 50 kB | 37/52 kB
Progress (3): 0.7/1.2 MB | 50 kB | 41/52 kB
Progress (3): 0.7/1.2 MB | 50 kB | 41/52 kB
Progress (3): 0.7/1.2 MB | 50 kB | 45/52 kB
Progress (3): 0.7/1.2 MB | 50 kB | 45/52 kB
Progress (3): 0.7/1.2 MB | 50 kB | 49/52 kB
Progress (3): 0.7/1.2 MB | 50 kB | 52 kB   
Progress (3): 0.7/1.2 MB | 50 kB | 52 kB
Progress (3): 0.7/1.2 MB | 50 kB | 52 kB
Progress (3): 0.7/1.2 MB | 50 kB | 52 kB
Progress (3): 0.7/1.2 MB | 50 kB | 52 kB
Progress (3): 0.8/1.2 MB | 50 kB | 52 kB
Progress (3): 0.8/1.2 MB | 50 kB | 52 kB
Progress (3): 0.8/1.2 MB | 50 kB | 52 kB
Progress (3): 0.8/1.2 MB | 50 kB | 52 kB
Progress (3): 0.8/1.2 MB | 50 kB | 52 kB
Progress (3): 0.8/1.2 MB | 50 kB | 52 kB
Progress (3): 0.8/1.2 MB | 50 kB | 52 kB
Progress (3): 0.8/1.2 MB | 50 kB | 52 kB
Progress (3): 0.8/1.2 MB | 50 kB | 52 kB
Progress (3): 0.8/1.2 MB | 50 kB | 52 kB
Progress (4): 0.8/1.2 MB | 50 kB | 52 kB | 4.1/15 kB
Progress (4): 0.8/1.2 MB | 50 kB | 52 kB | 4.1/15 kB
Progress (4): 0.8/1.2 MB | 50 kB | 52 kB | 7.7/15 kB
                                                    
Downloaded from eclipse.maven.central.mirror: https://repo.eclipse.org/content/repositories/maven_central/org/apache/maven/doxia/doxia-site-renderer/1.1.2/doxia-site-renderer-1.1.2.jar (50 kB at 655 kB/s)
Progress (3): 0.8/1.2 MB | 52 kB | 7.7/15 kB
Progress (3): 0.8/1.2 MB | 52 kB | 12/15 kB 
                                           
Downloading from eclipse.maven.central.mirror: https://repo.eclipse.org/content/repositories/maven_central/org/codehaus/plexus/plexus-velocity/1.1.7/plexus-velocity-1.1.7.jar
Downloaded from eclipse.maven.central.mirror: https://repo.eclipse.org/content/repositories/maven_central/org/apache/maven/doxia/doxia-decoration-model/1.1.2/doxia-decoration-model-1.1.2.jar (52 kB at 679 kB/s)
Progress (2): 0.8/1.2 MB | 15 kB
                                
Downloading from eclipse.maven.central.mirror: https://repo.eclipse.org/content/repositories/maven_central/commons-collections/commons-collections/3.2/commons-collections-3.2.jar
Progress (2): 0.8/1.2 MB | 15 kB
Progress (2): 0.8/1.2 MB | 15 kB
Progress (2): 0.8/1.2 MB | 15 kB
Progress (2): 0.8/1.2 MB | 15 kB
Progress (2): 0.8/1.2 MB | 15 kB
Progress (2): 0.8/1.2 MB | 15 kB
Progress (3): 0.8/1.2 MB | 15 kB | 4.1/37 kB
Progress (3): 0.8/1.2 MB | 15 kB | 7.7/37 kB
Progress (3): 0.8/1.2 MB | 15 kB | 12/37 kB 
Progress (3): 0.8/1.2 MB | 15 kB | 12/37 kB
Progress (3): 0.8/1.2 MB | 15 kB | 16/37 kB
Progress (3): 0.8/1.2 MB | 15 kB | 16/37 kB
Progress (3): 0.8/1.2 MB | 15 kB | 20/37 kB
Progress (3): 0.8/1.2 MB | 15 kB | 24/37 kB
Progress (3): 0.8/1.2 MB | 15 kB | 24/37 kB
Progress (3): 0.8/1.2 MB | 15 kB | 28/37 kB
Progress (3): 0.8/1.2 MB | 15 kB | 28/37 kB
Progress (3): 0.8/1.2 MB | 15 kB | 32/37 kB
Progress (3): 0.8/1.2 MB | 15 kB | 33/37 kB
Progress (3): 0.8/1.2 MB | 15 kB | 37/37 kB
Progress (3): 0.8/1.2 MB | 15 kB | 37 kB   
Progress (3): 0.8/1.2 MB | 15 kB | 37 kB
Progress (3): 0.8/1.2 MB | 15 kB | 37 kB
Progress (3): 0.8/1.2 MB | 15 kB | 37 kB
Progress (3): 0.9/1.2 MB | 15 kB | 37 kB
Progress (3): 0.9/1.2 MB | 15 kB | 37 kB
Progress (3): 0.9/1.2 MB | 15 kB | 37 kB
Progress (3): 0.9/1.2 MB | 15 kB | 37 kB
Progress (3): 0.9/1.2 MB | 15 kB | 37 kB
Progress (3): 0.9/1.2 MB | 15 kB | 37 kB
Progress (3): 0.9/1.2 MB | 15 kB | 37 kB
Progress (4): 0.9/1.2 MB | 15 kB | 37 kB | 4.1/7.7 kB
Progress (4): 0.9/1.2 MB | 15 kB | 37 kB | 7.7 kB    
Progress (4): 0.9/1.2 MB | 15 kB | 37 kB | 7.7 kB
Progress (4): 0.9/1.2 MB | 15 kB | 37 kB | 7.7 kB
Progress (4): 0.9/1.2 MB | 15 kB | 37 kB | 7.7 kB
Progress (4): 0.9/1.2 MB | 15 kB | 37 kB | 7.7 kB
Progress (4): 0.9/1.2 MB | 15 kB | 37 kB | 7.7 kB
Progress (4): 0.9/1.2 MB | 15 kB | 37 kB | 7.7 kB
Progress (4): 0.9/1.2 MB | 15 kB | 37 kB | 7.7 kB
Progress (4): 0.9/1.2 MB | 15 kB | 37 kB | 7.7 kB
                                                 
Downloaded from eclipse.maven.central.mirror: https://repo.eclipse.org/content/repositories/maven_central/org/apache/maven/doxia/doxia-module-fml/1.1.2/doxia-module-fml-1.1.2.jar (37 kB at 440 kB/s)
Downloading from eclipse.maven.central.mirror: https://repo.eclipse.org/content/repositories/maven_central/commons-validator/commons-validator/1.2.0/commons-validator-1.2.0.jar
Downloaded from eclipse.maven.central.mirror: https://repo.eclipse.org/content/repositories/maven_central/org/apache/maven/doxia/doxia-module-xhtml/1.1.2/doxia-module-xhtml-1.1.2.jar (15 kB at 174 kB/s)
Downloading from eclipse.maven.central.mirror: https://repo.eclipse.org/content/repositories/maven_central/xml-apis/xml-apis/1.0.b2/xml-apis-1.0.b2.jar
Progress (2): 0.9/1.2 MB | 7.7 kB
Progress (2): 0.9/1.2 MB | 7.7 kB
Progress (2): 0.9/1.2 MB | 7.7 kB
Progress (2): 0.9/1.2 MB | 7.7 kB
                                 
Downloaded from eclipse.maven.central.mirror: https://repo.eclipse.org/content/repositories/maven_central/org/codehaus/plexus/plexus-velocity/1.1.7/plexus-velocity-1.1.7.jar (7.7 kB at 88 kB/s)
Downloading from eclipse.maven.central.mirror: https://repo.eclipse.org/content/repositories/maven_central/org/jacoco/org.jacoco.agent/0.7.9/org.jacoco.agent-0.7.9-runtime.jar
Progress (1): 0.9/1.2 MB
Progress (1): 0.9/1.2 MB
Progress (1): 0.9/1.2 MB
Progress (1): 0.9/1.2 MB
Progress (1): 0.9/1.2 MB
Progress (1): 0.9/1.2 MB
Progress (1): 1.0/1.2 MB
Progress (1): 1.0/1.2 MB
Progress (1): 1.0/1.2 MB
Progress (1): 1.0/1.2 MB
Progress (1): 1.0/1.2 MB
Progress (1): 1.0/1.2 MB
Progress (1): 1.0/1.2 MB
Progress (1): 1.0/1.2 MB
Progress (2): 1.0/1.2 MB | 4.1/571 kB
Progress (2): 1.0/1.2 MB | 7.7/571 kB
Progress (2): 1.0/1.2 MB | 7.7/571 kB
Progress (2): 1.0/1.2 MB | 7.7/571 kB
Progress (2): 1.0/1.2 MB | 12/571 kB 
Progress (2): 1.0/1.2 MB | 16/571 kB
Progress (2): 1.0/1.2 MB | 16/571 kB
Progress (2): 1.0/1.2 MB | 16/571 kB
Progress (2): 1.0/1.2 MB | 20/571 kB
Progress (2): 1.0/1.2 MB | 24/571 kB
Progress (2): 1.0/1.2 MB | 28/571 kB
Progress (2): 1.0/1.2 MB | 32/571 kB
Progress (2): 1.0/1.2 MB | 33/571 kB
Progress (2): 1.0/1.2 MB | 33/571 kB
Progress (2): 1.0/1.2 MB | 33/571 kB
Progress (2): 1.0/1.2 MB | 37/571 kB
Progress (2): 1.0/1.2 MB | 41/571 kB
Progress (2): 1.0/1.2 MB | 41/571 kB
Progress (2): 1.0/1.2 MB | 41/571 kB
Progress (2): 1.0/1.2 MB | 45/571 kB
Progress (2): 1.0/1.2 MB | 49/571 kB
Progress (2): 1.0/1.2 MB | 49/571 kB
Progress (2): 1.0/1.2 MB | 53/571 kB
Progress (2): 1.0/1.2 MB | 53/571 kB
Progress (2): 1.0/1.2 MB | 57/571 kB
Progress (2): 1.0/1.2 MB | 61/571 kB
Progress (2): 1.0/1.2 MB | 65/571 kB
Progress (2): 1.0/1.2 MB | 66/571 kB
Progress (2): 1.0/1.2 MB | 66/571 kB
Progress (2): 1.0/1.2 MB | 70/571 kB
Progress (2): 1.0/1.2 MB | 70/571 kB
Progress (2): 1.0/1.2 MB | 74/571 kB
Progress (2): 1.0/1.2 MB | 74/571 kB
Progress (2): 1.0/1.2 MB | 78/571 kB
Progress (2): 1.0/1.2 MB | 78/571 kB
Progress (2): 1.0/1.2 MB | 82/571 kB
Progress (2): 1.0/1.2 MB | 86/571 kB
Progress (2): 1.0/1.2 MB | 86/571 kB
Progress (2): 1.0/1.2 MB | 90/571 kB
Progress (2): 1.0/1.2 MB | 90/571 kB
Progress (2): 1.0/1.2 MB | 94/571 kB
Progress (2): 1.0/1.2 MB | 94/571 kB
Progress (2): 1.0/1.2 MB | 98/571 kB
Progress (3): 1.0/1.2 MB | 98/571 kB | 4.1/91 kB
Progress (3): 1.1/1.2 MB | 98/571 kB | 4.1/91 kB
Progress (3): 1.1/1.2 MB | 98/571 kB | 4.1/91 kB
Progress (3): 1.1/1.2 MB | 98/571 kB | 7.7/91 kB
Progress (3): 1.1/1.2 MB | 102/571 kB | 7.7/91 kB
Progress (3): 1.1/1.2 MB | 102/571 kB | 7.7/91 kB
Progress (3): 1.1/1.2 MB | 106/571 kB | 7.7/91 kB
Progress (3): 1.1/1.2 MB | 106/571 kB | 7.7/91 kB
Progress (3): 1.1/1.2 MB | 110/571 kB | 7.7/91 kB
Progress (3): 1.1/1.2 MB | 114/571 kB | 7.7/91 kB
Progress (3): 1.1/1.2 MB | 114/571 kB | 12/91 kB 
Progress (3): 1.1/1.2 MB | 114/571 kB | 16/91 kB
Progress (3): 1.1/1.2 MB | 118/571 kB | 16/91 kB
Progress (3): 1.1/1.2 MB | 122/571 kB | 16/91 kB
Progress (3): 1.1/1.2 MB | 122/571 kB | 16/91 kB
Progress (3): 1.1/1.2 MB | 122/571 kB | 16/91 kB
Progress (3): 1.1/1.2 MB | 126/571 kB | 16/91 kB
Progress (3): 1.1/1.2 MB | 130/571 kB | 16/91 kB
Progress (3): 1.1/1.2 MB | 134/571 kB | 16/91 kB
Progress (3): 1.1/1.2 MB | 134/571 kB | 16/91 kB
Progress (3): 1.1/1.2 MB | 138/571 kB | 16/91 kB
Progress (3): 1.1/1.2 MB | 138/571 kB | 16/91 kB
Progress (3): 1.1/1.2 MB | 142/571 kB | 16/91 kB
Progress (3): 1.1/1.2 MB | 146/571 kB | 16/91 kB
Progress (3): 1.1/1.2 MB | 150/571 kB | 16/91 kB
Progress (3): 1.1/1.2 MB | 154/571 kB | 16/91 kB
Progress (3): 1.1/1.2 MB | 158/571 kB | 16/91 kB
Progress (4): 1.1/1.2 MB | 158/571 kB | 16/91 kB | 4.1/259 kB
Progress (4): 1.1/1.2 MB | 162/571 kB | 16/91 kB | 4.1/259 kB
Progress (4): 1.1/1.2 MB | 162/571 kB | 16/91 kB | 7.7/259 kB
Progress (4): 1.1/1.2 MB | 166/571 kB | 16/91 kB | 7.7/259 kB
Progress (4): 1.1/1.2 MB | 166/571 kB | 16/91 kB | 12/259 kB 
Progress (4): 1.1/1.2 MB | 170/571 kB | 16/91 kB | 12/259 kB
Progress (4): 1.1/1.2 MB | 170/571 kB | 16/91 kB | 16/259 kB
Progress (4): 1.1/1.2 MB | 174/571 kB | 16/91 kB | 16/259 kB
Progress (4): 1.1/1.2 MB | 174/571 kB | 16/91 kB | 20/259 kB
Progress (4): 1.1/1.2 MB | 178/571 kB | 16/91 kB | 20/259 kB
Progress (4): 1.1/1.2 MB | 178/571 kB | 16/91 kB | 24/259 kB
Progress (4): 1.1/1.2 MB | 182/571 kB | 16/91 kB | 24/259 kB
Progress (4): 1.1/1.2 MB | 182/571 kB | 16/91 kB | 28/259 kB
Progress (4): 1.1/1.2 MB | 186/571 kB | 16/91 kB | 28/259 kB
Progress (4): 1.1/1.2 MB | 186/571 kB | 16/91 kB | 32/259 kB
Progress (4): 1.1/1.2 MB | 186/571 kB | 16/91 kB | 32/259 kB
Progress (4): 1.1/1.2 MB | 190/571 kB | 16/91 kB | 32/259 kB
Progress (4): 1.1/1.2 MB | 190/571 kB | 16/91 kB | 33/259 kB
Progress (4): 1.1/1.2 MB | 194/571 kB | 16/91 kB | 33/259 kB
Progress (4): 1.1/1.2 MB | 194/571 kB | 16/91 kB | 33/259 kB
Progress (4): 1.1/1.2 MB | 194/571 kB | 16/91 kB | 37/259 kB
Progress (4): 1.1/1.2 MB | 198/571 kB | 16/91 kB | 37/259 kB
Progress (4): 1.1/1.2 MB | 198/571 kB | 16/91 kB | 41/259 kB
Progress (4): 1.1/1.2 MB | 202/571 kB | 16/91 kB | 41/259 kB
Progress (4): 1.1/1.2 MB | 202/571 kB | 16/91 kB | 41/259 kB
Progress (4): 1.1/1.2 MB | 202/571 kB | 16/91 kB | 41/259 kB
Progress (4): 1.1/1.2 MB | 206/571 kB | 16/91 kB | 41/259 kB
Progress (4): 1.1/1.2 MB | 210/571 kB | 16/91 kB | 41/259 kB
Progress (4): 1.1/1.2 MB | 210/571 kB | 16/91 kB | 45/259 kB
Progress (4): 1.1/1.2 MB | 210/571 kB | 16/91 kB | 49/259 kB
Progress (4): 1.1/1.2 MB | 214/571 kB | 16/91 kB | 49/259 kB
Progress (4): 1.1/1.2 MB | 218/571 kB | 16/91 kB | 49/259 kB
Progress (4): 1.1/1.2 MB | 218/571 kB | 16/91 kB | 53/259 kB
Progress (4): 1.1/1.2 MB | 218/571 kB | 16/91 kB | 57/259 kB
Progress (4): 1.1/1.2 MB | 222/571 kB | 16/91 kB | 57/259 kB
Progress (4): 1.1/1.2 MB | 222/571 kB | 16/91 kB | 57/259 kB
Progress (4): 1.1/1.2 MB | 226/571 kB | 16/91 kB | 57/259 kB
Progress (4): 1.1/1.2 MB | 226/571 kB | 16/91 kB | 61/259 kB
Progress (4): 1.1/1.2 MB | 226/571 kB | 16/91 kB | 61/259 kB
Progress (4): 1.1/1.2 MB | 230/571 kB | 16/91 kB | 61/259 kB
Progress (4): 1.1/1.2 MB | 230/571 kB | 16/91 kB | 65/259 kB
Progress (4): 1.1/1.2 MB | 234/571 kB | 16/91 kB | 65/259 kB
Progress (4): 1.1/1.2 MB | 234/571 kB | 16/91 kB | 66/259 kB
Progress (4): 1.1/1.2 MB | 234/571 kB | 16/91 kB | 66/259 kB
Progress (4): 1.1/1.2 MB | 238/571 kB | 16/91 kB | 66/259 kB
Progress (4): 1.1/1.2 MB | 238/571 kB | 16/91 kB | 66/259 kB
Progress (4): 1.1/1.2 MB | 242/571 kB | 16/91 kB | 66/259 kB
Progress (4): 1.1/1.2 MB | 246/571 kB | 16/91 kB | 66/259 kB
Progress (4): 1.1/1.2 MB | 250/571 kB | 16/91 kB | 66/259 kB
Progress (4): 1.1/1.2 MB | 254/571 kB | 16/91 kB | 66/259 kB
Progress (4): 1.1/1.2 MB | 258/571 kB | 16/91 kB | 66/259 kB
Progress (4): 1.1/1.2 MB | 258/571 kB | 16/91 kB | 66/259 kB
Progress (4): 1.1/1.2 MB | 258/571 kB | 16/91 kB | 66/259 kB
Progress (4): 1.1/1.2 MB | 262/571 kB | 16/91 kB | 66/259 kB
Progress (4): 1.1/1.2 MB | 266/571 kB | 16/91 kB | 66/259 kB
Progress (4): 1.1/1.2 MB | 270/571 kB | 16/91 kB | 66/259 kB
Progress (4): 1.1/1.2 MB | 274/571 kB | 16/91 kB | 66/259 kB
Progress (4): 1.1/1.2 MB | 274/571 kB | 16/91 kB | 66/259 kB
Progress (4): 1.1/1.2 MB | 278/571 kB | 16/91 kB | 66/259 kB
Progress (4): 1.1/1.2 MB | 278/571 kB | 16/91 kB | 66/259 kB
Progress (4): 1.1/1.2 MB | 282/571 kB | 16/91 kB | 66/259 kB
Progress (4): 1.1/1.2 MB | 286/571 kB | 16/91 kB | 66/259 kB
Progress (4): 1.1/1.2 MB | 290/571 kB | 16/91 kB | 66/259 kB
Progress (4): 1.1/1.2 MB | 294/571 kB | 16/91 kB | 66/259 kB
Progress (4): 1.1/1.2 MB | 298/571 kB | 16/91 kB | 66/259 kB
Progress (4): 1.1/1.2 MB | 302/571 kB | 16/91 kB | 66/259 kB
Progress (4): 1.1/1.2 MB | 306/571 kB | 16/91 kB | 66/259 kB
Progress (4): 1.1/1.2 MB | 310/571 kB | 16/91 kB | 66/259 kB
Progress (4): 1.1/1.2 MB | 314/571 kB | 16/91 kB | 66/259 kB
Progress (4): 1.1/1.2 MB | 318/571 kB | 16/91 kB | 66/259 kB
Progress (4): 1.1/1.2 MB | 322/571 kB | 16/91 kB | 66/259 kB
Progress (4): 1.1/1.2 MB | 326/571 kB | 16/91 kB | 66/259 kB
Progress (4): 1.1/1.2 MB | 330/571 kB | 16/91 kB | 66/259 kB
Progress (4): 1.1/1.2 MB | 334/571 kB | 16/91 kB | 66/259 kB
Progress (4): 1.1/1.2 MB | 338/571 kB | 16/91 kB | 66/259 kB
Progress (4): 1.1/1.2 MB | 338/571 kB | 16/91 kB | 66/259 kB
Progress (4): 1.1/1.2 MB | 342/571 kB | 16/91 kB | 66/259 kB
Progress (4): 1.1/1.2 MB | 342/571 kB | 16/91 kB | 66/259 kB
Progress (4): 1.1/1.2 MB | 346/571 kB | 16/91 kB | 66/259 kB
Progress (4): 1.1/1.2 MB | 346/571 kB | 16/91 kB | 66/259 kB
Progress (4): 1.1/1.2 MB | 350/571 kB | 16/91 kB | 66/259 kB
Progress (4): 1.1/1.2 MB | 350/571 kB | 16/91 kB | 66/259 kB
Progress (4): 1.1/1.2 MB | 354/571 kB | 16/91 kB | 66/259 kB
Progress (4): 1.1/1.2 MB | 358/571 kB | 16/91 kB | 66/259 kB
Progress (4): 1.1/1.2 MB | 362/571 kB | 16/91 kB | 66/259 kB
Progress (4): 1.1/1.2 MB | 366/571 kB | 16/91 kB | 66/259 kB
Progress (4): 1.1/1.2 MB | 370/571 kB | 16/91 kB | 66/259 kB
Progress (4): 1.1/1.2 MB | 370/571 kB | 16/91 kB | 66/259 kB
Progress (4): 1.1/1.2 MB | 374/571 kB | 16/91 kB | 66/259 kB
Progress (4): 1.1/1.2 MB | 374/571 kB | 16/91 kB | 66/259 kB
Progress (4): 1.1/1.2 MB | 378/571 kB | 16/91 kB | 66/259 kB
Progress (4): 1.1/1.2 MB | 378/571 kB | 16/91 kB | 70/259 kB
Progress (4): 1.1/1.2 MB | 382/571 kB | 16/91 kB | 70/259 kB
Progress (4): 1.1/1.2 MB | 382/571 kB | 16/91 kB | 74/259 kB
Progress (4): 1.1/1.2 MB | 386/571 kB | 16/91 kB | 74/259 kB
Progress (4): 1.1/1.2 MB | 390/571 kB | 16/91 kB | 74/259 kB
Progress (4): 1.2/1.2 MB | 390/571 kB | 16/91 kB | 74/259 kB
Progress (4): 1.2/1.2 MB | 394/571 kB | 16/91 kB | 74/259 kB
Progress (4): 1.2/1.2 MB | 394/571 kB | 16/91 kB | 74/259 kB
Progress (4): 1.2/1.2 MB | 394/571 kB | 16/91 kB | 78/259 kB
Progress (4): 1.2/1.2 MB | 398/571 kB | 16/91 kB | 78/259 kB
Progress (4): 1.2/1.2 MB | 398/571 kB | 16/91 kB | 82/259 kB
Progress (4): 1.2/1.2 MB | 402/571 kB | 16/91 kB | 82/259 kB
Progress (4): 1.2/1.2 MB | 402/571 kB | 16/91 kB | 86/259 kB
Progress (4): 1.2/1.2 MB | 406/571 kB | 16/91 kB | 86/259 kB
Progress (4): 1.2/1.2 MB | 406/571 kB | 16/91 kB | 90/259 kB
Progress (4): 1.2/1.2 MB | 410/571 kB | 16/91 kB | 90/259 kB
Progress (4): 1.2/1.2 MB | 410/571 kB | 16/91 kB | 90/259 kB
Progress (4): 1.2/1.2 MB | 414/571 kB | 16/91 kB | 90/259 kB
Progress (4): 1.2/1.2 MB | 414/571 kB | 16/91 kB | 94/259 kB
Progress (4): 1.2/1.2 MB | 414/571 kB | 16/91 kB | 94/259 kB
Progress (4): 1.2/1.2 MB | 418/571 kB | 16/91 kB | 94/259 kB
Progress (4): 1.2/1.2 MB | 418/571 kB | 16/91 kB | 98/259 kB
Progress (4): 1.2/1.2 MB | 418/571 kB | 16/91 kB | 98/259 kB
Progress (4): 1.2/1.2 MB | 422/571 kB | 16/91 kB | 98/259 kB
Progress (4): 1.2/1.2 MB | 426/571 kB | 16/91 kB | 98/259 kB
Progress (4): 1.2/1.2 MB | 426/571 kB | 16/91 kB | 102/259 kB
Progress (4): 1.2/1.2 MB | 426/571 kB | 16/91 kB | 102/259 kB
Progress (4): 1.2/1.2 MB | 426/571 kB | 16/91 kB | 106/259 kB
Progress (4): 1.2/1.2 MB | 430/571 kB | 16/91 kB | 106/259 kB
Progress (4): 1.2/1.2 MB | 430/571 kB | 16/91 kB | 106/259 kB
Progress (4): 1.2/1.2 MB | 434/571 kB | 16/91 kB | 106/259 kB
Progress (4): 1.2/1.2 MB | 434/571 kB | 16/91 kB | 110/259 kB
Progress (4): 1.2/1.2 MB | 438/571 kB | 16/91 kB | 110/259 kB
Progress (4): 1.2/1.2 MB | 438/571 kB | 16/91 kB | 114/259 kB
Progress (4): 1.2/1.2 MB | 442/571 kB | 16/91 kB | 114/259 kB
Progress (4): 1.2/1.2 MB | 442/571 kB | 16/91 kB | 118/259 kB
Progress (4): 1.2/1.2 MB | 446/571 kB | 16/91 kB | 118/259 kB
Progress (4): 1.2/1.2 MB | 446/571 kB | 16/91 kB | 122/259 kB
Progress (4): 1.2/1.2 MB | 450/571 kB | 16/91 kB | 122/259 kB
Progress (4): 1.2/1.2 MB | 454/571 kB | 16/91 kB | 122/259 kB
Progress (4): 1.2/1.2 MB | 454/571 kB | 16/91 kB | 122/259 kB
Progress (4): 1.2/1.2 MB | 454/571 kB | 16/91 kB | 126/259 kB
Progress (4): 1.2/1.2 MB | 458/571 kB | 16/91 kB | 126/259 kB
Progress (4): 1.2/1.2 MB | 458/571 kB | 16/91 kB | 126/259 kB
Progress (4): 1.2/1.2 MB | 458/571 kB | 16/91 kB | 130/259 kB
Progress (4): 1.2/1.2 MB | 462/571 kB | 16/91 kB | 130/259 kB
Progress (4): 1.2/1.2 MB | 462/571 kB | 16/91 kB | 131/259 kB
Progress (4): 1.2/1.2 MB | 466/571 kB | 16/91 kB | 131/259 kB
Progress (4): 1.2/1.2 MB | 466/571 kB | 16/91 kB | 135/259 kB
Progress (4): 1.2/1.2 MB | 470/571 kB | 16/91 kB | 135/259 kB
Progress (4): 1.2/1.2 MB | 470/571 kB | 16/91 kB | 139/259 kB
Progress (4): 1.2/1.2 MB | 474/571 kB | 16/91 kB | 139/259 kB
Progress (4): 1.2/1.2 MB | 478/571 kB | 16/91 kB | 139/259 kB
Progress (4): 1.2/1.2 MB | 478/571 kB | 16/91 kB | 139/259 kB
Progress (4): 1.2/1.2 MB | 482/571 kB | 16/91 kB | 139/259 kB
Progress (4): 1.2/1.2 MB | 482/571 kB | 16/91 kB | 143/259 kB
Progress (4): 1.2/1.2 MB | 482/571 kB | 16/91 kB | 143/259 kB
Progress (4): 1.2/1.2 MB | 482/571 kB | 16/91 kB | 147/259 kB
Progress (4): 1.2/1.2 MB | 486/571 kB | 16/91 kB | 147/259 kB
Progress (4): 1.2/1.2 MB | 490/571 kB | 16/91 kB | 147/259 kB
Progress (4): 1.2/1.2 MB | 490/571 kB | 16/91 kB | 151/259 kB
Progress (4): 1.2/1.2 MB | 490/571 kB | 16/91 kB | 155/259 kB
Progress (4): 1.2/1.2 MB | 494/571 kB | 16/91 kB | 155/259 kB
Progress (4): 1.2/1.2 MB | 498/571 kB | 16/91 kB | 155/259 kB
Progress (4): 1.2/1.2 MB | 498/571 kB | 16/91 kB | 155/259 kB
Progress (4): 1.2/1.2 MB | 498/571 kB | 16/91 kB | 159/259 kB
Progress (4): 1.2/1.2 MB | 502/571 kB | 16/91 kB | 159/259 kB
Progress (4): 1.2/1.2 MB | 502/571 kB | 16/91 kB | 159/259 kB
Progress (4): 1.2/1.2 MB | 506/571 kB | 16/91 kB | 159/259 kB
Progress (4): 1.2/1.2 MB | 506/571 kB | 16/91 kB | 163/259 kB
Progress (4): 1.2/1.2 MB | 510/571 kB | 16/91 kB | 163/259 kB
Progress (4): 1.2/1.2 MB | 510/571 kB | 16/91 kB | 167/259 kB
Progress (4): 1.2/1.2 MB | 514/571 kB | 16/91 kB | 167/259 kB
Progress (4): 1.2/1.2 MB | 514/571 kB | 16/91 kB | 171/259 kB
Progress (4): 1.2/1.2 MB | 518/571 kB | 16/91 kB | 171/259 kB
Progress (4): 1.2/1.2 MB | 522/571 kB | 16/91 kB | 171/259 kB
Progress (4): 1.2/1.2 MB | 522/571 kB | 16/91 kB | 171/259 kB
Progress (4): 1.2/1.2 MB | 522/571 kB | 16/91 kB | 175/259 kB
Progress (4): 1.2/1.2 MB | 526/571 kB | 16/91 kB | 175/259 kB
Progress (4): 1.2/1.2 MB | 526/571 kB | 16/91 kB | 175/259 kB
Progress (4): 1.2/1.2 MB | 530/571 kB | 16/91 kB | 175/259 kB
Progress (4): 1.2/1.2 MB | 530/571 kB | 16/91 kB | 179/259 kB
Progress (4): 1.2/1.2 MB | 534/571 kB | 16/91 kB | 179/259 kB
Progress (4): 1.2/1.2 MB | 534/571 kB | 16/91 kB | 183/259 kB
Progress (4): 1.2/1.2 MB | 538/571 kB | 16/91 kB | 183/259 kB
Progress (4): 1.2/1.2 MB | 538/571 kB | 16/91 kB | 187/259 kB
Progress (4): 1.2/1.2 MB | 542/571 kB | 16/91 kB | 187/259 kB
Progress (4): 1.2/1.2 MB | 542/571 kB | 16/91 kB | 191/259 kB
Progress (4): 1.2/1.2 MB | 546/571 kB | 16/91 kB | 191/259 kB
Progress (4): 1.2/1.2 MB | 546/571 kB | 16/91 kB | 195/259 kB
Progress (4): 1.2/1.2 MB | 550/571 kB | 16/91 kB | 195/259 kB
Progress (4): 1.2/1.2 MB | 554/571 kB | 16/91 kB | 195/259 kB
Progress (4): 1.2/1.2 MB | 554/571 kB | 16/91 kB | 195/259 kB
Progress (4): 1.2/1.2 MB | 554/571 kB | 16/91 kB | 199/259 kB
Progress (4): 1.2/1.2 MB | 558/571 kB | 16/91 kB | 199/259 kB
Progress (4): 1.2/1.2 MB | 558/571 kB | 16/91 kB | 199/259 kB
Progress (4): 1.2/1.2 MB | 558/571 kB | 16/91 kB | 203/259 kB
Progress (4): 1.2/1.2 MB | 562/571 kB | 16/91 kB | 203/259 kB
Progress (4): 1.2 MB | 562/571 kB | 16/91 kB | 203/259 kB    
Progress (4): 1.2 MB | 566/571 kB | 16/91 kB | 203/259 kB
Progress (4): 1.2 MB | 566/571 kB | 16/91 kB | 207/259 kB
Progress (4): 1.2 MB | 570/571 kB | 16/91 kB | 207/259 kB
Progress (4): 1.2 MB | 570/571 kB | 16/91 kB | 211/259 kB
Progress (4): 1.2 MB | 571 kB | 16/91 kB | 211/259 kB    
Progress (4): 1.2 MB | 571 kB | 16/91 kB | 215/259 kB
Progress (4): 1.2 MB | 571 kB | 16/91 kB | 219/259 kB
Progress (4): 1.2 MB | 571 kB | 16/91 kB | 223/259 kB
Progress (4): 1.2 MB | 571 kB | 16/91 kB | 227/259 kB
Progress (4): 1.2 MB | 571 kB | 16/91 kB | 231/259 kB
Progress (4): 1.2 MB | 571 kB | 16/91 kB | 235/259 kB
Progress (4): 1.2 MB | 571 kB | 16/91 kB | 239/259 kB
Progress (4): 1.2 MB | 571 kB | 16/91 kB | 243/259 kB
Progress (4): 1.2 MB | 571 kB | 16/91 kB | 247/259 kB
Progress (4): 1.2 MB | 571 kB | 16/91 kB | 251/259 kB
Progress (4): 1.2 MB | 571 kB | 16/91 kB | 255/259 kB
Progress (4): 1.2 MB | 571 kB | 16/91 kB | 259 kB    
                                                 
Downloaded from eclipse.maven.central.mirror: https://repo.eclipse.org/content/repositories/maven_central/xerces/xercesImpl/2.8.1/xercesImpl-2.8.1.jar (1.2 MB at 10 MB/s)
Downloading from eclipse.maven.central.mirror: https://repo.eclipse.org/content/repositories/maven_central/org/jacoco/org.jacoco.core/0.7.9/org.jacoco.core-0.7.9.jar
Downloaded from eclipse.maven.central.mirror: https://repo.eclipse.org/content/repositories/maven_central/commons-collections/commons-collections/3.2/commons-collections-3.2.jar (571 kB at 4.8 MB/s)
Downloading from eclipse.maven.central.mirror: https://repo.eclipse.org/content/repositories/maven_central/org/ow2/asm/asm-debug-all/5.2/asm-debug-all-5.2.jar
Downloaded from eclipse.maven.central.mirror: https://repo.eclipse.org/content/repositories/maven_central/org/jacoco/org.jacoco.agent/0.7.9/org.jacoco.agent-0.7.9-runtime.jar (259 kB at 2.1 MB/s)
Downloading from eclipse.maven.central.mirror: https://repo.eclipse.org/content/repositories/maven_central/org/jacoco/org.jacoco.report/0.7.9/org.jacoco.report-0.7.9.jar
Progress (2): 16/91 kB | 4.1/126 kB
Progress (2): 16/91 kB | 7.7/126 kB
Progress (2): 16/91 kB | 12/126 kB 
Progress (2): 16/91 kB | 16/126 kB
Progress (2): 16/91 kB | 20/126 kB
Progress (2): 16/91 kB | 24/126 kB
Progress (2): 16/91 kB | 28/126 kB
Progress (2): 16/91 kB | 32/126 kB
Progress (2): 16/91 kB | 33/126 kB
Progress (2): 16/91 kB | 37/126 kB
Progress (2): 16/91 kB | 41/126 kB
Progress (2): 16/91 kB | 45/126 kB
Progress (2): 16/91 kB | 49/126 kB
Progress (2): 16/91 kB | 53/126 kB
Progress (2): 16/91 kB | 57/126 kB
Progress (2): 16/91 kB | 61/126 kB
Progress (2): 16/91 kB | 65/126 kB
Progress (3): 16/91 kB | 65/126 kB | 4.1/128 kB
Progress (3): 16/91 kB | 66/126 kB | 4.1/128 kB
Progress (3): 16/91 kB | 66/126 kB | 7.7/128 kB
Progress (3): 16/91 kB | 70/126 kB | 7.7/128 kB
Progress (3): 16/91 kB | 74/126 kB | 7.7/128 kB
Progress (3): 16/91 kB | 74/126 kB | 12/128 kB 
Progress (3): 16/91 kB | 78/126 kB | 12/128 kB
Progress (3): 16/91 kB | 78/126 kB | 16/128 kB
Progress (3): 16/91 kB | 82/126 kB | 16/128 kB
Progress (3): 16/91 kB | 82/126 kB | 20/128 kB
Progress (3): 16/91 kB | 86/126 kB | 20/128 kB
Progress (3): 16/91 kB | 86/126 kB | 24/128 kB
Progress (3): 16/91 kB | 90/126 kB | 24/128 kB
Progress (3): 16/91 kB | 90/126 kB | 28/128 kB
Progress (3): 16/91 kB | 94/126 kB | 28/128 kB
Progress (3): 16/91 kB | 98/126 kB | 28/128 kB
Progress (4): 16/91 kB | 98/126 kB | 28/128 kB | 4.1/388 kB
Progress (4): 16/91 kB | 98/126 kB | 32/128 kB | 4.1/388 kB
Progress (4): 16/91 kB | 102/126 kB | 32/128 kB | 4.1/388 kB
Progress (4): 16/91 kB | 102/126 kB | 32/128 kB | 7.7/388 kB
Progress (4): 16/91 kB | 106/126 kB | 32/128 kB | 7.7/388 kB
Progress (4): 16/91 kB | 106/126 kB | 36/128 kB | 7.7/388 kB
Progress (4): 16/91 kB | 106/126 kB | 40/128 kB | 7.7/388 kB
Progress (4): 16/91 kB | 110/126 kB | 40/128 kB | 7.7/388 kB
Progress (4): 16/91 kB | 114/126 kB | 40/128 kB | 7.7/388 kB
Progress (4): 16/91 kB | 114/126 kB | 44/128 kB | 7.7/388 kB
Progress (4): 16/91 kB | 118/126 kB | 44/128 kB | 7.7/388 kB
Progress (4): 16/91 kB | 118/126 kB | 48/128 kB | 7.7/388 kB
Progress (4): 16/91 kB | 122/126 kB | 48/128 kB | 7.7/388 kB
Progress (4): 16/91 kB | 126/126 kB | 48/128 kB | 7.7/388 kB
Progress (4): 16/91 kB | 126/126 kB | 52/128 kB | 7.7/388 kB
Progress (4): 16/91 kB | 126/126 kB | 52/128 kB | 12/388 kB 
Progress (4): 16/91 kB | 126 kB | 52/128 kB | 12/388 kB    
Progress (4): 16/91 kB | 126 kB | 56/128 kB | 12/388 kB
Progress (4): 16/91 kB | 126 kB | 56/128 kB | 16/388 kB
Progress (4): 16/91 kB | 126 kB | 60/128 kB | 16/388 kB
Progress (4): 16/91 kB | 126 kB | 64/128 kB | 16/388 kB
Progress (4): 16/91 kB | 126 kB | 68/128 kB | 16/388 kB
Progress (4): 16/91 kB | 126 kB | 72/128 kB | 16/388 kB
Progress (4): 16/91 kB | 126 kB | 72/128 kB | 20/388 kB
Progress (4): 16/91 kB | 126 kB | 76/128 kB | 20/388 kB
Progress (4): 16/91 kB | 126 kB | 76/128 kB | 24/388 kB
Progress (4): 16/91 kB | 126 kB | 80/128 kB | 24/388 kB
Progress (4): 16/91 kB | 126 kB | 84/128 kB | 24/388 kB
Progress (4): 16/91 kB | 126 kB | 88/128 kB | 24/388 kB
Progress (4): 16/91 kB | 126 kB | 92/128 kB | 24/388 kB
Progress (4): 16/91 kB | 126 kB | 96/128 kB | 24/388 kB
Progress (4): 16/91 kB | 126 kB | 96/128 kB | 28/388 kB
Progress (4): 16/91 kB | 126 kB | 96/128 kB | 32/388 kB
Progress (4): 16/91 kB | 126 kB | 100/128 kB | 32/388 kB
Progress (4): 16/91 kB | 126 kB | 100/128 kB | 33/388 kB
Progress (4): 16/91 kB | 126 kB | 104/128 kB | 33/388 kB
Progress (4): 16/91 kB | 126 kB | 108/128 kB | 33/388 kB
Progress (4): 16/91 kB | 126 kB | 112/128 kB | 33/388 kB
Progress (4): 16/91 kB | 126 kB | 116/128 kB | 33/388 kB
Progress (4): 16/91 kB | 126 kB | 120/128 kB | 33/388 kB
Progress (4): 16/91 kB | 126 kB | 120/128 kB | 37/388 kB
Progress (4): 16/91 kB | 126 kB | 124/128 kB | 37/388 kB
Progress (4): 16/91 kB | 126 kB | 124/128 kB | 41/388 kB
Progress (4): 16/91 kB | 126 kB | 128/128 kB | 41/388 kB
Progress (4): 16/91 kB | 126 kB | 128 kB | 41/388 kB    
                                                    
Downloaded from eclipse.maven.central.mirror: https://repo.eclipse.org/content/repositories/maven_central/org/jacoco/org.jacoco.core/0.7.9/org.jacoco.core-0.7.9.jar (126 kB at 952 kB/s)
Progress (3): 16/91 kB | 128 kB | 45/388 kB
Progress (3): 16/91 kB | 128 kB | 49/388 kB
Progress (3): 16/91 kB | 128 kB | 53/388 kB
Progress (3): 16/91 kB | 128 kB | 57/388 kB
Progress (3): 16/91 kB | 128 kB | 61/388 kB
Progress (3): 16/91 kB | 128 kB | 65/388 kB
Progress (3): 16/91 kB | 128 kB | 66/388 kB
Progress (3): 16/91 kB | 128 kB | 70/388 kB
Progress (3): 16/91 kB | 128 kB | 74/388 kB
                                           
Downloaded from eclipse.maven.central.mirror: https://repo.eclipse.org/content/repositories/maven_central/org/jacoco/org.jacoco.report/0.7.9/org.jacoco.report-0.7.9.jar (128 kB at 948 kB/s)
Progress (2): 16/91 kB | 78/388 kB
Progress (2): 16/91 kB | 82/388 kB
Progress (2): 16/91 kB | 86/388 kB
Progress (2): 16/91 kB | 90/388 kB
Progress (2): 16/91 kB | 94/388 kB
Progress (2): 16/91 kB | 98/388 kB
Progress (2): 16/91 kB | 98/388 kB
Progress (2): 16/91 kB | 102/388 kB
Progress (2): 16/91 kB | 106/388 kB
Progress (2): 16/91 kB | 110/388 kB
Progress (2): 16/91 kB | 114/388 kB
Progress (2): 16/91 kB | 118/388 kB
Progress (2): 16/91 kB | 122/388 kB
Progress (2): 16/91 kB | 126/388 kB
Progress (2): 16/91 kB | 130/388 kB
Progress (2): 16/91 kB | 131/388 kB
Progress (2): 16/91 kB | 135/388 kB
Progress (2): 16/91 kB | 139/388 kB
Progress (2): 16/91 kB | 143/388 kB
Progress (2): 16/91 kB | 147/388 kB
Progress (2): 16/91 kB | 151/388 kB
Progress (2): 16/91 kB | 155/388 kB
Progress (2): 16/91 kB | 159/388 kB
Progress (2): 16/91 kB | 163/388 kB
Progress (2): 16/91 kB | 167/388 kB
Progress (2): 16/91 kB | 171/388 kB
Progress (2): 16/91 kB | 175/388 kB
Progress (2): 16/91 kB | 179/388 kB
Progress (2): 16/91 kB | 183/388 kB
Progress (2): 16/91 kB | 187/388 kB
Progress (2): 16/91 kB | 191/388 kB
Progress (2): 16/91 kB | 195/388 kB
Progress (2): 16/91 kB | 199/388 kB
Progress (2): 16/91 kB | 203/388 kB
Progress (2): 16/91 kB | 207/388 kB
Progress (2): 16/91 kB | 211/388 kB
Progress (2): 16/91 kB | 215/388 kB
Progress (2): 16/91 kB | 219/388 kB
Progress (2): 16/91 kB | 223/388 kB
Progress (2): 16/91 kB | 227/388 kB
Progress (2): 16/91 kB | 231/388 kB
Progress (2): 16/91 kB | 235/388 kB
Progress (2): 16/91 kB | 239/388 kB
Progress (2): 16/91 kB | 243/388 kB
Progress (2): 16/91 kB | 247/388 kB
Progress (2): 16/91 kB | 251/388 kB
Progress (2): 16/91 kB | 255/388 kB
Progress (2): 16/91 kB | 259/388 kB
Progress (2): 16/91 kB | 263/388 kB
Progress (2): 16/91 kB | 267/388 kB
Progress (2): 16/91 kB | 271/388 kB
Progress (2): 16/91 kB | 275/388 kB
Progress (2): 16/91 kB | 279/388 kB
Progress (2): 16/91 kB | 283/388 kB
Progress (2): 16/91 kB | 287/388 kB
Progress (2): 16/91 kB | 291/388 kB
Progress (2): 16/91 kB | 295/388 kB
Progress (2): 16/91 kB | 299/388 kB
Progress (2): 16/91 kB | 303/388 kB
Progress (2): 16/91 kB | 307/388 kB
Progress (2): 16/91 kB | 311/388 kB
Progress (2): 16/91 kB | 315/388 kB
Progress (2): 16/91 kB | 319/388 kB
Progress (2): 16/91 kB | 323/388 kB
Progress (2): 16/91 kB | 327/388 kB
Progress (2): 16/91 kB | 331/388 kB
Progress (2): 16/91 kB | 335/388 kB
Progress (2): 16/91 kB | 339/388 kB
Progress (2): 16/91 kB | 343/388 kB
Progress (2): 16/91 kB | 347/388 kB
Progress (2): 16/91 kB | 351/388 kB
Progress (2): 16/91 kB | 355/388 kB
Progress (2): 16/91 kB | 359/388 kB
Progress (2): 16/91 kB | 363/388 kB
Progress (2): 16/91 kB | 367/388 kB
Progress (2): 16/91 kB | 371/388 kB
Progress (2): 16/91 kB | 375/388 kB
Progress (2): 16/91 kB | 379/388 kB
Progress (2): 16/91 kB | 383/388 kB
Progress (2): 16/91 kB | 387/388 kB
Progress (2): 16/91 kB | 388 kB    
                               
Downloaded from eclipse.maven.central.mirror: https://repo.eclipse.org/content/repositories/maven_central/org/ow2/asm/asm-debug-all/5.2/asm-debug-all-5.2.jar (388 kB at 2.3 MB/s)
Progress (2): 16/91 kB | 4.1/109 kB
Progress (2): 16/91 kB | 7.7/109 kB
Progress (2): 16/91 kB | 12/109 kB 
Progress (2): 16/91 kB | 16/109 kB
Progress (2): 16/91 kB | 20/109 kB
Progress (2): 16/91 kB | 24/109 kB
Progress (2): 16/91 kB | 28/109 kB
Progress (2): 16/91 kB | 32/109 kB
Progress (2): 20/91 kB | 32/109 kB
Progress (2): 20/91 kB | 33/109 kB
Progress (2): 24/91 kB | 33/109 kB
Progress (2): 24/91 kB | 37/109 kB
Progress (2): 28/91 kB | 37/109 kB
Progress (2): 28/91 kB | 41/109 kB
Progress (2): 32/91 kB | 41/109 kB
Progress (2): 32/91 kB | 45/109 kB
Progress (2): 33/91 kB | 45/109 kB
Progress (2): 33/91 kB | 49/109 kB
Progress (2): 37/91 kB | 49/109 kB
Progress (2): 37/91 kB | 53/109 kB
Progress (2): 41/91 kB | 53/109 kB
Progress (2): 41/91 kB | 57/109 kB
Progress (2): 45/91 kB | 57/109 kB
Progress (2): 45/91 kB | 61/109 kB
Progress (2): 49/91 kB | 61/109 kB
Progress (2): 49/91 kB | 65/109 kB
Progress (2): 49/91 kB | 66/109 kB
Progress (2): 53/91 kB | 66/109 kB
Progress (2): 53/91 kB | 70/109 kB
Progress (2): 57/91 kB | 70/109 kB
Progress (2): 57/91 kB | 74/109 kB
Progress (2): 61/91 kB | 74/109 kB
Progress (2): 61/91 kB | 78/109 kB
Progress (2): 65/91 kB | 78/109 kB
Progress (2): 65/91 kB | 82/109 kB
Progress (2): 69/91 kB | 82/109 kB
Progress (2): 69/91 kB | 86/109 kB
Progress (2): 73/91 kB | 86/109 kB
Progress (2): 73/91 kB | 90/109 kB
Progress (2): 77/91 kB | 90/109 kB
Progress (2): 77/91 kB | 94/109 kB
Progress (2): 81/91 kB | 94/109 kB
Progress (2): 81/91 kB | 98/109 kB
Progress (2): 81/91 kB | 102/109 kB
Progress (2): 85/91 kB | 102/109 kB
Progress (2): 85/91 kB | 106/109 kB
Progress (2): 89/91 kB | 106/109 kB
Progress (2): 89/91 kB | 109 kB    
Progress (2): 91 kB | 109 kB   
                            
Downloaded from eclipse.maven.central.mirror: https://repo.eclipse.org/content/repositories/maven_central/xml-apis/xml-apis/1.0.b2/xml-apis-1.0.b2.jar (109 kB at 349 kB/s)
Downloaded from eclipse.maven.central.mirror: https://repo.eclipse.org/content/repositories/maven_central/commons-validator/commons-validator/1.2.0/commons-validator-1.2.0.jar (91 kB at 291 kB/s)
[INFO] argLine set to -javaagent:/home/hudson/genie.recommenders/.jenkins/jobs/org.eclipse.recommenders.snipmatch-gerrit/workspace/simrel/luna/toolchain/JavaSE-1.7/.repository/org/jacoco/org.jacoco.agent/0.7.9/org.jacoco.agent-0.7.9-runtime.jar=destfile=/jobs/genie.recommenders/org.eclipse.recommenders.snipmatch-gerrit/workspace/simrel/luna/toolchain/target/jacoco.exec,append=true,includes=org.eclipse.recommenders.*
[INFO] 
[INFO] --- animal-sniffer-maven-plugin:1.14:check (check-signature) @ tests ---
[INFO] Checking unresolved references to org.codehaus.mojo.signature:java17:1.0
[INFO] 
[INFO] --- tycho-source-plugin:1.0.0:plugin-source (attach-source) @ tests ---
[INFO] 
[INFO] --- tidy-maven-plugin:1.0.0:check (check-pom) @ tests ---
[INFO] 
[INFO] --- maven-checkstyle-plugin:2.12:check (check-coding-conventions) @ tests ---
[INFO] 
[INFO] 
[INFO] --- maven-license-plugin:1.9.0:check (check-license-headers) @ tests ---
[INFO] Checking licenses...
[WARNING] Property 'strictCheck' is not enabled. Please consider adding <strictCheck>true</strictCheck> in your pom.xml file.
[WARNING] See http://code.google.com/p/maven-license-plugin/wiki/Configuration for more information.
[INFO] 
[INFO] ------------------------------------------------------------------------
[INFO] Building org.eclipse.recommenders.templates.tests 0.3.0-SNAPSHOT
[INFO] ------------------------------------------------------------------------
[INFO] 
[INFO] --- maven-clean-plugin:3.0.0:clean (default-clean) @ org.eclipse.recommenders.templates.tests ---
[INFO] Deleting /jobs/genie.recommenders/org.eclipse.recommenders.snipmatch-gerrit/workspace/simrel/luna/toolchain/JavaSE-1.7/tests/org.eclipse.recommenders.templates.tests/target (includes = [], excludes = [generated-sources/xtext/**])
[INFO] 
[INFO] --- tycho-packaging-plugin:1.0.0:build-qualifier (default-build-qualifier) @ org.eclipse.recommenders.templates.tests ---
[WARNING] Working tree is dirty.
git status tests/org.eclipse.recommenders.templates.tests:

Changes not staged for commit:
	modified:    tests/org.eclipse.recommenders.templates.tests/META-INF/MANIFEST.MF

[WARNING] Fallback to default timestamp provider
[INFO] The project's OSGi version is 0.3.0.v20180117-1103
[INFO] 
[INFO] --- tycho-packaging-plugin:1.0.0:validate-id (default-validate-id) @ org.eclipse.recommenders.templates.tests ---
[INFO] 
[INFO] --- tycho-packaging-plugin:1.0.0:validate-version (default-validate-version) @ org.eclipse.recommenders.templates.tests ---
[INFO] 
[INFO] --- maven-enforcer-plugin:1.4.1:enforce (require-maven-version) @ org.eclipse.recommenders.templates.tests ---
[INFO] 
[INFO] --- maven-enforcer-plugin:1.4.1:enforce (require-plugin-versions) @ org.eclipse.recommenders.templates.tests ---
[INFO] 
[INFO] --- maven-toolchains-plugin:1.1:toolchain (default) @ org.eclipse.recommenders.templates.tests ---
[INFO] Required toolchain: jdk [ id='JavaSE-1.7' ]
[INFO] Found matching toolchain for type jdk: JDK[/opt/public/common/jdk1.7.0-latest/jre]
[INFO] 
[INFO] --- jacoco-maven-plugin:0.7.9:prepare-agent (prepare-agent) @ org.eclipse.recommenders.templates.tests ---
[INFO] tycho.testArgLine set to -javaagent:/home/hudson/genie.recommenders/.jenkins/jobs/org.eclipse.recommenders.snipmatch-gerrit/workspace/simrel/luna/toolchain/JavaSE-1.7/.repository/org/jacoco/org.jacoco.agent/0.7.9/org.jacoco.agent-0.7.9-runtime.jar=destfile=/jobs/genie.recommenders/org.eclipse.recommenders.snipmatch-gerrit/workspace/simrel/luna/toolchain/JavaSE-1.7/target/jacoco.exec,append=true,includes=org.eclipse.recommenders.*
[INFO] 
[INFO] --- maven-resources-plugin:2.7:resources (default-resources) @ org.eclipse.recommenders.templates.tests ---
[INFO] Using 'UTF-8' encoding to copy filtered resources.
[INFO] Copying 74 resources
[INFO] 
[INFO] --- tycho-compiler-plugin:1.0.0:compile (default-compile) @ org.eclipse.recommenders.templates.tests ---
[INFO] Compiling 7 source files to /jobs/genie.recommenders/org.eclipse.recommenders.snipmatch-gerrit/workspace/simrel/luna/toolchain/JavaSE-1.7/tests/org.eclipse.recommenders.templates.tests/target/classes
[INFO] 
[INFO] --- animal-sniffer-maven-plugin:1.14:check (check-signature) @ org.eclipse.recommenders.templates.tests ---
[INFO] Checking unresolved references to org.codehaus.mojo.signature:java17:1.0
[INFO] 
[INFO] --- maven-resources-plugin:2.7:testResources (default-testResources) @ org.eclipse.recommenders.templates.tests ---
[INFO] Using 'UTF-8' encoding to copy filtered resources.
[INFO] skip non existing resourceDirectory /jobs/genie.recommenders/org.eclipse.recommenders.snipmatch-gerrit/workspace/simrel/luna/toolchain/JavaSE-1.7/tests/org.eclipse.recommenders.templates.tests/src/test/resources
[INFO] 
[INFO] --- tycho-source-plugin:1.0.0:plugin-source (attach-source) @ org.eclipse.recommenders.templates.tests ---
[WARNING] bundle localization file /jobs/genie.recommenders/org.eclipse.recommenders.snipmatch-gerrit/workspace/simrel/luna/toolchain/JavaSE-1.7/tests/org.eclipse.recommenders.templates.tests/plugin.properties not found
[INFO] Building jar: /jobs/genie.recommenders/org.eclipse.recommenders.snipmatch-gerrit/workspace/simrel/luna/toolchain/JavaSE-1.7/tests/org.eclipse.recommenders.templates.tests/target/org.eclipse.recommenders.templates.tests-0.3.0-SNAPSHOT-sources.jar
[INFO] 
[INFO] --- target-platform-configuration:1.0.0:target-platform (default-target-platform) @ org.eclipse.recommenders.templates.tests ---
[INFO] 
[INFO] --- tycho-packaging-plugin:1.0.0:package-plugin (default-package-plugin) @ org.eclipse.recommenders.templates.tests ---
[INFO] Building jar: /jobs/genie.recommenders/org.eclipse.recommenders.snipmatch-gerrit/workspace/simrel/luna/toolchain/JavaSE-1.7/tests/org.eclipse.recommenders.templates.tests/target/org.eclipse.recommenders.templates.tests-0.3.0-SNAPSHOT.jar
[INFO] 
[INFO] --- tycho-p2-plugin:1.0.0:p2-metadata-default (default-p2-metadata-default) @ org.eclipse.recommenders.templates.tests ---
[INFO] 
[INFO] --- tycho-surefire-plugin:1.0.0:test (default-test) @ org.eclipse.recommenders.templates.tests ---
[INFO] Toolchain in tycho-surefire-plugin: JDK[/opt/public/common/jdk1.7.0-latest/jre]
[INFO] Expected eclipse log file: /jobs/genie.recommenders/org.eclipse.recommenders.snipmatch-gerrit/workspace/simrel/luna/toolchain/JavaSE-1.7/tests/org.eclipse.recommenders.templates.tests/target/work/data/.metadata/.log
[INFO] Command line:
	[/opt/public/common/jdk1.7.0-latest/jre/bin/java, -Dosgi.noShutdown=false, -Dosgi.os=linux, -Dosgi.ws=gtk, -Dosgi.arch=x86_64, -javaagent:/home/hudson/genie.recommenders/.jenkins/jobs/org.eclipse.recommenders.snipmatch-gerrit/workspace/simrel/luna/toolchain/JavaSE-1.7/.repository/org/jacoco/org.jacoco.agent/0.7.9/org.jacoco.agent-0.7.9-runtime.jar=destfile=/jobs/genie.recommenders/org.eclipse.recommenders.snipmatch-gerrit/workspace/simrel/luna/toolchain/JavaSE-1.7/target/jacoco.exec,append=true,includes=org.eclipse.recommenders.*, -XX:MaxPermSize=128m, -Dosgi.clean=true, -Dorg.eclipse.swtbot.screenshots.dir=/jobs/genie.recommenders/org.eclipse.recommenders.snipmatch-gerrit/workspace/simrel/luna/toolchain/JavaSE-1.7/tests/org.eclipse.recommenders.templates.tests/target/screenshots, -jar, /jobs/genie.recommenders/org.eclipse.recommenders.snipmatch-gerrit/workspace/simrel/luna/toolchain/JavaSE-1.7/.repository/p2/osgi/bundle/org.eclipse.equinox.launcher/1.3.0.v20140415-2008/org.eclipse.equinox.launcher-1.3.0.v20140415-2008.jar, -data, /jobs/genie.recommenders/org.eclipse.recommenders.snipmatch-gerrit/workspace/simrel/luna/toolchain/JavaSE-1.7/tests/org.eclipse.recommenders.templates.tests/target/work/data, -install, /jobs/genie.recommenders/org.eclipse.recommenders.snipmatch-gerrit/workspace/simrel/luna/toolchain/JavaSE-1.7/tests/org.eclipse.recommenders.templates.tests/target/work, -configuration, /jobs/genie.recommenders/org.eclipse.recommenders.snipmatch-gerrit/workspace/simrel/luna/toolchain/JavaSE-1.7/tests/org.eclipse.recommenders.templates.tests/target/work/configuration, -application, org.eclipse.tycho.surefire.osgibooter.headlesstest, -testproperties, /jobs/genie.recommenders/org.eclipse.recommenders.snipmatch-gerrit/workspace/simrel/luna/toolchain/JavaSE-1.7/tests/org.eclipse.recommenders.templates.tests/target/surefire.properties]

-------------------------------------------------------
 T E S T S
-------------------------------------------------------
Running org.eclipse.recommenders.templates.validation.TemplateJavaValidatorTest
log4j:WARN No appenders could be found for logger (org.eclipse.xtext.parser.antlr.AbstractInternalAntlrParser).
log4j:WARN Please initialize the log4j system properly.
Tests run: 2, Failures: 0, Errors: 0, Skipped: 0, Time elapsed: 1.712 sec - in org.eclipse.recommenders.templates.validation.TemplateJavaValidatorTest
test[0 (Nounique variable types should give error code): File uniqueVariableTypesTest => error code 101](org.eclipse.recommenders.templates.validation.TemplateJavaValidatorTest)  Time elapsed: 1.477 sec
test[1 (Nounique variable keywords should give error code): File uniqueVariableKeywordsTest => error code 102](org.eclipse.recommenders.templates.validation.TemplateJavaValidatorTest)  Time elapsed: 0.162 sec
Running org.eclipse.recommenders.templates.BuiltinTemplatesTest
Jan 17, 2018 6:09:36 AM org.eclipse.emf.mwe.utils.StandaloneSetup setPlatformUri
INFO: Registering platform uri '/jobs/genie.recommenders/org.eclipse.recommenders.snipmatch-gerrit/workspace/simrel/luna/toolchain/JavaSE-1.7/tests'
Jan 17, 2018 6:09:36 AM org.eclipse.emf.mwe.utils.StandaloneSetup setPlatformUri
WARNING: No projects found in platform location '..'
because there are no '.project' files.
Please use explicit project mappings:
    projectMapping = { projectName = 'com.acme' path = '../path/com.acme' }.
Tests run: 32, Failures: 0, Errors: 0, Skipped: 0, Time elapsed: 0.92 sec - in org.eclipse.recommenders.templates.BuiltinTemplatesTest
testArrayMerge(org.eclipse.recommenders.templates.BuiltinTemplatesTest)  Time elapsed: 0.211 sec
testSystrace(org.eclipse.recommenders.templates.BuiltinTemplatesTest)  Time elapsed: 0.02 sec
testToarray(org.eclipse.recommenders.templates.BuiltinTemplatesTest)  Time elapsed: 0.024 sec
testNew(org.eclipse.recommenders.templates.BuiltinTemplatesTest)  Time elapsed: 0.014 sec
testNls(org.eclipse.recommenders.templates.BuiltinTemplatesTest)  Time elapsed: 0.02 sec
testTry(org.eclipse.recommenders.templates.BuiltinTemplatesTest)  Time elapsed: 0.022 sec
testCatch(org.eclipse.recommenders.templates.BuiltinTemplatesTest)  Time elapsed: 0.019 sec
testCast(org.eclipse.recommenders.templates.BuiltinTemplatesTest)  Time elapsed: 0.013 sec
testElse(org.eclipse.recommenders.templates.BuiltinTemplatesTest)  Time elapsed: 0.009 sec
testFor1(org.eclipse.recommenders.templates.BuiltinTemplatesTest)  Time elapsed: 0.023 sec
testFor2(org.eclipse.recommenders.templates.BuiltinTemplatesTest)  Time elapsed: 0.029 sec
testFor3(org.eclipse.recommenders.templates.BuiltinTemplatesTest)  Time elapsed: 0.037 sec
testLazy(org.eclipse.recommenders.templates.BuiltinTemplatesTest)  Time elapsed: 0.023 sec
testMain(org.eclipse.recommenders.templates.BuiltinTemplatesTest)  Time elapsed: 0.016 sec
testTest(org.eclipse.recommenders.templates.BuiltinTemplatesTest)  Time elapsed: 0.018 sec
testForeach(org.eclipse.recommenders.templates.BuiltinTemplatesTest)  Time elapsed: 0.016 sec
testDo(org.eclipse.recommenders.templates.BuiltinTemplatesTest)  Time elapsed: 0.015 sec
testIf(org.eclipse.recommenders.templates.BuiltinTemplatesTest)  Time elapsed: 0.012 sec
testArrayAdd(org.eclipse.recommenders.templates.BuiltinTemplatesTest)  Time elapsed: 0.039 sec
testSynchronized(org.eclipse.recommenders.templates.BuiltinTemplatesTest)  Time elapsed: 0.011 sec
testInstanceof(org.eclipse.recommenders.templates.BuiltinTemplatesTest)  Time elapsed: 0.019 sec
testStaticFinal(org.eclipse.recommenders.templates.BuiltinTemplatesTest)  Time elapsed: 0.015 sec
testFallThrough(org.eclipse.recommenders.templates.BuiltinTemplatesTest)  Time elapsed: 0.007 sec
testElseIf(org.eclipse.recommenders.templates.BuiltinTemplatesTest)  Time elapsed: 0.01 sec
testIfElse(org.eclipse.recommenders.templates.BuiltinTemplatesTest)  Time elapsed: 0.012 sec
testRunnable(org.eclipse.recommenders.templates.BuiltinTemplatesTest)  Time elapsed: 0.013 sec
testSwitch(org.eclipse.recommenders.templates.BuiltinTemplatesTest)  Time elapsed: 0.015 sec
testSyserr(org.eclipse.recommenders.templates.BuiltinTemplatesTest)  Time elapsed: 0.011 sec
testSysout(org.eclipse.recommenders.templates.BuiltinTemplatesTest)  Time elapsed: 0.01 sec
testWhile1(org.eclipse.recommenders.templates.BuiltinTemplatesTest)  Time elapsed: 0.023 sec
testWhile2(org.eclipse.recommenders.templates.BuiltinTemplatesTest)  Time elapsed: 0.022 sec
testWhile3(org.eclipse.recommenders.templates.BuiltinTemplatesTest)  Time elapsed: 0.01 sec
Running org.eclipse.recommenders.templates.LexerTemplatesTest
Tests run: 8, Failures: 1, Errors: 4, Skipped: 0, Time elapsed: 0.02 sec <<< FAILURE! - in org.eclipse.recommenders.templates.LexerTemplatesTest
smoketestLexerHexaFloatPoint(org.eclipse.recommenders.templates.LexerTemplatesTest)  Time elapsed: 0.003 sec  <<< ERROR!
java.lang.NullPointerException: null
	at com.itemis.xtext.testing.XtextTestBase.testNotTerminal(XtextTestBase.java:356)
	at org.eclipse.recommenders.templates.LexerTemplatesTest.smoketestLexerHexaFloatPoint(LexerTemplatesTest.java:96)

smoketestLexerBinaryToken(org.eclipse.recommenders.templates.LexerTemplatesTest)  Time elapsed: 0.001 sec
testLexerANYOTHERToken(org.eclipse.recommenders.templates.LexerTemplatesTest)  Time elapsed: 0.001 sec
smoketestLexerDecimalFloatPointToken(org.eclipse.recommenders.templates.LexerTemplatesTest)  Time elapsed: 0.001 sec  <<< FAILURE!
java.lang.AssertionError: 0._01F
	at org.junit.Assert.fail(Assert.java:88)
	at org.junit.Assert.assertTrue(Assert.java:41)
	at org.junit.Assert.assertFalse(Assert.java:64)
	at com.itemis.xtext.testing.XtextTestBase.testNotTerminal(XtextTestBase.java:355)
	at org.eclipse.recommenders.templates.LexerTemplatesTest.smoketestLexerDecimalFloatPointToken(LexerTemplatesTest.java:80)

testLexerIDToken(org.eclipse.recommenders.templates.LexerTemplatesTest)  Time elapsed: 0 sec  <<< ERROR!
java.lang.NullPointerException: null
	at com.itemis.xtext.testing.XtextTestBase.testNotTerminal(XtextTestBase.java:356)
	at org.eclipse.recommenders.templates.LexerTemplatesTest.testLexerIDToken(LexerTemplatesTest.java:60)

smoketestLexerHexaToken(org.eclipse.recommenders.templates.LexerTemplatesTest)  Time elapsed: 0 sec
smoketestLexerOctalToken(org.eclipse.recommenders.templates.LexerTemplatesTest)  Time elapsed: 0 sec  <<< ERROR!
java.lang.NullPointerException: null
	at com.itemis.xtext.testing.XtextTestBase.testNotTerminal(XtextTestBase.java:356)
	at org.eclipse.recommenders.templates.LexerTemplatesTest.smoketestLexerOctalToken(LexerTemplatesTest.java:140)

smoketestLexerDecimalToken(org.eclipse.recommenders.templates.LexerTemplatesTest)  Time elapsed: 0.001 sec  <<< ERROR!
java.lang.NullPointerException: null
	at com.itemis.xtext.testing.XtextTestBase.testNotTerminal(XtextTestBase.java:356)
	at org.eclipse.recommenders.templates.LexerTemplatesTest.smoketestLexerDecimalToken(LexerTemplatesTest.java:127)

Running org.eclipse.recommenders.templates.ParserTemplatesTest
Tests run: 11, Failures: 0, Errors: 0, Skipped: 0, Time elapsed: 0.032 sec - in org.eclipse.recommenders.templates.ParserTemplatesTest
testParserTemplateSingleQuotedStringRule(org.eclipse.recommenders.templates.ParserTemplatesTest)  Time elapsed: 0.006 sec
testParserJavaKeywordRule(org.eclipse.recommenders.templates.ParserTemplatesTest)  Time elapsed: 0.001 sec
testParserEscapeRule(org.eclipse.recommenders.templates.ParserTemplatesTest)  Time elapsed: 0.003 sec
smoketestParserNumericLiteralAsIdentifier(org.eclipse.recommenders.templates.ParserTemplatesTest)  Time elapsed: 0.002 sec
smoketestParserIntegerLiteralRuleBUG(org.eclipse.recommenders.templates.ParserTemplatesTest)  Time elapsed: 0.001 sec
testParserJavaIdentifierRule(org.eclipse.recommenders.templates.ParserTemplatesTest)  Time elapsed: 0.002 sec
testParserFullVariableRule(org.eclipse.recommenders.templates.ParserTemplatesTest)  Time elapsed: 0.001 sec
testParserProposalRule(org.eclipse.recommenders.templates.ParserTemplatesTest)  Time elapsed: 0.002 sec
testParserSimpleVariableRule(org.eclipse.recommenders.templates.ParserTemplatesTest)  Time elapsed: 0.001 sec
testParserTextRule(org.eclipse.recommenders.templates.ParserTemplatesTest)  Time elapsed: 0.002 sec
testParserTypeRule(org.eclipse.recommenders.templates.ParserTemplatesTest)  Time elapsed: 0.002 sec
Running org.eclipse.recommenders.templates.SmoketestTemplatesTest
Tests run: 40, Failures: 0, Errors: 0, Skipped: 1, Time elapsed: 0.762 sec - in org.eclipse.recommenders.templates.SmoketestTemplatesTest
smoketestImportVariable(org.eclipse.recommenders.templates.SmoketestTemplatesTest)  Time elapsed: 0.013 sec
smoketestSLInMLComments(org.eclipse.recommenders.templates.SmoketestTemplatesTest)  Time elapsed: 0.013 sec
smoketestPrimitiveFloats(org.eclipse.recommenders.templates.SmoketestTemplatesTest)  Time elapsed: 0.028 sec
smoketestLinkVariable(org.eclipse.recommenders.templates.SmoketestTemplatesTest)  Time elapsed: 0.017 sec
smoketestPrimitiveDoubles(org.eclipse.recommenders.templates.SmoketestTemplatesTest)  Time elapsed: 0.027 sec
smoketestSLTemplateVariablesComments(org.eclipse.recommenders.templates.SmoketestTemplatesTest)  Time elapsed: 0.015 sec
smoketestClassDefinition(org.eclipse.recommenders.templates.SmoketestTemplatesTest)  Time elapsed: 0.017 sec
smoketestSerializeAnnotation(org.eclipse.recommenders.templates.SmoketestTemplatesTest)  Time elapsed: 0.018 sec
smoketestPrimitiveTemplateVariables(org.eclipse.recommenders.templates.SmoketestTemplatesTest)  Time elapsed: 0.022 sec
smoketestescapesInDoubleQuote(org.eclipse.recommenders.templates.SmoketestTemplatesTest)  Time elapsed: 0.011 sec
smoketestNoElementAnnotation(org.eclipse.recommenders.templates.SmoketestTemplatesTest)  Time elapsed: 0.012 sec
smoketestAbstractAnnotations(org.eclipse.recommenders.templates.SmoketestTemplatesTest)  Time elapsed: 0.014 sec
smoketestEscapesInSingleQuote(org.eclipse.recommenders.templates.SmoketestTemplatesTest)  Time elapsed: 0.01 sec
smoketestFieldVariable(org.eclipse.recommenders.templates.SmoketestTemplatesTest)  Time elapsed: 0.007 sec
smoketestSignsAndNumbersComments(org.eclipse.recommenders.templates.SmoketestTemplatesTest)  Time elapsed: 0.048 sec
smoketestPrimitiveCharEscapes(org.eclipse.recommenders.templates.SmoketestTemplatesTest)  Time elapsed: 0.046 sec
smoketestMLInSLComments(org.eclipse.recommenders.templates.SmoketestTemplatesTest)  Time elapsed: 0.01 sec
smoketestTestMethod(org.eclipse.recommenders.templates.SmoketestTemplatesTest)  Time elapsed: 0.011 sec
smoketestDoubleQuoteString(org.eclipse.recommenders.templates.SmoketestTemplatesTest)  Time elapsed: 0.009 sec
smoketestSingleElementAnnotations(org.eclipse.recommenders.templates.SmoketestTemplatesTest)  Time elapsed: 0.037 sec
smoketestEnclosingProjectVariable(org.eclipse.recommenders.templates.SmoketestTemplatesTest)  Time elapsed: 0.012 sec
smoketestIncompleteComments(org.eclipse.recommenders.templates.SmoketestTemplatesTest)  Time elapsed: 0.027 sec
smoketestEnclosingTypeVariable(org.eclipse.recommenders.templates.SmoketestTemplatesTest)  Time elapsed: 0.011 sec
smoketestAnnotations(org.eclipse.recommenders.templates.SmoketestTemplatesTest)  Time elapsed: 0.025 sec
smoketestLocalVarVariable(org.eclipse.recommenders.templates.SmoketestTemplatesTest)  Time elapsed: 0.006 sec
smoketestCopyrightComment(org.eclipse.recommenders.templates.SmoketestTemplatesTest)  Time elapsed: 0.102 sec
smoketestPrimitiveCharQuotes(org.eclipse.recommenders.templates.SmoketestTemplatesTest)  Time elapsed: 0.009 sec
smoketestNestedMLComments(org.eclipse.recommenders.templates.SmoketestTemplatesTest) skipped
smoketestNewNameVariable(org.eclipse.recommenders.templates.SmoketestTemplatesTest)  Time elapsed: 0.008 sec
smoketestArgTypeVariable(org.eclipse.recommenders.templates.SmoketestTemplatesTest)  Time elapsed: 0.015 sec
smoketestNewTypeVariable(org.eclipse.recommenders.templates.SmoketestTemplatesTest)  Time elapsed: 0.007 sec
smoketestMLTemplateVariablesComments(org.eclipse.recommenders.templates.SmoketestTemplatesTest)  Time elapsed: 0.023 sec
smoketestVarVariable(org.eclipse.recommenders.templates.SmoketestTemplatesTest)  Time elapsed: 0.007 sec
smoketestElemTypeVariable(org.eclipse.recommenders.templates.SmoketestTemplatesTest)  Time elapsed: 0.005 sec
smoketestNormalAnnotations(org.eclipse.recommenders.templates.SmoketestTemplatesTest)  Time elapsed: 0.043 sec
smoketestPrimitiveLongs(org.eclipse.recommenders.templates.SmoketestTemplatesTest)  Time elapsed: 0.011 sec
smoketestSingleQuoteString(org.eclipse.recommenders.templates.SmoketestTemplatesTest)  Time elapsed: 0.009 sec
smoketestPrimitiveBinaries(org.eclipse.recommenders.templates.SmoketestTemplatesTest)  Time elapsed: 0.011 sec
smoketestPrimitiveHexa(org.eclipse.recommenders.templates.SmoketestTemplatesTest)  Time elapsed: 0.01 sec
smoketestPrimitiveInts(org.eclipse.recommenders.templates.SmoketestTemplatesTest)  Time elapsed: 0.013 sec

Results :

Failed tests: 
  LexerTemplatesTest.smoketestLexerDecimalFloatPointToken:80->XtextTestBase.testNotTerminal:355 0._01F

Tests in error: 
  LexerTemplatesTest.smoketestLexerHexaFloatPoint:96->XtextTestBase.testNotTerminal:356 » NullPointer
  LexerTemplatesTest.testLexerIDToken:60->XtextTestBase.testNotTerminal:356 » NullPointer
  LexerTemplatesTest.smoketestLexerOctalToken:140->XtextTestBase.testNotTerminal:356 » NullPointer
  LexerTemplatesTest.smoketestLexerDecimalToken:127->XtextTestBase.testNotTerminal:356 » NullPointer

Tests run: 93, Failures: 1, Errors: 4, Skipped: 1

[INFO] ------------------------------------------------------------------------
[INFO] Reactor Summary:
[INFO] 
[INFO] Release Engineering ................................ SUCCESS [  3.365 s]
[INFO] licenses ........................................... SUCCESS [  2.033 s]
[INFO] Targets Definitions ................................ SUCCESS [  0.188 s]
[INFO] Target Definition for Eclipse Luna ................. SUCCESS [  0.875 s]
[INFO] Plugins ............................................ SUCCESS [ 10.343 s]
[INFO] org.eclipse.recommenders.templates ................. SUCCESS [02:07 min]
[INFO] org.eclipse.recommenders.templates.rcp ............. SUCCESS [ 15.951 s]
[INFO] org.eclipse.recommenders.templates.snipmatch.rcp ... SUCCESS [  7.096 s]
[INFO] Tests .............................................. SUCCESS [  3.332 s]
[INFO] org.eclipse.recommenders.templates.tests ........... FAILURE [ 13.772 s]
[INFO] org.eclipse.recommenders.templates.rcp.tests ....... SKIPPED
[INFO] Features ........................................... SKIPPED
[INFO] org.eclipse.recommenders.templates.3rd.feature ..... SKIPPED
[INFO] org.eclipse.recommenders.templates.rcp.feature ..... SKIPPED
[INFO] org.eclipse.recommenders.templates.snipmatch.rcp.feature SKIPPED
[INFO] repositories ....................................... SKIPPED
[INFO] Snipmatch Editor (Incubator) Head Update Site ...... SKIPPED
[INFO] Snipmatch Editor (Incubator) Milestones Update Site  SKIPPED
[INFO] aggregator ......................................... SKIPPED
[INFO] ------------------------------------------------------------------------
[INFO] BUILD FAILURE
[INFO] ------------------------------------------------------------------------
[INFO] Total time: 06:04 min
[INFO] Finished at: 2018-01-17T06:09:39-05:00
[INFO] Final Memory: 446M/4056M
[INFO] ------------------------------------------------------------------------
[ERROR] Failed to execute goal org.eclipse.tycho:tycho-surefire-plugin:1.0.0:test (default-test) on project org.eclipse.recommenders.templates.tests: There are test failures.
[ERROR] 
[ERROR] Please refer to /jobs/genie.recommenders/org.eclipse.recommenders.snipmatch-gerrit/workspace/simrel/luna/toolchain/JavaSE-1.7/tests/org.eclipse.recommenders.templates.tests/target/surefire-reports for the individual test results.
[ERROR] -> [Help 1]
[ERROR] 
[ERROR] To see the full stack trace of the errors, re-run Maven with the -e switch.
[ERROR] Re-run Maven using the -X switch to enable full debug logging.
[ERROR] 
[ERROR] For more information about the errors and possible solutions, please read the following articles:
[ERROR] [Help 1] http://cwiki.apache.org/confluence/display/MAVEN/MojoFailureException
[ERROR] 
[ERROR] After correcting the problems, you can resume the build with the command
[ERROR]   mvn <goals> -rf :org.eclipse.recommenders.templates.tests
Build step 'Invoke top-level Maven targets' marked build as failure
Terminating xvnc.
[CHECKSTYLE] Skipping publisher since build result is FAILURE
Recording test results
Started calculate disk usage of build
Finished Calculation of disk usage of build in 0 seconds
Started calculate disk usage of workspace
Finished Calculation of disk usage of workspace in 0 seconds
Finished: FAILURE