SuccessConsole Output

Skipping 64 KB.. Full Log
# Benchmark mode: Average time, time/op
# Benchmark: org.eclipse.rdf4j.sail.shacl.benchmark.ParallelBenchmark.shaclSnapshot

# Run progress: NaN% complete, ETA 00:00:00
# Fork: N/A, test runs in the host VM
# *** WARNING: Non-forked runs may silently omit JVM options, mess up profilers, disable compiler hints, etc. ***
# *** WARNING: Use non-forked runs only for debugging purposes, not for actual performance runs. ***
Iteration   1: 49.683 ms/op

Result "org.eclipse.rdf4j.sail.shacl.benchmark.ParallelBenchmark.shaclSnapshot":
  49.683 ms/op


# JMH version: 1.21
# VM version: JDK 11.0.2, OpenJDK 64-Bit Server VM, 11.0.2+9
# VM invoker: /opt/tools/java/openjdk/jdk-11/11.0.2+9/bin/java
# VM options: -Xms8G -Xmx8G -XX:+UseSerialGC
# Warmup: <none>
# Measurement: 1 iterations, single-shot each
# Timeout: 10 min per iteration
# Threads: 1 thread, will synchronize iterations
# Benchmark mode: Average time, time/op
# Benchmark: org.eclipse.rdf4j.sail.shacl.benchmark.ParallelBenchmark.shaclSnapshotMixedReadWrite

# Run progress: NaN% complete, ETA 00:00:00
# Fork: N/A, test runs in the host VM
# *** WARNING: Non-forked runs may silently omit JVM options, mess up profilers, disable compiler hints, etc. ***
# *** WARNING: Use non-forked runs only for debugging purposes, not for actual performance runs. ***
Iteration   1: 128.786 ms/op

Result "org.eclipse.rdf4j.sail.shacl.benchmark.ParallelBenchmark.shaclSnapshotMixedReadWrite":
  128.786 ms/op


# JMH version: 1.21
# VM version: JDK 11.0.2, OpenJDK 64-Bit Server VM, 11.0.2+9
# VM invoker: /opt/tools/java/openjdk/jdk-11/11.0.2+9/bin/java
# VM options: -Xms8G -Xmx8G -XX:+UseSerialGC
# Warmup: <none>
# Measurement: 1 iterations, single-shot each
# Timeout: 10 min per iteration
# Threads: 1 thread, will synchronize iterations
# Benchmark mode: Average time, time/op
# Benchmark: org.eclipse.rdf4j.sail.shacl.benchmark.ParallelBenchmark.shaclSnapshotWithoutSerializableValidation

# Run progress: NaN% complete, ETA 00:00:00
# Fork: N/A, test runs in the host VM
# *** WARNING: Non-forked runs may silently omit JVM options, mess up profilers, disable compiler hints, etc. ***
# *** WARNING: Use non-forked runs only for debugging purposes, not for actual performance runs. ***
Iteration   1: 34.544 ms/op

Result "org.eclipse.rdf4j.sail.shacl.benchmark.ParallelBenchmark.shaclSnapshotWithoutSerializableValidation":
  34.544 ms/op


# JMH version: 1.21
# VM version: JDK 11.0.2, OpenJDK 64-Bit Server VM, 11.0.2+9
# VM invoker: /opt/tools/java/openjdk/jdk-11/11.0.2+9/bin/java
# VM options: -Xms8G -Xmx8G -XX:+UseSerialGC
# Warmup: <none>
# Measurement: 1 iterations, single-shot each
# Timeout: 10 min per iteration
# Threads: 1 thread, will synchronize iterations
# Benchmark mode: Average time, time/op
# Benchmark: org.eclipse.rdf4j.sail.shacl.benchmark.ParallelBenchmark.shaclSnapshotWithoutSerializableValidationMixedReadWrite

# Run progress: NaN% complete, ETA 00:00:00
# Fork: N/A, test runs in the host VM
# *** WARNING: Non-forked runs may silently omit JVM options, mess up profilers, disable compiler hints, etc. ***
# *** WARNING: Use non-forked runs only for debugging purposes, not for actual performance runs. ***
Iteration   1: 55.460 ms/op

Result "org.eclipse.rdf4j.sail.shacl.benchmark.ParallelBenchmark.shaclSnapshotWithoutSerializableValidationMixedReadWrite":
  55.460 ms/op


# JMH version: 1.21
# VM version: JDK 11.0.2, OpenJDK 64-Bit Server VM, 11.0.2+9
# VM invoker: /opt/tools/java/openjdk/jdk-11/11.0.2+9/bin/java
# VM options: -Xms8G -Xmx8G -XX:+UseSerialGC
# Warmup: <none>
# Measurement: 1 iterations, single-shot each
# Timeout: 10 min per iteration
# Threads: 1 thread, will synchronize iterations
# Benchmark mode: Average time, time/op
# Benchmark: org.eclipse.rdf4j.sail.shacl.benchmark.ShaclLoadingBenchmark.testAddingDataAndAddingShapes

# Run progress: NaN% complete, ETA 00:00:00
# Fork: N/A, test runs in the host VM
# *** WARNING: Non-forked runs may silently omit JVM options, mess up profilers, disable compiler hints, etc. ***
# *** WARNING: Use non-forked runs only for debugging purposes, not for actual performance runs. ***
Iteration   1: 183.394 ms/op

Result "org.eclipse.rdf4j.sail.shacl.benchmark.ShaclLoadingBenchmark.testAddingDataAndAddingShapes":
  183.394 ms/op


# JMH version: 1.21
# VM version: JDK 11.0.2, OpenJDK 64-Bit Server VM, 11.0.2+9
# VM invoker: /opt/tools/java/openjdk/jdk-11/11.0.2+9/bin/java
# VM options: -Xms8G -Xmx8G -XX:+UseG1GC
# Warmup: <none>
# Measurement: 1 iterations, single-shot each
# Timeout: 10 min per iteration
# Threads: 1 thread, will synchronize iterations
# Benchmark mode: Average time, time/op
# Benchmark: org.eclipse.rdf4j.sail.shacl.benchmark.TargetBenchmarkInitialData.benchmark
# Parameters: (existingTargets = 1, shape = shaclDatatypePredicateObjectTarget.ttl)

# Run progress: NaN% complete, ETA 00:00:00
# Fork: N/A, test runs in the host VM
# *** WARNING: Non-forked runs may silently omit JVM options, mess up profilers, disable compiler hints, etc. ***
# *** WARNING: Use non-forked runs only for debugging purposes, not for actual performance runs. ***
Iteration   1: <failure>

java.lang.IllegalArgumentException: Input stream must not be 'null'
	at org.eclipse.rdf4j.rio.turtle.TurtleParser.parse(TurtleParser.java:126)
	at org.eclipse.rdf4j.rio.Rio.parse(Rio.java:296)
	at org.eclipse.rdf4j.rio.Rio.parse(Rio.java:263)
	at org.eclipse.rdf4j.rio.Rio.parse(Rio.java:214)
	at org.eclipse.rdf4j.sail.shacl.Utils.loadShapeData(Utils.java:44)
	at org.eclipse.rdf4j.sail.shacl.Utils.getInitializedShaclSail(Utils.java:90)
	at org.eclipse.rdf4j.sail.shacl.benchmark.TargetBenchmarkInitialData.invocationSetup(TargetBenchmarkInitialData.java:109)
	at org.eclipse.rdf4j.sail.shacl.benchmark.generated.TargetBenchmarkInitialData_benchmark_jmhTest.benchmark_avgt_jmhStub(TargetBenchmarkInitialData_benchmark_jmhTest.java:423)
	at org.eclipse.rdf4j.sail.shacl.benchmark.generated.TargetBenchmarkInitialData_benchmark_jmhTest.benchmark_AverageTime(TargetBenchmarkInitialData_benchmark_jmhTest.java:323)
	at java.base/jdk.internal.reflect.NativeMethodAccessorImpl.invoke0(Native Method)
	at java.base/jdk.internal.reflect.NativeMethodAccessorImpl.invoke(NativeMethodAccessorImpl.java:62)
	at java.base/jdk.internal.reflect.DelegatingMethodAccessorImpl.invoke(DelegatingMethodAccessorImpl.java:43)
	at java.base/java.lang.reflect.Method.invoke(Method.java:566)
	at org.openjdk.jmh.runner.BenchmarkHandler$BenchmarkTask.call(BenchmarkHandler.java:453)
	at org.openjdk.jmh.runner.BenchmarkHandler$BenchmarkTask.call(BenchmarkHandler.java:437)
	at java.base/java.util.concurrent.FutureTask.run(FutureTask.java:264)
	at java.base/java.util.concurrent.Executors$RunnableAdapter.call(Executors.java:515)
	at java.base/java.util.concurrent.FutureTask.run(FutureTask.java:264)
	at java.base/java.util.concurrent.ThreadPoolExecutor.runWorker(ThreadPoolExecutor.java:1128)
	at java.base/java.util.concurrent.ThreadPoolExecutor$Worker.run(ThreadPoolExecutor.java:628)
	at java.base/java.lang.Thread.run(Thread.java:834)


# JMH version: 1.21
# VM version: JDK 11.0.2, OpenJDK 64-Bit Server VM, 11.0.2+9
# VM invoker: /opt/tools/java/openjdk/jdk-11/11.0.2+9/bin/java
# VM options: -Xms8G -Xmx8G -XX:+UseG1GC
# Warmup: <none>
# Measurement: 1 iterations, single-shot each
# Timeout: 10 min per iteration
# Threads: 1 thread, will synchronize iterations
# Benchmark mode: Average time, time/op
# Benchmark: org.eclipse.rdf4j.sail.shacl.benchmark.TargetBenchmarkInitialData.benchmark
# Parameters: (existingTargets = 1, shape = shaclDatatypeSparqlTarget.ttl)

# Run progress: NaN% complete, ETA 00:00:00
# Fork: N/A, test runs in the host VM
# *** WARNING: Non-forked runs may silently omit JVM options, mess up profilers, disable compiler hints, etc. ***
# *** WARNING: Use non-forked runs only for debugging purposes, not for actual performance runs. ***
Iteration   1: <failure>

java.lang.IllegalArgumentException: Input stream must not be 'null'
	at org.eclipse.rdf4j.rio.turtle.TurtleParser.parse(TurtleParser.java:126)
	at org.eclipse.rdf4j.rio.Rio.parse(Rio.java:296)
	at org.eclipse.rdf4j.rio.Rio.parse(Rio.java:263)
	at org.eclipse.rdf4j.rio.Rio.parse(Rio.java:214)
	at org.eclipse.rdf4j.sail.shacl.Utils.loadShapeData(Utils.java:44)
	at org.eclipse.rdf4j.sail.shacl.Utils.getInitializedShaclSail(Utils.java:90)
	at org.eclipse.rdf4j.sail.shacl.benchmark.TargetBenchmarkInitialData.invocationSetup(TargetBenchmarkInitialData.java:109)
	at org.eclipse.rdf4j.sail.shacl.benchmark.generated.TargetBenchmarkInitialData_benchmark_jmhTest.benchmark_avgt_jmhStub(TargetBenchmarkInitialData_benchmark_jmhTest.java:423)
	at org.eclipse.rdf4j.sail.shacl.benchmark.generated.TargetBenchmarkInitialData_benchmark_jmhTest.benchmark_AverageTime(TargetBenchmarkInitialData_benchmark_jmhTest.java:323)
	at java.base/jdk.internal.reflect.NativeMethodAccessorImpl.invoke0(Native Method)
	at java.base/jdk.internal.reflect.NativeMethodAccessorImpl.invoke(NativeMethodAccessorImpl.java:62)
	at java.base/jdk.internal.reflect.DelegatingMethodAccessorImpl.invoke(DelegatingMethodAccessorImpl.java:43)
	at java.base/java.lang.reflect.Method.invoke(Method.java:566)
	at org.openjdk.jmh.runner.BenchmarkHandler$BenchmarkTask.call(BenchmarkHandler.java:453)
	at org.openjdk.jmh.runner.BenchmarkHandler$BenchmarkTask.call(BenchmarkHandler.java:437)
	at java.base/java.util.concurrent.FutureTask.run(FutureTask.java:264)
	at java.base/java.util.concurrent.Executors$RunnableAdapter.call(Executors.java:515)
	at java.base/java.util.concurrent.FutureTask.run(FutureTask.java:264)
	at java.base/java.util.concurrent.ThreadPoolExecutor.runWorker(ThreadPoolExecutor.java:1128)
	at java.base/java.util.concurrent.ThreadPoolExecutor$Worker.run(ThreadPoolExecutor.java:628)
	at java.base/java.lang.Thread.run(Thread.java:834)


# JMH version: 1.21
# VM version: JDK 11.0.2, OpenJDK 64-Bit Server VM, 11.0.2+9
# VM invoker: /opt/tools/java/openjdk/jdk-11/11.0.2+9/bin/java
# VM options: -Xms8G -Xmx8G -XX:+UseG1GC
# Warmup: <none>
# Measurement: 1 iterations, single-shot each
# Timeout: 10 min per iteration
# Threads: 1 thread, will synchronize iterations
# Benchmark mode: Average time, time/op
# Benchmark: org.eclipse.rdf4j.sail.shacl.benchmark.TargetBenchmarkInitialData.benchmark
# Parameters: (existingTargets = 1, shape = shaclDatatypeTargetFilter.ttl)

# Run progress: NaN% complete, ETA 00:00:00
# Fork: N/A, test runs in the host VM
# *** WARNING: Non-forked runs may silently omit JVM options, mess up profilers, disable compiler hints, etc. ***
# *** WARNING: Use non-forked runs only for debugging purposes, not for actual performance runs. ***
Iteration   1: <failure>

java.lang.IllegalArgumentException: Input stream must not be 'null'
	at org.eclipse.rdf4j.rio.turtle.TurtleParser.parse(TurtleParser.java:126)
	at org.eclipse.rdf4j.rio.Rio.parse(Rio.java:296)
	at org.eclipse.rdf4j.rio.Rio.parse(Rio.java:263)
	at org.eclipse.rdf4j.rio.Rio.parse(Rio.java:214)
	at org.eclipse.rdf4j.sail.shacl.Utils.loadShapeData(Utils.java:44)
	at org.eclipse.rdf4j.sail.shacl.Utils.getInitializedShaclSail(Utils.java:90)
	at org.eclipse.rdf4j.sail.shacl.benchmark.TargetBenchmarkInitialData.invocationSetup(TargetBenchmarkInitialData.java:109)
	at org.eclipse.rdf4j.sail.shacl.benchmark.generated.TargetBenchmarkInitialData_benchmark_jmhTest.benchmark_avgt_jmhStub(TargetBenchmarkInitialData_benchmark_jmhTest.java:423)
	at org.eclipse.rdf4j.sail.shacl.benchmark.generated.TargetBenchmarkInitialData_benchmark_jmhTest.benchmark_AverageTime(TargetBenchmarkInitialData_benchmark_jmhTest.java:323)
	at java.base/jdk.internal.reflect.NativeMethodAccessorImpl.invoke0(Native Method)
	at java.base/jdk.internal.reflect.NativeMethodAccessorImpl.invoke(NativeMethodAccessorImpl.java:62)
	at java.base/jdk.internal.reflect.DelegatingMethodAccessorImpl.invoke(DelegatingMethodAccessorImpl.java:43)
	at java.base/java.lang.reflect.Method.invoke(Method.java:566)
	at org.openjdk.jmh.runner.BenchmarkHandler$BenchmarkTask.call(BenchmarkHandler.java:453)
	at org.openjdk.jmh.runner.BenchmarkHandler$BenchmarkTask.call(BenchmarkHandler.java:437)
	at java.base/java.util.concurrent.FutureTask.run(FutureTask.java:264)
	at java.base/java.util.concurrent.Executors$RunnableAdapter.call(Executors.java:515)
	at java.base/java.util.concurrent.FutureTask.run(FutureTask.java:264)
	at java.base/java.util.concurrent.ThreadPoolExecutor.runWorker(ThreadPoolExecutor.java:1128)
	at java.base/java.util.concurrent.ThreadPoolExecutor$Worker.run(ThreadPoolExecutor.java:628)
	at java.base/java.lang.Thread.run(Thread.java:834)


# JMH version: 1.21
# VM version: JDK 11.0.2, OpenJDK 64-Bit Server VM, 11.0.2+9
# VM invoker: /opt/tools/java/openjdk/jdk-11/11.0.2+9/bin/java
# VM options: -Xms8G -Xmx8G -XX:+UseG1GC
# Warmup: <none>
# Measurement: 1 iterations, single-shot each
# Timeout: 10 min per iteration
# Threads: 1 thread, will synchronize iterations
# Benchmark mode: Average time, time/op
# Benchmark: org.eclipse.rdf4j.sail.shacl.benchmark.TargetBenchmarkInitialData.benchmark
# Parameters: (existingTargets = 1000, shape = shaclDatatypePredicateObjectTarget.ttl)

# Run progress: NaN% complete, ETA 00:00:00
# Fork: N/A, test runs in the host VM
# *** WARNING: Non-forked runs may silently omit JVM options, mess up profilers, disable compiler hints, etc. ***
# *** WARNING: Use non-forked runs only for debugging purposes, not for actual performance runs. ***
Iteration   1: <failure>

java.lang.IllegalArgumentException: Input stream must not be 'null'
	at org.eclipse.rdf4j.rio.turtle.TurtleParser.parse(TurtleParser.java:126)
	at org.eclipse.rdf4j.rio.Rio.parse(Rio.java:296)
	at org.eclipse.rdf4j.rio.Rio.parse(Rio.java:263)
	at org.eclipse.rdf4j.rio.Rio.parse(Rio.java:214)
	at org.eclipse.rdf4j.sail.shacl.Utils.loadShapeData(Utils.java:44)
	at org.eclipse.rdf4j.sail.shacl.Utils.getInitializedShaclSail(Utils.java:90)
	at org.eclipse.rdf4j.sail.shacl.benchmark.TargetBenchmarkInitialData.invocationSetup(TargetBenchmarkInitialData.java:109)
	at org.eclipse.rdf4j.sail.shacl.benchmark.generated.TargetBenchmarkInitialData_benchmark_jmhTest.benchmark_avgt_jmhStub(TargetBenchmarkInitialData_benchmark_jmhTest.java:423)
	at org.eclipse.rdf4j.sail.shacl.benchmark.generated.TargetBenchmarkInitialData_benchmark_jmhTest.benchmark_AverageTime(TargetBenchmarkInitialData_benchmark_jmhTest.java:323)
	at java.base/jdk.internal.reflect.NativeMethodAccessorImpl.invoke0(Native Method)
	at java.base/jdk.internal.reflect.NativeMethodAccessorImpl.invoke(NativeMethodAccessorImpl.java:62)
	at java.base/jdk.internal.reflect.DelegatingMethodAccessorImpl.invoke(DelegatingMethodAccessorImpl.java:43)
	at java.base/java.lang.reflect.Method.invoke(Method.java:566)
	at org.openjdk.jmh.runner.BenchmarkHandler$BenchmarkTask.call(BenchmarkHandler.java:453)
	at org.openjdk.jmh.runner.BenchmarkHandler$BenchmarkTask.call(BenchmarkHandler.java:437)
	at java.base/java.util.concurrent.FutureTask.run(FutureTask.java:264)
	at java.base/java.util.concurrent.Executors$RunnableAdapter.call(Executors.java:515)
	at java.base/java.util.concurrent.FutureTask.run(FutureTask.java:264)
	at java.base/java.util.concurrent.ThreadPoolExecutor.runWorker(ThreadPoolExecutor.java:1128)
	at java.base/java.util.concurrent.ThreadPoolExecutor$Worker.run(ThreadPoolExecutor.java:628)
	at java.base/java.lang.Thread.run(Thread.java:834)


# JMH version: 1.21
# VM version: JDK 11.0.2, OpenJDK 64-Bit Server VM, 11.0.2+9
# VM invoker: /opt/tools/java/openjdk/jdk-11/11.0.2+9/bin/java
# VM options: -Xms8G -Xmx8G -XX:+UseG1GC
# Warmup: <none>
# Measurement: 1 iterations, single-shot each
# Timeout: 10 min per iteration
# Threads: 1 thread, will synchronize iterations
# Benchmark mode: Average time, time/op
# Benchmark: org.eclipse.rdf4j.sail.shacl.benchmark.TargetBenchmarkInitialData.benchmark
# Parameters: (existingTargets = 1000, shape = shaclDatatypeSparqlTarget.ttl)

# Run progress: NaN% complete, ETA 00:00:00
# Fork: N/A, test runs in the host VM
# *** WARNING: Non-forked runs may silently omit JVM options, mess up profilers, disable compiler hints, etc. ***
# *** WARNING: Use non-forked runs only for debugging purposes, not for actual performance runs. ***
Iteration   1: <failure>

java.lang.IllegalArgumentException: Input stream must not be 'null'
	at org.eclipse.rdf4j.rio.turtle.TurtleParser.parse(TurtleParser.java:126)
	at org.eclipse.rdf4j.rio.Rio.parse(Rio.java:296)
	at org.eclipse.rdf4j.rio.Rio.parse(Rio.java:263)
	at org.eclipse.rdf4j.rio.Rio.parse(Rio.java:214)
	at org.eclipse.rdf4j.sail.shacl.Utils.loadShapeData(Utils.java:44)
	at org.eclipse.rdf4j.sail.shacl.Utils.getInitializedShaclSail(Utils.java:90)
	at org.eclipse.rdf4j.sail.shacl.benchmark.TargetBenchmarkInitialData.invocationSetup(TargetBenchmarkInitialData.java:109)
	at org.eclipse.rdf4j.sail.shacl.benchmark.generated.TargetBenchmarkInitialData_benchmark_jmhTest.benchmark_avgt_jmhStub(TargetBenchmarkInitialData_benchmark_jmhTest.java:423)
	at org.eclipse.rdf4j.sail.shacl.benchmark.generated.TargetBenchmarkInitialData_benchmark_jmhTest.benchmark_AverageTime(TargetBenchmarkInitialData_benchmark_jmhTest.java:323)
	at java.base/jdk.internal.reflect.NativeMethodAccessorImpl.invoke0(Native Method)
	at java.base/jdk.internal.reflect.NativeMethodAccessorImpl.invoke(NativeMethodAccessorImpl.java:62)
	at java.base/jdk.internal.reflect.DelegatingMethodAccessorImpl.invoke(DelegatingMethodAccessorImpl.java:43)
	at java.base/java.lang.reflect.Method.invoke(Method.java:566)
	at org.openjdk.jmh.runner.BenchmarkHandler$BenchmarkTask.call(BenchmarkHandler.java:453)
	at org.openjdk.jmh.runner.BenchmarkHandler$BenchmarkTask.call(BenchmarkHandler.java:437)
	at java.base/java.util.concurrent.FutureTask.run(FutureTask.java:264)
	at java.base/java.util.concurrent.Executors$RunnableAdapter.call(Executors.java:515)
	at java.base/java.util.concurrent.FutureTask.run(FutureTask.java:264)
	at java.base/java.util.concurrent.ThreadPoolExecutor.runWorker(ThreadPoolExecutor.java:1128)
	at java.base/java.util.concurrent.ThreadPoolExecutor$Worker.run(ThreadPoolExecutor.java:628)
	at java.base/java.lang.Thread.run(Thread.java:834)


# JMH version: 1.21
# VM version: JDK 11.0.2, OpenJDK 64-Bit Server VM, 11.0.2+9
# VM invoker: /opt/tools/java/openjdk/jdk-11/11.0.2+9/bin/java
# VM options: -Xms8G -Xmx8G -XX:+UseG1GC
# Warmup: <none>
# Measurement: 1 iterations, single-shot each
# Timeout: 10 min per iteration
# Threads: 1 thread, will synchronize iterations
# Benchmark mode: Average time, time/op
# Benchmark: org.eclipse.rdf4j.sail.shacl.benchmark.TargetBenchmarkInitialData.benchmark
# Parameters: (existingTargets = 1000, shape = shaclDatatypeTargetFilter.ttl)

# Run progress: NaN% complete, ETA 00:00:00
# Fork: N/A, test runs in the host VM
# *** WARNING: Non-forked runs may silently omit JVM options, mess up profilers, disable compiler hints, etc. ***
# *** WARNING: Use non-forked runs only for debugging purposes, not for actual performance runs. ***
Iteration   1: <failure>

java.lang.IllegalArgumentException: Input stream must not be 'null'
	at org.eclipse.rdf4j.rio.turtle.TurtleParser.parse(TurtleParser.java:126)
	at org.eclipse.rdf4j.rio.Rio.parse(Rio.java:296)
	at org.eclipse.rdf4j.rio.Rio.parse(Rio.java:263)
	at org.eclipse.rdf4j.rio.Rio.parse(Rio.java:214)
	at org.eclipse.rdf4j.sail.shacl.Utils.loadShapeData(Utils.java:44)
	at org.eclipse.rdf4j.sail.shacl.Utils.getInitializedShaclSail(Utils.java:90)
	at org.eclipse.rdf4j.sail.shacl.benchmark.TargetBenchmarkInitialData.invocationSetup(TargetBenchmarkInitialData.java:109)
	at org.eclipse.rdf4j.sail.shacl.benchmark.generated.TargetBenchmarkInitialData_benchmark_jmhTest.benchmark_avgt_jmhStub(TargetBenchmarkInitialData_benchmark_jmhTest.java:423)
	at org.eclipse.rdf4j.sail.shacl.benchmark.generated.TargetBenchmarkInitialData_benchmark_jmhTest.benchmark_AverageTime(TargetBenchmarkInitialData_benchmark_jmhTest.java:323)
	at java.base/jdk.internal.reflect.NativeMethodAccessorImpl.invoke0(Native Method)
	at java.base/jdk.internal.reflect.NativeMethodAccessorImpl.invoke(NativeMethodAccessorImpl.java:62)
	at java.base/jdk.internal.reflect.DelegatingMethodAccessorImpl.invoke(DelegatingMethodAccessorImpl.java:43)
	at java.base/java.lang.reflect.Method.invoke(Method.java:566)
	at org.openjdk.jmh.runner.BenchmarkHandler$BenchmarkTask.call(BenchmarkHandler.java:453)
	at org.openjdk.jmh.runner.BenchmarkHandler$BenchmarkTask.call(BenchmarkHandler.java:437)
	at java.base/java.util.concurrent.FutureTask.run(FutureTask.java:264)
	at java.base/java.util.concurrent.Executors$RunnableAdapter.call(Executors.java:515)
	at java.base/java.util.concurrent.FutureTask.run(FutureTask.java:264)
	at java.base/java.util.concurrent.ThreadPoolExecutor.runWorker(ThreadPoolExecutor.java:1128)
	at java.base/java.util.concurrent.ThreadPoolExecutor$Worker.run(ThreadPoolExecutor.java:628)
	at java.base/java.lang.Thread.run(Thread.java:834)


# JMH version: 1.21
# VM version: JDK 11.0.2, OpenJDK 64-Bit Server VM, 11.0.2+9
# VM invoker: /opt/tools/java/openjdk/jdk-11/11.0.2+9/bin/java
# VM options: -Xms8G -Xmx8G -XX:+UseG1GC
# Warmup: <none>
# Measurement: 1 iterations, single-shot each
# Timeout: 10 min per iteration
# Threads: 1 thread, will synchronize iterations
# Benchmark mode: Average time, time/op
# Benchmark: org.eclipse.rdf4j.sail.shacl.benchmark.TargetBenchmarkInitialData.benchmark
# Parameters: (existingTargets = 100000, shape = shaclDatatypePredicateObjectTarget.ttl)

# Run progress: NaN% complete, ETA 00:00:00
# Fork: N/A, test runs in the host VM
# *** WARNING: Non-forked runs may silently omit JVM options, mess up profilers, disable compiler hints, etc. ***
# *** WARNING: Use non-forked runs only for debugging purposes, not for actual performance runs. ***
Iteration   1: <failure>

java.lang.IllegalArgumentException: Input stream must not be 'null'
	at org.eclipse.rdf4j.rio.turtle.TurtleParser.parse(TurtleParser.java:126)
	at org.eclipse.rdf4j.rio.Rio.parse(Rio.java:296)
	at org.eclipse.rdf4j.rio.Rio.parse(Rio.java:263)
	at org.eclipse.rdf4j.rio.Rio.parse(Rio.java:214)
	at org.eclipse.rdf4j.sail.shacl.Utils.loadShapeData(Utils.java:44)
	at org.eclipse.rdf4j.sail.shacl.Utils.getInitializedShaclSail(Utils.java:90)
	at org.eclipse.rdf4j.sail.shacl.benchmark.TargetBenchmarkInitialData.invocationSetup(TargetBenchmarkInitialData.java:109)
	at org.eclipse.rdf4j.sail.shacl.benchmark.generated.TargetBenchmarkInitialData_benchmark_jmhTest.benchmark_avgt_jmhStub(TargetBenchmarkInitialData_benchmark_jmhTest.java:423)
	at org.eclipse.rdf4j.sail.shacl.benchmark.generated.TargetBenchmarkInitialData_benchmark_jmhTest.benchmark_AverageTime(TargetBenchmarkInitialData_benchmark_jmhTest.java:323)
	at java.base/jdk.internal.reflect.NativeMethodAccessorImpl.invoke0(Native Method)
	at java.base/jdk.internal.reflect.NativeMethodAccessorImpl.invoke(NativeMethodAccessorImpl.java:62)
	at java.base/jdk.internal.reflect.DelegatingMethodAccessorImpl.invoke(DelegatingMethodAccessorImpl.java:43)
	at java.base/java.lang.reflect.Method.invoke(Method.java:566)
	at org.openjdk.jmh.runner.BenchmarkHandler$BenchmarkTask.call(BenchmarkHandler.java:453)
	at org.openjdk.jmh.runner.BenchmarkHandler$BenchmarkTask.call(BenchmarkHandler.java:437)
	at java.base/java.util.concurrent.FutureTask.run(FutureTask.java:264)
	at java.base/java.util.concurrent.Executors$RunnableAdapter.call(Executors.java:515)
	at java.base/java.util.concurrent.FutureTask.run(FutureTask.java:264)
	at java.base/java.util.concurrent.ThreadPoolExecutor.runWorker(ThreadPoolExecutor.java:1128)
	at java.base/java.util.concurrent.ThreadPoolExecutor$Worker.run(ThreadPoolExecutor.java:628)
	at java.base/java.lang.Thread.run(Thread.java:834)


# JMH version: 1.21
# VM version: JDK 11.0.2, OpenJDK 64-Bit Server VM, 11.0.2+9
# VM invoker: /opt/tools/java/openjdk/jdk-11/11.0.2+9/bin/java
# VM options: -Xms8G -Xmx8G -XX:+UseG1GC
# Warmup: <none>
# Measurement: 1 iterations, single-shot each
# Timeout: 10 min per iteration
# Threads: 1 thread, will synchronize iterations
# Benchmark mode: Average time, time/op
# Benchmark: org.eclipse.rdf4j.sail.shacl.benchmark.TargetBenchmarkInitialData.benchmark
# Parameters: (existingTargets = 100000, shape = shaclDatatypeSparqlTarget.ttl)

# Run progress: NaN% complete, ETA 00:00:00
# Fork: N/A, test runs in the host VM
# *** WARNING: Non-forked runs may silently omit JVM options, mess up profilers, disable compiler hints, etc. ***
# *** WARNING: Use non-forked runs only for debugging purposes, not for actual performance runs. ***
Iteration   1: <failure>

java.lang.IllegalArgumentException: Input stream must not be 'null'
	at org.eclipse.rdf4j.rio.turtle.TurtleParser.parse(TurtleParser.java:126)
	at org.eclipse.rdf4j.rio.Rio.parse(Rio.java:296)
	at org.eclipse.rdf4j.rio.Rio.parse(Rio.java:263)
	at org.eclipse.rdf4j.rio.Rio.parse(Rio.java:214)
	at org.eclipse.rdf4j.sail.shacl.Utils.loadShapeData(Utils.java:44)
	at org.eclipse.rdf4j.sail.shacl.Utils.getInitializedShaclSail(Utils.java:90)
	at org.eclipse.rdf4j.sail.shacl.benchmark.TargetBenchmarkInitialData.invocationSetup(TargetBenchmarkInitialData.java:109)
	at org.eclipse.rdf4j.sail.shacl.benchmark.generated.TargetBenchmarkInitialData_benchmark_jmhTest.benchmark_avgt_jmhStub(TargetBenchmarkInitialData_benchmark_jmhTest.java:423)
	at org.eclipse.rdf4j.sail.shacl.benchmark.generated.TargetBenchmarkInitialData_benchmark_jmhTest.benchmark_AverageTime(TargetBenchmarkInitialData_benchmark_jmhTest.java:323)
	at java.base/jdk.internal.reflect.NativeMethodAccessorImpl.invoke0(Native Method)
	at java.base/jdk.internal.reflect.NativeMethodAccessorImpl.invoke(NativeMethodAccessorImpl.java:62)
	at java.base/jdk.internal.reflect.DelegatingMethodAccessorImpl.invoke(DelegatingMethodAccessorImpl.java:43)
	at java.base/java.lang.reflect.Method.invoke(Method.java:566)
	at org.openjdk.jmh.runner.BenchmarkHandler$BenchmarkTask.call(BenchmarkHandler.java:453)
	at org.openjdk.jmh.runner.BenchmarkHandler$BenchmarkTask.call(BenchmarkHandler.java:437)
	at java.base/java.util.concurrent.FutureTask.run(FutureTask.java:264)
	at java.base/java.util.concurrent.Executors$RunnableAdapter.call(Executors.java:515)
	at java.base/java.util.concurrent.FutureTask.run(FutureTask.java:264)
	at java.base/java.util.concurrent.ThreadPoolExecutor.runWorker(ThreadPoolExecutor.java:1128)
	at java.base/java.util.concurrent.ThreadPoolExecutor$Worker.run(ThreadPoolExecutor.java:628)
	at java.base/java.lang.Thread.run(Thread.java:834)


# JMH version: 1.21
# VM version: JDK 11.0.2, OpenJDK 64-Bit Server VM, 11.0.2+9
# VM invoker: /opt/tools/java/openjdk/jdk-11/11.0.2+9/bin/java
# VM options: -Xms8G -Xmx8G -XX:+UseG1GC
# Warmup: <none>
# Measurement: 1 iterations, single-shot each
# Timeout: 10 min per iteration
# Threads: 1 thread, will synchronize iterations
# Benchmark mode: Average time, time/op
# Benchmark: org.eclipse.rdf4j.sail.shacl.benchmark.TargetBenchmarkInitialData.benchmark
# Parameters: (existingTargets = 100000, shape = shaclDatatypeTargetFilter.ttl)

# Run progress: NaN% complete, ETA 00:00:00
# Fork: N/A, test runs in the host VM
# *** WARNING: Non-forked runs may silently omit JVM options, mess up profilers, disable compiler hints, etc. ***
# *** WARNING: Use non-forked runs only for debugging purposes, not for actual performance runs. ***
Iteration   1: <failure>

java.lang.IllegalArgumentException: Input stream must not be 'null'
	at org.eclipse.rdf4j.rio.turtle.TurtleParser.parse(TurtleParser.java:126)
	at org.eclipse.rdf4j.rio.Rio.parse(Rio.java:296)
	at org.eclipse.rdf4j.rio.Rio.parse(Rio.java:263)
	at org.eclipse.rdf4j.rio.Rio.parse(Rio.java:214)
	at org.eclipse.rdf4j.sail.shacl.Utils.loadShapeData(Utils.java:44)
	at org.eclipse.rdf4j.sail.shacl.Utils.getInitializedShaclSail(Utils.java:90)
	at org.eclipse.rdf4j.sail.shacl.benchmark.TargetBenchmarkInitialData.invocationSetup(TargetBenchmarkInitialData.java:109)
	at org.eclipse.rdf4j.sail.shacl.benchmark.generated.TargetBenchmarkInitialData_benchmark_jmhTest.benchmark_avgt_jmhStub(TargetBenchmarkInitialData_benchmark_jmhTest.java:423)
	at org.eclipse.rdf4j.sail.shacl.benchmark.generated.TargetBenchmarkInitialData_benchmark_jmhTest.benchmark_AverageTime(TargetBenchmarkInitialData_benchmark_jmhTest.java:323)
	at java.base/jdk.internal.reflect.NativeMethodAccessorImpl.invoke0(Native Method)
	at java.base/jdk.internal.reflect.NativeMethodAccessorImpl.invoke(NativeMethodAccessorImpl.java:62)
	at java.base/jdk.internal.reflect.DelegatingMethodAccessorImpl.invoke(DelegatingMethodAccessorImpl.java:43)
	at java.base/java.lang.reflect.Method.invoke(Method.java:566)
	at org.openjdk.jmh.runner.BenchmarkHandler$BenchmarkTask.call(BenchmarkHandler.java:453)
	at org.openjdk.jmh.runner.BenchmarkHandler$BenchmarkTask.call(BenchmarkHandler.java:437)
	at java.base/java.util.concurrent.FutureTask.run(FutureTask.java:264)
	at java.base/java.util.concurrent.Executors$RunnableAdapter.call(Executors.java:515)
	at java.base/java.util.concurrent.FutureTask.run(FutureTask.java:264)
	at java.base/java.util.concurrent.ThreadPoolExecutor.runWorker(ThreadPoolExecutor.java:1128)
	at java.base/java.util.concurrent.ThreadPoolExecutor$Worker.run(ThreadPoolExecutor.java:628)
	at java.base/java.lang.Thread.run(Thread.java:834)


# JMH version: 1.21
# VM version: JDK 11.0.2, OpenJDK 64-Bit Server VM, 11.0.2+9
# VM invoker: /opt/tools/java/openjdk/jdk-11/11.0.2+9/bin/java
# VM options: -Xmx64M -XX:+UseSerialGC
# Warmup: <none>
# Measurement: 1 iterations, single-shot each
# Timeout: 10 min per iteration
# Threads: 1 thread, will synchronize iterations
# Benchmark mode: Average time, time/op
# Benchmark: org.eclipse.rdf4j.sail.shacl.benchmark.UniqueLangBenchmarkEmpty.noShacl

# Run progress: NaN% complete, ETA 00:00:00
# Fork: N/A, test runs in the host VM
# *** WARNING: Non-forked runs may silently omit JVM options, mess up profilers, disable compiler hints, etc. ***
# *** WARNING: Use non-forked runs only for debugging purposes, not for actual performance runs. ***
Iteration   1: 02:24:07.923 [pool-277-thread-1] ERROR ShaclSail was garbage collected without shutdown() having been called first.
02:24:07.925 [pool-279-thread-1] ERROR ShaclSail was garbage collected without shutdown() having been called first.
02:24:07.926 [pool-281-thread-1] ERROR ShaclSail was garbage collected without shutdown() having been called first.
02:24:07.927 [pool-283-thread-1] ERROR ShaclSail was garbage collected without shutdown() having been called first.
02:24:07.928 [pool-285-thread-1] ERROR ShaclSail was garbage collected without shutdown() having been called first.
02:24:07.929 [pool-287-thread-1] ERROR ShaclSail was garbage collected without shutdown() having been called first.
02:24:07.930 [pool-289-thread-1] ERROR ShaclSail was garbage collected without shutdown() having been called first.
02:24:07.931 [pool-291-thread-1] ERROR ShaclSail was garbage collected without shutdown() having been called first.
02:24:07.932 [pool-293-thread-1] ERROR ShaclSail was garbage collected without shutdown() having been called first.
17.505 ms/op

Result "org.eclipse.rdf4j.sail.shacl.benchmark.UniqueLangBenchmarkEmpty.noShacl":
  17.505 ms/op


# JMH version: 1.21
# VM version: JDK 11.0.2, OpenJDK 64-Bit Server VM, 11.0.2+9
# VM invoker: /opt/tools/java/openjdk/jdk-11/11.0.2+9/bin/java
# VM options: -Xmx64M -XX:+UseSerialGC
# Warmup: <none>
# Measurement: 1 iterations, single-shot each
# Timeout: 10 min per iteration
# Threads: 1 thread, will synchronize iterations
# Benchmark mode: Average time, time/op
# Benchmark: org.eclipse.rdf4j.sail.shacl.benchmark.UniqueLangBenchmarkEmpty.shacl

# Run progress: NaN% complete, ETA 00:00:00
# Fork: N/A, test runs in the host VM
# *** WARNING: Non-forked runs may silently omit JVM options, mess up profilers, disable compiler hints, etc. ***
# *** WARNING: Use non-forked runs only for debugging purposes, not for actual performance runs. ***
Iteration   1: 241.254 ms/op

Result "org.eclipse.rdf4j.sail.shacl.benchmark.UniqueLangBenchmarkEmpty.shacl":
  241.254 ms/op


# JMH version: 1.21
# VM version: JDK 11.0.2, OpenJDK 64-Bit Server VM, 11.0.2+9
# VM invoker: /opt/tools/java/openjdk/jdk-11/11.0.2+9/bin/java
# VM options: -Xmx64M -XX:+UseSerialGC
# Warmup: <none>
# Measurement: 1 iterations, single-shot each
# Timeout: 10 min per iteration
# Threads: 1 thread, will synchronize iterations
# Benchmark mode: Average time, time/op
# Benchmark: org.eclipse.rdf4j.sail.shacl.benchmark.ValueInBenchmarkEmpty.noShacl

# Run progress: NaN% complete, ETA 00:00:00
# Fork: N/A, test runs in the host VM
# *** WARNING: Non-forked runs may silently omit JVM options, mess up profilers, disable compiler hints, etc. ***
# *** WARNING: Use non-forked runs only for debugging purposes, not for actual performance runs. ***
Iteration   1: 22.056 ms/op

Result "org.eclipse.rdf4j.sail.shacl.benchmark.ValueInBenchmarkEmpty.noShacl":
  22.056 ms/op


# JMH version: 1.21
# VM version: JDK 11.0.2, OpenJDK 64-Bit Server VM, 11.0.2+9
# VM invoker: /opt/tools/java/openjdk/jdk-11/11.0.2+9/bin/java
# VM options: -Xmx64M -XX:+UseSerialGC
# Warmup: <none>
# Measurement: 1 iterations, single-shot each
# Timeout: 10 min per iteration
# Threads: 1 thread, will synchronize iterations
# Benchmark mode: Average time, time/op
# Benchmark: org.eclipse.rdf4j.sail.shacl.benchmark.ValueInBenchmarkEmpty.shacl

# Run progress: NaN% complete, ETA 00:00:00
# Fork: N/A, test runs in the host VM
# *** WARNING: Non-forked runs may silently omit JVM options, mess up profilers, disable compiler hints, etc. ***
# *** WARNING: Use non-forked runs only for debugging purposes, not for actual performance runs. ***
Iteration   1: 239.298 ms/op

Result "org.eclipse.rdf4j.sail.shacl.benchmark.ValueInBenchmarkEmpty.shacl":
  239.298 ms/op


# Run complete. Total time: 00:00:50

REMEMBER: The numbers below are just data. To gain reusable insights, you need to follow up on
why the numbers are the way they are. Use profilers (see -prof, -lprof), design factorial
experiments, perform baseline and negative tests that provide experimental control, make sure
the benchmarking environment is safe on JVM/OS/HW level, ask for reviews from the domain experts.
Do not assume the numbers tell you what you want them to tell.

Benchmark                                                                      (NUMBER_OF_TRANSACTIONS)  (existingTargets)  Mode  Cnt      Score   Error  Units
AddRemoveBenchmarkEmpty.shacl                                                                       N/A                N/A  avgt         591.294          ms/op
BulkedBenchmark.innerJoin                                                                           N/A                N/A  avgt         121.044          ms/op
BulkedBenchmark.outerJoin                                                                           N/A                N/A  avgt          90.890          ms/op
ClassBenchmarkEmpty.noShacl                                                                         N/A                N/A  avgt          19.498          ms/op
ClassBenchmarkEmpty.shacl                                                                           N/A                N/A  avgt         230.259          ms/op
ClassBenchmarkEmpty.sparqlInsteadOfShacl                                                            N/A                N/A  avgt         442.580          ms/op
ComplexBenchmark.shacl                                                                              N/A                N/A  avgt         172.282          ms/op
ComplexBenchmark.shaclCache                                                                         N/A                N/A  avgt          75.402          ms/op
ComplexBenchmark.shaclEmptyTransactions                                                             N/A                N/A  avgt          15.276          ms/op
ComplexBenchmark.shaclNoTransactions                                                                N/A                N/A  avgt          12.212          ms/op
ComplexBenchmark.shaclNothingToValidateTransactions                                                 N/A                N/A  avgt          12.717          ms/op
ComplexBenchmark.shaclParallel                                                                      N/A                N/A  avgt          28.215          ms/op
ComplexBenchmark.shaclParallelCache                                                                 N/A                N/A  avgt          26.364          ms/op
ComplexBenchmark.shaclParallelCacheSingleTransactionNoIsolation                                     N/A                N/A  avgt          23.102          ms/op
ComplexBenchmark.shaclPropertiesSwitch                                                              N/A                N/A  avgt           1.303          ms/op
ComplexTargetBenchmark.benchmark                                                                    N/A                  1  avgt         170.304          ms/op
ComplexTargetBenchmark.benchmark                                                                    N/A               1000  avgt         130.748          ms/op
ComplexTargetBenchmark.benchmark                                                                    N/A             100000  avgt          99.855          ms/op
DatatypeBenchmarkEmpty.noShacl                                                                      N/A                N/A  avgt           9.225          ms/op
DatatypeBenchmarkEmpty.shacl                                                                        N/A                N/A  avgt          59.226          ms/op
DatatypeBenchmarkEmpty.sparqlInsteadOfShacl                                                         N/A                N/A  avgt         350.958          ms/op
DatatypeBenchmarkLinear.noShacl                                                                       1                N/A  avgt           0.443          ms/op
DatatypeBenchmarkLinear.noShacl                                                                      10                N/A  avgt           3.175          ms/op
DatatypeBenchmarkLinear.noShacl                                                                     100                N/A  avgt          31.544          ms/op
DatatypeBenchmarkLinear.shacl                                                                         1                N/A  avgt           4.983          ms/op
DatatypeBenchmarkLinear.shacl                                                                        10                N/A  avgt          19.647          ms/op
DatatypeBenchmarkLinear.shacl                                                                       100                N/A  avgt         213.942          ms/op
DatatypeBenchmarkPrefilled.noShacl                                                                  N/A                N/A  avgt           6.767          ms/op
DatatypeBenchmarkPrefilled.shacl                                                                    N/A                N/A  avgt          46.975          ms/op
DatatypeBenchmarkPrefilled.sparqlInsteadOfShacl                                                     N/A                N/A  avgt       10517.410          ms/op
DatatypeBenchmarkSerializableEmpty.noShacl                                                          N/A                N/A  avgt          24.175          ms/op
DatatypeBenchmarkSerializableEmpty.shacl                                                            N/A                N/A  avgt         130.945          ms/op
DatatypeBenchmarkSerializableEmpty.sparqlInsteadOfShacl                                             N/A                N/A  avgt         485.556          ms/op
HasValueBenchmarkEmpty.noShacl                                                                      N/A                N/A  avgt          23.689          ms/op
HasValueBenchmarkEmpty.shacl                                                                        N/A                N/A  avgt         174.335          ms/op
LanguageInBenchmarkEmpty.noShacl                                                                    N/A                N/A  avgt          54.034          ms/op
LanguageInBenchmarkEmpty.shacl                                                                      N/A                N/A  avgt         127.804          ms/op
MaxCountBenchmarkEmpty.noShacl                                                                      N/A                N/A  avgt          10.258          ms/op
MaxCountBenchmarkEmpty.shacl                                                                        N/A                N/A  avgt          97.817          ms/op
MaxCountBenchmarkEmpty.sparqlGroupByInsteadOfShacl                                                  N/A                N/A  avgt         551.689          ms/op
MaxCountBenchmarkEmpty.sparqlInsteadOfShacl                                                         N/A                N/A  avgt         492.215          ms/op
MinCountBenchmarkEmpty.noShacl                                                                      N/A                N/A  avgt           8.128          ms/op
MinCountBenchmarkEmpty.shacl                                                                        N/A                N/A  avgt          68.950          ms/op
MinCountBenchmarkEmpty.shaclClear                                                                   N/A                N/A  avgt          81.009          ms/op
MinCountBenchmarkEmpty.shaclMinCountZero                                                            N/A                N/A  avgt          25.338          ms/op
MinCountBenchmarkEmpty.sparqlInsteadOfShacl                                                         N/A                N/A  avgt         188.366          ms/op
MinCountBenchmarkPrefilled.noShacl                                                                  N/A                N/A  avgt           5.396          ms/op
MinCountBenchmarkPrefilled.shacl                                                                    N/A                N/A  avgt          57.973          ms/op
MinCountBenchmarkPrefilled.sparqlInsteadOfShacl                                                     N/A                N/A  avgt        8476.590          ms/op
MinCountPrefilledVsEmptyBenchmark.shaclEmpty                                                        N/A                N/A  avgt          63.229          ms/op
MinCountPrefilledVsEmptyBenchmark.shaclEmptyJustInitializeAndEmptyTransaction                       N/A                N/A  avgt           2.929          ms/op
MinCountPrefilledVsEmptyBenchmark.shaclEmptyJustinit                                                N/A                N/A  avgt           3.058          ms/op
MinCountPrefilledVsEmptyBenchmark.shaclPrefilled                                                    N/A                N/A  avgt          55.945          ms/op
NotClassBenchmarkEmpty.noShacl                                                                      N/A                N/A  avgt          27.526          ms/op
NotClassBenchmarkEmpty.shacl                                                                        N/A                N/A  avgt         254.946          ms/op
NotClassBenchmarkEmpty.shaclWithoutAnimals                                                          N/A                N/A  avgt          37.088          ms/op
NotClassBenchmarkEmpty.sparqlInsteadOfShacl                                                         N/A                N/A  avgt         424.855          ms/op
NotClassBenchmarkEmpty.sparqlInsteadOfShaclWithoutAnimals                                           N/A                N/A  avgt          19.812          ms/op
NotMaxCountBenchmarkEmpty.noShacl                                                                   N/A                N/A  avgt           8.252          ms/op
NotMaxCountBenchmarkEmpty.shacl                                                                     N/A                N/A  avgt         156.513          ms/op
NotUniqueLangBenchmarkEmpty.shacl                                                                   N/A                N/A  avgt         369.568          ms/op
ParallelBenchmark.nativeStoreShaclSerializable                                                      N/A                N/A  avgt        1298.692          ms/op
ParallelBenchmark.nativeStoreShaclSerializableNotParallel                                           N/A                N/A  avgt        1265.648          ms/op
ParallelBenchmark.nativeStoreShaclSnapshot                                                          N/A                N/A  avgt         603.308          ms/op
ParallelBenchmark.nativeStoreShaclSnapshotWithoutSerializableValidation                             N/A                N/A  avgt         408.950          ms/op
ParallelBenchmark.shaclSerializable                                                                 N/A                N/A  avgt         148.743          ms/op
ParallelBenchmark.shaclSerializableMixedReadWrite                                                   N/A                N/A  avgt         278.598          ms/op
ParallelBenchmark.shaclSerializableNotParallel                                                      N/A                N/A  avgt          96.788          ms/op
ParallelBenchmark.shaclSnapshot                                                                     N/A                N/A  avgt          49.683          ms/op
ParallelBenchmark.shaclSnapshotMixedReadWrite                                                       N/A                N/A  avgt         128.786          ms/op
ParallelBenchmark.shaclSnapshotWithoutSerializableValidation                                        N/A                N/A  avgt          34.544          ms/op
ParallelBenchmark.shaclSnapshotWithoutSerializableValidationMixedReadWrite                          N/A                N/A  avgt          55.460          ms/op
ShaclLoadingBenchmark.testAddingDataAndAddingShapes                                                 N/A                N/A  avgt         183.394          ms/op
UniqueLangBenchmarkEmpty.noShacl                                                                    N/A                N/A  avgt          17.505          ms/op
UniqueLangBenchmarkEmpty.shacl                                                                      N/A                N/A  avgt         241.254          ms/op
ValueInBenchmarkEmpty.noShacl                                                                       N/A                N/A  avgt          22.056          ms/op
ValueInBenchmarkEmpty.shacl                                                                         N/A                N/A  avgt         239.298          ms/op
[INFO] Tests run: 1, Failures: 0, Errors: 0, Skipped: 0, Time elapsed: 50.843 s - in org.eclipse.rdf4j.sail.shacl.benchmark.BenchmarkJunitTests
[INFO] Running org.eclipse.rdf4j.sail.shacl.ValidationReportTest
[INFO] Tests run: 5, Failures: 0, Errors: 0, Skipped: 0, Time elapsed: 0.087 s - in org.eclipse.rdf4j.sail.shacl.ValidationReportTest
[INFO] Running org.eclipse.rdf4j.sail.shacl.ExtendedFeaturesetTest
[INFO] Tests run: 4, Failures: 0, Errors: 0, Skipped: 0, Time elapsed: 0.013 s - in org.eclipse.rdf4j.sail.shacl.ExtendedFeaturesetTest
[INFO] Running org.eclipse.rdf4j.sail.shacl.TrackAddedStatementsTest
02:24:09.002 [main] INFO  (http://www.w3.org/2000/01/rdf-schema#Resource, http://www.w3.org/1999/02/22-rdf-syntax-ns#type, http://www.w3.org/2000/01/rdf-schema#Resource) [null]
02:24:09.004 [main] INFO  (http://www.w3.org/2000/01/rdf-schema#Resource, http://www.w3.org/1999/02/22-rdf-syntax-ns#type, http://www.w3.org/2000/01/rdf-schema#Resource) [null]
02:24:09.005 [main] INFO  (http://www.w3.org/2000/01/rdf-schema#Resource, http://www.w3.org/1999/02/22-rdf-syntax-ns#type, http://www.w3.org/2000/01/rdf-schema#Resource) [null]
1
org.eclipse.rdf4j.sail.shacl.ShaclSailValidationException: Failed SHACL validation
02:24:09.009 [main] INFO  (http://www.w3.org/2000/01/rdf-schema#Resource, http://www.w3.org/1999/02/22-rdf-syntax-ns#type, http://www.w3.org/2000/01/rdf-schema#Resource) [null]
02:24:09.010 [main] INFO  (http://www.w3.org/2000/01/rdf-schema#Resource, http://www.w3.org/1999/02/22-rdf-syntax-ns#type, http://www.w3.org/2000/01/rdf-schema#Resource) [null]
0
02:24:09.027 [main] INFO  (http://www.w3.org/2000/01/rdf-schema#Resource, http://www.w3.org/1999/02/22-rdf-syntax-ns#type, http://www.w3.org/2000/01/rdf-schema#Resource) [null]
[INFO] Tests run: 13, Failures: 0, Errors: 0, Skipped: 0, Time elapsed: 0.03 s - in org.eclipse.rdf4j.sail.shacl.TrackAddedStatementsTest
[INFO] Running org.eclipse.rdf4j.sail.shacl.rdf4jcompliance.ShaclRepositoryTest
[INFO] Tests run: 2, Failures: 0, Errors: 0, Skipped: 0, Time elapsed: 0.051 s - in org.eclipse.rdf4j.sail.shacl.rdf4jcompliance.ShaclRepositoryTest
[INFO] Running org.eclipse.rdf4j.sail.shacl.rdf4jcompliance.ShaclIsolationLevelTest
02:24:09.089 [pool-320-thread-1] ERROR ShaclSail was garbage collected without shutdown() having been called first.
02:24:09.091 [pool-321-thread-1] ERROR ShaclSail was garbage collected without shutdown() having been called first.
02:24:09.093 [pool-322-thread-1] ERROR ShaclSail was garbage collected without shutdown() having been called first.
02:24:09.096 [pool-308-thread-1] ERROR ShaclSail was garbage collected without shutdown() having been called first.
02:24:09.100 [pool-324-thread-1] ERROR ShaclSail was garbage collected without shutdown() having been called first.
02:24:09.101 [pool-325-thread-1] ERROR ShaclSail was garbage collected without shutdown() having been called first.
02:24:09.103 [pool-326-thread-1] ERROR ShaclSail was garbage collected without shutdown() having been called first.
02:24:09.105 [pool-310-thread-1] ERROR ShaclSail was garbage collected without shutdown() having been called first.
02:24:09.105 [pool-327-thread-1] ERROR ShaclSail was garbage collected without shutdown() having been called first.
02:24:09.106 [pool-328-thread-1] ERROR ShaclSail was garbage collected without shutdown() having been called first.
02:24:09.108 [pool-330-thread-1] ERROR ShaclSail was garbage collected without shutdown() having been called first.
02:24:09.109 [pool-331-thread-1] ERROR ShaclSail was garbage collected without shutdown() having been called first.
02:24:09.111 [pool-312-thread-1] ERROR ShaclSail was garbage collected without shutdown() having been called first.
02:24:09.111 [pool-332-thread-1] ERROR ShaclSail was garbage collected without shutdown() having been called first.
02:24:09.116 [pool-314-thread-1] ERROR ShaclSail was garbage collected without shutdown() having been called first.
02:24:09.119 [pool-316-thread-1] ERROR ShaclSail was garbage collected without shutdown() having been called first.
02:24:09.123 [pool-336-thread-1] ERROR ShaclSail was garbage collected without shutdown() having been called first.
02:24:09.123 [pool-334-thread-1] ERROR ShaclSail was garbage collected without shutdown() having been called first.
02:24:09.123 [pool-335-thread-1] ERROR ShaclSail was garbage collected without shutdown() having been called first.
02:24:09.123 [pool-337-thread-1] ERROR ShaclSail was garbage collected without shutdown() having been called first.
02:24:09.126 [pool-338-thread-1] ERROR ShaclSail was garbage collected without shutdown() having been called first.
02:24:09.184 [pool-318-thread-1] ERROR ShaclSail was garbage collected without shutdown() having been called first.
[INFO] Tests run: 10, Failures: 0, Errors: 0, Skipped: 0, Time elapsed: 0.258 s - in org.eclipse.rdf4j.sail.shacl.rdf4jcompliance.ShaclIsolationLevelTest
[INFO] Running org.eclipse.rdf4j.sail.shacl.rdf4jcompliance.ShaclRepositoryConnectionTest
02:24:09.414 [Time-limited test] WARN  [Rio error] Illegal language tag char: '_' (6, -1)
02:24:09.418 [Time-limited test] WARN  [Rio error] Illegal language tag char: '_' (6, -1)
02:24:09.542 [Time-limited test] WARN  [Rio error] Illegal language tag char: '_' (6, -1)
02:24:09.544 [Time-limited test] WARN  [Rio error] Illegal language tag char: '_' (6, -1)
02:24:09.639 [Time-limited test] WARN  [Rio error] Illegal language tag char: '_' (6, -1)
02:24:09.641 [Time-limited test] WARN  [Rio error] Illegal language tag char: '_' (6, -1)
02:24:09.736 [Time-limited test] WARN  [Rio error] Illegal language tag char: '_' (6, -1)
02:24:09.738 [Time-limited test] WARN  [Rio error] Illegal language tag char: '_' (6, -1)
02:24:09.833 [Time-limited test] WARN  [Rio error] Illegal language tag char: '_' (6, -1)
02:24:09.836 [Time-limited test] WARN  [Rio error] Illegal language tag char: '_' (6, -1)
02:24:09.927 [Time-limited test] WARN  [Rio error] Illegal language tag char: '_' (6, -1)
02:24:09.929 [Time-limited test] WARN  [Rio error] Illegal language tag char: '_' (6, -1)
[INFO] Tests run: 432, Failures: 0, Errors: 0, Skipped: 0, Time elapsed: 0.676 s - in org.eclipse.rdf4j.sail.shacl.rdf4jcompliance.ShaclRepositoryConnectionTest
[INFO] Running org.eclipse.rdf4j.sail.shacl.rdf4jcompliance.ShaclConcurrencyTest
[WARNING] Tests run: 3, Failures: 0, Errors: 0, Skipped: 2, Time elapsed: 4.579 s - in org.eclipse.rdf4j.sail.shacl.rdf4jcompliance.ShaclConcurrencyTest
[INFO] Running org.eclipse.rdf4j.sail.shacl.ShaclTest
[INFO] Tests run: 9240, Failures: 0, Errors: 0, Skipped: 0, Time elapsed: 28.618 s - in org.eclipse.rdf4j.sail.shacl.ShaclTest
[INFO] Running org.eclipse.rdf4j.sail.shacl.OrderingTest
[INFO] Tests run: 4, Failures: 0, Errors: 0, Skipped: 0, Time elapsed: 0 s - in org.eclipse.rdf4j.sail.shacl.OrderingTest
[INFO] Running org.eclipse.rdf4j.sail.shacl.SerializableTest
org.eclipse.rdf4j.repository.RepositoryException: org.eclipse.rdf4j.sail.SailConflictException: Observed State has Changed
	at org.eclipse.rdf4j.repository.sail.SailRepositoryConnection.commit(SailRepositoryConnection.java:208)
	at org.eclipse.rdf4j.sail.shacl.SerializableTest.lambda$multithreadedMaxCountViolation$1(SerializableTest.java:169)
	at java.base/java.lang.Thread.run(Thread.java:834)
Caused by: org.eclipse.rdf4j.sail.SailConflictException: Observed State has Changed
	at org.eclipse.rdf4j.sail.memory.MemorySailStore$MemorySailSink.prepare(MemorySailStore.java:453)
	at org.eclipse.rdf4j.sail.base.SailSourceBranch.prepare(SailSourceBranch.java:247)
	at org.eclipse.rdf4j.sail.base.UnionSailSource.prepare(UnionSailSource.java:62)
	at org.eclipse.rdf4j.sail.base.SailSourceConnection.prepareInternal(SailSourceConnection.java:457)
	at org.eclipse.rdf4j.sail.helpers.AbstractSailConnection.prepare(AbstractSailConnection.java:368)
	at org.eclipse.rdf4j.sail.shacl.ShaclSailConnection.prepare(ShaclSailConnection.java:705)
	at org.eclipse.rdf4j.repository.sail.SailRepositoryConnection.commit(SailRepositoryConnection.java:205)
	... 2 more

_:node1elhbf3pax358262 a <http://www.w3.org/ns/shacl#ValidationReport>;
  <http://www.w3.org/ns/shacl#conforms> true;
  <http://rdf4j.org/schema/rdf4j#truncated> false .
org.eclipse.rdf4j.repository.RepositoryException: org.eclipse.rdf4j.sail.shacl.ShaclSailValidationException: Failed SHACL validation
	at org.eclipse.rdf4j.repository.sail.SailRepositoryConnection.commit(SailRepositoryConnection.java:208)
	at org.eclipse.rdf4j.sail.shacl.SerializableTest.lambda$multithreadedMaxCountViolation$0(SerializableTest.java:145)
	at java.base/java.lang.Thread.run(Thread.java:834)
Caused by: org.eclipse.rdf4j.sail.shacl.ShaclSailValidationException: Failed SHACL validation
	at org.eclipse.rdf4j.sail.shacl.ShaclSailConnection.prepare(ShaclSailConnection.java:693)
	at org.eclipse.rdf4j.repository.sail.SailRepositoryConnection.commit(SailRepositoryConnection.java:205)
	... 2 more

_:node1elhbf3pax358306 a <http://www.w3.org/ns/shacl#ValidationReport>;
  <http://www.w3.org/ns/shacl#conforms> true;
  <http://rdf4j.org/schema/rdf4j#truncated> false .
org.eclipse.rdf4j.repository.RepositoryException: org.eclipse.rdf4j.sail.shacl.ShaclSailValidationException: Failed SHACL validation
	at org.eclipse.rdf4j.repository.sail.SailRepositoryConnection.commit(SailRepositoryConnection.java:208)
	at org.eclipse.rdf4j.sail.shacl.SerializableTest.lambda$multithreadedMaxCountViolation$1(SerializableTest.java:169)
	at java.base/java.lang.Thread.run(Thread.java:834)
Caused by: org.eclipse.rdf4j.sail.shacl.ShaclSailValidationException: Failed SHACL validation
	at org.eclipse.rdf4j.sail.shacl.ShaclSailConnection.prepare(ShaclSailConnection.java:693)
	at org.eclipse.rdf4j.repository.sail.SailRepositoryConnection.commit(SailRepositoryConnection.java:205)
	... 2 more

_:node1elhbf3pax358350 a <http://www.w3.org/ns/shacl#ValidationReport>;
  <http://www.w3.org/ns/shacl#conforms> true;
  <http://rdf4j.org/schema/rdf4j#truncated> false .
org.eclipse.rdf4j.repository.RepositoryException: org.eclipse.rdf4j.sail.shacl.ShaclSailValidationException: Failed SHACL validation
	at org.eclipse.rdf4j.repository.sail.SailRepositoryConnection.commit(SailRepositoryConnection.java:208)
	at org.eclipse.rdf4j.sail.shacl.SerializableTest.lambda$multithreadedMaxCountViolation$1(SerializableTest.java:169)
	at java.base/java.lang.Thread.run(Thread.java:834)
Caused by: org.eclipse.rdf4j.sail.shacl.ShaclSailValidationException: Failed SHACL validation
	at org.eclipse.rdf4j.sail.shacl.ShaclSailConnection.prepare(ShaclSailConnection.java:693)
	at org.eclipse.rdf4j.repository.sail.SailRepositoryConnection.commit(SailRepositoryConnection.java:205)
	... 2 more

_:node1elhbf3pax358394 a <http://www.w3.org/ns/shacl#ValidationReport>;
  <http://www.w3.org/ns/shacl#conforms> true;
  <http://rdf4j.org/schema/rdf4j#truncated> false .
org.eclipse.rdf4j.repository.RepositoryException: org.eclipse.rdf4j.sail.shacl.ShaclSailValidationException: Failed SHACL validation
	at org.eclipse.rdf4j.repository.sail.SailRepositoryConnection.commit(SailRepositoryConnection.java:208)
	at org.eclipse.rdf4j.sail.shacl.SerializableTest.lambda$multithreadedMaxCountViolation$1(SerializableTest.java:169)
	at java.base/java.lang.Thread.run(Thread.java:834)
Caused by: org.eclipse.rdf4j.sail.shacl.ShaclSailValidationException: Failed SHACL validation
	at org.eclipse.rdf4j.sail.shacl.ShaclSailConnection.prepare(ShaclSailConnection.java:693)
	at org.eclipse.rdf4j.repository.sail.SailRepositoryConnection.commit(SailRepositoryConnection.java:205)
	... 2 more

_:node1elhbf3pax358438 a <http://www.w3.org/ns/shacl#ValidationReport>;
  <http://www.w3.org/ns/shacl#conforms> true;
  <http://rdf4j.org/schema/rdf4j#truncated> false .
org.eclipse.rdf4j.repository.RepositoryException: org.eclipse.rdf4j.sail.shacl.ShaclSailValidationException: Failed SHACL validation
	at org.eclipse.rdf4j.repository.sail.SailRepositoryConnection.commit(SailRepositoryConnection.java:208)
	at org.eclipse.rdf4j.sail.shacl.SerializableTest.lambda$multithreadedMaxCountViolation$1(SerializableTest.java:169)
	at java.base/java.lang.Thread.run(Thread.java:834)
Caused by: org.eclipse.rdf4j.sail.shacl.ShaclSailValidationException: Failed SHACL validation
	at org.eclipse.rdf4j.sail.shacl.ShaclSailConnection.prepare(ShaclSailConnection.java:693)
	at org.eclipse.rdf4j.repository.sail.SailRepositoryConnection.commit(SailRepositoryConnection.java:205)
	... 2 more

_:node1elhbf3pax358482 a <http://www.w3.org/ns/shacl#ValidationReport>;
  <http://www.w3.org/ns/shacl#conforms> true;
  <http://rdf4j.org/schema/rdf4j#truncated> false .
org.eclipse.rdf4j.repository.RepositoryException: org.eclipse.rdf4j.sail.shacl.ShaclSailValidationException: Failed SHACL validation
	at org.eclipse.rdf4j.repository.sail.SailRepositoryConnection.commit(SailRepositoryConnection.java:208)
	at org.eclipse.rdf4j.sail.shacl.SerializableTest.lambda$multithreadedMaxCountViolation$0(SerializableTest.java:145)
	at java.base/java.lang.Thread.run(Thread.java:834)
Caused by: org.eclipse.rdf4j.sail.shacl.ShaclSailValidationException: Failed SHACL validation
	at org.eclipse.rdf4j.sail.shacl.ShaclSailConnection.prepare(ShaclSailConnection.java:693)
	at org.eclipse.rdf4j.repository.sail.SailRepositoryConnection.commit(SailRepositoryConnection.java:205)
	... 2 more

_:node1elhbf3pax358526 a <http://www.w3.org/ns/shacl#ValidationReport>;
  <http://www.w3.org/ns/shacl#conforms> true;
  <http://rdf4j.org/schema/rdf4j#truncated> false .
org.eclipse.rdf4j.repository.RepositoryException: org.eclipse.rdf4j.sail.shacl.ShaclSailValidationException: Failed SHACL validation
	at org.eclipse.rdf4j.repository.sail.SailRepositoryConnection.commit(SailRepositoryConnection.java:208)
	at org.eclipse.rdf4j.sail.shacl.SerializableTest.lambda$multithreadedMaxCountViolation$0(SerializableTest.java:145)
	at java.base/java.lang.Thread.run(Thread.java:834)
Caused by: org.eclipse.rdf4j.sail.shacl.ShaclSailValidationException: Failed SHACL validation
	at org.eclipse.rdf4j.sail.shacl.ShaclSailConnection.prepare(ShaclSailConnection.java:693)
	at org.eclipse.rdf4j.repository.sail.SailRepositoryConnection.commit(SailRepositoryConnection.java:205)
	... 2 more

_:node1elhbf3pax358570 a <http://www.w3.org/ns/shacl#ValidationReport>;
  <http://www.w3.org/ns/shacl#conforms> true;
  <http://rdf4j.org/schema/rdf4j#truncated> false .
org.eclipse.rdf4j.repository.RepositoryException: org.eclipse.rdf4j.sail.shacl.ShaclSailValidationException: Failed SHACL validation
	at org.eclipse.rdf4j.repository.sail.SailRepositoryConnection.commit(SailRepositoryConnection.java:208)
	at org.eclipse.rdf4j.sail.shacl.SerializableTest.lambda$multithreadedMaxCountViolation$0(SerializableTest.java:145)
	at java.base/java.lang.Thread.run(Thread.java:834)
Caused by: org.eclipse.rdf4j.sail.shacl.ShaclSailValidationException: Failed SHACL validation
	at org.eclipse.rdf4j.sail.shacl.ShaclSailConnection.prepare(ShaclSailConnection.java:693)
	at org.eclipse.rdf4j.repository.sail.SailRepositoryConnection.commit(SailRepositoryConnection.java:205)
	... 2 more

_:node1elhbf3pax358614 a <http://www.w3.org/ns/shacl#ValidationReport>;
  <http://www.w3.org/ns/shacl#conforms> true;
  <http://rdf4j.org/schema/rdf4j#truncated> false .
org.eclipse.rdf4j.repository.RepositoryException: org.eclipse.rdf4j.sail.shacl.ShaclSailValidationException: Failed SHACL validation
	at org.eclipse.rdf4j.repository.sail.SailRepositoryConnection.commit(SailRepositoryConnection.java:208)
	at org.eclipse.rdf4j.sail.shacl.SerializableTest.lambda$multithreadedMaxCountViolation$0(SerializableTest.java:145)
	at java.base/java.lang.Thread.run(Thread.java:834)
Caused by: org.eclipse.rdf4j.sail.shacl.ShaclSailValidationException: Failed SHACL validation
	at org.eclipse.rdf4j.sail.shacl.ShaclSailConnection.prepare(ShaclSailConnection.java:693)
	at org.eclipse.rdf4j.repository.sail.SailRepositoryConnection.commit(SailRepositoryConnection.java:205)
	... 2 more

_:node1elhbf3pax358658 a <http://www.w3.org/ns/shacl#ValidationReport>;
  <http://www.w3.org/ns/shacl#conforms> true;
  <http://rdf4j.org/schema/rdf4j#truncated> false .
org.eclipse.rdf4j.repository.RepositoryException: org.eclipse.rdf4j.sail.shacl.ShaclSailValidationException: Failed SHACL validation
	at org.eclipse.rdf4j.repository.sail.SailRepositoryConnection.commit(SailRepositoryConnection.java:208)
	at org.eclipse.rdf4j.sail.shacl.SerializableTest.lambda$multithreadedMaxCountViolation$1(SerializableTest.java:169)
	at java.base/java.lang.Thread.run(Thread.java:834)
Caused by: org.eclipse.rdf4j.sail.shacl.ShaclSailValidationException: Failed SHACL validation
	at org.eclipse.rdf4j.sail.shacl.ShaclSailConnection.prepare(ShaclSailConnection.java:693)
	at org.eclipse.rdf4j.repository.sail.SailRepositoryConnection.commit(SailRepositoryConnection.java:205)
	... 2 more

_:node1elhbf3pax358702 a <http://www.w3.org/ns/shacl#ValidationReport>;
  <http://www.w3.org/ns/shacl#conforms> true;
  <http://rdf4j.org/schema/rdf4j#truncated> false .
org.eclipse.rdf4j.repository.RepositoryException: org.eclipse.rdf4j.sail.SailConflictException: Observed State has Changed
	at org.eclipse.rdf4j.repository.sail.SailRepositoryConnection.commit(SailRepositoryConnection.java:208)
	at org.eclipse.rdf4j.sail.shacl.SerializableTest.lambda$multithreadedMaxCount2Violation$3(SerializableTest.java:230)
	at java.base/java.lang.Thread.run(Thread.java:834)
Caused by: org.eclipse.rdf4j.sail.SailConflictException: Observed State has Changed
	at org.eclipse.rdf4j.sail.memory.MemorySailStore$MemorySailSink.prepare(MemorySailStore.java:453)
	at org.eclipse.rdf4j.sail.base.SailSourceBranch.prepare(SailSourceBranch.java:247)
	at org.eclipse.rdf4j.sail.base.UnionSailSource.prepare(UnionSailSource.java:62)
	at org.eclipse.rdf4j.sail.base.SailSourceConnection.prepareInternal(SailSourceConnection.java:457)
	at org.eclipse.rdf4j.sail.helpers.AbstractSailConnection.prepare(AbstractSailConnection.java:368)
	at org.eclipse.rdf4j.sail.shacl.ShaclSailConnection.prepare(ShaclSailConnection.java:705)
	at org.eclipse.rdf4j.repository.sail.SailRepositoryConnection.commit(SailRepositoryConnection.java:205)
	... 2 more

_:node1elhbf3pax358741 a <http://www.w3.org/ns/shacl#ValidationReport>;
  <http://www.w3.org/ns/shacl#conforms> true;
  <http://rdf4j.org/schema/rdf4j#truncated> false .
org.eclipse.rdf4j.repository.RepositoryException: org.eclipse.rdf4j.sail.shacl.ShaclSailValidationException: Failed SHACL validation
	at org.eclipse.rdf4j.repository.sail.SailRepositoryConnection.commit(SailRepositoryConnection.java:208)
	at org.eclipse.rdf4j.sail.shacl.SerializableTest.lambda$multithreadedMaxCount2Violation$2(SerializableTest.java:207)
	at java.base/java.lang.Thread.run(Thread.java:834)
Caused by: org.eclipse.rdf4j.sail.shacl.ShaclSailValidationException: Failed SHACL validation
	at org.eclipse.rdf4j.sail.shacl.ShaclSailConnection.prepare(ShaclSailConnection.java:693)
	at org.eclipse.rdf4j.repository.sail.SailRepositoryConnection.commit(SailRepositoryConnection.java:205)
	... 2 more

_:node1elhbf3pax358785 a <http://www.w3.org/ns/shacl#ValidationReport>;
  <http://www.w3.org/ns/shacl#conforms> true;
  <http://rdf4j.org/schema/rdf4j#truncated> false .
[INFO] Tests run: 4, Failures: 0, Errors: 0, Skipped: 0, Time elapsed: 0 s - in org.eclipse.rdf4j.sail.shacl.SerializableTest
[INFO] Running org.eclipse.rdf4j.sail.shacl.MultithreadedNativeStoreTest
testLotsOfValidationFailuresSerializable
testLotsOfValidationFailuresReadCommitted
testLotsOfValidationFailuresSerializableValidation
testDataAndShapes
testLotsOfValidationFailuresSnapshot
testLotsOfValidationFailuresReadUncommitted
[INFO] Tests run: 6, Failures: 0, Errors: 0, Skipped: 0, Time elapsed: 94.947 s - in org.eclipse.rdf4j.sail.shacl.MultithreadedNativeStoreTest
[INFO] Running org.eclipse.rdf4j.sail.shacl.LeftOuterJoinTest
Tuple{line=["a1", "b1"], propertyShapes= }
Tuple{line=["a2", "b2"], propertyShapes= }
Tuple{line=["a2", "b22"], propertyShapes= }
Tuple{line=["a3"], propertyShapes= }
Tuple{line=["a4", "b4"], propertyShapes= }
Tuple{line=["a1"], propertyShapes= }
Tuple{line=["a2", "b2"], propertyShapes= }
Tuple{line=["a2", "b22"], propertyShapes= }
Tuple{line=["a3"], propertyShapes= }
Tuple{line=["a4", "b4"], propertyShapes= }
Tuple{line=["a1"], propertyShapes= }
Tuple{line=["a2", "b2"], propertyShapes= }
Tuple{line=["a2", "b22"], propertyShapes= }
Tuple{line=["a3"], propertyShapes= }
Tuple{line=["a4"], propertyShapes= }
Tuple{line=["a1", "b1"], propertyShapes= }
Tuple{line=["a1", "b11"], propertyShapes= }
Tuple{line=["a2", "b2"], propertyShapes= }
Tuple{line=["a2", "b22"], propertyShapes= }
Tuple{line=["a3"], propertyShapes= }
Tuple{line=["a4"], propertyShapes= }
Tuple{line=["a1", "b"], propertyShapes= }
Tuple{line=["a2"], propertyShapes= }
Tuple{line=["a1"], propertyShapes= }
Tuple{line=["a2", "b"], propertyShapes= }
Tuple{line=["a1"], propertyShapes= }
Tuple{line=["a2"], propertyShapes= }
Tuple{line=["a1", "b1"], propertyShapes= }
Tuple{line=["a2", "b2"], propertyShapes= }
Tuple{line=["a3", "b3"], propertyShapes= }
Tuple{line=["a4", "b4"], propertyShapes= }
Tuple{line=["a1", "b1"], propertyShapes= }
Tuple{line=["a2", "b2"], propertyShapes= }
Tuple{line=["a1", "b1"], propertyShapes= }
Tuple{line=["a2", "b2"], propertyShapes= }
Tuple{line=["a3", "b3"], propertyShapes= }
Tuple{line=["a1", "b1"], propertyShapes= }
Tuple{line=["a2", "b2"], propertyShapes= }
Tuple{line=["a2", "b22"], propertyShapes= }
Tuple{line=["a3", "b3"], propertyShapes= }
Tuple{line=["a4", "b4"], propertyShapes= }
Tuple{line=["a", "b"], propertyShapes= }
[INFO] Tests run: 13, Failures: 0, Errors: 0, Skipped: 0, Time elapsed: 0.006 s - in org.eclipse.rdf4j.sail.shacl.LeftOuterJoinTest
[INFO] Running org.eclipse.rdf4j.sail.shacl.MultithreadedMemoryStoreTest
testLotsOfValidationFailuresSerializable
testLotsOfValidationFailuresReadCommitted
testLotsOfValidationFailuresSerializableValidation
testDataAndShapes
testLotsOfValidationFailuresSnapshot
testLotsOfValidationFailuresReadUncommitted
[INFO] Tests run: 6, Failures: 0, Errors: 0, Skipped: 0, Time elapsed: 46.465 s - in org.eclipse.rdf4j.sail.shacl.MultithreadedMemoryStoreTest
[INFO] Running org.eclipse.rdf4j.sail.shacl.NativeStoreTest
[INFO] Tests run: 2, Failures: 0, Errors: 0, Skipped: 0, Time elapsed: 0.079 s - in org.eclipse.rdf4j.sail.shacl.NativeStoreTest
[INFO] Running org.eclipse.rdf4j.sail.shacl.UniqueTest
[INFO] Tests run: 3, Failures: 0, Errors: 0, Skipped: 0, Time elapsed: 0 s - in org.eclipse.rdf4j.sail.shacl.UniqueTest
[INFO] Running org.eclipse.rdf4j.sail.shacl.VisulizerTest
02:27:04.914 [main] INFO  Graphviz DOT output:

digraph  {
labelloc=t;
fontsize=30;
label="MinCountPropertyShape";
940463474 [label="Base sail" nodeShape=pentagon fillcolor=lightblue style=filled];
1215407504 [label="Previous state connection" nodeShape=pentagon fillcolor=lightblue style=filled];
1862648601 [label="Added statements" nodeShape=pentagon fillcolor=lightblue style=filled];
2053142246 [label="Removed statements" nodeShape=pentagon fillcolor=lightblue style=filled];
281587072 [label="MinCountFilter{minCount=1}"];
933392532 -> 281587072
281587072 -> 661337858 [label="false values"]
933392532 [label="GroupByCount"];
1633470546 -> 933392532
1633470546 [label="BulkedExternalLeftOuterJoin{parsedQuery=select * where {   VALUES (?a) {}  ?a <http://www.w3.org/2000/01/rdf-schema#label> ?c .     }  ORDER BY ?a}"];
107938901 [label="Unique"];
586019548 -> 107938901
586019548 [label="TrimTuple{newLength=1, startIndex=0}"];
1556091556 -> 586019548
1540972342 [label="MinCountFilter{minCount=1}"];
636138932 -> 1540972342
1540972342 -> 1556091556 [label="false values"]
636138932 [label="GroupByCount"];
1750915271 -> 636138932
1750915271 [label="UnionNode"];
878027354 -> 1750915271
878027354 [label="Unique"];
635730697 -> 878027354
635730697 [label="UnionNode"];
1439902996 -> 635730697
1439902996 [label="Unique"];
1531403657 -> 1439902996
1531403657 [label="TrimTuple{newLength=1, startIndex=0}"];
1108960201 -> 1531403657
1108960201 [label="BufferedSplitter"];
1143170224 -> 1108960201
1143170224 [label="Sort"];
139745965 -> 1143170224
139745965 [label="UnorderedSelect{subject=null, predicate=rdf:type, object=rdfs:Resource, outputPattern=SubjectPredicateObject}"];
1862648601 -> 139745965
1611711722 -> 635730697
1611711722 [label="ExternalPredicateObjectFilter{, filterOnPredicate=http://www.w3.org/1999/02/22-rdf-syntax-ns#typefilterOnObject=[rdfs:Resource], index=0}"];
197887584 -> 1611711722
940463474 -> 1611711722 [label="filter source"]
197887584 [label="Unique"];
1830429799 -> 197887584
1830429799 [label="TrimTuple{newLength=1, startIndex=0}"];
460386226 -> 1830429799
460386226 [label="BufferedSplitter"];
442836696 -> 460386226
442836696 [label="Sort"];
1305103218 -> 442836696
1305103218 [label="UnorderedSelect{subject=null, predicate=rdfs:label, object=null, outputPattern=SubjectObject}"];
2053142246 -> 1305103218
1909422000 -> 1750915271
1909422000 [label="ExternalPredicateObjectFilter{, filterOnPredicate=http://www.w3.org/1999/02/22-rdf-syntax-ns#typefilterOnObject=[rdfs:Resource], index=0}"];
1843272516 -> 1909422000
940463474 -> 1909422000 [label="filter source"]
1843272516 [label="BufferedSplitter"];
1581167553 -> 1843272516
1581167553 [label="Sort"];
1093726895 -> 1581167553
1093726895 [label="UnorderedSelect{subject=null, predicate=rdfs:label, object=null, outputPattern=SubjectObject}"];
1862648601 -> 1093726895
1556091556 [label="UnBufferedPlanNode"];
940463474 -> 1633470546 [label="right"]
107938901 -> 1633470546 [label="left"]
661337858 [label="UnBufferedPlanNode"];
}



02:27:04.919 [main] INFO  Graphviz DOT output:

digraph  {
labelloc=t;
fontsize=30;
label="MaxCountPropertyShape";
443018643 [label="Base sail" nodeShape=pentagon fillcolor=lightblue style=filled];
1539000005 [label="Previous state connection" nodeShape=pentagon fillcolor=lightblue style=filled];
1310370012 [label="Added statements" nodeShape=pentagon fillcolor=lightblue style=filled];
1804694471 [label="Removed statements" nodeShape=pentagon fillcolor=lightblue style=filled];
1312755795 [label="UnionNode"];
1643700951 -> 1312755795
1843412614 [label="MaxCountFilter{maxCount=2 'true means <= 2'}"];
227502006 -> 1843412614
1843412614 -> 1643700951 [label="false values"]
227502006 [label="GroupByCount"];
998523868 -> 227502006
998523868 [label="BulkedExternalInnerJoin{parsedQuery=select * where {   VALUES (?a) {}  ?a <http://www.w3.org/2000/01/rdf-schema#label> ?c .     }  ORDER BY ?a}"];
491581473 -> 998523868 [label="left"]
443018643 -> 998523868 [label="right"]
1539000005 -> 998523868 [label="skip if not present"]
491581473 [label="Unique"];
1907681536 -> 491581473
1907681536 [label="TrimTuple{newLength=1, startIndex=0}"];
133206615 -> 1907681536
510897110 [label="MaxCountFilter{maxCount=2 'true means <= 2'}"];
1690607041 -> 510897110
510897110 -> 133206615 [label="true values"]
510897110 -> 846103728 [label="false values"]
1690607041 [label="GroupByCount"];
831507072 -> 1690607041
831507072 [label="UnionNode"];
841083516 -> 831507072
841083516 [label="Unique"];
1917539180 -> 841083516
1917539180 [label="TrimTuple{newLength=1, startIndex=0}"];
877007505 -> 1917539180
877007505 [label="BufferedSplitter"];
2068972883 -> 877007505
2068972883 [label="Sort"];
1176330831 -> 2068972883
1176330831 [label="UnorderedSelect{subject=null, predicate=rdf:type, object=rdfs:Resource, outputPattern=SubjectPredicateObject}"];
1310370012 -> 1176330831
1860540883 -> 831507072
1860540883 [label="ExternalPredicateObjectFilter{, filterOnPredicate=http://www.w3.org/1999/02/22-rdf-syntax-ns#typefilterOnObject=[rdfs:Resource], index=0}"];
1781779460 -> 1860540883
443018643 -> 1860540883 [label="filter source"]
1781779460 [label="BufferedSplitter"];
18887820 -> 1781779460
18887820 [label="Sort"];
738341373 -> 18887820
738341373 [label="UnorderedSelect{subject=null, predicate=rdfs:label, object=null, outputPattern=SubjectObject}"];
1310370012 -> 738341373
133206615 [label="BufferedPlanNode"];
1643700951 [label="UnBufferedPlanNode"];
846103728 -> 1312755795
846103728 [label="BufferedPlanNode"];
}



02:27:04.924 [main] INFO  Graphviz DOT output:

digraph  {
labelloc=t;
fontsize=30;
label="DatatypePropertyShape";
1980058656 [label="Base sail" nodeShape=pentagon fillcolor=lightblue style=filled];
1739205449 [label="Previous state connection" nodeShape=pentagon fillcolor=lightblue style=filled];
1192003585 [label="Added statements" nodeShape=pentagon fillcolor=lightblue style=filled];
1994973111 [label="Removed statements" nodeShape=pentagon fillcolor=lightblue style=filled];
709949702 [label="DatatypeFilter{datatype=xsd:int}"];
1697519130 -> 709949702
709949702 -> 2005144897 [label="false values"]
1697519130 [label="UnionNode"];
1201764705 -> 1697519130
1201764705 [label="UnionNode"];
1779707994 -> 1201764705
2141156804 [label="Unique"];
677796203 -> 2141156804
677796203 [label="TrimTuple{newLength=1, startIndex=0}"];
1690322807 -> 677796203
1690322807 [label="BufferedSplitter"];
790441301 -> 1690322807
790441301 [label="Sort"];
724065319 -> 790441301
724065319 [label="UnorderedSelect{subject=null, predicate=rdf:type, object=rdfs:Resource, outputPattern=SubjectPredicateObject}"];
1192003585 -> 724065319
832562472 [label="InnerJoin"];
2141156804 -> 832562472 [label="left"];
1468200851 -> 832562472 [label="right"];
1468200851 [label="BufferedSplitter"];
296947635 -> 1468200851
296947635 [label="Sort"];
520544110 -> 296947635
2022940870 [label="DatatypeFilter{datatype=xsd:int}"];
913026137 -> 2022940870
2022940870 -> 520544110 [label="false values"]
913026137 [label="UnorderedSelect{subject=null, predicate=http://xmlns.com/foaf/0.1/age, object=null, outputPattern=SubjectObject}"];
1192003585 -> 913026137
520544110 [label="UnBufferedPlanNode"];
832562472 -> 1981148008 [label="discardedRight"];
832562472 -> 1779707994 [label="joined"];
1779707994 [label="BufferedPlanNode"];
2136124558 -> 1201764705
2136124558 [label="ExternalPredicateObjectFilter{, filterOnPredicate=http://www.w3.org/1999/02/22-rdf-syntax-ns#typefilterOnObject=[rdfs:Resource], index=0}"];
1981148008 -> 2136124558
1980058656 -> 2136124558 [label="filter source"]
1981148008 [label="BufferedPlanNode"];
446866994 -> 1697519130
446866994 [label="BulkedExternalInnerJoin{parsedQuery=select * where {   VALUES (?a) {}  ?a <http://xmlns.com/foaf/0.1/age> ?c .     }  ORDER BY ?a}"];
1900071003 -> 446866994 [label="left"]
1980058656 -> 446866994 [label="right"]
1739205449 -> 446866994 [label="skip if not present"]
1900071003 [label="Unique"];
676803504 -> 1900071003
676803504 [label="TrimTuple{newLength=1, startIndex=0}"];
1690322807 -> 676803504
1690322807 [label="BufferedSplitter"];
790441301 -> 1690322807
2005144897 [label="UnBufferedPlanNode"];
}



[INFO] Tests run: 3, Failures: 0, Errors: 0, Skipped: 0, Time elapsed: 0.024 s - in org.eclipse.rdf4j.sail.shacl.VisulizerTest
[INFO] Running org.eclipse.rdf4j.sail.shacl.ModifyShapesPostInitTest
[WARNING] Tests run: 13, Failures: 0, Errors: 0, Skipped: 1, Time elapsed: 0.033 s - in org.eclipse.rdf4j.sail.shacl.ModifyShapesPostInitTest
[INFO] Running org.eclipse.rdf4j.sail.shacl.ShaclSailSupportedPredicatesDocumentationTest
02:27:05.215 [pool-21513-thread-1] ERROR ShaclSail was garbage collected without shutdown() having been called first.
02:27:05.220 [pool-21516-thread-1] ERROR ShaclSail was garbage collected without shutdown() having been called first.
02:27:05.227 [pool-21520-thread-1] ERROR ShaclSail was garbage collected without shutdown() having been called first.
02:27:05.232 [pool-21524-thread-1] ERROR ShaclSail was garbage collected without shutdown() having been called first.
02:27:05.234 [pool-21525-thread-1] ERROR ShaclSail was garbage collected without shutdown() having been called first.
02:27:05.237 [pool-21527-thread-1] ERROR ShaclSail was garbage collected without shutdown() having been called first.
02:27:05.243 [pool-21532-thread-1] ERROR ShaclSail was garbage collected without shutdown() having been called first.
02:27:05.248 [pool-21534-thread-1] ERROR ShaclSail was garbage collected without shutdown() having been called first.
02:27:05.257 [pool-21540-thread-1] ERROR ShaclSail was garbage collected without shutdown() having been called first.
02:27:05.294 [pool-21506-thread-1] ERROR ShaclSail was garbage collected without shutdown() having been called first.
02:27:05.301 [pool-21510-thread-1] ERROR ShaclSail was garbage collected without shutdown() having been called first.
[INFO] Tests run: 2310, Failures: 0, Errors: 0, Skipped: 0, Time elapsed: 0.663 s - in org.eclipse.rdf4j.sail.shacl.ShaclSailSupportedPredicatesDocumentationTest
[INFO] Running org.eclipse.rdf4j.sail.shacl.ValidationApproachFactoryTest
[INFO] Tests run: 2, Failures: 0, Errors: 0, Skipped: 0, Time elapsed: 0 s - in org.eclipse.rdf4j.sail.shacl.ValidationApproachFactoryTest
[INFO] Running org.eclipse.rdf4j.sail.shacl.TargetNodeMinCountEdgeCaseTests
[INFO] Tests run: 6, Failures: 0, Errors: 0, Skipped: 0, Time elapsed: 0 s - in org.eclipse.rdf4j.sail.shacl.TargetNodeMinCountEdgeCaseTests
[INFO] Running org.eclipse.rdf4j.sail.shacl.BulkValidationSettingsTest
[INFO] Tests run: 6, Failures: 0, Errors: 0, Skipped: 0, Time elapsed: 0.001 s - in org.eclipse.rdf4j.sail.shacl.BulkValidationSettingsTest
[INFO] Running org.eclipse.rdf4j.sail.shacl.ReduceNumberOfPlansTest
[INFO] Tests run: 2, Failures: 0, Errors: 0, Skipped: 0, Time elapsed: 0.009 s - in org.eclipse.rdf4j.sail.shacl.ReduceNumberOfPlansTest
[INFO] Running org.eclipse.rdf4j.sail.shacl.UnknownShapesTest
02:27:05.705 [main] WARN  Unsupported SHACL feature with complex path. Only single predicate paths, or single predicate inverse paths are supported. <http://example.com/ns#inverseOfWithComplex> shape has been deactivated! 
@prefix sh: <http://www.w3.org/ns/shacl#> .

<http://example.com/ns#inverseOfWithComplex> sh:path [
      sh:inversePath [
          sh:zeroOrMorePath <http://example.com/ns#inverseThis>
        ]
    ] .

02:27:05.708 [main] WARN  Unsupported SHACL feature with complex path. Only single predicate paths, or single predicate inverse paths are supported. <http://example.com/ns#pathSequence> shape has been deactivated! 
@prefix sh: <http://www.w3.org/ns/shacl#> .

<http://example.com/ns#pathSequence> sh:path (<http://example.com/ns#parent> <http://example.com/ns#firstName>) .

02:27:05.709 [main] WARN  Unsupported SHACL feature with complex path. Only single predicate paths, or single predicate inverse paths are supported. <http://example.com/ns#alternativePath> shape has been deactivated! 
@prefix sh: <http://www.w3.org/ns/shacl#> .

<http://example.com/ns#alternativePath> sh:path [
      sh:alternativePath <http://example.com/ns#father>
    ] .

02:27:05.812 [main] WARN  Unsupported SHACL feature detected sh:unknownTarget in statement (http://example.com/ns#PersonShape, http://www.w3.org/ns/shacl#unknownTarget, http://www.w3.org/2000/01/rdf-schema#Class) [null]
02:27:05.812 [main] WARN  Unsupported SHACL feature detected sh:unknownShaclProperty in statement (http://example.com/ns#PersonPropertyShape, http://www.w3.org/ns/shacl#unknownShaclProperty, "1"^^<http://www.w3.org/2001/XMLSchema#integer>) [null]
02:27:05.813 [main] WARN  Unsupported SHACL feature detected sh:unknownTarget in statement (http://example.com/ns#PersonShape, http://www.w3.org/ns/shacl#unknownTarget, http://www.w3.org/2000/01/rdf-schema#Class) [null]
[INFO] Tests run: 2, Failures: 0, Errors: 0, Skipped: 0, Time elapsed: 0.21 s - in org.eclipse.rdf4j.sail.shacl.UnknownShapesTest
[INFO] Running org.eclipse.rdf4j.sail.shacl.EqualsJoinTest
[Tuple{line=["a"], propertyShapes= }]
[Tuple{line=["a"], propertyShapes= }, Tuple{line=["c"], propertyShapes= }]
[Tuple{line=["a"], propertyShapes= }, Tuple{line=["c"], propertyShapes= }]
[]
[Tuple{line=["c"], propertyShapes= }]
[Tuple{line=["a", "1"], propertyShapes= }, Tuple{line=["b", "1"], propertyShapes= }, Tuple{line=["b", "1"], propertyShapes= }, Tuple{line=["c", "1"], propertyShapes= }]
[INFO] Tests run: 6, Failures: 0, Errors: 0, Skipped: 0, Time elapsed: 0 s - in org.eclipse.rdf4j.sail.shacl.EqualsJoinTest
[INFO] Running org.eclipse.rdf4j.sail.shacl.config.ShaclSailConfigTest
[INFO] Tests run: 5, Failures: 0, Errors: 0, Skipped: 0, Time elapsed: 0.007 s - in org.eclipse.rdf4j.sail.shacl.config.ShaclSailConfigTest
[INFO] Running org.eclipse.rdf4j.sail.shacl.config.ShaclSailFactoryTest
[INFO] Tests run: 3, Failures: 0, Errors: 0, Skipped: 0, Time elapsed: 0 s - in org.eclipse.rdf4j.sail.shacl.config.ShaclSailFactoryTest
[INFO] Running org.eclipse.rdf4j.sail.shacl.BulkedExternalInnerJoinTest
02:27:05.931 [main] INFO       506935450	  BulkedExternalInnerJoin.next():  Tuple{line=[http://b, http://www.w3.org/2000/01/rdf-schema#Resource], propertyShapes= } :  BulkedExternalInnerJoin{parsedQuery=select * where {   VALUES (?a) {}  ?a <http://www.w3.org/ns/dcat#accessURL> ?c.   }  ORDER BY ?a}
02:27:05.931 [main] INFO       506935450	  BulkedExternalInnerJoin.next():  Tuple{line=[http://d, http://www.w3.org/2000/01/rdf-schema#subPropertyOf], propertyShapes= } :  BulkedExternalInnerJoin{parsedQuery=select * where {   VALUES (?a) {}  ?a <http://www.w3.org/ns/dcat#accessURL> ?c.   }  ORDER BY ?a}
Tuple{line=[http://b, http://www.w3.org/2000/01/rdf-schema#Resource], propertyShapes= }
Tuple{line=[http://d, http://www.w3.org/2000/01/rdf-schema#subPropertyOf], propertyShapes= }
[INFO] Tests run: 1, Failures: 0, Errors: 0, Skipped: 0, Time elapsed: 0.006 s - in org.eclipse.rdf4j.sail.shacl.BulkedExternalInnerJoinTest
[INFO] Running org.eclipse.rdf4j.sail.shacl.InnerJoinTest
02:27:05.932 [main] INFO       506935450	  BulkedExternalInnerJoin.next():  Tuple{line=[http://b, http://www.w3.org/2000/01/rdf-schema#Resource], propertyShapes= } :  BulkedExternalInnerJoin{parsedQuery=select * where {   VALUES (?a) {}  ?a <http://www.w3.org/ns/dcat#accessURL> ?c.   }  ORDER BY ?a}
02:27:05.933 [main] INFO       506935450	  BulkedExternalInnerJoin.next():  Tuple{line=[http://d, http://www.w3.org/2000/01/rdf-schema#subPropertyOf], propertyShapes= } :  BulkedExternalInnerJoin{parsedQuery=select * where {   VALUES (?a) {}  ?a <http://www.w3.org/ns/dcat#accessURL> ?c.   }  ORDER BY ?a}
02:27:05.933 [main] INFO       277682724	InnerJoin:Buffered:Joined.next():  Tuple{line=["a1", "b1"], propertyShapes= } :  InnerJoin
02:27:05.933 [main] INFO       277682724	InnerJoin:Buffered:Joined.next():  Tuple{line=["a2", "b2"], propertyShapes= } :  InnerJoin
02:27:05.933 [main] INFO       277682724	InnerJoin:Buffered:Joined.next():  Tuple{line=["a2", "b22"], propertyShapes= } :  InnerJoin
02:27:05.933 [main] INFO       277682724	InnerJoin:Buffered:Joined.next():  Tuple{line=["a4", "b4"], propertyShapes= } :  InnerJoin
Tuple{line=["a1", "b1"], propertyShapes= }
Tuple{line=["a2", "b2"], propertyShapes= }
Tuple{line=["a2", "b22"], propertyShapes= }
Tuple{line=["a4", "b4"], propertyShapes= }
02:27:05.934 [main] INFO       506935450	  BulkedExternalInnerJoin.next():  Tuple{line=[http://b, http://www.w3.org/2000/01/rdf-schema#Resource], propertyShapes= } :  BulkedExternalInnerJoin{parsedQuery=select * where {   VALUES (?a) {}  ?a <http://www.w3.org/ns/dcat#accessURL> ?c.   }  ORDER BY ?a}
02:27:05.934 [main] INFO       506935450	  BulkedExternalInnerJoin.next():  Tuple{line=[http://d, http://www.w3.org/2000/01/rdf-schema#subPropertyOf], propertyShapes= } :  BulkedExternalInnerJoin{parsedQuery=select * where {   VALUES (?a) {}  ?a <http://www.w3.org/ns/dcat#accessURL> ?c.   }  ORDER BY ?a}
02:27:05.934 [main] INFO       277682724	InnerJoin:Buffered:Joined.next():  Tuple{line=["a1", "b1"], propertyShapes= } :  InnerJoin
02:27:05.934 [main] INFO       277682724	InnerJoin:Buffered:Joined.next():  Tuple{line=["a2", "b2"], propertyShapes= } :  InnerJoin
02:27:05.934 [main] INFO       277682724	InnerJoin:Buffered:Joined.next():  Tuple{line=["a2", "b22"], propertyShapes= } :  InnerJoin
02:27:05.934 [main] INFO       277682724	InnerJoin:Buffered:Joined.next():  Tuple{line=["a4", "b4"], propertyShapes= } :  InnerJoin
02:27:05.934 [main] INFO      1322228822	InnerJoin:Buffered:Joined.next():  Tuple{line=["a2", "b2"], propertyShapes= } :  InnerJoin
02:27:05.934 [main] INFO      1322228822	InnerJoin:Buffered:Joined.next():  Tuple{line=["a2", "b22"], propertyShapes= } :  InnerJoin
02:27:05.934 [main] INFO      1322228822	InnerJoin:Buffered:Joined.next():  Tuple{line=["a4", "b4"], propertyShapes= } :  InnerJoin
Tuple{line=["a2", "b2"], propertyShapes= }
Tuple{line=["a2", "b22"], propertyShapes= }
Tuple{line=["a4", "b4"], propertyShapes= }
02:27:05.934 [main] INFO       506935450	  BulkedExternalInnerJoin.next():  Tuple{line=[http://b, http://www.w3.org/2000/01/rdf-schema#Resource], propertyShapes= } :  BulkedExternalInnerJoin{parsedQuery=select * where {   VALUES (?a) {}  ?a <http://www.w3.org/ns/dcat#accessURL> ?c.   }  ORDER BY ?a}
02:27:05.934 [main] INFO       506935450	  BulkedExternalInnerJoin.next():  Tuple{line=[http://d, http://www.w3.org/2000/01/rdf-schema#subPropertyOf], propertyShapes= } :  BulkedExternalInnerJoin{parsedQuery=select * where {   VALUES (?a) {}  ?a <http://www.w3.org/ns/dcat#accessURL> ?c.   }  ORDER BY ?a}
02:27:05.934 [main] INFO       277682724	InnerJoin:Buffered:Joined.next():  Tuple{line=["a1", "b1"], propertyShapes= } :  InnerJoin
02:27:05.934 [main] INFO       277682724	InnerJoin:Buffered:Joined.next():  Tuple{line=["a2", "b2"], propertyShapes= } :  InnerJoin
02:27:05.934 [main] INFO       277682724	InnerJoin:Buffered:Joined.next():  Tuple{line=["a2", "b22"], propertyShapes= } :  InnerJoin
02:27:05.934 [main] INFO       277682724	InnerJoin:Buffered:Joined.next():  Tuple{line=["a4", "b4"], propertyShapes= } :  InnerJoin
02:27:05.934 [main] INFO      1322228822	InnerJoin:Buffered:Joined.next():  Tuple{line=["a2", "b2"], propertyShapes= } :  InnerJoin
02:27:05.934 [main] INFO      1322228822	InnerJoin:Buffered:Joined.next():  Tuple{line=["a2", "b22"], propertyShapes= } :  InnerJoin
02:27:05.934 [main] INFO      1322228822	InnerJoin:Buffered:Joined.next():  Tuple{line=["a4", "b4"], propertyShapes= } :  InnerJoin
02:27:05.935 [main] INFO       359176186	InnerJoin:Buffered:Joined.next():  Tuple{line=["a2", "b2"], propertyShapes= } :  InnerJoin
02:27:05.935 [main] INFO       359176186	InnerJoin:Buffered:Joined.next():  Tuple{line=["a2", "b22"], propertyShapes= } :  InnerJoin
Tuple{line=["a2", "b2"], propertyShapes= }
Tuple{line=["a2", "b22"], propertyShapes= }
02:27:05.935 [main] INFO       506935450	  BulkedExternalInnerJoin.next():  Tuple{line=[http://b, http://www.w3.org/2000/01/rdf-schema#Resource], propertyShapes= } :  BulkedExternalInnerJoin{parsedQuery=select * where {   VALUES (?a) {}  ?a <http://www.w3.org/ns/dcat#accessURL> ?c.   }  ORDER BY ?a}
02:27:05.935 [main] INFO       506935450	  BulkedExternalInnerJoin.next():  Tuple{line=[http://d, http://www.w3.org/2000/01/rdf-schema#subPropertyOf], propertyShapes= } :  BulkedExternalInnerJoin{parsedQuery=select * where {   VALUES (?a) {}  ?a <http://www.w3.org/ns/dcat#accessURL> ?c.   }  ORDER BY ?a}
02:27:05.935 [main] INFO       277682724	InnerJoin:Buffered:Joined.next():  Tuple{line=["a1", "b1"], propertyShapes= } :  InnerJoin
02:27:05.935 [main] INFO       277682724	InnerJoin:Buffered:Joined.next():  Tuple{line=["a2", "b2"], propertyShapes= } :  InnerJoin
02:27:05.935 [main] INFO       277682724	InnerJoin:Buffered:Joined.next():  Tuple{line=["a2", "b22"], propertyShapes= } :  InnerJoin
02:27:05.935 [main] INFO       277682724	InnerJoin:Buffered:Joined.next():  Tuple{line=["a4", "b4"], propertyShapes= } :  InnerJoin
02:27:05.935 [main] INFO      1322228822	InnerJoin:Buffered:Joined.next():  Tuple{line=["a2", "b2"], propertyShapes= } :  InnerJoin
02:27:05.935 [main] INFO      1322228822	InnerJoin:Buffered:Joined.next():  Tuple{line=["a2", "b22"], propertyShapes= } :  InnerJoin
02:27:05.935 [main] INFO      1322228822	InnerJoin:Buffered:Joined.next():  Tuple{line=["a4", "b4"], propertyShapes= } :  InnerJoin
02:27:05.935 [main] INFO       359176186	InnerJoin:Buffered:Joined.next():  Tuple{line=["a2", "b2"], propertyShapes= } :  InnerJoin
02:27:05.935 [main] INFO       359176186	InnerJoin:Buffered:Joined.next():  Tuple{line=["a2", "b22"], propertyShapes= } :  InnerJoin
02:27:05.935 [main] INFO      2014990099	InnerJoin:Buffered:Joined.next():  Tuple{line=["a1", "b1"], propertyShapes= } :  InnerJoin
02:27:05.935 [main] INFO      2014990099	InnerJoin:Buffered:Joined.next():  Tuple{line=["a1", "b11"], propertyShapes= } :  InnerJoin
02:27:05.935 [main] INFO      2014990099	InnerJoin:Buffered:Joined.next():  Tuple{line=["a2", "b2"], propertyShapes= } :  InnerJoin
02:27:05.935 [main] INFO      2014990099	InnerJoin:Buffered:Joined.next():  Tuple{line=["a2", "b22"], propertyShapes= } :  InnerJoin
Tuple{line=["a1", "b1"], propertyShapes= }
Tuple{line=["a1", "b11"], propertyShapes= }
Tuple{line=["a2", "b2"], propertyShapes= }
Tuple{line=["a2", "b22"], propertyShapes= }
02:27:05.936 [main] INFO       506935450	  BulkedExternalInnerJoin.next():  Tuple{line=[http://b, http://www.w3.org/2000/01/rdf-schema#Resource], propertyShapes= } :  BulkedExternalInnerJoin{parsedQuery=select * where {   VALUES (?a) {}  ?a <http://www.w3.org/ns/dcat#accessURL> ?c.   }  ORDER BY ?a}
02:27:05.936 [main] INFO       506935450	  BulkedExternalInnerJoin.next():  Tuple{line=[http://d, http://www.w3.org/2000/01/rdf-schema#subPropertyOf], propertyShapes= } :  BulkedExternalInnerJoin{parsedQuery=select * where {   VALUES (?a) {}  ?a <http://www.w3.org/ns/dcat#accessURL> ?c.   }  ORDER BY ?a}
02:27:05.936 [main] INFO       277682724	InnerJoin:Buffered:Joined.next():  Tuple{line=["a1", "b1"], propertyShapes= } :  InnerJoin
02:27:05.936 [main] INFO       277682724	InnerJoin:Buffered:Joined.next():  Tuple{line=["a2", "b2"], propertyShapes= } :  InnerJoin
02:27:05.936 [main] INFO       277682724	InnerJoin:Buffered:Joined.next():  Tuple{line=["a2", "b22"], propertyShapes= } :  InnerJoin
02:27:05.936 [main] INFO       277682724	InnerJoin:Buffered:Joined.next():  Tuple{line=["a4", "b4"], propertyShapes= } :  InnerJoin
02:27:05.936 [main] INFO      1322228822	InnerJoin:Buffered:Joined.next():  Tuple{line=["a2", "b2"], propertyShapes= } :  InnerJoin
02:27:05.936 [main] INFO      1322228822	InnerJoin:Buffered:Joined.next():  Tuple{line=["a2", "b22"], propertyShapes= } :  InnerJoin
02:27:05.936 [main] INFO      1322228822	InnerJoin:Buffered:Joined.next():  Tuple{line=["a4", "b4"], propertyShapes= } :  InnerJoin
02:27:05.936 [main] INFO       359176186	InnerJoin:Buffered:Joined.next():  Tuple{line=["a2", "b2"], propertyShapes= } :  InnerJoin
02:27:05.936 [main] INFO       359176186	InnerJoin:Buffered:Joined.next():  Tuple{line=["a2", "b22"], propertyShapes= } :  InnerJoin
02:27:05.936 [main] INFO      2014990099	InnerJoin:Buffered:Joined.next():  Tuple{line=["a1", "b1"], propertyShapes= } :  InnerJoin
02:27:05.936 [main] INFO      2014990099	InnerJoin:Buffered:Joined.next():  Tuple{line=["a1", "b11"], propertyShapes= } :  InnerJoin
02:27:05.936 [main] INFO      2014990099	InnerJoin:Buffered:Joined.next():  Tuple{line=["a2", "b2"], propertyShapes= } :  InnerJoin
02:27:05.936 [main] INFO      2014990099	InnerJoin:Buffered:Joined.next():  Tuple{line=["a2", "b22"], propertyShapes= } :  InnerJoin
02:27:05.936 [main] INFO       812039223	InnerJoin:Buffered:Joined.next():  Tuple{line=["a1", "b"], propertyShapes= } :  InnerJoin
Tuple{line=["a1", "b"], propertyShapes= }
02:27:05.936 [main] INFO       506935450	  BulkedExternalInnerJoin.next():  Tuple{line=[http://b, http://www.w3.org/2000/01/rdf-schema#Resource], propertyShapes= } :  BulkedExternalInnerJoin{parsedQuery=select * where {   VALUES (?a) {}  ?a <http://www.w3.org/ns/dcat#accessURL> ?c.   }  ORDER BY ?a}
02:27:05.936 [main] INFO       506935450	  BulkedExternalInnerJoin.next():  Tuple{line=[http://d, http://www.w3.org/2000/01/rdf-schema#subPropertyOf], propertyShapes= } :  BulkedExternalInnerJoin{parsedQuery=select * where {   VALUES (?a) {}  ?a <http://www.w3.org/ns/dcat#accessURL> ?c.   }  ORDER BY ?a}
02:27:05.936 [main] INFO       277682724	InnerJoin:Buffered:Joined.next():  Tuple{line=["a1", "b1"], propertyShapes= } :  InnerJoin
02:27:05.936 [main] INFO       277682724	InnerJoin:Buffered:Joined.next():  Tuple{line=["a2", "b2"], propertyShapes= } :  InnerJoin
02:27:05.936 [main] INFO       277682724	InnerJoin:Buffered:Joined.next():  Tuple{line=["a2", "b22"], propertyShapes= } :  InnerJoin
02:27:05.936 [main] INFO       277682724	InnerJoin:Buffered:Joined.next():  Tuple{line=["a4", "b4"], propertyShapes= } :  InnerJoin
02:27:05.936 [main] INFO      1322228822	InnerJoin:Buffered:Joined.next():  Tuple{line=["a2", "b2"], propertyShapes= } :  InnerJoin
02:27:05.936 [main] INFO      1322228822	InnerJoin:Buffered:Joined.next():  Tuple{line=["a2", "b22"], propertyShapes= } :  InnerJoin
02:27:05.936 [main] INFO      1322228822	InnerJoin:Buffered:Joined.next():  Tuple{line=["a4", "b4"], propertyShapes= } :  InnerJoin
02:27:05.937 [main] INFO       359176186	InnerJoin:Buffered:Joined.next():  Tuple{line=["a2", "b2"], propertyShapes= } :  InnerJoin
02:27:05.937 [main] INFO       359176186	InnerJoin:Buffered:Joined.next():  Tuple{line=["a2", "b22"], propertyShapes= } :  InnerJoin
02:27:05.937 [main] INFO      2014990099	InnerJoin:Buffered:Joined.next():  Tuple{line=["a1", "b1"], propertyShapes= } :  InnerJoin
02:27:05.937 [main] INFO      2014990099	InnerJoin:Buffered:Joined.next():  Tuple{line=["a1", "b11"], propertyShapes= } :  InnerJoin
02:27:05.937 [main] INFO      2014990099	InnerJoin:Buffered:Joined.next():  Tuple{line=["a2", "b2"], propertyShapes= } :  InnerJoin
02:27:05.937 [main] INFO      2014990099	InnerJoin:Buffered:Joined.next():  Tuple{line=["a2", "b22"], propertyShapes= } :  InnerJoin
02:27:05.937 [main] INFO       812039223	InnerJoin:Buffered:Joined.next():  Tuple{line=["a1", "b"], propertyShapes= } :  InnerJoin
02:27:05.937 [main] INFO      2062694110	InnerJoin:Buffered:Joined.next():  Tuple{line=["a2", "b"], propertyShapes= } :  InnerJoin
Tuple{line=["a2", "b"], propertyShapes= }
02:27:05.937 [main] INFO       506935450	  BulkedExternalInnerJoin.next():  Tuple{line=[http://b, http://www.w3.org/2000/01/rdf-schema#Resource], propertyShapes= } :  BulkedExternalInnerJoin{parsedQuery=select * where {   VALUES (?a) {}  ?a <http://www.w3.org/ns/dcat#accessURL> ?c.   }  ORDER BY ?a}
02:27:05.937 [main] INFO       506935450	  BulkedExternalInnerJoin.next():  Tuple{line=[http://d, http://www.w3.org/2000/01/rdf-schema#subPropertyOf], propertyShapes= } :  BulkedExternalInnerJoin{parsedQuery=select * where {   VALUES (?a) {}  ?a <http://www.w3.org/ns/dcat#accessURL> ?c.   }  ORDER BY ?a}
02:27:05.937 [main] INFO       277682724	InnerJoin:Buffered:Joined.next():  Tuple{line=["a1", "b1"], propertyShapes= } :  InnerJoin
02:27:05.937 [main] INFO       277682724	InnerJoin:Buffered:Joined.next():  Tuple{line=["a2", "b2"], propertyShapes= } :  InnerJoin
02:27:05.937 [main] INFO       277682724	InnerJoin:Buffered:Joined.next():  Tuple{line=["a2", "b22"], propertyShapes= } :  InnerJoin
02:27:05.937 [main] INFO       277682724	InnerJoin:Buffered:Joined.next():  Tuple{line=["a4", "b4"], propertyShapes= } :  InnerJoin
02:27:05.937 [main] INFO      1322228822	InnerJoin:Buffered:Joined.next():  Tuple{line=["a2", "b2"], propertyShapes= } :  InnerJoin
02:27:05.937 [main] INFO      1322228822	InnerJoin:Buffered:Joined.next():  Tuple{line=["a2", "b22"], propertyShapes= } :  InnerJoin
02:27:05.937 [main] INFO      1322228822	InnerJoin:Buffered:Joined.next():  Tuple{line=["a4", "b4"], propertyShapes= } :  InnerJoin
02:27:05.937 [main] INFO       359176186	InnerJoin:Buffered:Joined.next():  Tuple{line=["a2", "b2"], propertyShapes= } :  InnerJoin
02:27:05.937 [main] INFO       359176186	InnerJoin:Buffered:Joined.next():  Tuple{line=["a2", "b22"], propertyShapes= } :  InnerJoin
02:27:05.937 [main] INFO      2014990099	InnerJoin:Buffered:Joined.next():  Tuple{line=["a1", "b1"], propertyShapes= } :  InnerJoin
02:27:05.937 [main] INFO      2014990099	InnerJoin:Buffered:Joined.next():  Tuple{line=["a1", "b11"], propertyShapes= } :  InnerJoin
02:27:05.937 [main] INFO      2014990099	InnerJoin:Buffered:Joined.next():  Tuple{line=["a2", "b2"], propertyShapes= } :  InnerJoin
02:27:05.937 [main] INFO      2014990099	InnerJoin:Buffered:Joined.next():  Tuple{line=["a2", "b22"], propertyShapes= } :  InnerJoin
02:27:05.937 [main] INFO       812039223	InnerJoin:Buffered:Joined.next():  Tuple{line=["a1", "b"], propertyShapes= } :  InnerJoin
02:27:05.937 [main] INFO      2062694110	InnerJoin:Buffered:Joined.next():  Tuple{line=["a2", "b"], propertyShapes= } :  InnerJoin
02:27:05.938 [main] INFO       506935450	  BulkedExternalInnerJoin.next():  Tuple{line=[http://b, http://www.w3.org/2000/01/rdf-schema#Resource], propertyShapes= } :  BulkedExternalInnerJoin{parsedQuery=select * where {   VALUES (?a) {}  ?a <http://www.w3.org/ns/dcat#accessURL> ?c.   }  ORDER BY ?a}
02:27:05.938 [main] INFO       506935450	  BulkedExternalInnerJoin.next():  Tuple{line=[http://d, http://www.w3.org/2000/01/rdf-schema#subPropertyOf], propertyShapes= } :  BulkedExternalInnerJoin{parsedQuery=select * where {   VALUES (?a) {}  ?a <http://www.w3.org/ns/dcat#accessURL> ?c.   }  ORDER BY ?a}
02:27:05.938 [main] INFO       277682724	InnerJoin:Buffered:Joined.next():  Tuple{line=["a1", "b1"], propertyShapes= } :  InnerJoin
02:27:05.938 [main] INFO       277682724	InnerJoin:Buffered:Joined.next():  Tuple{line=["a2", "b2"], propertyShapes= } :  InnerJoin
02:27:05.938 [main] INFO       277682724	InnerJoin:Buffered:Joined.next():  Tuple{line=["a2", "b22"], propertyShapes= } :  InnerJoin
02:27:05.938 [main] INFO       277682724	InnerJoin:Buffered:Joined.next():  Tuple{line=["a4", "b4"], propertyShapes= } :  InnerJoin
02:27:05.938 [main] INFO      1322228822	InnerJoin:Buffered:Joined.next():  Tuple{line=["a2", "b2"], propertyShapes= } :  InnerJoin
02:27:05.938 [main] INFO      1322228822	InnerJoin:Buffered:Joined.next():  Tuple{line=["a2", "b22"], propertyShapes= } :  InnerJoin
02:27:05.938 [main] INFO      1322228822	InnerJoin:Buffered:Joined.next():  Tuple{line=["a4", "b4"], propertyShapes= } :  InnerJoin
02:27:05.938 [main] INFO       359176186	InnerJoin:Buffered:Joined.next():  Tuple{line=["a2", "b2"], propertyShapes= } :  InnerJoin
02:27:05.938 [main] INFO       359176186	InnerJoin:Buffered:Joined.next():  Tuple{line=["a2", "b22"], propertyShapes= } :  InnerJoin
02:27:05.938 [main] INFO      2014990099	InnerJoin:Buffered:Joined.next():  Tuple{line=["a1", "b1"], propertyShapes= } :  InnerJoin
02:27:05.938 [main] INFO      2014990099	InnerJoin:Buffered:Joined.next():  Tuple{line=["a1", "b11"], propertyShapes= } :  InnerJoin
02:27:05.938 [main] INFO      2014990099	InnerJoin:Buffered:Joined.next():  Tuple{line=["a2", "b2"], propertyShapes= } :  InnerJoin
02:27:05.938 [main] INFO      2014990099	InnerJoin:Buffered:Joined.next():  Tuple{line=["a2", "b22"], propertyShapes= } :  InnerJoin
02:27:05.938 [main] INFO       812039223	InnerJoin:Buffered:Joined.next():  Tuple{line=["a1", "b"], propertyShapes= } :  InnerJoin
02:27:05.938 [main] INFO      2062694110	InnerJoin:Buffered:Joined.next():  Tuple{line=["a2", "b"], propertyShapes= } :  InnerJoin
02:27:05.938 [main] INFO       506935450	  BulkedExternalInnerJoin.next():  Tuple{line=[http://b, http://www.w3.org/2000/01/rdf-schema#Resource], propertyShapes= } :  BulkedExternalInnerJoin{parsedQuery=select * where {   VALUES (?a) {}  ?a <http://www.w3.org/ns/dcat#accessURL> ?c.   }  ORDER BY ?a}
02:27:05.938 [main] INFO       506935450	  BulkedExternalInnerJoin.next():  Tuple{line=[http://d, http://www.w3.org/2000/01/rdf-schema#subPropertyOf], propertyShapes= } :  BulkedExternalInnerJoin{parsedQuery=select * where {   VALUES (?a) {}  ?a <http://www.w3.org/ns/dcat#accessURL> ?c.   }  ORDER BY ?a}
02:27:05.938 [main] INFO       277682724	InnerJoin:Buffered:Joined.next():  Tuple{line=["a1", "b1"], propertyShapes= } :  InnerJoin
02:27:05.938 [main] INFO       277682724	InnerJoin:Buffered:Joined.next():  Tuple{line=["a2", "b2"], propertyShapes= } :  InnerJoin
02:27:05.938 [main] INFO       277682724	InnerJoin:Buffered:Joined.next():  Tuple{line=["a2", "b22"], propertyShapes= } :  InnerJoin
02:27:05.938 [main] INFO       277682724	InnerJoin:Buffered:Joined.next():  Tuple{line=["a4", "b4"], propertyShapes= } :  InnerJoin
02:27:05.938 [main] INFO      1322228822	InnerJoin:Buffered:Joined.next():  Tuple{line=["a2", "b2"], propertyShapes= } :  InnerJoin
02:27:05.938 [main] INFO      1322228822	InnerJoin:Buffered:Joined.next():  Tuple{line=["a2", "b22"], propertyShapes= } :  InnerJoin
02:27:05.938 [main] INFO      1322228822	InnerJoin:Buffered:Joined.next():  Tuple{line=["a4", "b4"], propertyShapes= } :  InnerJoin
02:27:05.938 [main] INFO       359176186	InnerJoin:Buffered:Joined.next():  Tuple{line=["a2", "b2"], propertyShapes= } :  InnerJoin
02:27:05.938 [main] INFO       359176186	InnerJoin:Buffered:Joined.next():  Tuple{line=["a2", "b22"], propertyShapes= } :  InnerJoin
02:27:05.938 [main] INFO      2014990099	InnerJoin:Buffered:Joined.next():  Tuple{line=["a1", "b1"], propertyShapes= } :  InnerJoin
02:27:05.939 [main] INFO      2014990099	InnerJoin:Buffered:Joined.next():  Tuple{line=["a1", "b11"], propertyShapes= } :  InnerJoin
02:27:05.939 [main] INFO      2014990099	InnerJoin:Buffered:Joined.next():  Tuple{line=["a2", "b2"], propertyShapes= } :  InnerJoin
02:27:05.939 [main] INFO      2014990099	InnerJoin:Buffered:Joined.next():  Tuple{line=["a2", "b22"], propertyShapes= } :  InnerJoin
02:27:05.939 [main] INFO       812039223	InnerJoin:Buffered:Joined.next():  Tuple{line=["a1", "b"], propertyShapes= } :  InnerJoin
02:27:05.939 [main] INFO      2062694110	InnerJoin:Buffered:Joined.next():  Tuple{line=["a2", "b"], propertyShapes= } :  InnerJoin
02:27:05.939 [main] INFO      1881951521	InnerJoin:Buffered:Joined.next():  Tuple{line=["a1", "b1"], propertyShapes= } :  InnerJoin
02:27:05.939 [main] INFO      1881951521	InnerJoin:Buffered:Joined.next():  Tuple{line=["a2", "b2"], propertyShapes= } :  InnerJoin
02:27:05.939 [main] INFO      1881951521	InnerJoin:Buffered:Joined.next():  Tuple{line=["a3", "b3"], propertyShapes= } :  InnerJoin
02:27:05.939 [main] INFO      1881951521	InnerJoin:Buffered:Joined.next():  Tuple{line=["a4", "b4"], propertyShapes= } :  InnerJoin
Tuple{line=["a1", "b1"], propertyShapes= }
Tuple{line=["a2", "b2"], propertyShapes= }
Tuple{line=["a3", "b3"], propertyShapes= }
Tuple{line=["a4", "b4"], propertyShapes= }
02:27:05.939 [main] INFO       506935450	  BulkedExternalInnerJoin.next():  Tuple{line=[http://b, http://www.w3.org/2000/01/rdf-schema#Resource], propertyShapes= } :  BulkedExternalInnerJoin{parsedQuery=select * where {   VALUES (?a) {}  ?a <http://www.w3.org/ns/dcat#accessURL> ?c.   }  ORDER BY ?a}
02:27:05.939 [main] INFO       506935450	  BulkedExternalInnerJoin.next():  Tuple{line=[http://d, http://www.w3.org/2000/01/rdf-schema#subPropertyOf], propertyShapes= } :  BulkedExternalInnerJoin{parsedQuery=select * where {   VALUES (?a) {}  ?a <http://www.w3.org/ns/dcat#accessURL> ?c.   }  ORDER BY ?a}
02:27:05.939 [main] INFO       277682724	InnerJoin:Buffered:Joined.next():  Tuple{line=["a1", "b1"], propertyShapes= } :  InnerJoin
02:27:05.939 [main] INFO       277682724	InnerJoin:Buffered:Joined.next():  Tuple{line=["a2", "b2"], propertyShapes= } :  InnerJoin
02:27:05.939 [main] INFO       277682724	InnerJoin:Buffered:Joined.next():  Tuple{line=["a2", "b22"], propertyShapes= } :  InnerJoin
02:27:05.939 [main] INFO       277682724	InnerJoin:Buffered:Joined.next():  Tuple{line=["a4", "b4"], propertyShapes= } :  InnerJoin
02:27:05.939 [main] INFO      1322228822	InnerJoin:Buffered:Joined.next():  Tuple{line=["a2", "b2"], propertyShapes= } :  InnerJoin
02:27:05.939 [main] INFO      1322228822	InnerJoin:Buffered:Joined.next():  Tuple{line=["a2", "b22"], propertyShapes= } :  InnerJoin
02:27:05.939 [main] INFO      1322228822	InnerJoin:Buffered:Joined.next():  Tuple{line=["a4", "b4"], propertyShapes= } :  InnerJoin
02:27:05.939 [main] INFO       359176186	InnerJoin:Buffered:Joined.next():  Tuple{line=["a2", "b2"], propertyShapes= } :  InnerJoin
02:27:05.939 [main] INFO       359176186	InnerJoin:Buffered:Joined.next():  Tuple{line=["a2", "b22"], propertyShapes= } :  InnerJoin
02:27:05.939 [main] INFO      2014990099	InnerJoin:Buffered:Joined.next():  Tuple{line=["a1", "b1"], propertyShapes= } :  InnerJoin
02:27:05.939 [main] INFO      2014990099	InnerJoin:Buffered:Joined.next():  Tuple{line=["a1", "b11"], propertyShapes= } :  InnerJoin
02:27:05.939 [main] INFO      2014990099	InnerJoin:Buffered:Joined.next():  Tuple{line=["a2", "b2"], propertyShapes= } :  InnerJoin
02:27:05.939 [main] INFO      2014990099	InnerJoin:Buffered:Joined.next():  Tuple{line=["a2", "b22"], propertyShapes= } :  InnerJoin
02:27:05.939 [main] INFO       812039223	InnerJoin:Buffered:Joined.next():  Tuple{line=["a1", "b"], propertyShapes= } :  InnerJoin
02:27:05.939 [main] INFO      2062694110	InnerJoin:Buffered:Joined.next():  Tuple{line=["a2", "b"], propertyShapes= } :  InnerJoin
02:27:05.939 [main] INFO      1881951521	InnerJoin:Buffered:Joined.next():  Tuple{line=["a1", "b1"], propertyShapes= } :  InnerJoin
02:27:05.939 [main] INFO      1881951521	InnerJoin:Buffered:Joined.next():  Tuple{line=["a2", "b2"], propertyShapes= } :  InnerJoin
02:27:05.939 [main] INFO      1881951521	InnerJoin:Buffered:Joined.next():  Tuple{line=["a3", "b3"], propertyShapes= } :  InnerJoin
02:27:05.940 [main] INFO      1881951521	InnerJoin:Buffered:Joined.next():  Tuple{line=["a4", "b4"], propertyShapes= } :  InnerJoin
02:27:05.940 [main] INFO      1631367346	InnerJoin:Buffered:Joined.next():  Tuple{line=["a1", "b1"], propertyShapes= } :  InnerJoin
02:27:05.940 [main] INFO      1631367346	InnerJoin:Buffered:Joined.next():  Tuple{line=["a2", "b2"], propertyShapes= } :  InnerJoin
Tuple{line=["a1", "b1"], propertyShapes= }
Tuple{line=["a2", "b2"], propertyShapes= }
02:27:05.940 [main] INFO       506935450	  BulkedExternalInnerJoin.next():  Tuple{line=[http://b, http://www.w3.org/2000/01/rdf-schema#Resource], propertyShapes= } :  BulkedExternalInnerJoin{parsedQuery=select * where {   VALUES (?a) {}  ?a <http://www.w3.org/ns/dcat#accessURL> ?c.   }  ORDER BY ?a}
02:27:05.940 [main] INFO       506935450	  BulkedExternalInnerJoin.next():  Tuple{line=[http://d, http://www.w3.org/2000/01/rdf-schema#subPropertyOf], propertyShapes= } :  BulkedExternalInnerJoin{parsedQuery=select * where {   VALUES (?a) {}  ?a <http://www.w3.org/ns/dcat#accessURL> ?c.   }  ORDER BY ?a}
02:27:05.940 [main] INFO       277682724	InnerJoin:Buffered:Joined.next():  Tuple{line=["a1", "b1"], propertyShapes= } :  InnerJoin
02:27:05.940 [main] INFO       277682724	InnerJoin:Buffered:Joined.next():  Tuple{line=["a2", "b2"], propertyShapes= } :  InnerJoin
02:27:05.940 [main] INFO       277682724	InnerJoin:Buffered:Joined.next():  Tuple{line=["a2", "b22"], propertyShapes= } :  InnerJoin
02:27:05.940 [main] INFO       277682724	InnerJoin:Buffered:Joined.next():  Tuple{line=["a4", "b4"], propertyShapes= } :  InnerJoin
02:27:05.940 [main] INFO      1322228822	InnerJoin:Buffered:Joined.next():  Tuple{line=["a2", "b2"], propertyShapes= } :  InnerJoin
02:27:05.940 [main] INFO      1322228822	InnerJoin:Buffered:Joined.next():  Tuple{line=["a2", "b22"], propertyShapes= } :  InnerJoin
02:27:05.940 [main] INFO      1322228822	InnerJoin:Buffered:Joined.next():  Tuple{line=["a4", "b4"], propertyShapes= } :  InnerJoin
02:27:05.940 [main] INFO       359176186	InnerJoin:Buffered:Joined.next():  Tuple{line=["a2", "b2"], propertyShapes= } :  InnerJoin
02:27:05.940 [main] INFO       359176186	InnerJoin:Buffered:Joined.next():  Tuple{line=["a2", "b22"], propertyShapes= } :  InnerJoin
02:27:05.940 [main] INFO      2014990099	InnerJoin:Buffered:Joined.next():  Tuple{line=["a1", "b1"], propertyShapes= } :  InnerJoin
02:27:05.940 [main] INFO      2014990099	InnerJoin:Buffered:Joined.next():  Tuple{line=["a1", "b11"], propertyShapes= } :  InnerJoin
02:27:05.940 [main] INFO      2014990099	InnerJoin:Buffered:Joined.next():  Tuple{line=["a2", "b2"], propertyShapes= } :  InnerJoin
02:27:05.940 [main] INFO      2014990099	InnerJoin:Buffered:Joined.next():  Tuple{line=["a2", "b22"], propertyShapes= } :  InnerJoin
02:27:05.940 [main] INFO       812039223	InnerJoin:Buffered:Joined.next():  Tuple{line=["a1", "b"], propertyShapes= } :  InnerJoin
02:27:05.940 [main] INFO      2062694110	InnerJoin:Buffered:Joined.next():  Tuple{line=["a2", "b"], propertyShapes= } :  InnerJoin
02:27:05.940 [main] INFO      1881951521	InnerJoin:Buffered:Joined.next():  Tuple{line=["a1", "b1"], propertyShapes= } :  InnerJoin
02:27:05.940 [main] INFO      1881951521	InnerJoin:Buffered:Joined.next():  Tuple{line=["a2", "b2"], propertyShapes= } :  InnerJoin
02:27:05.940 [main] INFO      1881951521	InnerJoin:Buffered:Joined.next():  Tuple{line=["a3", "b3"], propertyShapes= } :  InnerJoin
02:27:05.940 [main] INFO      1881951521	InnerJoin:Buffered:Joined.next():  Tuple{line=["a4", "b4"], propertyShapes= } :  InnerJoin
02:27:05.940 [main] INFO      1631367346	InnerJoin:Buffered:Joined.next():  Tuple{line=["a1", "b1"], propertyShapes= } :  InnerJoin
02:27:05.940 [main] INFO      1631367346	InnerJoin:Buffered:Joined.next():  Tuple{line=["a2", "b2"], propertyShapes= } :  InnerJoin
02:27:05.940 [main] INFO      1980749223	InnerJoin:Buffered:Joined.next():  Tuple{line=["a1", "b1"], propertyShapes= } :  InnerJoin
02:27:05.940 [main] INFO      1980749223	InnerJoin:Buffered:Joined.next():  Tuple{line=["a2", "b2"], propertyShapes= } :  InnerJoin
02:27:05.940 [main] INFO      1980749223	InnerJoin:Buffered:Joined.next():  Tuple{line=["a3", "b3"], propertyShapes= } :  InnerJoin
Tuple{line=["a1", "b1"], propertyShapes= }
Tuple{line=["a2", "b2"], propertyShapes= }
Tuple{line=["a3", "b3"], propertyShapes= }
02:27:05.941 [main] INFO       506935450	  BulkedExternalInnerJoin.next():  Tuple{line=[http://b, http://www.w3.org/2000/01/rdf-schema#Resource], propertyShapes= } :  BulkedExternalInnerJoin{parsedQuery=select * where {   VALUES (?a) {}  ?a <http://www.w3.org/ns/dcat#accessURL> ?c.   }  ORDER BY ?a}
02:27:05.941 [main] INFO       506935450	  BulkedExternalInnerJoin.next():  Tuple{line=[http://d, http://www.w3.org/2000/01/rdf-schema#subPropertyOf], propertyShapes= } :  BulkedExternalInnerJoin{parsedQuery=select * where {   VALUES (?a) {}  ?a <http://www.w3.org/ns/dcat#accessURL> ?c.   }  ORDER BY ?a}
02:27:05.941 [main] INFO       277682724	InnerJoin:Buffered:Joined.next():  Tuple{line=["a1", "b1"], propertyShapes= } :  InnerJoin
02:27:05.941 [main] INFO       277682724	InnerJoin:Buffered:Joined.next():  Tuple{line=["a2", "b2"], propertyShapes= } :  InnerJoin
02:27:05.941 [main] INFO       277682724	InnerJoin:Buffered:Joined.next():  Tuple{line=["a2", "b22"], propertyShapes= } :  InnerJoin
02:27:05.941 [main] INFO       277682724	InnerJoin:Buffered:Joined.next():  Tuple{line=["a4", "b4"], propertyShapes= } :  InnerJoin
02:27:05.941 [main] INFO      1322228822	InnerJoin:Buffered:Joined.next():  Tuple{line=["a2", "b2"], propertyShapes= } :  InnerJoin
02:27:05.941 [main] INFO      1322228822	InnerJoin:Buffered:Joined.next():  Tuple{line=["a2", "b22"], propertyShapes= } :  InnerJoin
02:27:05.941 [main] INFO      1322228822	InnerJoin:Buffered:Joined.next():  Tuple{line=["a4", "b4"], propertyShapes= } :  InnerJoin
02:27:05.941 [main] INFO       359176186	InnerJoin:Buffered:Joined.next():  Tuple{line=["a2", "b2"], propertyShapes= } :  InnerJoin
02:27:05.941 [main] INFO       359176186	InnerJoin:Buffered:Joined.next():  Tuple{line=["a2", "b22"], propertyShapes= } :  InnerJoin
02:27:05.941 [main] INFO      2014990099	InnerJoin:Buffered:Joined.next():  Tuple{line=["a1", "b1"], propertyShapes= } :  InnerJoin
02:27:05.941 [main] INFO      2014990099	InnerJoin:Buffered:Joined.next():  Tuple{line=["a1", "b11"], propertyShapes= } :  InnerJoin
02:27:05.941 [main] INFO      2014990099	InnerJoin:Buffered:Joined.next():  Tuple{line=["a2", "b2"], propertyShapes= } :  InnerJoin
02:27:05.941 [main] INFO      2014990099	InnerJoin:Buffered:Joined.next():  Tuple{line=["a2", "b22"], propertyShapes= } :  InnerJoin
02:27:05.941 [main] INFO       812039223	InnerJoin:Buffered:Joined.next():  Tuple{line=["a1", "b"], propertyShapes= } :  InnerJoin
02:27:05.941 [main] INFO      2062694110	InnerJoin:Buffered:Joined.next():  Tuple{line=["a2", "b"], propertyShapes= } :  InnerJoin
02:27:05.941 [main] INFO      1881951521	InnerJoin:Buffered:Joined.next():  Tuple{line=["a1", "b1"], propertyShapes= } :  InnerJoin
02:27:05.941 [main] INFO      1881951521	InnerJoin:Buffered:Joined.next():  Tuple{line=["a2", "b2"], propertyShapes= } :  InnerJoin
02:27:05.941 [main] INFO      1881951521	InnerJoin:Buffered:Joined.next():  Tuple{line=["a3", "b3"], propertyShapes= } :  InnerJoin
02:27:05.941 [main] INFO      1881951521	InnerJoin:Buffered:Joined.next():  Tuple{line=["a4", "b4"], propertyShapes= } :  InnerJoin
02:27:05.941 [main] INFO      1631367346	InnerJoin:Buffered:Joined.next():  Tuple{line=["a1", "b1"], propertyShapes= } :  InnerJoin
02:27:05.941 [main] INFO      1631367346	InnerJoin:Buffered:Joined.next():  Tuple{line=["a2", "b2"], propertyShapes= } :  InnerJoin
02:27:05.941 [main] INFO      1980749223	InnerJoin:Buffered:Joined.next():  Tuple{line=["a1", "b1"], propertyShapes= } :  InnerJoin
02:27:05.941 [main] INFO      1980749223	InnerJoin:Buffered:Joined.next():  Tuple{line=["a2", "b2"], propertyShapes= } :  InnerJoin
02:27:05.941 [main] INFO      1980749223	InnerJoin:Buffered:Joined.next():  Tuple{line=["a3", "b3"], propertyShapes= } :  InnerJoin
02:27:05.941 [main] INFO      1942414504	InnerJoin:Buffered:Joined.next():  Tuple{line=["a1", "b1"], propertyShapes= } :  InnerJoin
02:27:05.941 [main] INFO      1942414504	InnerJoin:Buffered:Joined.next():  Tuple{line=["a2", "b2"], propertyShapes= } :  InnerJoin
02:27:05.941 [main] INFO      1942414504	InnerJoin:Buffered:Joined.next():  Tuple{line=["a2", "b22"], propertyShapes= } :  InnerJoin
02:27:05.941 [main] INFO      1942414504	InnerJoin:Buffered:Joined.next():  Tuple{line=["a3", "b3"], propertyShapes= } :  InnerJoin
02:27:05.941 [main] INFO      1942414504	InnerJoin:Buffered:Joined.next():  Tuple{line=["a4", "b4"], propertyShapes= } :  InnerJoin
Tuple{line=["a1", "b1"], propertyShapes= }
Tuple{line=["a2", "b2"], propertyShapes= }
Tuple{line=["a2", "b22"], propertyShapes= }
Tuple{line=["a3", "b3"], propertyShapes= }
Tuple{line=["a4", "b4"], propertyShapes= }
02:27:05.942 [main] INFO       506935450	  BulkedExternalInnerJoin.next():  Tuple{line=[http://b, http://www.w3.org/2000/01/rdf-schema#Resource], propertyShapes= } :  BulkedExternalInnerJoin{parsedQuery=select * where {   VALUES (?a) {}  ?a <http://www.w3.org/ns/dcat#accessURL> ?c.   }  ORDER BY ?a}
02:27:05.942 [main] INFO       506935450	  BulkedExternalInnerJoin.next():  Tuple{line=[http://d, http://www.w3.org/2000/01/rdf-schema#subPropertyOf], propertyShapes= } :  BulkedExternalInnerJoin{parsedQuery=select * where {   VALUES (?a) {}  ?a <http://www.w3.org/ns/dcat#accessURL> ?c.   }  ORDER BY ?a}
02:27:05.942 [main] INFO       277682724	InnerJoin:Buffered:Joined.next():  Tuple{line=["a1", "b1"], propertyShapes= } :  InnerJoin
02:27:05.942 [main] INFO       277682724	InnerJoin:Buffered:Joined.next():  Tuple{line=["a2", "b2"], propertyShapes= } :  InnerJoin
02:27:05.942 [main] INFO       277682724	InnerJoin:Buffered:Joined.next():  Tuple{line=["a2", "b22"], propertyShapes= } :  InnerJoin
02:27:05.942 [main] INFO       277682724	InnerJoin:Buffered:Joined.next():  Tuple{line=["a4", "b4"], propertyShapes= } :  InnerJoin
02:27:05.942 [main] INFO      1322228822	InnerJoin:Buffered:Joined.next():  Tuple{line=["a2", "b2"], propertyShapes= } :  InnerJoin
02:27:05.942 [main] INFO      1322228822	InnerJoin:Buffered:Joined.next():  Tuple{line=["a2", "b22"], propertyShapes= } :  InnerJoin
02:27:05.942 [main] INFO      1322228822	InnerJoin:Buffered:Joined.next():  Tuple{line=["a4", "b4"], propertyShapes= } :  InnerJoin
02:27:05.942 [main] INFO       359176186	InnerJoin:Buffered:Joined.next():  Tuple{line=["a2", "b2"], propertyShapes= } :  InnerJoin
02:27:05.942 [main] INFO       359176186	InnerJoin:Buffered:Joined.next():  Tuple{line=["a2", "b22"], propertyShapes= } :  InnerJoin
02:27:05.942 [main] INFO      2014990099	InnerJoin:Buffered:Joined.next():  Tuple{line=["a1", "b1"], propertyShapes= } :  InnerJoin
02:27:05.942 [main] INFO      2014990099	InnerJoin:Buffered:Joined.next():  Tuple{line=["a1", "b11"], propertyShapes= } :  InnerJoin
02:27:05.942 [main] INFO      2014990099	InnerJoin:Buffered:Joined.next():  Tuple{line=["a2", "b2"], propertyShapes= } :  InnerJoin
02:27:05.942 [main] INFO      2014990099	InnerJoin:Buffered:Joined.next():  Tuple{line=["a2", "b22"], propertyShapes= } :  InnerJoin
02:27:05.942 [main] INFO       812039223	InnerJoin:Buffered:Joined.next():  Tuple{line=["a1", "b"], propertyShapes= } :  InnerJoin
02:27:05.942 [main] INFO      2062694110	InnerJoin:Buffered:Joined.next():  Tuple{line=["a2", "b"], propertyShapes= } :  InnerJoin
02:27:05.942 [main] INFO      1881951521	InnerJoin:Buffered:Joined.next():  Tuple{line=["a1", "b1"], propertyShapes= } :  InnerJoin
02:27:05.942 [main] INFO      1881951521	InnerJoin:Buffered:Joined.next():  Tuple{line=["a2", "b2"], propertyShapes= } :  InnerJoin
02:27:05.942 [main] INFO      1881951521	InnerJoin:Buffered:Joined.next():  Tuple{line=["a3", "b3"], propertyShapes= } :  InnerJoin
02:27:05.942 [main] INFO      1881951521	InnerJoin:Buffered:Joined.next():  Tuple{line=["a4", "b4"], propertyShapes= } :  InnerJoin
02:27:05.942 [main] INFO      1631367346	InnerJoin:Buffered:Joined.next():  Tuple{line=["a1", "b1"], propertyShapes= } :  InnerJoin
02:27:05.942 [main] INFO      1631367346	InnerJoin:Buffered:Joined.next():  Tuple{line=["a2", "b2"], propertyShapes= } :  InnerJoin
02:27:05.942 [main] INFO      1980749223	InnerJoin:Buffered:Joined.next():  Tuple{line=["a1", "b1"], propertyShapes= } :  InnerJoin
02:27:05.942 [main] INFO      1980749223	InnerJoin:Buffered:Joined.next():  Tuple{line=["a2", "b2"], propertyShapes= } :  InnerJoin
02:27:05.942 [main] INFO      1980749223	InnerJoin:Buffered:Joined.next():  Tuple{line=["a3", "b3"], propertyShapes= } :  InnerJoin
02:27:05.942 [main] INFO      1942414504	InnerJoin:Buffered:Joined.next():  Tuple{line=["a1", "b1"], propertyShapes= } :  InnerJoin
02:27:05.942 [main] INFO      1942414504	InnerJoin:Buffered:Joined.next():  Tuple{line=["a2", "b2"], propertyShapes= } :  InnerJoin
02:27:05.942 [main] INFO      1942414504	InnerJoin:Buffered:Joined.next():  Tuple{line=["a2", "b22"], propertyShapes= } :  InnerJoin
02:27:05.942 [main] INFO      1942414504	InnerJoin:Buffered:Joined.next():  Tuple{line=["a3", "b3"], propertyShapes= } :  InnerJoin
02:27:05.942 [main] INFO      1942414504	InnerJoin:Buffered:Joined.next():  Tuple{line=["a4", "b4"], propertyShapes= } :  InnerJoin
02:27:05.942 [main] INFO      1499247861	InnerJoin:Buffered:Joined.next():  Tuple{line=["a", "b"], propertyShapes= } :  InnerJoin
Tuple{line=["a", "b"], propertyShapes= }
[INFO] Tests run: 13, Failures: 0, Errors: 0, Skipped: 0, Time elapsed: 0.048 s - in org.eclipse.rdf4j.sail.shacl.InnerJoinTest
[INFO] Running org.eclipse.rdf4j.sail.shacl.PrepareCommitTest
02:27:06.007 [main] WARN  Cannot rollback transaction on connection because transaction is not active
java.lang.Throwable: null
	at org.eclipse.rdf4j.sail.helpers.AbstractSailConnection.rollback(AbstractSailConnection.java:430)
	at org.eclipse.rdf4j.sail.shacl.ShaclSailConnection.rollback(ShaclSailConnection.java:281)
	at org.eclipse.rdf4j.sail.shacl.PrepareCommitTest.testPrepareAfterRollback(PrepareCommitTest.java:93)
	at java.base/jdk.internal.reflect.NativeMethodAccessorImpl.invoke0(Native Method)
	at java.base/jdk.internal.reflect.NativeMethodAccessorImpl.invoke(NativeMethodAccessorImpl.java:62)
	at java.base/jdk.internal.reflect.DelegatingMethodAccessorImpl.invoke(DelegatingMethodAccessorImpl.java:43)
	at java.base/java.lang.reflect.Method.invoke(Method.java:566)
	at org.junit.runners.model.FrameworkMethod$1.runReflectiveCall(FrameworkMethod.java:59)
	at org.junit.internal.runners.model.ReflectiveCallable.run(ReflectiveCallable.java:12)
	at org.junit.runners.model.FrameworkMethod.invokeExplosively(FrameworkMethod.java:56)
	at org.junit.internal.runners.statements.InvokeMethod.evaluate(InvokeMethod.java:17)
	at org.junit.runners.ParentRunner$3.evaluate(ParentRunner.java:306)
	at org.junit.runners.BlockJUnit4ClassRunner$1.evaluate(BlockJUnit4ClassRunner.java:100)
	at org.junit.runners.ParentRunner.runLeaf(ParentRunner.java:366)
	at org.junit.runners.BlockJUnit4ClassRunner.runChild(BlockJUnit4ClassRunner.java:103)
	at org.junit.runners.BlockJUnit4ClassRunner.runChild(BlockJUnit4ClassRunner.java:63)
	at org.junit.runners.ParentRunner$4.run(ParentRunner.java:331)
	at org.junit.runners.ParentRunner$1.schedule(ParentRunner.java:79)
	at org.junit.runners.ParentRunner.runChildren(ParentRunner.java:329)
	at org.junit.runners.ParentRunner.access$100(ParentRunner.java:66)
	at org.junit.runners.ParentRunner$2.evaluate(ParentRunner.java:293)
	at org.junit.runners.ParentRunner$3.evaluate(ParentRunner.java:306)
	at org.junit.runners.ParentRunner.run(ParentRunner.java:413)
	at org.apache.maven.surefire.junit4.JUnit4Provider.execute(JUnit4Provider.java:365)
	at org.apache.maven.surefire.junit4.JUnit4Provider.executeWithRerun(JUnit4Provider.java:273)
	at org.apache.maven.surefire.junit4.JUnit4Provider.executeTestSet(JUnit4Provider.java:238)
	at org.apache.maven.surefire.junit4.JUnit4Provider.invoke(JUnit4Provider.java:159)
	at org.apache.maven.surefire.booter.ForkedBooter.invokeProviderInSameClassLoader(ForkedBooter.java:384)
	at org.apache.maven.surefire.booter.ForkedBooter.runSuitesInProcess(ForkedBooter.java:345)
	at org.apache.maven.surefire.booter.ForkedBooter.execute(ForkedBooter.java:126)
	at org.apache.maven.surefire.booter.ForkedBooter.main(ForkedBooter.java:418)
02:27:06.008 [main] WARN  Cannot rollback transaction on connection because transaction is not active
java.lang.Throwable: null
	at org.eclipse.rdf4j.sail.helpers.AbstractSailConnection.rollback(AbstractSailConnection.java:430)
	at org.eclipse.rdf4j.repository.sail.SailRepositoryConnection.rollback(SailRepositoryConnection.java:215)
	at org.eclipse.rdf4j.sail.shacl.ShaclSailConnection.rollback(ShaclSailConnection.java:282)
	at org.eclipse.rdf4j.sail.shacl.PrepareCommitTest.testPrepareAfterRollback(PrepareCommitTest.java:93)
	at java.base/jdk.internal.reflect.NativeMethodAccessorImpl.invoke0(Native Method)
	at java.base/jdk.internal.reflect.NativeMethodAccessorImpl.invoke(NativeMethodAccessorImpl.java:62)
	at java.base/jdk.internal.reflect.DelegatingMethodAccessorImpl.invoke(DelegatingMethodAccessorImpl.java:43)
	at java.base/java.lang.reflect.Method.invoke(Method.java:566)
	at org.junit.runners.model.FrameworkMethod$1.runReflectiveCall(FrameworkMethod.java:59)
	at org.junit.internal.runners.model.ReflectiveCallable.run(ReflectiveCallable.java:12)
	at org.junit.runners.model.FrameworkMethod.invokeExplosively(FrameworkMethod.java:56)
	at org.junit.internal.runners.statements.InvokeMethod.evaluate(InvokeMethod.java:17)
	at org.junit.runners.ParentRunner$3.evaluate(ParentRunner.java:306)
	at org.junit.runners.BlockJUnit4ClassRunner$1.evaluate(BlockJUnit4ClassRunner.java:100)
	at org.junit.runners.ParentRunner.runLeaf(ParentRunner.java:366)
	at org.junit.runners.BlockJUnit4ClassRunner.runChild(BlockJUnit4ClassRunner.java:103)
	at org.junit.runners.BlockJUnit4ClassRunner.runChild(BlockJUnit4ClassRunner.java:63)
	at org.junit.runners.ParentRunner$4.run(ParentRunner.java:331)
	at org.junit.runners.ParentRunner$1.schedule(ParentRunner.java:79)
	at org.junit.runners.ParentRunner.runChildren(ParentRunner.java:329)
	at org.junit.runners.ParentRunner.access$100(ParentRunner.java:66)
	at org.junit.runners.ParentRunner$2.evaluate(ParentRunner.java:293)
	at org.junit.runners.ParentRunner$3.evaluate(ParentRunner.java:306)
	at org.junit.runners.ParentRunner.run(ParentRunner.java:413)
	at org.apache.maven.surefire.junit4.JUnit4Provider.execute(JUnit4Provider.java:365)
	at org.apache.maven.surefire.junit4.JUnit4Provider.executeWithRerun(JUnit4Provider.java:273)
	at org.apache.maven.surefire.junit4.JUnit4Provider.executeTestSet(JUnit4Provider.java:238)
	at org.apache.maven.surefire.junit4.JUnit4Provider.invoke(JUnit4Provider.java:159)
	at org.apache.maven.surefire.booter.ForkedBooter.invokeProviderInSameClassLoader(ForkedBooter.java:384)
	at org.apache.maven.surefire.booter.ForkedBooter.runSuitesInProcess(ForkedBooter.java:345)
	at org.apache.maven.surefire.booter.ForkedBooter.execute(ForkedBooter.java:126)
	at org.apache.maven.surefire.booter.ForkedBooter.main(ForkedBooter.java:418)
02:27:06.008 [main] WARN  Cannot rollback transaction on connection because transaction is not active
java.lang.Throwable: null
	at org.eclipse.rdf4j.sail.helpers.AbstractSailConnection.rollback(AbstractSailConnection.java:430)
	at org.eclipse.rdf4j.sail.helpers.SailConnectionWrapper.rollback(SailConnectionWrapper.java:134)
	at org.eclipse.rdf4j.sail.shacl.ShaclSailConnection.rollback(ShaclSailConnection.java:283)
	at org.eclipse.rdf4j.sail.shacl.PrepareCommitTest.testPrepareAfterRollback(PrepareCommitTest.java:93)
	at java.base/jdk.internal.reflect.NativeMethodAccessorImpl.invoke0(Native Method)
	at java.base/jdk.internal.reflect.NativeMethodAccessorImpl.invoke(NativeMethodAccessorImpl.java:62)
	at java.base/jdk.internal.reflect.DelegatingMethodAccessorImpl.invoke(DelegatingMethodAccessorImpl.java:43)
	at java.base/java.lang.reflect.Method.invoke(Method.java:566)
	at org.junit.runners.model.FrameworkMethod$1.runReflectiveCall(FrameworkMethod.java:59)
	at org.junit.internal.runners.model.ReflectiveCallable.run(ReflectiveCallable.java:12)
	at org.junit.runners.model.FrameworkMethod.invokeExplosively(FrameworkMethod.java:56)
	at org.junit.internal.runners.statements.InvokeMethod.evaluate(InvokeMethod.java:17)
	at org.junit.runners.ParentRunner$3.evaluate(ParentRunner.java:306)
	at org.junit.runners.BlockJUnit4ClassRunner$1.evaluate(BlockJUnit4ClassRunner.java:100)
	at org.junit.runners.ParentRunner.runLeaf(ParentRunner.java:366)
	at org.junit.runners.BlockJUnit4ClassRunner.runChild(BlockJUnit4ClassRunner.java:103)
	at org.junit.runners.BlockJUnit4ClassRunner.runChild(BlockJUnit4ClassRunner.java:63)
	at org.junit.runners.ParentRunner$4.run(ParentRunner.java:331)
	at org.junit.runners.ParentRunner$1.schedule(ParentRunner.java:79)
	at org.junit.runners.ParentRunner.runChildren(ParentRunner.java:329)
	at org.junit.runners.ParentRunner.access$100(ParentRunner.java:66)
	at org.junit.runners.ParentRunner$2.evaluate(ParentRunner.java:293)
	at org.junit.runners.ParentRunner$3.evaluate(ParentRunner.java:306)
	at org.junit.runners.ParentRunner.run(ParentRunner.java:413)
	at org.apache.maven.surefire.junit4.JUnit4Provider.execute(JUnit4Provider.java:365)
	at org.apache.maven.surefire.junit4.JUnit4Provider.executeWithRerun(JUnit4Provider.java:273)
	at org.apache.maven.surefire.junit4.JUnit4Provider.executeTestSet(JUnit4Provider.java:238)
	at org.apache.maven.surefire.junit4.JUnit4Provider.invoke(JUnit4Provider.java:159)
	at org.apache.maven.surefire.booter.ForkedBooter.invokeProviderInSameClassLoader(ForkedBooter.java:384)
	at org.apache.maven.surefire.booter.ForkedBooter.runSuitesInProcess(ForkedBooter.java:345)
	at org.apache.maven.surefire.booter.ForkedBooter.execute(ForkedBooter.java:126)
	at org.apache.maven.surefire.booter.ForkedBooter.main(ForkedBooter.java:418)
[INFO] Tests run: 7, Failures: 0, Errors: 0, Skipped: 0, Time elapsed: 0.027 s - in org.eclipse.rdf4j.sail.shacl.PrepareCommitTest
[INFO] Running org.eclipse.rdf4j.sail.shacl.DeadlockTest
02:27:06.581 [pool-21552-thread-1] ERROR ShaclSail was garbage collected without shutdown() having been called first.
02:27:06.581 [pool-21555-thread-1] ERROR ShaclSail was garbage collected without shutdown() having been called first.
02:27:06.581 [pool-21554-thread-1] ERROR ShaclSail was garbage collected without shutdown() having been called first.
02:27:06.581 [pool-21550-thread-1] ERROR ShaclSail was garbage collected without shutdown() having been called first.
02:27:06.583 [pool-21556-thread-1] ERROR ShaclSail was garbage collected without shutdown() having been called first.
02:27:06.585 [pool-21557-thread-1] ERROR ShaclSail was garbage collected without shutdown() having been called first.
02:27:06.587 [pool-21558-thread-1] ERROR ShaclSail was garbage collected without shutdown() having been called first.
02:27:06.589 [pool-21559-thread-1] ERROR ShaclSail was garbage collected without shutdown() having been called first.
02:27:06.590 [pool-21573-thread-1] ERROR ShaclSail was garbage collected without shutdown() having been called first.
02:27:06.592 [pool-21560-thread-1] ERROR ShaclSail was garbage collected without shutdown() having been called first.
02:27:06.597 [pool-21563-thread-1] ERROR ShaclSail was garbage collected without shutdown() having been called first.
02:27:06.603 [pool-21566-thread-1] ERROR ShaclSail was garbage collected without shutdown() having been called first.
02:27:06.611 [pool-21567-thread-1] ERROR ShaclSail was garbage collected without shutdown() having been called first.
02:27:06.630 [pool-21542-thread-1] ERROR ShaclSail was garbage collected without shutdown() having been called first.
02:27:06.632 [pool-21544-thread-1] ERROR ShaclSail was garbage collected without shutdown() having been called first.
02:27:06.636 [pool-21546-thread-1] ERROR ShaclSail was garbage collected without shutdown() having been called first.
02:27:06.637 [pool-21548-thread-1] ERROR ShaclSail was garbage collected without shutdown() having been called first.
02:27:11.068 [pool-21591-thread-1] ERROR ShaclSail was garbage collected without shutdown() having been called first.
02:27:11.072 [pool-21611-thread-1] ERROR ShaclSail was garbage collected without shutdown() having been called first.
02:27:11.082 [pool-21596-thread-1] ERROR ShaclSail was garbage collected without shutdown() having been called first.
02:27:11.114 [pool-21616-thread-1] ERROR ShaclSail was garbage collected without shutdown() having been called first.
02:27:11.115 [pool-21601-thread-1] ERROR ShaclSail was garbage collected without shutdown() having been called first.
02:27:11.118 [pool-21581-thread-1] ERROR ShaclSail was garbage collected without shutdown() having been called first.
02:27:11.139 [pool-21606-thread-1] ERROR ShaclSail was garbage collected without shutdown() having been called first.
02:27:11.144 [pool-21586-thread-1] ERROR ShaclSail was garbage collected without shutdown() having been called first.
[INFO] Tests run: 1, Failures: 0, Errors: 0, Skipped: 0, Time elapsed: 6.168 s - in org.eclipse.rdf4j.sail.shacl.DeadlockTest
[INFO] Running org.eclipse.rdf4j.sail.shacl.RdfsShaclConnectionTest
(http://example.com/aSubSub, http://www.w3.org/1999/02/22-rdf-syntax-ns#type, http://example.com/sup) [null]
[INFO] Tests run: 3, Failures: 0, Errors: 0, Skipped: 0, Time elapsed: 0.002 s - in org.eclipse.rdf4j.sail.shacl.RdfsShaclConnectionTest
[INFO] Running org.eclipse.rdf4j.sail.shacl.W3cComplianceTest
[file:/home/jenkins/agent/workspace/rdf4j-pr-verify/core/sail/shacl/target/test-classes/w3c/core/node/node-001.ttl, file:/home/jenkins/agent/workspace/rdf4j-pr-verify/core/sail/shacl/target/test-classes/w3c/core/property/class-001.ttl, file:/home/jenkins/agent/workspace/rdf4j-pr-verify/core/sail/shacl/target/test-classes/w3c/core/node/minExclusive-001.ttl, file:/home/jenkins/agent/workspace/rdf4j-pr-verify/core/sail/shacl/target/test-classes/w3c/core/node/class-001.ttl, file:/home/jenkins/agent/workspace/rdf4j-pr-verify/core/sail/shacl/target/test-classes/w3c/core/node/equals-001.ttl, file:/home/jenkins/agent/workspace/rdf4j-pr-verify/core/sail/shacl/target/test-classes/w3c/core/property/pattern-002.ttl, file:/home/jenkins/agent/workspace/rdf4j-pr-verify/core/sail/shacl/target/test-classes/w3c/core/node/datatype-001.ttl, file:/home/jenkins/agent/workspace/rdf4j-pr-verify/core/sail/shacl/target/test-classes/w3c/core/property/datatype-001.ttl, file:/home/jenkins/agent/workspace/rdf4j-pr-verify/core/sail/shacl/target/test-classes/w3c/core/node/languageIn-001.ttl, file:/home/jenkins/agent/workspace/rdf4j-pr-verify/core/sail/shacl/target/test-classes/w3c/core/property/equals-001.ttl, file:/home/jenkins/agent/workspace/rdf4j-pr-verify/core/sail/shacl/target/test-classes/w3c/core/property/maxInclusive-001.ttl, file:/home/jenkins/agent/workspace/rdf4j-pr-verify/core/sail/shacl/target/test-classes/w3c/core/property/minLength-001.ttl, file:/home/jenkins/agent/workspace/rdf4j-pr-verify/core/sail/shacl/target/test-classes/w3c/core/property/qualifiedValueShapesDisjoint-001.ttl, file:/home/jenkins/agent/workspace/rdf4j-pr-verify/core/sail/shacl/target/test-classes/w3c/core/property/lessThan-001.ttl, file:/home/jenkins/agent/workspace/rdf4j-pr-verify/core/sail/shacl/target/test-classes/w3c/core/property/minExclusive-001.ttl, file:/home/jenkins/agent/workspace/rdf4j-pr-verify/core/sail/shacl/target/test-classes/w3c/core/property/uniqueLang-002.ttl, file:/home/jenkins/agent/workspace/rdf4j-pr-verify/core/sail/shacl/target/test-classes/w3c/core/node/in-001.ttl, file:/home/jenkins/agent/workspace/rdf4j-pr-verify/core/sail/shacl/target/test-classes/w3c/core/complex/personexample.ttl, file:/home/jenkins/agent/workspace/rdf4j-pr-verify/core/sail/shacl/target/test-classes/w3c/core/node/and-002.ttl, file:/home/jenkins/agent/workspace/rdf4j-pr-verify/core/sail/shacl/target/test-classes/w3c/core/validation-reports/shared.ttl, file:/home/jenkins/agent/workspace/rdf4j-pr-verify/core/sail/shacl/target/test-classes/w3c/core/targets/targetNode-001.ttl, file:/home/jenkins/agent/workspace/rdf4j-pr-verify/core/sail/shacl/target/test-classes/w3c/core/node/minLength-001.ttl, file:/home/jenkins/agent/workspace/rdf4j-pr-verify/core/sail/shacl/target/test-classes/w3c/core/property/datatype-ill-formed.ttl, file:/home/jenkins/agent/workspace/rdf4j-pr-verify/core/sail/shacl/target/test-classes/w3c/core/property/node-002.ttl, file:/home/jenkins/agent/workspace/rdf4j-pr-verify/core/sail/shacl/target/test-classes/w3c/core/path/path-complex-002.ttl, file:/home/jenkins/agent/workspace/rdf4j-pr-verify/core/sail/shacl/target/test-classes/w3c/core/property/datatype-003.ttl, file:/home/jenkins/agent/workspace/rdf4j-pr-verify/core/sail/shacl/target/test-classes/w3c/core/misc/deactivated-002.ttl, file:/home/jenkins/agent/workspace/rdf4j-pr-verify/core/sail/shacl/target/test-classes/w3c/core/node/minInclusive-003.ttl, file:/home/jenkins/agent/workspace/rdf4j-pr-verify/core/sail/shacl/target/test-classes/w3c/core/node/or-001.ttl, file:/home/jenkins/agent/workspace/rdf4j-pr-verify/core/sail/shacl/target/test-classes/w3c/core/path/path-oneOrMore-001.ttl, file:/home/jenkins/agent/workspace/rdf4j-pr-verify/core/sail/shacl/target/test-classes/w3c/core/property/property-001.ttl, file:/home/jenkins/agent/workspace/rdf4j-pr-verify/core/sail/shacl/target/test-classes/w3c/core/node/xone-duplicate.ttl, file:/home/jenkins/agent/workspace/rdf4j-pr-verify/core/sail/shacl/target/test-classes/w3c/core/node/minInclusive-001.ttl, file:/home/jenkins/agent/workspace/rdf4j-pr-verify/core/sail/shacl/target/test-classes/w3c/core/path/path-sequence-002.ttl, file:/home/jenkins/agent/workspace/rdf4j-pr-verify/core/sail/shacl/target/test-classes/w3c/core/property/lessThanOrEquals-001.ttl, file:/home/jenkins/agent/workspace/rdf4j-pr-verify/core/sail/shacl/target/test-classes/w3c/core/targets/targetClassImplicit-001.ttl, file:/home/jenkins/agent/workspace/rdf4j-pr-verify/core/sail/shacl/target/test-classes/w3c/core/node/maxExclusive-001.ttl, file:/home/jenkins/agent/workspace/rdf4j-pr-verify/core/sail/shacl/target/test-classes/w3c/core/node/closed-001.ttl, file:/home/jenkins/agent/workspace/rdf4j-pr-verify/core/sail/shacl/target/test-classes/w3c/core/path/path-strange-001.ttl, file:/home/jenkins/agent/workspace/rdf4j-pr-verify/core/sail/shacl/target/test-classes/w3c/core/node/hasValue-001.ttl, file:/home/jenkins/agent/workspace/rdf4j-pr-verify/core/sail/shacl/target/test-classes/w3c/core/node/pattern-002.ttl, file:/home/jenkins/agent/workspace/rdf4j-pr-verify/core/sail/shacl/target/test-classes/w3c/core/targets/targetSubjectsOf-002.ttl, file:/home/jenkins/agent/workspace/rdf4j-pr-verify/core/sail/shacl/target/test-classes/w3c/core/node/not-002.ttl, file:/home/jenkins/agent/workspace/rdf4j-pr-verify/core/sail/shacl/target/test-classes/w3c/core/misc/severity-001.ttl, file:/home/jenkins/agent/workspace/rdf4j-pr-verify/core/sail/shacl/target/test-classes/w3c/core/property/or-001.ttl, file:/home/jenkins/agent/workspace/rdf4j-pr-verify/core/sail/shacl/target/test-classes/w3c/core/misc/message-001.ttl, file:/home/jenkins/agent/workspace/rdf4j-pr-verify/core/sail/shacl/target/test-classes/w3c/core/path/path-alternative-001.ttl, file:/home/jenkins/agent/workspace/rdf4j-pr-verify/core/sail/shacl/target/test-classes/w3c/core/node/qualified-001.ttl, file:/home/jenkins/agent/workspace/rdf4j-pr-verify/core/sail/shacl/target/test-classes/w3c/core/property/maxCount-002.ttl, file:/home/jenkins/agent/workspace/rdf4j-pr-verify/core/sail/shacl/target/test-classes/w3c/core/property/minCount-002.ttl, file:/home/jenkins/agent/workspace/rdf4j-pr-verify/core/sail/shacl/target/test-classes/w3c/core/node/disjoint-001.ttl, file:/home/jenkins/agent/workspace/rdf4j-pr-verify/core/sail/shacl/target/test-classes/w3c/core/node/maxLength-001.ttl, file:/home/jenkins/agent/workspace/rdf4j-pr-verify/core/sail/shacl/target/test-classes/w3c/core/misc/deactivated-001.ttl, file:/home/jenkins/agent/workspace/rdf4j-pr-verify/core/sail/shacl/target/test-classes/w3c/core/property/pattern-001.ttl, file:/home/jenkins/agent/workspace/rdf4j-pr-verify/core/sail/shacl/target/test-classes/w3c/core/node/class-002.ttl, file:/home/jenkins/agent/workspace/rdf4j-pr-verify/core/sail/shacl/target/test-classes/w3c/core/property/not-001.ttl, file:/home/jenkins/agent/workspace/rdf4j-pr-verify/core/sail/shacl/target/test-classes/w3c/core/property/maxLength-001.ttl, file:/home/jenkins/agent/workspace/rdf4j-pr-verify/core/sail/shacl/target/test-classes/w3c/core/node/nodeKind-001.ttl, file:/home/jenkins/agent/workspace/rdf4j-pr-verify/core/sail/shacl/target/test-classes/w3c/core/property/maxCount-001.ttl, file:/home/jenkins/agent/workspace/rdf4j-pr-verify/core/sail/shacl/target/test-classes/w3c/core/property/qualifiedMinCountDisjoint-001.ttl, file:/home/jenkins/agent/workspace/rdf4j-pr-verify/core/sail/shacl/target/test-classes/w3c/core/path/path-sequence-duplicate-001.ttl, file:/home/jenkins/agent/workspace/rdf4j-pr-verify/core/sail/shacl/target/test-classes/w3c/core/targets/multipleTargets-001.ttl, file:/home/jenkins/agent/workspace/rdf4j-pr-verify/core/sail/shacl/target/test-classes/w3c/core/node/datatype-002.ttl, file:/home/jenkins/agent/workspace/rdf4j-pr-verify/core/sail/shacl/target/test-classes/w3c/core/property/hasValue-001.ttl, file:/home/jenkins/agent/workspace/rdf4j-pr-verify/core/sail/shacl/target/test-classes/w3c/core/property/node-001.ttl, file:/home/jenkins/agent/workspace/rdf4j-pr-verify/core/sail/shacl/target/test-classes/w3c/core/property/datatype-002.ttl, file:/home/jenkins/agent/workspace/rdf4j-pr-verify/core/sail/shacl/target/test-classes/w3c/core/property/uniqueLang-001.ttl, file:/home/jenkins/agent/workspace/rdf4j-pr-verify/core/sail/shacl/target/test-classes/w3c/core/path/path-complex-001.ttl, file:/home/jenkins/agent/workspace/rdf4j-pr-verify/core/sail/shacl/target/test-classes/w3c/core/path/path-zeroOrMore-001.ttl, file:/home/jenkins/agent/workspace/rdf4j-pr-verify/core/sail/shacl/target/test-classes/w3c/core/property/lessThan-002.ttl, file:/home/jenkins/agent/workspace/rdf4j-pr-verify/core/sail/shacl/target/test-classes/w3c/core/property/disjoint-001.ttl, file:/home/jenkins/agent/workspace/rdf4j-pr-verify/core/sail/shacl/target/test-classes/w3c/core/path/path-inverse-001.ttl, file:/home/jenkins/agent/workspace/rdf4j-pr-verify/core/sail/shacl/target/test-classes/w3c/core/property/nodeKind-001.ttl, file:/home/jenkins/agent/workspace/rdf4j-pr-verify/core/sail/shacl/target/test-classes/w3c/core/path/path-zeroOrOne-001.ttl, file:/home/jenkins/agent/workspace/rdf4j-pr-verify/core/sail/shacl/target/test-classes/w3c/core/node/and-001.ttl, file:/home/jenkins/agent/workspace/rdf4j-pr-verify/core/sail/shacl/target/test-classes/w3c/core/path/path-sequence-001.ttl, file:/home/jenkins/agent/workspace/rdf4j-pr-verify/core/sail/shacl/target/test-classes/w3c/core/property/qualifiedValueShape-001.ttl, file:/home/jenkins/agent/workspace/rdf4j-pr-verify/core/sail/shacl/target/test-classes/w3c/core/node/minInclusive-002.ttl, file:/home/jenkins/agent/workspace/rdf4j-pr-verify/core/sail/shacl/target/test-classes/w3c/core/node/not-001.ttl, file:/home/jenkins/agent/workspace/rdf4j-pr-verify/core/sail/shacl/target/test-classes/w3c/core/property/maxExclusive-001.ttl, file:/home/jenkins/agent/workspace/rdf4j-pr-verify/core/sail/shacl/target/test-classes/w3c/core/property/and-001.ttl, file:/home/jenkins/agent/workspace/rdf4j-pr-verify/core/sail/shacl/target/test-classes/w3c/core/property/minExclusive-002.ttl, file:/home/jenkins/agent/workspace/rdf4j-pr-verify/core/sail/shacl/target/test-classes/w3c/core/misc/severity-002.ttl, file:/home/jenkins/agent/workspace/rdf4j-pr-verify/core/sail/shacl/target/test-classes/w3c/core/property/or-datatypes-001.ttl, file:/home/jenkins/agent/workspace/rdf4j-pr-verify/core/sail/shacl/target/test-classes/w3c/core/property/in-001.ttl, file:/home/jenkins/agent/workspace/rdf4j-pr-verify/core/sail/shacl/target/test-classes/w3c/core/node/maxInclusive-001.ttl, file:/home/jenkins/agent/workspace/rdf4j-pr-verify/core/sail/shacl/target/test-classes/w3c/core/node/xone-001.ttl, file:/home/jenkins/agent/workspace/rdf4j-pr-verify/core/sail/shacl/target/test-classes/w3c/core/targets/targetObjectsOf-001.ttl, file:/home/jenkins/agent/workspace/rdf4j-pr-verify/core/sail/shacl/target/test-classes/w3c/core/property/languageIn-001.ttl, file:/home/jenkins/agent/workspace/rdf4j-pr-verify/core/sail/shacl/target/test-classes/w3c/core/targets/targetSubjectsOf-001.ttl, file:/home/jenkins/agent/workspace/rdf4j-pr-verify/core/sail/shacl/target/test-classes/w3c/core/property/minCount-001.ttl, file:/home/jenkins/agent/workspace/rdf4j-pr-verify/core/sail/shacl/target/test-classes/w3c/core/complex/shacl-shacl.ttl, file:/home/jenkins/agent/workspace/rdf4j-pr-verify/core/sail/shacl/target/test-classes/w3c/core/node/closed-002.ttl, file:/home/jenkins/agent/workspace/rdf4j-pr-verify/core/sail/shacl/target/test-classes/w3c/core/path/path-unused-001.ttl, file:/home/jenkins/agent/workspace/rdf4j-pr-verify/core/sail/shacl/target/test-classes/w3c/core/targets/targetClass-001.ttl, file:/home/jenkins/agent/workspace/rdf4j-pr-verify/core/sail/shacl/target/test-classes/w3c/core/node/class-003.ttl, file:/home/jenkins/agent/workspace/rdf4j-pr-verify/core/sail/shacl/target/test-classes/w3c/core/path/path-strange-002.ttl, file:/home/jenkins/agent/workspace/rdf4j-pr-verify/core/sail/shacl/target/test-classes/w3c/core/node/pattern-001.ttl]
[WARNING] Tests run: 98, Failures: 0, Errors: 0, Skipped: 98, Time elapsed: 0.053 s - in org.eclipse.rdf4j.sail.shacl.W3cComplianceTest
[INFO] Running org.eclipse.rdf4j.sail.shacl.TruncatedValidationReportTest
02:27:12.379 [pool-21631-thread-1] ERROR ShaclSail was garbage collected without shutdown() having been called first.
02:27:12.380 [pool-21626-thread-1] ERROR ShaclSail was garbage collected without shutdown() having been called first.
02:27:12.380 [pool-21632-thread-1] ERROR ShaclSail was garbage collected without shutdown() having been called first.
02:27:12.381 [pool-21633-thread-1] ERROR ShaclSail was garbage collected without shutdown() having been called first.
02:27:12.458 [pool-21621-thread-1] ERROR ShaclSail was garbage collected without shutdown() having been called first.
[INFO] Tests run: 10, Failures: 0, Errors: 0, Skipped: 0, Time elapsed: 9.168 s - in org.eclipse.rdf4j.sail.shacl.TruncatedValidationReportTest
[INFO] Running org.eclipse.rdf4j.sail.shacl.TempTest
02:27:21.408 [main] INFO  isUndefinedTargetValidatesAllSubjects() is deprecated, please use .setDashDataShapes(true) and use the custom targets from http://datashapes.org/dash#AllSubjectsTarget
02:27:21.415 [main] INFO  isUndefinedTargetValidatesAllSubjects() is deprecated, please use .setDashDataShapes(true) and use the custom targets from http://datashapes.org/dash#AllSubjectsTarget











02:27:21.421 [main] INFO  isUndefinedTargetValidatesAllSubjects() is deprecated, please use .setDashDataShapes(true) and use the custom targets from http://datashapes.org/dash#AllSubjectsTarget






















02:27:21.430 [main] INFO  isUndefinedTargetValidatesAllSubjects() is deprecated, please use .setDashDataShapes(true) and use the custom targets from http://datashapes.org/dash#AllSubjectsTarget
02:27:21.432 [main] INFO  isUndefinedTargetValidatesAllSubjects() is deprecated, please use .setDashDataShapes(true) and use the custom targets from http://datashapes.org/dash#AllSubjectsTarget
02:27:21.432 [main] INFO  isUndefinedTargetValidatesAllSubjects() is deprecated, please use .setDashDataShapes(true) and use the custom targets from http://datashapes.org/dash#AllSubjectsTarget
02:27:21.434 [main] INFO  isUndefinedTargetValidatesAllSubjects() is deprecated, please use .setDashDataShapes(true) and use the custom targets from http://datashapes.org/dash#AllSubjectsTarget











02:27:21.442 [main] INFO  isUndefinedTargetValidatesAllSubjects() is deprecated, please use .setDashDataShapes(true) and use the custom targets from http://datashapes.org/dash#AllSubjectsTarget
02:27:21.443 [main] INFO  isUndefinedTargetValidatesAllSubjects() is deprecated, please use .setDashDataShapes(true) and use the custom targets from http://datashapes.org/dash#AllSubjectsTarget
02:27:21.443 [main] INFO  isUndefinedTargetValidatesAllSubjects() is deprecated, please use .setDashDataShapes(true) and use the custom targets from http://datashapes.org/dash#AllSubjectsTarget
[WARNING] Tests run: 12, Failures: 0, Errors: 0, Skipped: 1, Time elapsed: 0.037 s - in org.eclipse.rdf4j.sail.shacl.TempTest
[INFO] Running org.eclipse.rdf4j.sail.shacl.ShutdownTest
0
02:27:21.615 [pool-21671-thread-1] ERROR ShaclSail was garbage collected without shutdown() having been called first.
02:27:21.618 [pool-21674-thread-1] ERROR ShaclSail was garbage collected without shutdown() having been called first.
02:27:21.620 [pool-21677-thread-1] ERROR ShaclSail was garbage collected without shutdown() having been called first.
02:27:21.624 [pool-21680-thread-1] ERROR ShaclSail was garbage collected without shutdown() having been called first.
02:27:21.627 [pool-21683-thread-1] ERROR ShaclSail was garbage collected without shutdown() having been called first.
02:27:21.630 [pool-21686-thread-1] ERROR ShaclSail was garbage collected without shutdown() having been called first.
02:27:21.635 [pool-21690-thread-1] ERROR ShaclSail was garbage collected without shutdown() having been called first.
02:27:21.638 [pool-21691-thread-1] ERROR ShaclSail was garbage collected without shutdown() having been called first.
02:27:21.641 [pool-21694-thread-1] ERROR ShaclSail was garbage collected without shutdown() having been called first.
02:27:21.646 [pool-21699-thread-1] ERROR ShaclSail was garbage collected without shutdown() having been called first.
02:27:21.734 [pool-21664-thread-1] ERROR ShaclSail was garbage collected without shutdown() having been called first.
02:27:21.734 [pool-21669-thread-1] ERROR ShaclSail was garbage collected without shutdown() having been called first.
02:27:22.035 [main] ERROR Shutdown ShaclSail while validation is still running.
02:27:22.436 [main] ERROR Shutdown ShaclSail while validation is still running.
02:27:22.837 [main] ERROR Shutdown ShaclSail while validation is still running.
02:27:23.239 [main] ERROR Shutdown ShaclSail while validation is still running.
[INFO] Tests run: 3, Failures: 0, Errors: 0, Skipped: 0, Time elapsed: 1.893 s - in org.eclipse.rdf4j.sail.shacl.ShutdownTest
[INFO] 
[INFO] Results:
[INFO] 
[WARNING] Tests run: 12254, Failures: 0, Errors: 0, Skipped: 102
[INFO] 
[JENKINS] Recording test results
[INFO] 
[INFO] --- animal-sniffer-maven-plugin:1.16:check (default) @ rdf4j-shacl ---
[INFO] Checking unresolved references to org.codehaus.mojo.signature:java18:1.0
[INFO] 
[INFO] --- maven-jar-plugin:2.3.1:jar (default-jar) @ rdf4j-shacl ---
[INFO] Building jar: /home/jenkins/agent/workspace/rdf4j-pr-verify/core/sail/shacl/target/rdf4j-shacl-3.5.0-SNAPSHOT.jar
[INFO] 
[INFO] --- maven-assembly-plugin:3.3.0:single (benchmark-jar) @ rdf4j-shacl ---
[INFO] Building jar: /home/jenkins/agent/workspace/rdf4j-pr-verify/core/sail/shacl/target/jmh-benchmarks.jar