SuccessConsole Output

Skipping 491 KB.. Full Log
es/minExclusive/simple/shacl.ttl
org.eclipse.rdf4j.sail.shacl.ShaclSailValidationException: Failed SHACL validation
test-cases/minExclusive/simple/shacl.ttl
org.eclipse.rdf4j.sail.shacl.ShaclSailValidationException: Failed SHACL validation
test-cases/minExclusive/simple/invalid/case9/query1.rq
org.eclipse.rdf4j.sail.shacl.ShaclSailValidationException: Failed SHACL validation
test-cases/minExclusive/simple/shacl.ttl
org.eclipse.rdf4j.sail.shacl.ShaclSailValidationException: Failed SHACL validation
test-cases/minExclusive/simple/shacl.ttl
org.eclipse.rdf4j.sail.shacl.ShaclSailValidationException: Failed SHACL validation
test-cases/minExclusive/simple/invalid/case9/query1.rq
org.eclipse.rdf4j.sail.shacl.ShaclSailValidationException: Failed SHACL validation
test-cases/minExclusive/simple/shacl.ttl
org.eclipse.rdf4j.sail.shacl.ShaclSailValidationException: Failed SHACL validation
test-cases/minInclusive/simple/shacl.ttl
test-cases/minInclusive/simple/valid/case1/query1.rq
test-cases/minInclusive/simple/shacl.ttl
test-cases/minInclusive/simple/shacl.ttl
test-cases/minInclusive/simple/valid/case1/query1.rq
test-cases/minInclusive/simple/shacl.ttl
test-cases/minInclusive/simple/shacl.ttl
test-cases/minInclusive/simple/valid/case1/query1.rq
test-cases/minInclusive/simple/shacl.ttl
test-cases/minInclusive/simple/shacl.ttl
org.eclipse.rdf4j.sail.shacl.ShaclSailValidationException: Failed SHACL validation
test-cases/minInclusive/simple/invalid/case1/query1.rq
org.eclipse.rdf4j.sail.shacl.ShaclSailValidationException: Failed SHACL validation
test-cases/minInclusive/simple/shacl.ttl
org.eclipse.rdf4j.sail.shacl.ShaclSailValidationException: Failed SHACL validation
test-cases/minInclusive/simple/shacl.ttl
org.eclipse.rdf4j.sail.shacl.ShaclSailValidationException: Failed SHACL validation
test-cases/minInclusive/simple/invalid/case1/query1.rq
org.eclipse.rdf4j.sail.shacl.ShaclSailValidationException: Failed SHACL validation
test-cases/minInclusive/simple/shacl.ttl
org.eclipse.rdf4j.sail.shacl.ShaclSailValidationException: Failed SHACL validation
test-cases/minInclusive/simple/shacl.ttl
org.eclipse.rdf4j.sail.shacl.ShaclSailValidationException: Failed SHACL validation
test-cases/minInclusive/simple/invalid/case1/query1.rq
org.eclipse.rdf4j.sail.shacl.ShaclSailValidationException: Failed SHACL validation
test-cases/minInclusive/simple/shacl.ttl
org.eclipse.rdf4j.sail.shacl.ShaclSailValidationException: Failed SHACL validation
test-cases/minLength/simple/shacl.ttl
test-cases/minLength/simple/valid/case1/query1.rq
test-cases/minLength/simple/shacl.ttl
test-cases/minLength/simple/shacl.ttl
test-cases/minLength/simple/valid/case1/query1.rq
test-cases/minLength/simple/shacl.ttl
test-cases/minLength/simple/shacl.ttl
test-cases/minLength/simple/valid/case1/query1.rq
test-cases/minLength/simple/shacl.ttl
test-cases/minLength/simple/shacl.ttl
test-cases/minLength/simple/valid/case2/query1.rq
test-cases/minLength/simple/valid/case2/query2.rq
test-cases/minLength/simple/shacl.ttl
test-cases/minLength/simple/shacl.ttl
test-cases/minLength/simple/valid/case2/query1.rq
test-cases/minLength/simple/valid/case2/query2.rq
test-cases/minLength/simple/shacl.ttl
test-cases/minLength/simple/shacl.ttl
test-cases/minLength/simple/valid/case2/query1.rq
test-cases/minLength/simple/valid/case2/query2.rq
test-cases/minLength/simple/shacl.ttl
test-cases/minLength/simple/shacl.ttl
test-cases/minLength/simple/valid/case3/query1.rq
test-cases/minLength/simple/valid/case3/query2.rq
test-cases/minLength/simple/shacl.ttl
test-cases/minLength/simple/shacl.ttl
test-cases/minLength/simple/valid/case3/query1.rq
test-cases/minLength/simple/valid/case3/query2.rq
test-cases/minLength/simple/shacl.ttl
test-cases/minLength/simple/shacl.ttl
test-cases/minLength/simple/valid/case3/query1.rq
test-cases/minLength/simple/valid/case3/query2.rq
test-cases/minLength/simple/shacl.ttl
test-cases/minLength/simple/shacl.ttl
test-cases/minLength/simple/valid/case4/query1.rq
test-cases/minLength/simple/shacl.ttl
test-cases/minLength/simple/shacl.ttl
test-cases/minLength/simple/valid/case4/query1.rq
test-cases/minLength/simple/shacl.ttl
test-cases/minLength/simple/shacl.ttl
test-cases/minLength/simple/valid/case4/query1.rq
test-cases/minLength/simple/shacl.ttl
test-cases/minLength/simple/shacl.ttl
org.eclipse.rdf4j.sail.shacl.ShaclSailValidationException: Failed SHACL validation
test-cases/minLength/simple/invalid/case1/query1.rq
org.eclipse.rdf4j.sail.shacl.ShaclSailValidationException: Failed SHACL validation
test-cases/minLength/simple/shacl.ttl
org.eclipse.rdf4j.sail.shacl.ShaclSailValidationException: Failed SHACL validation
test-cases/minLength/simple/shacl.ttl
org.eclipse.rdf4j.sail.shacl.ShaclSailValidationException: Failed SHACL validation
test-cases/minLength/simple/invalid/case1/query1.rq
org.eclipse.rdf4j.sail.shacl.ShaclSailValidationException: Failed SHACL validation
test-cases/minLength/simple/shacl.ttl
org.eclipse.rdf4j.sail.shacl.ShaclSailValidationException: Failed SHACL validation
test-cases/minLength/simple/shacl.ttl
org.eclipse.rdf4j.sail.shacl.ShaclSailValidationException: Failed SHACL validation
test-cases/minLength/simple/invalid/case1/query1.rq
org.eclipse.rdf4j.sail.shacl.ShaclSailValidationException: Failed SHACL validation
test-cases/minLength/simple/shacl.ttl
org.eclipse.rdf4j.sail.shacl.ShaclSailValidationException: Failed SHACL validation
test-cases/minLength/simple/shacl.ttl
org.eclipse.rdf4j.sail.shacl.ShaclSailValidationException: Failed SHACL validation
test-cases/minLength/simple/invalid/case2/query1.rq
test-cases/minLength/simple/invalid/case2/query2.rq
org.eclipse.rdf4j.sail.shacl.ShaclSailValidationException: Failed SHACL validation
test-cases/minLength/simple/shacl.ttl
org.eclipse.rdf4j.sail.shacl.ShaclSailValidationException: Failed SHACL validation
test-cases/minLength/simple/shacl.ttl
org.eclipse.rdf4j.sail.shacl.ShaclSailValidationException: Failed SHACL validation
test-cases/minLength/simple/invalid/case2/query1.rq
test-cases/minLength/simple/invalid/case2/query2.rq
org.eclipse.rdf4j.sail.shacl.ShaclSailValidationException: Failed SHACL validation
test-cases/minLength/simple/shacl.ttl
org.eclipse.rdf4j.sail.shacl.ShaclSailValidationException: Failed SHACL validation
test-cases/minLength/simple/shacl.ttl
org.eclipse.rdf4j.sail.shacl.ShaclSailValidationException: Failed SHACL validation
test-cases/minLength/simple/invalid/case2/query1.rq
test-cases/minLength/simple/invalid/case2/query2.rq
org.eclipse.rdf4j.sail.shacl.ShaclSailValidationException: Failed SHACL validation
test-cases/minLength/simple/shacl.ttl
org.eclipse.rdf4j.sail.shacl.ShaclSailValidationException: Failed SHACL validation
test-cases/minLength/simple/shacl.ttl
org.eclipse.rdf4j.sail.shacl.ShaclSailValidationException: Failed SHACL validation
test-cases/minLength/simple/invalid/case3/query1.rq
test-cases/minLength/simple/invalid/case3/query2.rq
org.eclipse.rdf4j.sail.shacl.ShaclSailValidationException: Failed SHACL validation
test-cases/minLength/simple/shacl.ttl
org.eclipse.rdf4j.sail.shacl.ShaclSailValidationException: Failed SHACL validation
test-cases/minLength/simple/shacl.ttl
org.eclipse.rdf4j.sail.shacl.ShaclSailValidationException: Failed SHACL validation
test-cases/minLength/simple/invalid/case3/query1.rq
test-cases/minLength/simple/invalid/case3/query2.rq
org.eclipse.rdf4j.sail.shacl.ShaclSailValidationException: Failed SHACL validation
test-cases/minLength/simple/shacl.ttl
org.eclipse.rdf4j.sail.shacl.ShaclSailValidationException: Failed SHACL validation
test-cases/minLength/simple/shacl.ttl
org.eclipse.rdf4j.sail.shacl.ShaclSailValidationException: Failed SHACL validation
test-cases/minLength/simple/invalid/case3/query1.rq
test-cases/minLength/simple/invalid/case3/query2.rq
org.eclipse.rdf4j.sail.shacl.ShaclSailValidationException: Failed SHACL validation
test-cases/minLength/simple/shacl.ttl
org.eclipse.rdf4j.sail.shacl.ShaclSailValidationException: Failed SHACL validation
test-cases/minLength/simple/shacl.ttl
org.eclipse.rdf4j.sail.shacl.ShaclSailValidationException: Failed SHACL validation
test-cases/minLength/simple/invalid/case4/query1.rq
test-cases/minLength/simple/invalid/case4/query2.rq
org.eclipse.rdf4j.sail.shacl.ShaclSailValidationException: Failed SHACL validation
test-cases/minLength/simple/shacl.ttl
org.eclipse.rdf4j.sail.shacl.ShaclSailValidationException: Failed SHACL validation
test-cases/minLength/simple/shacl.ttl
org.eclipse.rdf4j.sail.shacl.ShaclSailValidationException: Failed SHACL validation
test-cases/minLength/simple/invalid/case4/query1.rq
test-cases/minLength/simple/invalid/case4/query2.rq
org.eclipse.rdf4j.sail.shacl.ShaclSailValidationException: Failed SHACL validation
test-cases/minLength/simple/shacl.ttl
org.eclipse.rdf4j.sail.shacl.ShaclSailValidationException: Failed SHACL validation
test-cases/minLength/simple/shacl.ttl
org.eclipse.rdf4j.sail.shacl.ShaclSailValidationException: Failed SHACL validation
test-cases/minLength/simple/invalid/case4/query1.rq
test-cases/minLength/simple/invalid/case4/query2.rq
org.eclipse.rdf4j.sail.shacl.ShaclSailValidationException: Failed SHACL validation
test-cases/minLength/simple/shacl.ttl
org.eclipse.rdf4j.sail.shacl.ShaclSailValidationException: Failed SHACL validation
test-cases/minLength/simple/shacl.ttl
org.eclipse.rdf4j.sail.shacl.ShaclSailValidationException: Failed SHACL validation
test-cases/minLength/simple/invalid/case5/query1.rq
test-cases/minLength/simple/invalid/case5/query2.rq
org.eclipse.rdf4j.sail.shacl.ShaclSailValidationException: Failed SHACL validation
test-cases/minLength/simple/shacl.ttl
org.eclipse.rdf4j.sail.shacl.ShaclSailValidationException: Failed SHACL validation
test-cases/minLength/simple/shacl.ttl
org.eclipse.rdf4j.sail.shacl.ShaclSailValidationException: Failed SHACL validation
test-cases/minLength/simple/invalid/case5/query1.rq
test-cases/minLength/simple/invalid/case5/query2.rq
org.eclipse.rdf4j.sail.shacl.ShaclSailValidationException: Failed SHACL validation
test-cases/minLength/simple/shacl.ttl
org.eclipse.rdf4j.sail.shacl.ShaclSailValidationException: Failed SHACL validation
test-cases/minLength/simple/shacl.ttl
org.eclipse.rdf4j.sail.shacl.ShaclSailValidationException: Failed SHACL validation
test-cases/minLength/simple/invalid/case5/query1.rq
test-cases/minLength/simple/invalid/case5/query2.rq
org.eclipse.rdf4j.sail.shacl.ShaclSailValidationException: Failed SHACL validation
test-cases/minLength/simple/shacl.ttl
org.eclipse.rdf4j.sail.shacl.ShaclSailValidationException: Failed SHACL validation
test-cases/nodeKind/not/shacl.ttl
test-cases/nodeKind/not/valid/case1/query1.rq
test-cases/nodeKind/not/shacl.ttl
test-cases/nodeKind/not/shacl.ttl
test-cases/nodeKind/not/valid/case1/query1.rq
test-cases/nodeKind/not/shacl.ttl
test-cases/nodeKind/not/shacl.ttl
test-cases/nodeKind/not/valid/case1/query1.rq
test-cases/nodeKind/not/shacl.ttl
test-cases/nodeKind/not/shacl.ttl
test-cases/nodeKind/not/valid/case2/query1.rq
test-cases/nodeKind/not/valid/case2/query2.rq
test-cases/nodeKind/not/shacl.ttl
test-cases/nodeKind/not/shacl.ttl
test-cases/nodeKind/not/valid/case2/query1.rq
test-cases/nodeKind/not/valid/case2/query2.rq
test-cases/nodeKind/not/shacl.ttl
test-cases/nodeKind/not/shacl.ttl
test-cases/nodeKind/not/valid/case2/query1.rq
test-cases/nodeKind/not/valid/case2/query2.rq
test-cases/nodeKind/not/shacl.ttl
test-cases/nodeKind/not/shacl.ttl
test-cases/nodeKind/not/valid/case3/query1.rq
test-cases/nodeKind/not/valid/case3/query2.rq
test-cases/nodeKind/not/shacl.ttl
test-cases/nodeKind/not/shacl.ttl
test-cases/nodeKind/not/valid/case3/query1.rq
test-cases/nodeKind/not/valid/case3/query2.rq
test-cases/nodeKind/not/shacl.ttl
test-cases/nodeKind/not/shacl.ttl
test-cases/nodeKind/not/valid/case3/query1.rq
test-cases/nodeKind/not/valid/case3/query2.rq
test-cases/nodeKind/not/shacl.ttl
test-cases/nodeKind/not/shacl.ttl
test-cases/nodeKind/not/valid/case4/query1.rq
test-cases/nodeKind/not/shacl.ttl
test-cases/nodeKind/not/shacl.ttl
test-cases/nodeKind/not/valid/case4/query1.rq
test-cases/nodeKind/not/shacl.ttl
test-cases/nodeKind/not/shacl.ttl
test-cases/nodeKind/not/valid/case4/query1.rq
test-cases/nodeKind/not/shacl.ttl
test-cases/nodeKind/not/shacl.ttl
test-cases/nodeKind/not/valid/case5/query1.rq
test-cases/nodeKind/not/shacl.ttl
test-cases/nodeKind/not/shacl.ttl
test-cases/nodeKind/not/valid/case5/query1.rq
test-cases/nodeKind/not/shacl.ttl
test-cases/nodeKind/not/shacl.ttl
test-cases/nodeKind/not/valid/case5/query1.rq
test-cases/nodeKind/not/shacl.ttl
test-cases/nodeKind/not/shacl.ttl
org.eclipse.rdf4j.sail.shacl.ShaclSailValidationException: Failed SHACL validation
test-cases/nodeKind/not/invalid/case1/query1.rq
org.eclipse.rdf4j.sail.shacl.ShaclSailValidationException: Failed SHACL validation
test-cases/nodeKind/not/shacl.ttl
org.eclipse.rdf4j.sail.shacl.ShaclSailValidationException: Failed SHACL validation
test-cases/nodeKind/not/shacl.ttl
org.eclipse.rdf4j.sail.shacl.ShaclSailValidationException: Failed SHACL validation
test-cases/nodeKind/not/invalid/case1/query1.rq
org.eclipse.rdf4j.sail.shacl.ShaclSailValidationException: Failed SHACL validation
test-cases/nodeKind/not/shacl.ttl
org.eclipse.rdf4j.sail.shacl.ShaclSailValidationException: Failed SHACL validation
test-cases/nodeKind/not/shacl.ttl
org.eclipse.rdf4j.sail.shacl.ShaclSailValidationException: Failed SHACL validation
test-cases/nodeKind/not/invalid/case1/query1.rq
org.eclipse.rdf4j.sail.shacl.ShaclSailValidationException: Failed SHACL validation
test-cases/nodeKind/not/shacl.ttl
org.eclipse.rdf4j.sail.shacl.ShaclSailValidationException: Failed SHACL validation
test-cases/nodeKind/not/shacl.ttl
org.eclipse.rdf4j.sail.shacl.ShaclSailValidationException: Failed SHACL validation
test-cases/nodeKind/not/invalid/case2/query1.rq
test-cases/nodeKind/not/invalid/case2/query2.rq
org.eclipse.rdf4j.sail.shacl.ShaclSailValidationException: Failed SHACL validation
test-cases/nodeKind/not/shacl.ttl
org.eclipse.rdf4j.sail.shacl.ShaclSailValidationException: Failed SHACL validation
test-cases/nodeKind/not/shacl.ttl
org.eclipse.rdf4j.sail.shacl.ShaclSailValidationException: Failed SHACL validation
test-cases/nodeKind/not/invalid/case2/query1.rq
test-cases/nodeKind/not/invalid/case2/query2.rq
org.eclipse.rdf4j.sail.shacl.ShaclSailValidationException: Failed SHACL validation
test-cases/nodeKind/not/shacl.ttl
org.eclipse.rdf4j.sail.shacl.ShaclSailValidationException: Failed SHACL validation
test-cases/nodeKind/not/shacl.ttl
org.eclipse.rdf4j.sail.shacl.ShaclSailValidationException: Failed SHACL validation
test-cases/nodeKind/not/invalid/case2/query1.rq
test-cases/nodeKind/not/invalid/case2/query2.rq
org.eclipse.rdf4j.sail.shacl.ShaclSailValidationException: Failed SHACL validation
test-cases/nodeKind/not/shacl.ttl
org.eclipse.rdf4j.sail.shacl.ShaclSailValidationException: Failed SHACL validation
test-cases/nodeKind/not/shacl.ttl
org.eclipse.rdf4j.sail.shacl.ShaclSailValidationException: Failed SHACL validation
test-cases/nodeKind/not/invalid/case3/query1.rq
test-cases/nodeKind/not/invalid/case3/query2.rq
org.eclipse.rdf4j.sail.shacl.ShaclSailValidationException: Failed SHACL validation
test-cases/nodeKind/not/shacl.ttl
org.eclipse.rdf4j.sail.shacl.ShaclSailValidationException: Failed SHACL validation
test-cases/nodeKind/not/shacl.ttl
org.eclipse.rdf4j.sail.shacl.ShaclSailValidationException: Failed SHACL validation
test-cases/nodeKind/not/invalid/case3/query1.rq
test-cases/nodeKind/not/invalid/case3/query2.rq
org.eclipse.rdf4j.sail.shacl.ShaclSailValidationException: Failed SHACL validation
test-cases/nodeKind/not/shacl.ttl
org.eclipse.rdf4j.sail.shacl.ShaclSailValidationException: Failed SHACL validation
test-cases/nodeKind/not/shacl.ttl
org.eclipse.rdf4j.sail.shacl.ShaclSailValidationException: Failed SHACL validation
test-cases/nodeKind/not/invalid/case3/query1.rq
test-cases/nodeKind/not/invalid/case3/query2.rq
org.eclipse.rdf4j.sail.shacl.ShaclSailValidationException: Failed SHACL validation
test-cases/nodeKind/not/shacl.ttl
org.eclipse.rdf4j.sail.shacl.ShaclSailValidationException: Failed SHACL validation
test-cases/nodeKind/not/shacl.ttl
org.eclipse.rdf4j.sail.shacl.ShaclSailValidationException: Failed SHACL validation
test-cases/nodeKind/not/invalid/case4/query1.rq
test-cases/nodeKind/not/invalid/case4/query2.rq
org.eclipse.rdf4j.sail.shacl.ShaclSailValidationException: Failed SHACL validation
test-cases/nodeKind/not/shacl.ttl
org.eclipse.rdf4j.sail.shacl.ShaclSailValidationException: Failed SHACL validation
test-cases/nodeKind/not/shacl.ttl
org.eclipse.rdf4j.sail.shacl.ShaclSailValidationException: Failed SHACL validation
test-cases/nodeKind/not/invalid/case4/query1.rq
test-cases/nodeKind/not/invalid/case4/query2.rq
org.eclipse.rdf4j.sail.shacl.ShaclSailValidationException: Failed SHACL validation
test-cases/nodeKind/not/shacl.ttl
org.eclipse.rdf4j.sail.shacl.ShaclSailValidationException: Failed SHACL validation
test-cases/nodeKind/not/shacl.ttl
org.eclipse.rdf4j.sail.shacl.ShaclSailValidationException: Failed SHACL validation
test-cases/nodeKind/not/invalid/case4/query1.rq
test-cases/nodeKind/not/invalid/case4/query2.rq
org.eclipse.rdf4j.sail.shacl.ShaclSailValidationException: Failed SHACL validation
test-cases/nodeKind/not/shacl.ttl
org.eclipse.rdf4j.sail.shacl.ShaclSailValidationException: Failed SHACL validation
test-cases/nodeKind/not/shacl.ttl
org.eclipse.rdf4j.sail.shacl.ShaclSailValidationException: Failed SHACL validation
test-cases/nodeKind/not/invalid/case5/query1.rq
test-cases/nodeKind/not/invalid/case5/query2.rq
org.eclipse.rdf4j.sail.shacl.ShaclSailValidationException: Failed SHACL validation
test-cases/nodeKind/not/shacl.ttl
org.eclipse.rdf4j.sail.shacl.ShaclSailValidationException: Failed SHACL validation
test-cases/nodeKind/not/shacl.ttl
org.eclipse.rdf4j.sail.shacl.ShaclSailValidationException: Failed SHACL validation
test-cases/nodeKind/not/invalid/case5/query1.rq
test-cases/nodeKind/not/invalid/case5/query2.rq
org.eclipse.rdf4j.sail.shacl.ShaclSailValidationException: Failed SHACL validation
test-cases/nodeKind/not/shacl.ttl
org.eclipse.rdf4j.sail.shacl.ShaclSailValidationException: Failed SHACL validation
test-cases/nodeKind/not/shacl.ttl
org.eclipse.rdf4j.sail.shacl.ShaclSailValidationException: Failed SHACL validation
test-cases/nodeKind/not/invalid/case5/query1.rq
test-cases/nodeKind/not/invalid/case5/query2.rq
org.eclipse.rdf4j.sail.shacl.ShaclSailValidationException: Failed SHACL validation
test-cases/nodeKind/not/shacl.ttl
org.eclipse.rdf4j.sail.shacl.ShaclSailValidationException: Failed SHACL validation
test-cases/nodeKind/simple/shacl.ttl
test-cases/nodeKind/simple/valid/case1/query1.rq
test-cases/nodeKind/simple/shacl.ttl
test-cases/nodeKind/simple/shacl.ttl
test-cases/nodeKind/simple/valid/case1/query1.rq
test-cases/nodeKind/simple/shacl.ttl
test-cases/nodeKind/simple/shacl.ttl
test-cases/nodeKind/simple/valid/case1/query1.rq
test-cases/nodeKind/simple/shacl.ttl
test-cases/nodeKind/simple/shacl.ttl
test-cases/nodeKind/simple/valid/case2/query1.rq
test-cases/nodeKind/simple/valid/case2/query2.rq
test-cases/nodeKind/simple/shacl.ttl
test-cases/nodeKind/simple/shacl.ttl
test-cases/nodeKind/simple/valid/case2/query1.rq
test-cases/nodeKind/simple/valid/case2/query2.rq
test-cases/nodeKind/simple/shacl.ttl
test-cases/nodeKind/simple/shacl.ttl
test-cases/nodeKind/simple/valid/case2/query1.rq
test-cases/nodeKind/simple/valid/case2/query2.rq
test-cases/nodeKind/simple/shacl.ttl
test-cases/nodeKind/simple/shacl.ttl
test-cases/nodeKind/simple/valid/case3/query1.rq
test-cases/nodeKind/simple/valid/case3/query2.rq
test-cases/nodeKind/simple/shacl.ttl
test-cases/nodeKind/simple/shacl.ttl
test-cases/nodeKind/simple/valid/case3/query1.rq
test-cases/nodeKind/simple/valid/case3/query2.rq
test-cases/nodeKind/simple/shacl.ttl
test-cases/nodeKind/simple/shacl.ttl
test-cases/nodeKind/simple/valid/case3/query1.rq
test-cases/nodeKind/simple/valid/case3/query2.rq
test-cases/nodeKind/simple/shacl.ttl
test-cases/nodeKind/simple/shacl.ttl
test-cases/nodeKind/simple/valid/case4/query1.rq
test-cases/nodeKind/simple/shacl.ttl
test-cases/nodeKind/simple/shacl.ttl
test-cases/nodeKind/simple/valid/case4/query1.rq
test-cases/nodeKind/simple/shacl.ttl
test-cases/nodeKind/simple/shacl.ttl
test-cases/nodeKind/simple/valid/case4/query1.rq
test-cases/nodeKind/simple/shacl.ttl
test-cases/nodeKind/simple/shacl.ttl
test-cases/nodeKind/simple/valid/case5/query1.rq
test-cases/nodeKind/simple/shacl.ttl
test-cases/nodeKind/simple/shacl.ttl
test-cases/nodeKind/simple/valid/case5/query1.rq
test-cases/nodeKind/simple/shacl.ttl
test-cases/nodeKind/simple/shacl.ttl
test-cases/nodeKind/simple/valid/case5/query1.rq
test-cases/nodeKind/simple/shacl.ttl
test-cases/nodeKind/simple/shacl.ttl
org.eclipse.rdf4j.sail.shacl.ShaclSailValidationException: Failed SHACL validation
test-cases/nodeKind/simple/invalid/case1/query1.rq
org.eclipse.rdf4j.sail.shacl.ShaclSailValidationException: Failed SHACL validation
test-cases/nodeKind/simple/shacl.ttl
org.eclipse.rdf4j.sail.shacl.ShaclSailValidationException: Failed SHACL validation
test-cases/nodeKind/simple/shacl.ttl
org.eclipse.rdf4j.sail.shacl.ShaclSailValidationException: Failed SHACL validation
test-cases/nodeKind/simple/invalid/case1/query1.rq
org.eclipse.rdf4j.sail.shacl.ShaclSailValidationException: Failed SHACL validation
test-cases/nodeKind/simple/shacl.ttl
org.eclipse.rdf4j.sail.shacl.ShaclSailValidationException: Failed SHACL validation
test-cases/nodeKind/simple/shacl.ttl
org.eclipse.rdf4j.sail.shacl.ShaclSailValidationException: Failed SHACL validation
test-cases/nodeKind/simple/invalid/case1/query1.rq
org.eclipse.rdf4j.sail.shacl.ShaclSailValidationException: Failed SHACL validation
test-cases/nodeKind/simple/shacl.ttl
org.eclipse.rdf4j.sail.shacl.ShaclSailValidationException: Failed SHACL validation
test-cases/nodeKind/simple/shacl.ttl
org.eclipse.rdf4j.sail.shacl.ShaclSailValidationException: Failed SHACL validation
test-cases/nodeKind/simple/invalid/case2/query1.rq
test-cases/nodeKind/simple/invalid/case2/query2.rq
org.eclipse.rdf4j.sail.shacl.ShaclSailValidationException: Failed SHACL validation
test-cases/nodeKind/simple/shacl.ttl
org.eclipse.rdf4j.sail.shacl.ShaclSailValidationException: Failed SHACL validation
test-cases/nodeKind/simple/shacl.ttl
org.eclipse.rdf4j.sail.shacl.ShaclSailValidationException: Failed SHACL validation
test-cases/nodeKind/simple/invalid/case2/query1.rq
test-cases/nodeKind/simple/invalid/case2/query2.rq
org.eclipse.rdf4j.sail.shacl.ShaclSailValidationException: Failed SHACL validation
test-cases/nodeKind/simple/shacl.ttl
org.eclipse.rdf4j.sail.shacl.ShaclSailValidationException: Failed SHACL validation
test-cases/nodeKind/simple/shacl.ttl
org.eclipse.rdf4j.sail.shacl.ShaclSailValidationException: Failed SHACL validation
test-cases/nodeKind/simple/invalid/case2/query1.rq
test-cases/nodeKind/simple/invalid/case2/query2.rq
org.eclipse.rdf4j.sail.shacl.ShaclSailValidationException: Failed SHACL validation
test-cases/nodeKind/simple/shacl.ttl
org.eclipse.rdf4j.sail.shacl.ShaclSailValidationException: Failed SHACL validation
test-cases/nodeKind/simple/shacl.ttl
org.eclipse.rdf4j.sail.shacl.ShaclSailValidationException: Failed SHACL validation
test-cases/nodeKind/simple/invalid/case3/query1.rq
test-cases/nodeKind/simple/invalid/case3/query2.rq
org.eclipse.rdf4j.sail.shacl.ShaclSailValidationException: Failed SHACL validation
test-cases/nodeKind/simple/shacl.ttl
org.eclipse.rdf4j.sail.shacl.ShaclSailValidationException: Failed SHACL validation
test-cases/nodeKind/simple/shacl.ttl
org.eclipse.rdf4j.sail.shacl.ShaclSailValidationException: Failed SHACL validation
test-cases/nodeKind/simple/invalid/case3/query1.rq
test-cases/nodeKind/simple/invalid/case3/query2.rq
org.eclipse.rdf4j.sail.shacl.ShaclSailValidationException: Failed SHACL validation
test-cases/nodeKind/simple/shacl.ttl
org.eclipse.rdf4j.sail.shacl.ShaclSailValidationException: Failed SHACL validation
test-cases/nodeKind/simple/shacl.ttl
org.eclipse.rdf4j.sail.shacl.ShaclSailValidationException: Failed SHACL validation
test-cases/nodeKind/simple/invalid/case3/query1.rq
test-cases/nodeKind/simple/invalid/case3/query2.rq
org.eclipse.rdf4j.sail.shacl.ShaclSailValidationException: Failed SHACL validation
test-cases/nodeKind/simple/shacl.ttl
org.eclipse.rdf4j.sail.shacl.ShaclSailValidationException: Failed SHACL validation
test-cases/nodeKind/simple/shacl.ttl
org.eclipse.rdf4j.sail.shacl.ShaclSailValidationException: Failed SHACL validation
test-cases/nodeKind/simple/invalid/case4/query1.rq
test-cases/nodeKind/simple/invalid/case4/query2.rq
org.eclipse.rdf4j.sail.shacl.ShaclSailValidationException: Failed SHACL validation
test-cases/nodeKind/simple/shacl.ttl
org.eclipse.rdf4j.sail.shacl.ShaclSailValidationException: Failed SHACL validation
test-cases/nodeKind/simple/shacl.ttl
org.eclipse.rdf4j.sail.shacl.ShaclSailValidationException: Failed SHACL validation
test-cases/nodeKind/simple/invalid/case4/query1.rq
test-cases/nodeKind/simple/invalid/case4/query2.rq
org.eclipse.rdf4j.sail.shacl.ShaclSailValidationException: Failed SHACL validation
test-cases/nodeKind/simple/shacl.ttl
org.eclipse.rdf4j.sail.shacl.ShaclSailValidationException: Failed SHACL validation
test-cases/nodeKind/simple/shacl.ttl
org.eclipse.rdf4j.sail.shacl.ShaclSailValidationException: Failed SHACL validation
test-cases/nodeKind/simple/invalid/case4/query1.rq
test-cases/nodeKind/simple/invalid/case4/query2.rq
org.eclipse.rdf4j.sail.shacl.ShaclSailValidationException: Failed SHACL validation
test-cases/nodeKind/simple/shacl.ttl
org.eclipse.rdf4j.sail.shacl.ShaclSailValidationException: Failed SHACL validation
test-cases/nodeKind/simple/shacl.ttl
org.eclipse.rdf4j.sail.shacl.ShaclSailValidationException: Failed SHACL validation
test-cases/nodeKind/simple/invalid/case5/query1.rq
test-cases/nodeKind/simple/invalid/case5/query2.rq
org.eclipse.rdf4j.sail.shacl.ShaclSailValidationException: Failed SHACL validation
test-cases/nodeKind/simple/shacl.ttl
org.eclipse.rdf4j.sail.shacl.ShaclSailValidationException: Failed SHACL validation
test-cases/nodeKind/simple/shacl.ttl
org.eclipse.rdf4j.sail.shacl.ShaclSailValidationException: Failed SHACL validation
test-cases/nodeKind/simple/invalid/case5/query1.rq
test-cases/nodeKind/simple/invalid/case5/query2.rq
org.eclipse.rdf4j.sail.shacl.ShaclSailValidationException: Failed SHACL validation
test-cases/nodeKind/simple/shacl.ttl
org.eclipse.rdf4j.sail.shacl.ShaclSailValidationException: Failed SHACL validation
test-cases/nodeKind/simple/shacl.ttl
org.eclipse.rdf4j.sail.shacl.ShaclSailValidationException: Failed SHACL validation
test-cases/nodeKind/simple/invalid/case5/query1.rq
test-cases/nodeKind/simple/invalid/case5/query2.rq
org.eclipse.rdf4j.sail.shacl.ShaclSailValidationException: Failed SHACL validation
test-cases/nodeKind/simple/shacl.ttl
org.eclipse.rdf4j.sail.shacl.ShaclSailValidationException: Failed SHACL validation
test-cases/nodeKind/validateTarget/shacl.ttl
test-cases/nodeKind/validateTarget/valid/case1/query1.rq
test-cases/nodeKind/validateTarget/shacl.ttl
test-cases/nodeKind/validateTarget/shacl.ttl
test-cases/nodeKind/validateTarget/valid/case1/query1.rq
test-cases/nodeKind/validateTarget/shacl.ttl
test-cases/nodeKind/validateTarget/shacl.ttl
test-cases/nodeKind/validateTarget/valid/case1/query1.rq
test-cases/nodeKind/validateTarget/shacl.ttl
test-cases/nodeKind/validateTarget/shacl.ttl
test-cases/nodeKind/validateTarget/valid/case2/query1.rq
test-cases/nodeKind/validateTarget/valid/case2/query2.rq
test-cases/nodeKind/validateTarget/shacl.ttl
test-cases/nodeKind/validateTarget/shacl.ttl
test-cases/nodeKind/validateTarget/valid/case2/query1.rq
test-cases/nodeKind/validateTarget/valid/case2/query2.rq
test-cases/nodeKind/validateTarget/shacl.ttl
test-cases/nodeKind/validateTarget/shacl.ttl
test-cases/nodeKind/validateTarget/valid/case2/query1.rq
test-cases/nodeKind/validateTarget/valid/case2/query2.rq
test-cases/nodeKind/validateTarget/shacl.ttl
test-cases/nodeKind/validateTarget/shacl.ttl
org.eclipse.rdf4j.sail.shacl.ShaclSailValidationException: Failed SHACL validation
test-cases/nodeKind/validateTarget/invalid/case1/query1.rq
org.eclipse.rdf4j.sail.shacl.ShaclSailValidationException: Failed SHACL validation
test-cases/nodeKind/validateTarget/shacl.ttl
org.eclipse.rdf4j.sail.shacl.ShaclSailValidationException: Failed SHACL validation
test-cases/nodeKind/validateTarget/shacl.ttl
org.eclipse.rdf4j.sail.shacl.ShaclSailValidationException: Failed SHACL validation
test-cases/nodeKind/validateTarget/invalid/case1/query1.rq
org.eclipse.rdf4j.sail.shacl.ShaclSailValidationException: Failed SHACL validation
test-cases/nodeKind/validateTarget/shacl.ttl
org.eclipse.rdf4j.sail.shacl.ShaclSailValidationException: Failed SHACL validation
test-cases/nodeKind/validateTarget/shacl.ttl
org.eclipse.rdf4j.sail.shacl.ShaclSailValidationException: Failed SHACL validation
test-cases/nodeKind/validateTarget/invalid/case1/query1.rq
org.eclipse.rdf4j.sail.shacl.ShaclSailValidationException: Failed SHACL validation
test-cases/nodeKind/validateTarget/shacl.ttl
org.eclipse.rdf4j.sail.shacl.ShaclSailValidationException: Failed SHACL validation
test-cases/or/class/shacl.ttl
test-cases/or/class/valid/case1/query1.rq
test-cases/or/class/shacl.ttl
test-cases/or/class/shacl.ttl
test-cases/or/class/valid/case1/query1.rq
test-cases/or/class/shacl.ttl
test-cases/or/class/shacl.ttl
test-cases/or/class/valid/case1/query1.rq
test-cases/or/class/shacl.ttl
test-cases/or/class/shacl.ttl
test-cases/or/class/valid/case2/query1.rq
test-cases/or/class/valid/case2/query2.rq
test-cases/or/class/shacl.ttl
test-cases/or/class/shacl.ttl
test-cases/or/class/valid/case2/query1.rq
test-cases/or/class/valid/case2/query2.rq
test-cases/or/class/shacl.ttl
test-cases/or/class/shacl.ttl
test-cases/or/class/valid/case2/query1.rq
test-cases/or/class/valid/case2/query2.rq
test-cases/or/class/shacl.ttl
test-cases/or/class/shacl.ttl
test-cases/or/class/valid/case3/query1.rq
test-cases/or/class/valid/case3/query2.rq
test-cases/or/class/shacl.ttl
test-cases/or/class/shacl.ttl
test-cases/or/class/valid/case3/query1.rq
test-cases/or/class/valid/case3/query2.rq
test-cases/or/class/shacl.ttl
test-cases/or/class/shacl.ttl
test-cases/or/class/valid/case3/query1.rq
test-cases/or/class/valid/case3/query2.rq
test-cases/or/class/shacl.ttl
test-cases/or/class/shacl.ttl
org.eclipse.rdf4j.sail.shacl.ShaclSailValidationException: Failed SHACL validation
test-cases/or/class/invalid/case1/query1.rq
org.eclipse.rdf4j.sail.shacl.ShaclSailValidationException: Failed SHACL validation
test-cases/or/class/shacl.ttl
org.eclipse.rdf4j.sail.shacl.ShaclSailValidationException: Failed SHACL validation
test-cases/or/class/shacl.ttl
org.eclipse.rdf4j.sail.shacl.ShaclSailValidationException: Failed SHACL validation
test-cases/or/class/invalid/case1/query1.rq
org.eclipse.rdf4j.sail.shacl.ShaclSailValidationException: Failed SHACL validation
test-cases/or/class/shacl.ttl
org.eclipse.rdf4j.sail.shacl.ShaclSailValidationException: Failed SHACL validation
test-cases/or/class/shacl.ttl
org.eclipse.rdf4j.sail.shacl.ShaclSailValidationException: Failed SHACL validation
test-cases/or/class/invalid/case1/query1.rq
org.eclipse.rdf4j.sail.shacl.ShaclSailValidationException: Failed SHACL validation
test-cases/or/class/shacl.ttl
org.eclipse.rdf4j.sail.shacl.ShaclSailValidationException: Failed SHACL validation
test-cases/or/class/shacl.ttl
org.eclipse.rdf4j.sail.shacl.ShaclSailValidationException: Failed SHACL validation
test-cases/or/class/invalid/case2/query1.rq
test-cases/or/class/invalid/case2/query2.rq
org.eclipse.rdf4j.sail.shacl.ShaclSailValidationException: Failed SHACL validation
test-cases/or/class/shacl.ttl
org.eclipse.rdf4j.sail.shacl.ShaclSailValidationException: Failed SHACL validation
test-cases/or/class/shacl.ttl
org.eclipse.rdf4j.sail.shacl.ShaclSailValidationException: Failed SHACL validation
test-cases/or/class/invalid/case2/query1.rq
test-cases/or/class/invalid/case2/query2.rq
org.eclipse.rdf4j.sail.shacl.ShaclSailValidationException: Failed SHACL validation
test-cases/or/class/shacl.ttl
org.eclipse.rdf4j.sail.shacl.ShaclSailValidationException: Failed SHACL validation
test-cases/or/class/shacl.ttl
org.eclipse.rdf4j.sail.shacl.ShaclSailValidationException: Failed SHACL validation
test-cases/or/class/invalid/case2/query1.rq
test-cases/or/class/invalid/case2/query2.rq
org.eclipse.rdf4j.sail.shacl.ShaclSailValidationException: Failed SHACL validation
test-cases/or/class/shacl.ttl
org.eclipse.rdf4j.sail.shacl.ShaclSailValidationException: Failed SHACL validation
test-cases/or/class/shacl.ttl
org.eclipse.rdf4j.sail.shacl.ShaclSailValidationException: Failed SHACL validation
test-cases/or/class/invalid/case3/query1.rq
test-cases/or/class/invalid/case3/query2.rq
org.eclipse.rdf4j.sail.shacl.ShaclSailValidationException: Failed SHACL validation
test-cases/or/class/shacl.ttl
org.eclipse.rdf4j.sail.shacl.ShaclSailValidationException: Failed SHACL validation
test-cases/or/class/shacl.ttl
org.eclipse.rdf4j.sail.shacl.ShaclSailValidationException: Failed SHACL validation
test-cases/or/class/invalid/case3/query1.rq
test-cases/or/class/invalid/case3/query2.rq
org.eclipse.rdf4j.sail.shacl.ShaclSailValidationException: Failed SHACL validation
test-cases/or/class/shacl.ttl
org.eclipse.rdf4j.sail.shacl.ShaclSailValidationException: Failed SHACL validation
test-cases/or/class/shacl.ttl
org.eclipse.rdf4j.sail.shacl.ShaclSailValidationException: Failed SHACL validation
test-cases/or/class/invalid/case3/query1.rq
test-cases/or/class/invalid/case3/query2.rq
org.eclipse.rdf4j.sail.shacl.ShaclSailValidationException: Failed SHACL validation
test-cases/or/class/shacl.ttl
org.eclipse.rdf4j.sail.shacl.ShaclSailValidationException: Failed SHACL validation
test-cases/or/class2/shacl.ttl
test-cases/or/class2/valid/case1/query1.rq
test-cases/or/class2/shacl.ttl
test-cases/or/class2/shacl.ttl
test-cases/or/class2/valid/case1/query1.rq
test-cases/or/class2/shacl.ttl
test-cases/or/class2/shacl.ttl
test-cases/or/class2/valid/case1/query1.rq
test-cases/or/class2/shacl.ttl
test-cases/or/class2/shacl.ttl
test-cases/or/class2/valid/case2/query1.rq
test-cases/or/class2/valid/case2/query2.rq
test-cases/or/class2/shacl.ttl
test-cases/or/class2/shacl.ttl
test-cases/or/class2/valid/case2/query1.rq
test-cases/or/class2/valid/case2/query2.rq
test-cases/or/class2/shacl.ttl
test-cases/or/class2/shacl.ttl
test-cases/or/class2/valid/case2/query1.rq
test-cases/or/class2/valid/case2/query2.rq
test-cases/or/class2/shacl.ttl
test-cases/or/class2/shacl.ttl
test-cases/or/class2/valid/case3/query1.rq
test-cases/or/class2/valid/case3/query2.rq
test-cases/or/class2/shacl.ttl
test-cases/or/class2/shacl.ttl
test-cases/or/class2/valid/case3/query1.rq
test-cases/or/class2/valid/case3/query2.rq
test-cases/or/class2/shacl.ttl
test-cases/or/class2/shacl.ttl
test-cases/or/class2/valid/case3/query1.rq
test-cases/or/class2/valid/case3/query2.rq
test-cases/or/class2/shacl.ttl
test-cases/or/class2/shacl.ttl
org.eclipse.rdf4j.sail.shacl.ShaclSailValidationException: Failed SHACL validation
test-cases/or/class2/invalid/case1/query1.rq
org.eclipse.rdf4j.sail.shacl.ShaclSailValidationException: Failed SHACL validation
test-cases/or/class2/shacl.ttl
org.eclipse.rdf4j.sail.shacl.ShaclSailValidationException: Failed SHACL validation
test-cases/or/class2/shacl.ttl
org.eclipse.rdf4j.sail.shacl.ShaclSailValidationException: Failed SHACL validation
test-cases/or/class2/invalid/case1/query1.rq
org.eclipse.rdf4j.sail.shacl.ShaclSailValidationException: Failed SHACL validation
test-cases/or/class2/shacl.ttl
org.eclipse.rdf4j.sail.shacl.ShaclSailValidationException: Failed SHACL validation
test-cases/or/class2/shacl.ttl
org.eclipse.rdf4j.sail.shacl.ShaclSailValidationException: Failed SHACL validation
test-cases/or/class2/invalid/case1/query1.rq
org.eclipse.rdf4j.sail.shacl.ShaclSailValidationException: Failed SHACL validation
test-cases/or/class2/shacl.ttl
org.eclipse.rdf4j.sail.shacl.ShaclSailValidationException: Failed SHACL validation
test-cases/or/class2/shacl.ttl
org.eclipse.rdf4j.sail.shacl.ShaclSailValidationException: Failed SHACL validation
test-cases/or/class2/invalid/case2/query1.rq
test-cases/or/class2/invalid/case2/query2.rq
org.eclipse.rdf4j.sail.shacl.ShaclSailValidationException: Failed SHACL validation
test-cases/or/class2/shacl.ttl
org.eclipse.rdf4j.sail.shacl.ShaclSailValidationException: Failed SHACL validation
test-cases/or/class2/shacl.ttl
org.eclipse.rdf4j.sail.shacl.ShaclSailValidationException: Failed SHACL validation
test-cases/or/class2/invalid/case2/query1.rq
test-cases/or/class2/invalid/case2/query2.rq
org.eclipse.rdf4j.sail.shacl.ShaclSailValidationException: Failed SHACL validation
test-cases/or/class2/shacl.ttl
org.eclipse.rdf4j.sail.shacl.ShaclSailValidationException: Failed SHACL validation
test-cases/or/class2/shacl.ttl
org.eclipse.rdf4j.sail.shacl.ShaclSailValidationException: Failed SHACL validation
test-cases/or/class2/invalid/case2/query1.rq
test-cases/or/class2/invalid/case2/query2.rq
org.eclipse.rdf4j.sail.shacl.ShaclSailValidationException: Failed SHACL validation
test-cases/or/class2/shacl.ttl
org.eclipse.rdf4j.sail.shacl.ShaclSailValidationException: Failed SHACL validation
test-cases/or/class2/shacl.ttl
org.eclipse.rdf4j.sail.shacl.ShaclSailValidationException: Failed SHACL validation
test-cases/or/class2/invalid/case3/query1.rq
test-cases/or/class2/invalid/case3/query2.rq
org.eclipse.rdf4j.sail.shacl.ShaclSailValidationException: Failed SHACL validation
test-cases/or/class2/shacl.ttl
org.eclipse.rdf4j.sail.shacl.ShaclSailValidationException: Failed SHACL validation
test-cases/or/class2/shacl.ttl
org.eclipse.rdf4j.sail.shacl.ShaclSailValidationException: Failed SHACL validation
test-cases/or/class2/invalid/case3/query1.rq
test-cases/or/class2/invalid/case3/query2.rq
org.eclipse.rdf4j.sail.shacl.ShaclSailValidationException: Failed SHACL validation
test-cases/or/class2/shacl.ttl
org.eclipse.rdf4j.sail.shacl.ShaclSailValidationException: Failed SHACL validation
test-cases/or/class2/shacl.ttl
org.eclipse.rdf4j.sail.shacl.ShaclSailValidationException: Failed SHACL validation
test-cases/or/class2/invalid/case3/query1.rq
test-cases/or/class2/invalid/case3/query2.rq
org.eclipse.rdf4j.sail.shacl.ShaclSailValidationException: Failed SHACL validation
test-cases/or/class2/shacl.ttl
org.eclipse.rdf4j.sail.shacl.ShaclSailValidationException: Failed SHACL validation
test-cases/or/classValidateTarget/shacl.ttl
test-cases/or/classValidateTarget/valid/case1/query1.rq
test-cases/or/classValidateTarget/shacl.ttl
test-cases/or/classValidateTarget/shacl.ttl
test-cases/or/classValidateTarget/valid/case1/query1.rq
test-cases/or/classValidateTarget/shacl.ttl
test-cases/or/classValidateTarget/shacl.ttl
test-cases/or/classValidateTarget/valid/case1/query1.rq
test-cases/or/classValidateTarget/shacl.ttl
test-cases/or/classValidateTarget/shacl.ttl
test-cases/or/classValidateTarget/valid/case2/query1.rq
test-cases/or/classValidateTarget/shacl.ttl
test-cases/or/classValidateTarget/shacl.ttl
test-cases/or/classValidateTarget/valid/case2/query1.rq
test-cases/or/classValidateTarget/shacl.ttl
test-cases/or/classValidateTarget/shacl.ttl
test-cases/or/classValidateTarget/valid/case2/query1.rq
test-cases/or/classValidateTarget/shacl.ttl
test-cases/or/classValidateTarget/shacl.ttl
test-cases/or/classValidateTarget/valid/case3/query1.rq
test-cases/or/classValidateTarget/shacl.ttl
test-cases/or/classValidateTarget/shacl.ttl
test-cases/or/classValidateTarget/valid/case3/query1.rq
test-cases/or/classValidateTarget/shacl.ttl
test-cases/or/classValidateTarget/shacl.ttl
test-cases/or/classValidateTarget/valid/case3/query1.rq
test-cases/or/classValidateTarget/shacl.ttl
test-cases/or/classValidateTarget/shacl.ttl
test-cases/or/classValidateTarget/valid/case4/query1.rq
test-cases/or/classValidateTarget/valid/case4/query2.rq
test-cases/or/classValidateTarget/shacl.ttl
test-cases/or/classValidateTarget/shacl.ttl
test-cases/or/classValidateTarget/valid/case4/query1.rq
test-cases/or/classValidateTarget/valid/case4/query2.rq
test-cases/or/classValidateTarget/shacl.ttl
test-cases/or/classValidateTarget/shacl.ttl
test-cases/or/classValidateTarget/valid/case4/query1.rq
test-cases/or/classValidateTarget/valid/case4/query2.rq
test-cases/or/classValidateTarget/shacl.ttl
test-cases/or/classValidateTarget/shacl.ttl
test-cases/or/classValidateTarget/valid/case5/query1.rq
test-cases/or/classValidateTarget/valid/case5/query2.rq
test-cases/or/classValidateTarget/shacl.ttl
test-cases/or/classValidateTarget/shacl.ttl
test-cases/or/classValidateTarget/valid/case5/query1.rq
test-cases/or/classValidateTarget/valid/case5/query2.rq
test-cases/or/classValidateTarget/shacl.ttl
test-cases/or/classValidateTarget/shacl.ttl
test-cases/or/classValidateTarget/valid/case5/query1.rq
test-cases/or/classValidateTarget/valid/case5/query2.rq
test-cases/or/classValidateTarget/shacl.ttl
test-cases/or/classValidateTarget/shacl.ttl
org.eclipse.rdf4j.sail.shacl.ShaclSailValidationException: Failed SHACL validation
test-cases/or/classValidateTarget/invalid/case1/query1.rq
org.eclipse.rdf4j.sail.shacl.ShaclSailValidationException: Failed SHACL validation
test-cases/or/classValidateTarget/shacl.ttl
org.eclipse.rdf4j.sail.shacl.ShaclSailValidationException: Failed SHACL validation
test-cases/or/classValidateTarget/shacl.ttl
org.eclipse.rdf4j.sail.shacl.ShaclSailValidationException: Failed SHACL validation
test-cases/or/classValidateTarget/invalid/case1/query1.rq
org.eclipse.rdf4j.sail.shacl.ShaclSailValidationException: Failed SHACL validation
test-cases/or/classValidateTarget/shacl.ttl
org.eclipse.rdf4j.sail.shacl.ShaclSailValidationException: Failed SHACL validation
test-cases/or/classValidateTarget/shacl.ttl
org.eclipse.rdf4j.sail.shacl.ShaclSailValidationException: Failed SHACL validation
test-cases/or/classValidateTarget/invalid/case1/query1.rq
org.eclipse.rdf4j.sail.shacl.ShaclSailValidationException: Failed SHACL validation
test-cases/or/classValidateTarget/shacl.ttl
org.eclipse.rdf4j.sail.shacl.ShaclSailValidationException: Failed SHACL validation
test-cases/or/classValidateTarget/shacl.ttl
org.eclipse.rdf4j.sail.shacl.ShaclSailValidationException: Failed SHACL validation
test-cases/or/classValidateTarget/invalid/case2/query1.rq
test-cases/or/classValidateTarget/invalid/case2/query2.rq
org.eclipse.rdf4j.sail.shacl.ShaclSailValidationException: Failed SHACL validation
test-cases/or/classValidateTarget/shacl.ttl
org.eclipse.rdf4j.sail.shacl.ShaclSailValidationException: Failed SHACL validation
test-cases/or/classValidateTarget/shacl.ttl
org.eclipse.rdf4j.sail.shacl.ShaclSailValidationException: Failed SHACL validation
test-cases/or/classValidateTarget/invalid/case2/query1.rq
test-cases/or/classValidateTarget/invalid/case2/query2.rq
org.eclipse.rdf4j.sail.shacl.ShaclSailValidationException: Failed SHACL validation
test-cases/or/classValidateTarget/shacl.ttl
org.eclipse.rdf4j.sail.shacl.ShaclSailValidationException: Failed SHACL validation
test-cases/or/classValidateTarget/shacl.ttl
org.eclipse.rdf4j.sail.shacl.ShaclSailValidationException: Failed SHACL validation
test-cases/or/classValidateTarget/invalid/case2/query1.rq
test-cases/or/classValidateTarget/invalid/case2/query2.rq
org.eclipse.rdf4j.sail.shacl.ShaclSailValidationException: Failed SHACL validation
test-cases/or/classValidateTarget/shacl.ttl
org.eclipse.rdf4j.sail.shacl.ShaclSailValidationException: Failed SHACL validation
test-cases/or/classValidateTarget/shacl.ttl
org.eclipse.rdf4j.sail.shacl.ShaclSailValidationException: Failed SHACL validation
test-cases/or/classValidateTarget/invalid/case3/query1.rq
test-cases/or/classValidateTarget/invalid/case3/query2.rq
org.eclipse.rdf4j.sail.shacl.ShaclSailValidationException: Failed SHACL validation
test-cases/or/classValidateTarget/shacl.ttl
org.eclipse.rdf4j.sail.shacl.ShaclSailValidationException: Failed SHACL validation
test-cases/or/classValidateTarget/shacl.ttl
org.eclipse.rdf4j.sail.shacl.ShaclSailValidationException: Failed SHACL validation
test-cases/or/classValidateTarget/invalid/case3/query1.rq
test-cases/or/classValidateTarget/invalid/case3/query2.rq
org.eclipse.rdf4j.sail.shacl.ShaclSailValidationException: Failed SHACL validation
test-cases/or/classValidateTarget/shacl.ttl
org.eclipse.rdf4j.sail.shacl.ShaclSailValidationException: Failed SHACL validation
test-cases/or/classValidateTarget/shacl.ttl
org.eclipse.rdf4j.sail.shacl.ShaclSailValidationException: Failed SHACL validation
test-cases/or/classValidateTarget/invalid/case3/query1.rq
test-cases/or/classValidateTarget/invalid/case3/query2.rq
org.eclipse.rdf4j.sail.shacl.ShaclSailValidationException: Failed SHACL validation
test-cases/or/classValidateTarget/shacl.ttl
org.eclipse.rdf4j.sail.shacl.ShaclSailValidationException: Failed SHACL validation
test-cases/or/datatype/shacl.ttl
test-cases/or/datatype/valid/case1/query1.rq
test-cases/or/datatype/shacl.ttl
test-cases/or/datatype/shacl.ttl
test-cases/or/datatype/valid/case1/query1.rq
test-cases/or/datatype/shacl.ttl
test-cases/or/datatype/shacl.ttl
test-cases/or/datatype/valid/case1/query1.rq
test-cases/or/datatype/shacl.ttl
test-cases/or/datatype/shacl.ttl
org.eclipse.rdf4j.sail.shacl.ShaclSailValidationException: Failed SHACL validation
test-cases/or/datatype/invalid/case1/query1.rq
org.eclipse.rdf4j.sail.shacl.ShaclSailValidationException: Failed SHACL validation
test-cases/or/datatype/shacl.ttl
org.eclipse.rdf4j.sail.shacl.ShaclSailValidationException: Failed SHACL validation
test-cases/or/datatype/shacl.ttl
org.eclipse.rdf4j.sail.shacl.ShaclSailValidationException: Failed SHACL validation
test-cases/or/datatype/invalid/case1/query1.rq
org.eclipse.rdf4j.sail.shacl.ShaclSailValidationException: Failed SHACL validation
test-cases/or/datatype/shacl.ttl
org.eclipse.rdf4j.sail.shacl.ShaclSailValidationException: Failed SHACL validation
test-cases/or/datatype/shacl.ttl
org.eclipse.rdf4j.sail.shacl.ShaclSailValidationException: Failed SHACL validation
test-cases/or/datatype/invalid/case1/query1.rq
org.eclipse.rdf4j.sail.shacl.ShaclSailValidationException: Failed SHACL validation
test-cases/or/datatype/shacl.ttl
org.eclipse.rdf4j.sail.shacl.ShaclSailValidationException: Failed SHACL validation
test-cases/or/datatype2/shacl.ttl
test-cases/or/datatype2/valid/case1/query1.rq
test-cases/or/datatype2/shacl.ttl
test-cases/or/datatype2/shacl.ttl
test-cases/or/datatype2/valid/case1/query1.rq
test-cases/or/datatype2/shacl.ttl
test-cases/or/datatype2/shacl.ttl
test-cases/or/datatype2/valid/case1/query1.rq
test-cases/or/datatype2/shacl.ttl
test-cases/or/datatype2/shacl.ttl
org.eclipse.rdf4j.sail.shacl.ShaclSailValidationException: Failed SHACL validation
test-cases/or/datatype2/invalid/case1/query1.rq
test-cases/or/datatype2/invalid/case1/query2.rq
org.eclipse.rdf4j.sail.shacl.ShaclSailValidationException: Failed SHACL validation
test-cases/or/datatype2/shacl.ttl
org.eclipse.rdf4j.sail.shacl.ShaclSailValidationException: Failed SHACL validation
test-cases/or/datatype2/shacl.ttl
org.eclipse.rdf4j.sail.shacl.ShaclSailValidationException: Failed SHACL validation
test-cases/or/datatype2/invalid/case1/query1.rq
test-cases/or/datatype2/invalid/case1/query2.rq
org.eclipse.rdf4j.sail.shacl.ShaclSailValidationException: Failed SHACL validation
test-cases/or/datatype2/shacl.ttl
org.eclipse.rdf4j.sail.shacl.ShaclSailValidationException: Failed SHACL validation
test-cases/or/datatype2/shacl.ttl
org.eclipse.rdf4j.sail.shacl.ShaclSailValidationException: Failed SHACL validation
test-cases/or/datatype2/invalid/case1/query1.rq
test-cases/or/datatype2/invalid/case1/query2.rq
org.eclipse.rdf4j.sail.shacl.ShaclSailValidationException: Failed SHACL validation
test-cases/or/datatype2/shacl.ttl
org.eclipse.rdf4j.sail.shacl.ShaclSailValidationException: Failed SHACL validation
test-cases/or/datatypeDifferentPaths/shacl.ttl
test-cases/or/datatypeDifferentPaths/valid/case1/query1.rq
test-cases/or/datatypeDifferentPaths/shacl.ttl
test-cases/or/datatypeDifferentPaths/shacl.ttl
test-cases/or/datatypeDifferentPaths/valid/case1/query1.rq
test-cases/or/datatypeDifferentPaths/shacl.ttl
test-cases/or/datatypeDifferentPaths/shacl.ttl
test-cases/or/datatypeDifferentPaths/valid/case1/query1.rq
test-cases/or/datatypeDifferentPaths/shacl.ttl
test-cases/or/datatypeDifferentPaths/shacl.ttl
test-cases/or/datatypeDifferentPaths/valid/case2/query1.rq
test-cases/or/datatypeDifferentPaths/shacl.ttl
test-cases/or/datatypeDifferentPaths/shacl.ttl
test-cases/or/datatypeDifferentPaths/valid/case2/query1.rq
test-cases/or/datatypeDifferentPaths/shacl.ttl
test-cases/or/datatypeDifferentPaths/shacl.ttl
test-cases/or/datatypeDifferentPaths/valid/case2/query1.rq
test-cases/or/datatypeDifferentPaths/shacl.ttl
test-cases/or/datatypeDifferentPaths/shacl.ttl
test-cases/or/datatypeDifferentPaths/valid/case3/query1.rq
test-cases/or/datatypeDifferentPaths/shacl.ttl
test-cases/or/datatypeDifferentPaths/shacl.ttl
test-cases/or/datatypeDifferentPaths/valid/case3/query1.rq
test-cases/or/datatypeDifferentPaths/shacl.ttl
test-cases/or/datatypeDifferentPaths/shacl.ttl
test-cases/or/datatypeDifferentPaths/valid/case3/query1.rq
test-cases/or/datatypeDifferentPaths/shacl.ttl
test-cases/or/datatypeDifferentPaths/shacl.ttl
test-cases/or/datatypeDifferentPaths/valid/case4/query1.rq
test-cases/or/datatypeDifferentPaths/shacl.ttl
test-cases/or/datatypeDifferentPaths/shacl.ttl
test-cases/or/datatypeDifferentPaths/valid/case4/query1.rq
test-cases/or/datatypeDifferentPaths/shacl.ttl
test-cases/or/datatypeDifferentPaths/shacl.ttl
test-cases/or/datatypeDifferentPaths/valid/case4/query1.rq
test-cases/or/datatypeDifferentPaths/shacl.ttl
test-cases/or/datatypeDifferentPaths/shacl.ttl
org.eclipse.rdf4j.sail.shacl.ShaclSailValidationException: Failed SHACL validation
test-cases/or/datatypeDifferentPaths/invalid/case1/query1.rq
org.eclipse.rdf4j.sail.shacl.ShaclSailValidationException: Failed SHACL validation
test-cases/or/datatypeDifferentPaths/shacl.ttl
org.eclipse.rdf4j.sail.shacl.ShaclSailValidationException: Failed SHACL validation
test-cases/or/datatypeDifferentPaths/shacl.ttl
org.eclipse.rdf4j.sail.shacl.ShaclSailValidationException: Failed SHACL validation
test-cases/or/datatypeDifferentPaths/invalid/case1/query1.rq
org.eclipse.rdf4j.sail.shacl.ShaclSailValidationException: Failed SHACL validation
test-cases/or/datatypeDifferentPaths/shacl.ttl
org.eclipse.rdf4j.sail.shacl.ShaclSailValidationException: Failed SHACL validation
test-cases/or/datatypeDifferentPaths/shacl.ttl
org.eclipse.rdf4j.sail.shacl.ShaclSailValidationException: Failed SHACL validation
test-cases/or/datatypeDifferentPaths/invalid/case1/query1.rq
org.eclipse.rdf4j.sail.shacl.ShaclSailValidationException: Failed SHACL validation
test-cases/or/datatypeDifferentPaths/shacl.ttl
org.eclipse.rdf4j.sail.shacl.ShaclSailValidationException: Failed SHACL validation
test-cases/or/datatypeNodeShape/shacl.ttl
test-cases/or/datatypeNodeShape/valid/case1/query1.rq
test-cases/or/datatypeNodeShape/shacl.ttl
test-cases/or/datatypeNodeShape/shacl.ttl
test-cases/or/datatypeNodeShape/valid/case1/query1.rq
test-cases/or/datatypeNodeShape/shacl.ttl
test-cases/or/datatypeNodeShape/shacl.ttl
test-cases/or/datatypeNodeShape/valid/case1/query1.rq
test-cases/or/datatypeNodeShape/shacl.ttl
test-cases/or/datatypeNodeShape/shacl.ttl
org.eclipse.rdf4j.sail.shacl.ShaclSailValidationException: Failed SHACL validation
test-cases/or/datatypeNodeShape/invalid/case1/query1.rq
org.eclipse.rdf4j.sail.shacl.ShaclSailValidationException: Failed SHACL validation
test-cases/or/datatypeNodeShape/shacl.ttl
org.eclipse.rdf4j.sail.shacl.ShaclSailValidationException: Failed SHACL validation
test-cases/or/datatypeNodeShape/shacl.ttl
org.eclipse.rdf4j.sail.shacl.ShaclSailValidationException: Failed SHACL validation
test-cases/or/datatypeNodeShape/invalid/case1/query1.rq
org.eclipse.rdf4j.sail.shacl.ShaclSailValidationException: Failed SHACL validation
test-cases/or/datatypeNodeShape/shacl.ttl
org.eclipse.rdf4j.sail.shacl.ShaclSailValidationException: Failed SHACL validation
test-cases/or/datatypeNodeShape/shacl.ttl
org.eclipse.rdf4j.sail.shacl.ShaclSailValidationException: Failed SHACL validation
test-cases/or/datatypeNodeShape/invalid/case1/query1.rq
org.eclipse.rdf4j.sail.shacl.ShaclSailValidationException: Failed SHACL validation
test-cases/or/datatypeNodeShape/shacl.ttl
org.eclipse.rdf4j.sail.shacl.ShaclSailValidationException: Failed SHACL validation
test-cases/or/datatypeTargetNode/shacl.ttl
test-cases/or/datatypeTargetNode/valid/case1/query1.rq
test-cases/or/datatypeTargetNode/shacl.ttl
test-cases/or/datatypeTargetNode/shacl.ttl
test-cases/or/datatypeTargetNode/valid/case1/query1.rq
test-cases/or/datatypeTargetNode/shacl.ttl
test-cases/or/datatypeTargetNode/shacl.ttl
test-cases/or/datatypeTargetNode/valid/case1/query1.rq
test-cases/or/datatypeTargetNode/shacl.ttl
test-cases/or/datatypeTargetNode/shacl.ttl
org.eclipse.rdf4j.sail.shacl.ShaclSailValidationException: Failed SHACL validation
test-cases/or/datatypeTargetNode/invalid/case1/query1.rq
org.eclipse.rdf4j.sail.shacl.ShaclSailValidationException: Failed SHACL validation
test-cases/or/datatypeTargetNode/shacl.ttl
org.eclipse.rdf4j.sail.shacl.ShaclSailValidationException: Failed SHACL validation
test-cases/or/datatypeTargetNode/shacl.ttl
org.eclipse.rdf4j.sail.shacl.ShaclSailValidationException: Failed SHACL validation
test-cases/or/datatypeTargetNode/invalid/case1/query1.rq
org.eclipse.rdf4j.sail.shacl.ShaclSailValidationException: Failed SHACL validation
test-cases/or/datatypeTargetNode/shacl.ttl
org.eclipse.rdf4j.sail.shacl.ShaclSailValidationException: Failed SHACL validation
test-cases/or/datatypeTargetNode/shacl.ttl
org.eclipse.rdf4j.sail.shacl.ShaclSailValidationException: Failed SHACL validation
test-cases/or/datatypeTargetNode/invalid/case1/query1.rq
org.eclipse.rdf4j.sail.shacl.ShaclSailValidationException: Failed SHACL validation
test-cases/or/datatypeTargetNode/shacl.ttl
org.eclipse.rdf4j.sail.shacl.ShaclSailValidationException: Failed SHACL validation
test-cases/or/implicitAnd/shacl.ttl
test-cases/or/implicitAnd/valid/case1/query1.rq
test-cases/or/implicitAnd/shacl.ttl
test-cases/or/implicitAnd/shacl.ttl
test-cases/or/implicitAnd/valid/case1/query1.rq
test-cases/or/implicitAnd/shacl.ttl
test-cases/or/implicitAnd/shacl.ttl
test-cases/or/implicitAnd/valid/case1/query1.rq
test-cases/or/implicitAnd/shacl.ttl
test-cases/or/implicitAnd/shacl.ttl
test-cases/or/implicitAnd/valid/case2/query1.rq
test-cases/or/implicitAnd/shacl.ttl
test-cases/or/implicitAnd/shacl.ttl
test-cases/or/implicitAnd/valid/case2/query1.rq
test-cases/or/implicitAnd/shacl.ttl
test-cases/or/implicitAnd/shacl.ttl
test-cases/or/implicitAnd/valid/case2/query1.rq
test-cases/or/implicitAnd/shacl.ttl
test-cases/or/implicitAnd/shacl.ttl
org.eclipse.rdf4j.sail.shacl.ShaclSailValidationException: Failed SHACL validation
test-cases/or/implicitAnd/invalid/case1/query1.rq
org.eclipse.rdf4j.sail.shacl.ShaclSailValidationException: Failed SHACL validation
test-cases/or/implicitAnd/shacl.ttl
org.eclipse.rdf4j.sail.shacl.ShaclSailValidationException: Failed SHACL validation
test-cases/or/implicitAnd/shacl.ttl
org.eclipse.rdf4j.sail.shacl.ShaclSailValidationException: Failed SHACL validation
test-cases/or/implicitAnd/invalid/case1/query1.rq
org.eclipse.rdf4j.sail.shacl.ShaclSailValidationException: Failed SHACL validation
test-cases/or/implicitAnd/shacl.ttl
org.eclipse.rdf4j.sail.shacl.ShaclSailValidationException: Failed SHACL validation
test-cases/or/implicitAnd/shacl.ttl
org.eclipse.rdf4j.sail.shacl.ShaclSailValidationException: Failed SHACL validation
test-cases/or/implicitAnd/invalid/case1/query1.rq
org.eclipse.rdf4j.sail.shacl.ShaclSailValidationException: Failed SHACL validation
test-cases/or/implicitAnd/shacl.ttl
org.eclipse.rdf4j.sail.shacl.ShaclSailValidationException: Failed SHACL validation
test-cases/or/implicitAnd/shacl.ttl
org.eclipse.rdf4j.sail.shacl.ShaclSailValidationException: Failed SHACL validation
test-cases/or/implicitAnd/invalid/case2/query1.rq
org.eclipse.rdf4j.sail.shacl.ShaclSailValidationException: Failed SHACL validation
test-cases/or/implicitAnd/shacl.ttl
org.eclipse.rdf4j.sail.shacl.ShaclSailValidationException: Failed SHACL validation
test-cases/or/implicitAnd/shacl.ttl
org.eclipse.rdf4j.sail.shacl.ShaclSailValidationException: Failed SHACL validation
test-cases/or/implicitAnd/invalid/case2/query1.rq
org.eclipse.rdf4j.sail.shacl.ShaclSailValidationException: Failed SHACL validation
test-cases/or/implicitAnd/shacl.ttl
org.eclipse.rdf4j.sail.shacl.ShaclSailValidationException: Failed SHACL validation
test-cases/or/implicitAnd/shacl.ttl
org.eclipse.rdf4j.sail.shacl.ShaclSailValidationException: Failed SHACL validation
test-cases/or/implicitAnd/invalid/case2/query1.rq
org.eclipse.rdf4j.sail.shacl.ShaclSailValidationException: Failed SHACL validation
test-cases/or/implicitAnd/shacl.ttl
org.eclipse.rdf4j.sail.shacl.ShaclSailValidationException: Failed SHACL validation
test-cases/or/inheritance/shacl.ttl
test-cases/or/inheritance/valid/case1/query1.rq
test-cases/or/inheritance/shacl.ttl
test-cases/or/inheritance/shacl.ttl
test-cases/or/inheritance/valid/case1/query1.rq
test-cases/or/inheritance/shacl.ttl
test-cases/or/inheritance/shacl.ttl
test-cases/or/inheritance/valid/case1/query1.rq
test-cases/or/inheritance/shacl.ttl
test-cases/or/inheritance/shacl.ttl
org.eclipse.rdf4j.sail.shacl.ShaclSailValidationException: Failed SHACL validation
test-cases/or/inheritance/invalid/case1/query1.rq
org.eclipse.rdf4j.sail.shacl.ShaclSailValidationException: Failed SHACL validation
test-cases/or/inheritance/shacl.ttl
org.eclipse.rdf4j.sail.shacl.ShaclSailValidationException: Failed SHACL validation
test-cases/or/inheritance/shacl.ttl
org.eclipse.rdf4j.sail.shacl.ShaclSailValidationException: Failed SHACL validation
test-cases/or/inheritance/invalid/case1/query1.rq
org.eclipse.rdf4j.sail.shacl.ShaclSailValidationException: Failed SHACL validation
test-cases/or/inheritance/shacl.ttl
org.eclipse.rdf4j.sail.shacl.ShaclSailValidationException: Failed SHACL validation
test-cases/or/inheritance/shacl.ttl
org.eclipse.rdf4j.sail.shacl.ShaclSailValidationException: Failed SHACL validation
test-cases/or/inheritance/invalid/case1/query1.rq
org.eclipse.rdf4j.sail.shacl.ShaclSailValidationException: Failed SHACL validation
test-cases/or/inheritance/shacl.ttl
org.eclipse.rdf4j.sail.shacl.ShaclSailValidationException: Failed SHACL validation
test-cases/or/inheritance-deep/shacl.ttl
test-cases/or/inheritance-deep/valid/case1/query1.rq
test-cases/or/inheritance-deep/shacl.ttl
test-cases/or/inheritance-deep/shacl.ttl
test-cases/or/inheritance-deep/valid/case1/query1.rq
test-cases/or/inheritance-deep/shacl.ttl
test-cases/or/inheritance-deep/shacl.ttl
test-cases/or/inheritance-deep/valid/case1/query1.rq
test-cases/or/inheritance-deep/shacl.ttl
test-cases/or/inheritance-deep/shacl.ttl
org.eclipse.rdf4j.sail.shacl.ShaclSailValidationException: Failed SHACL validation
test-cases/or/inheritance-deep/invalid/case1/query1.rq
org.eclipse.rdf4j.sail.shacl.ShaclSailValidationException: Failed SHACL validation
test-cases/or/inheritance-deep/shacl.ttl
org.eclipse.rdf4j.sail.shacl.ShaclSailValidationException: Failed SHACL validation
test-cases/or/inheritance-deep/shacl.ttl
org.eclipse.rdf4j.sail.shacl.ShaclSailValidationException: Failed SHACL validation
test-cases/or/inheritance-deep/invalid/case1/query1.rq
org.eclipse.rdf4j.sail.shacl.ShaclSailValidationException: Failed SHACL validation
test-cases/or/inheritance-deep/shacl.ttl
org.eclipse.rdf4j.sail.shacl.ShaclSailValidationException: Failed SHACL validation
test-cases/or/inheritance-deep/shacl.ttl
org.eclipse.rdf4j.sail.shacl.ShaclSailValidationException: Failed SHACL validation
test-cases/or/inheritance-deep/invalid/case1/query1.rq
org.eclipse.rdf4j.sail.shacl.ShaclSailValidationException: Failed SHACL validation
test-cases/or/inheritance-deep/shacl.ttl
org.eclipse.rdf4j.sail.shacl.ShaclSailValidationException: Failed SHACL validation
test-cases/or/inheritanceNodeShape/shacl.ttl
test-cases/or/inheritanceNodeShape/valid/case1/query1.rq
test-cases/or/inheritanceNodeShape/shacl.ttl
test-cases/or/inheritanceNodeShape/shacl.ttl
test-cases/or/inheritanceNodeShape/valid/case1/query1.rq
test-cases/or/inheritanceNodeShape/shacl.ttl
test-cases/or/inheritanceNodeShape/shacl.ttl
test-cases/or/inheritanceNodeShape/valid/case1/query1.rq
test-cases/or/inheritanceNodeShape/shacl.ttl
test-cases/or/inheritanceNodeShape/shacl.ttl
org.eclipse.rdf4j.sail.shacl.ShaclSailValidationException: Failed SHACL validation
test-cases/or/inheritanceNodeShape/invalid/case1/query1.rq
org.eclipse.rdf4j.sail.shacl.ShaclSailValidationException: Failed SHACL validation
test-cases/or/inheritanceNodeShape/shacl.ttl
org.eclipse.rdf4j.sail.shacl.ShaclSailValidationException: Failed SHACL validation
test-cases/or/inheritanceNodeShape/shacl.ttl
org.eclipse.rdf4j.sail.shacl.ShaclSailValidationException: Failed SHACL validation
test-cases/or/inheritanceNodeShape/invalid/case1/query1.rq
org.eclipse.rdf4j.sail.shacl.ShaclSailValidationException: Failed SHACL validation
test-cases/or/inheritanceNodeShape/shacl.ttl
org.eclipse.rdf4j.sail.shacl.ShaclSailValidationException: Failed SHACL validation
test-cases/or/inheritanceNodeShape/shacl.ttl
org.eclipse.rdf4j.sail.shacl.ShaclSailValidationException: Failed SHACL validation
test-cases/or/inheritanceNodeShape/invalid/case1/query1.rq
org.eclipse.rdf4j.sail.shacl.ShaclSailValidationException: Failed SHACL validation
test-cases/or/inheritanceNodeShape/shacl.ttl
org.eclipse.rdf4j.sail.shacl.ShaclSailValidationException: Failed SHACL validation
test-cases/or/maxCount/shacl.ttl
test-cases/or/maxCount/valid/case1/query1.rq
test-cases/or/maxCount/shacl.ttl
test-cases/or/maxCount/shacl.ttl
test-cases/or/maxCount/valid/case1/query1.rq
test-cases/or/maxCount/shacl.ttl
test-cases/or/maxCount/shacl.ttl
test-cases/or/maxCount/valid/case1/query1.rq
test-cases/or/maxCount/shacl.ttl
test-cases/or/maxCount/shacl.ttl
test-cases/or/maxCount/valid/case2/query1.rq
test-cases/or/maxCount/valid/case2/query2.rq
test-cases/or/maxCount/shacl.ttl
test-cases/or/maxCount/shacl.ttl
test-cases/or/maxCount/valid/case2/query1.rq
test-cases/or/maxCount/valid/case2/query2.rq
test-cases/or/maxCount/shacl.ttl
test-cases/or/maxCount/shacl.ttl
test-cases/or/maxCount/valid/case2/query1.rq
test-cases/or/maxCount/valid/case2/query2.rq
test-cases/or/maxCount/shacl.ttl
test-cases/or/maxCount/shacl.ttl
test-cases/or/maxCount/valid/case3/query1.rq
test-cases/or/maxCount/valid/case3/query2.rq
test-cases/or/maxCount/valid/case3/query3.rq
test-cases/or/maxCount/shacl.ttl
test-cases/or/maxCount/shacl.ttl
test-cases/or/maxCount/valid/case3/query1.rq
test-cases/or/maxCount/valid/case3/query2.rq
test-cases/or/maxCount/valid/case3/query3.rq
test-cases/or/maxCount/shacl.ttl
test-cases/or/maxCount/shacl.ttl
test-cases/or/maxCount/valid/case3/query1.rq
test-cases/or/maxCount/valid/case3/query2.rq
test-cases/or/maxCount/valid/case3/query3.rq
test-cases/or/maxCount/shacl.ttl
test-cases/or/maxCount/shacl.ttl
org.eclipse.rdf4j.sail.shacl.ShaclSailValidationException: Failed SHACL validation
test-cases/or/maxCount/invalid/case1/query1.rq
org.eclipse.rdf4j.sail.shacl.ShaclSailValidationException: Failed SHACL validation
test-cases/or/maxCount/shacl.ttl
org.eclipse.rdf4j.sail.shacl.ShaclSailValidationException: Failed SHACL validation
test-cases/or/maxCount/shacl.ttl
org.eclipse.rdf4j.sail.shacl.ShaclSailValidationException: Failed SHACL validation
test-cases/or/maxCount/invalid/case1/query1.rq
org.eclipse.rdf4j.sail.shacl.ShaclSailValidationException: Failed SHACL validation
test-cases/or/maxCount/shacl.ttl
org.eclipse.rdf4j.sail.shacl.ShaclSailValidationException: Failed SHACL validation
test-cases/or/maxCount/shacl.ttl
org.eclipse.rdf4j.sail.shacl.ShaclSailValidationException: Failed SHACL validation
test-cases/or/maxCount/invalid/case1/query1.rq
org.eclipse.rdf4j.sail.shacl.ShaclSailValidationException: Failed SHACL validation
test-cases/or/maxCount/shacl.ttl
org.eclipse.rdf4j.sail.shacl.ShaclSailValidationException: Failed SHACL validation
test-cases/or/maxCount/shacl.ttl
org.eclipse.rdf4j.sail.shacl.ShaclSailValidationException: Failed SHACL validation
test-cases/or/maxCount/invalid/case2/query1.rq
test-cases/or/maxCount/invalid/case2/query2.rq
org.eclipse.rdf4j.sail.shacl.ShaclSailValidationException: Failed SHACL validation
test-cases/or/maxCount/shacl.ttl
org.eclipse.rdf4j.sail.shacl.ShaclSailValidationException: Failed SHACL validation
test-cases/or/maxCount/shacl.ttl
org.eclipse.rdf4j.sail.shacl.ShaclSailValidationException: Failed SHACL validation
test-cases/or/maxCount/invalid/case2/query1.rq
test-cases/or/maxCount/invalid/case2/query2.rq
org.eclipse.rdf4j.sail.shacl.ShaclSailValidationException: Failed SHACL validation
test-cases/or/maxCount/shacl.ttl
org.eclipse.rdf4j.sail.shacl.ShaclSailValidationException: Failed SHACL validation
test-cases/or/maxCount/shacl.ttl
org.eclipse.rdf4j.sail.shacl.ShaclSailValidationException: Failed SHACL validation
test-cases/or/maxCount/invalid/case2/query1.rq
test-cases/or/maxCount/invalid/case2/query2.rq
org.eclipse.rdf4j.sail.shacl.ShaclSailValidationException: Failed SHACL validation
test-cases/or/maxCount/shacl.ttl
org.eclipse.rdf4j.sail.shacl.ShaclSailValidationException: Failed SHACL validation
test-cases/or/maxCount/shacl.ttl
org.eclipse.rdf4j.sail.shacl.ShaclSailValidationException: Failed SHACL validation
test-cases/or/maxCount/invalid/case3/query1.rq
test-cases/or/maxCount/invalid/case3/query2.rq
test-cases/or/maxCount/invalid/case3/query3.rq
org.eclipse.rdf4j.sail.shacl.ShaclSailValidationException: Failed SHACL validation
test-cases/or/maxCount/shacl.ttl
org.eclipse.rdf4j.sail.shacl.ShaclSailValidationException: Failed SHACL validation
test-cases/or/maxCount/shacl.ttl
org.eclipse.rdf4j.sail.shacl.ShaclSailValidationException: Failed SHACL validation
test-cases/or/maxCount/invalid/case3/query1.rq
test-cases/or/maxCount/invalid/case3/query2.rq
test-cases/or/maxCount/invalid/case3/query3.rq
org.eclipse.rdf4j.sail.shacl.ShaclSailValidationException: Failed SHACL validation
test-cases/or/maxCount/shacl.ttl
org.eclipse.rdf4j.sail.shacl.ShaclSailValidationException: Failed SHACL validation
test-cases/or/maxCount/shacl.ttl
org.eclipse.rdf4j.sail.shacl.ShaclSailValidationException: Failed SHACL validation
test-cases/or/maxCount/invalid/case3/query1.rq
test-cases/or/maxCount/invalid/case3/query2.rq
test-cases/or/maxCount/invalid/case3/query3.rq
org.eclipse.rdf4j.sail.shacl.ShaclSailValidationException: Failed SHACL validation
test-cases/or/maxCount/shacl.ttl
org.eclipse.rdf4j.sail.shacl.ShaclSailValidationException: Failed SHACL validation
test-cases/or/minCount/shacl.ttl
test-cases/or/minCount/valid/case1/query1.rq
test-cases/or/minCount/shacl.ttl
test-cases/or/minCount/shacl.ttl
test-cases/or/minCount/valid/case1/query1.rq
test-cases/or/minCount/shacl.ttl
test-cases/or/minCount/shacl.ttl
test-cases/or/minCount/valid/case1/query1.rq
test-cases/or/minCount/shacl.ttl
test-cases/or/minCount/shacl.ttl
test-cases/or/minCount/valid/case2/query1.rq
test-cases/or/minCount/valid/case2/query2.rq
test-cases/or/minCount/shacl.ttl
test-cases/or/minCount/shacl.ttl
test-cases/or/minCount/valid/case2/query1.rq
test-cases/or/minCount/valid/case2/query2.rq
test-cases/or/minCount/shacl.ttl
test-cases/or/minCount/shacl.ttl
test-cases/or/minCount/valid/case2/query1.rq
test-cases/or/minCount/valid/case2/query2.rq
test-cases/or/minCount/shacl.ttl
test-cases/or/minCount/shacl.ttl
test-cases/or/minCount/valid/case3/query1.rq
test-cases/or/minCount/valid/case3/query2.rq
test-cases/or/minCount/shacl.ttl
test-cases/or/minCount/shacl.ttl
test-cases/or/minCount/valid/case3/query1.rq
test-cases/or/minCount/valid/case3/query2.rq
test-cases/or/minCount/shacl.ttl
test-cases/or/minCount/shacl.ttl
test-cases/or/minCount/valid/case3/query1.rq
test-cases/or/minCount/valid/case3/query2.rq
test-cases/or/minCount/shacl.ttl
test-cases/or/minCount/shacl.ttl
test-cases/or/minCount/valid/case4/query1.rq
test-cases/or/minCount/valid/case4/query2.rq
test-cases/or/minCount/valid/case4/query3.rq
test-cases/or/minCount/shacl.ttl
test-cases/or/minCount/shacl.ttl
test-cases/or/minCount/valid/case4/query1.rq
test-cases/or/minCount/valid/case4/query2.rq
test-cases/or/minCount/valid/case4/query3.rq
test-cases/or/minCount/shacl.ttl
test-cases/or/minCount/shacl.ttl
test-cases/or/minCount/valid/case4/query1.rq
test-cases/or/minCount/valid/case4/query2.rq
test-cases/or/minCount/valid/case4/query3.rq
test-cases/or/minCount/shacl.ttl
test-cases/or/minCount/shacl.ttl
org.eclipse.rdf4j.sail.shacl.ShaclSailValidationException: Failed SHACL validation
test-cases/or/minCount/invalid/case1/query1.rq
org.eclipse.rdf4j.sail.shacl.ShaclSailValidationException: Failed SHACL validation
test-cases/or/minCount/shacl.ttl
org.eclipse.rdf4j.sail.shacl.ShaclSailValidationException: Failed SHACL validation
test-cases/or/minCount/shacl.ttl
org.eclipse.rdf4j.sail.shacl.ShaclSailValidationException: Failed SHACL validation
test-cases/or/minCount/invalid/case1/query1.rq
org.eclipse.rdf4j.sail.shacl.ShaclSailValidationException: Failed SHACL validation
test-cases/or/minCount/shacl.ttl
org.eclipse.rdf4j.sail.shacl.ShaclSailValidationException: Failed SHACL validation
test-cases/or/minCount/shacl.ttl
org.eclipse.rdf4j.sail.shacl.ShaclSailValidationException: Failed SHACL validation
test-cases/or/minCount/invalid/case1/query1.rq
org.eclipse.rdf4j.sail.shacl.ShaclSailValidationException: Failed SHACL validation
test-cases/or/minCount/shacl.ttl
org.eclipse.rdf4j.sail.shacl.ShaclSailValidationException: Failed SHACL validation
test-cases/or/minCount/shacl.ttl
org.eclipse.rdf4j.sail.shacl.ShaclSailValidationException: Failed SHACL validation
test-cases/or/minCount/invalid/case2/query1.rq
test-cases/or/minCount/invalid/case2/query2.rq
org.eclipse.rdf4j.sail.shacl.ShaclSailValidationException: Failed SHACL validation
test-cases/or/minCount/shacl.ttl
org.eclipse.rdf4j.sail.shacl.ShaclSailValidationException: Failed SHACL validation
test-cases/or/minCount/shacl.ttl
org.eclipse.rdf4j.sail.shacl.ShaclSailValidationException: Failed SHACL validation
test-cases/or/minCount/invalid/case2/query1.rq
test-cases/or/minCount/invalid/case2/query2.rq
org.eclipse.rdf4j.sail.shacl.ShaclSailValidationException: Failed SHACL validation
test-cases/or/minCount/shacl.ttl
org.eclipse.rdf4j.sail.shacl.ShaclSailValidationException: Failed SHACL validation
test-cases/or/minCount/shacl.ttl
org.eclipse.rdf4j.sail.shacl.ShaclSailValidationException: Failed SHACL validation
test-cases/or/minCount/invalid/case2/query1.rq
test-cases/or/minCount/invalid/case2/query2.rq
org.eclipse.rdf4j.sail.shacl.ShaclSailValidationException: Failed SHACL validation
test-cases/or/minCount/shacl.ttl
org.eclipse.rdf4j.sail.shacl.ShaclSailValidationException: Failed SHACL validation
test-cases/or/minCount/shacl.ttl
org.eclipse.rdf4j.sail.shacl.ShaclSailValidationException: Failed SHACL validation
test-cases/or/minCount/invalid/case3/query1.rq
test-cases/or/minCount/invalid/case3/query2.rq
org.eclipse.rdf4j.sail.shacl.ShaclSailValidationException: Failed SHACL validation
test-cases/or/minCount/shacl.ttl
org.eclipse.rdf4j.sail.shacl.ShaclSailValidationException: Failed SHACL validation
test-cases/or/minCount/shacl.ttl
org.eclipse.rdf4j.sail.shacl.ShaclSailValidationException: Failed SHACL validation
test-cases/or/minCount/invalid/case3/query1.rq
test-cases/or/minCount/invalid/case3/query2.rq
org.eclipse.rdf4j.sail.shacl.ShaclSailValidationException: Failed SHACL validation
test-cases/or/minCount/shacl.ttl
org.eclipse.rdf4j.sail.shacl.ShaclSailValidationException: Failed SHACL validation
test-cases/or/minCount/shacl.ttl
org.eclipse.rdf4j.sail.shacl.ShaclSailValidationException: Failed SHACL validation
test-cases/or/minCount/invalid/case3/query1.rq
test-cases/or/minCount/invalid/case3/query2.rq
org.eclipse.rdf4j.sail.shacl.ShaclSailValidationException: Failed SHACL validation
test-cases/or/minCount/shacl.ttl
org.eclipse.rdf4j.sail.shacl.ShaclSailValidationException: Failed SHACL validation
test-cases/or/minCount/shacl.ttl
org.eclipse.rdf4j.sail.shacl.ShaclSailValidationException: Failed SHACL validation
test-cases/or/minCount/invalid/case4/query1.rq
test-cases/or/minCount/invalid/case4/query2.rq
test-cases/or/minCount/invalid/case4/query3.rq
org.eclipse.rdf4j.sail.shacl.ShaclSailValidationException: Failed SHACL validation
test-cases/or/minCount/shacl.ttl
org.eclipse.rdf4j.sail.shacl.ShaclSailValidationException: Failed SHACL validation
test-cases/or/minCount/shacl.ttl
org.eclipse.rdf4j.sail.shacl.ShaclSailValidationException: Failed SHACL validation
test-cases/or/minCount/invalid/case4/query1.rq
test-cases/or/minCount/invalid/case4/query2.rq
test-cases/or/minCount/invalid/case4/query3.rq
org.eclipse.rdf4j.sail.shacl.ShaclSailValidationException: Failed SHACL validation
test-cases/or/minCount/shacl.ttl
org.eclipse.rdf4j.sail.shacl.ShaclSailValidationException: Failed SHACL validation
test-cases/or/minCount/shacl.ttl
org.eclipse.rdf4j.sail.shacl.ShaclSailValidationException: Failed SHACL validation
test-cases/or/minCount/invalid/case4/query1.rq
test-cases/or/minCount/invalid/case4/query2.rq
test-cases/or/minCount/invalid/case4/query3.rq
org.eclipse.rdf4j.sail.shacl.ShaclSailValidationException: Failed SHACL validation
test-cases/or/minCount/shacl.ttl
org.eclipse.rdf4j.sail.shacl.ShaclSailValidationException: Failed SHACL validation
test-cases/or/minCountDifferentPath/shacl.ttl
test-cases/or/minCountDifferentPath/valid/case1/query1.rq
test-cases/or/minCountDifferentPath/shacl.ttl
test-cases/or/minCountDifferentPath/shacl.ttl
test-cases/or/minCountDifferentPath/valid/case1/query1.rq
test-cases/or/minCountDifferentPath/shacl.ttl
test-cases/or/minCountDifferentPath/shacl.ttl
test-cases/or/minCountDifferentPath/valid/case1/query1.rq
test-cases/or/minCountDifferentPath/shacl.ttl
test-cases/or/minCountDifferentPath/shacl.ttl
test-cases/or/minCountDifferentPath/valid/case2/query1.rq
test-cases/or/minCountDifferentPath/valid/case2/query2.rq
test-cases/or/minCountDifferentPath/shacl.ttl
test-cases/or/minCountDifferentPath/shacl.ttl
test-cases/or/minCountDifferentPath/valid/case2/query1.rq
test-cases/or/minCountDifferentPath/valid/case2/query2.rq
test-cases/or/minCountDifferentPath/shacl.ttl
test-cases/or/minCountDifferentPath/shacl.ttl
test-cases/or/minCountDifferentPath/valid/case2/query1.rq
test-cases/or/minCountDifferentPath/valid/case2/query2.rq
test-cases/or/minCountDifferentPath/shacl.ttl
test-cases/or/minCountDifferentPath/shacl.ttl
test-cases/or/minCountDifferentPath/valid/case3/query1.rq
test-cases/or/minCountDifferentPath/shacl.ttl
test-cases/or/minCountDifferentPath/shacl.ttl
test-cases/or/minCountDifferentPath/valid/case3/query1.rq
test-cases/or/minCountDifferentPath/shacl.ttl
test-cases/or/minCountDifferentPath/shacl.ttl
test-cases/or/minCountDifferentPath/valid/case3/query1.rq
test-cases/or/minCountDifferentPath/shacl.ttl
test-cases/or/minCountDifferentPath/shacl.ttl
test-cases/or/minCountDifferentPath/valid/case4/query1.rq
test-cases/or/minCountDifferentPath/shacl.ttl
test-cases/or/minCountDifferentPath/shacl.ttl
test-cases/or/minCountDifferentPath/valid/case4/query1.rq
test-cases/or/minCountDifferentPath/shacl.ttl
test-cases/or/minCountDifferentPath/shacl.ttl
test-cases/or/minCountDifferentPath/valid/case4/query1.rq
test-cases/or/minCountDifferentPath/shacl.ttl
test-cases/or/minCountDifferentPath/shacl.ttl
test-cases/or/minCountDifferentPath/valid/case5/query1.rq
test-cases/or/minCountDifferentPath/shacl.ttl
test-cases/or/minCountDifferentPath/shacl.ttl
test-cases/or/minCountDifferentPath/valid/case5/query1.rq
test-cases/or/minCountDifferentPath/shacl.ttl
test-cases/or/minCountDifferentPath/shacl.ttl
test-cases/or/minCountDifferentPath/valid/case5/query1.rq
test-cases/or/minCountDifferentPath/shacl.ttl
test-cases/or/minCountDifferentPath/shacl.ttl
org.eclipse.rdf4j.sail.shacl.ShaclSailValidationException: Failed SHACL validation
test-cases/or/minCountDifferentPath/invalid/case1/query1.rq
org.eclipse.rdf4j.sail.shacl.ShaclSailValidationException: Failed SHACL validation
test-cases/or/minCountDifferentPath/shacl.ttl
org.eclipse.rdf4j.sail.shacl.ShaclSailValidationException: Failed SHACL validation
test-cases/or/minCountDifferentPath/shacl.ttl
org.eclipse.rdf4j.sail.shacl.ShaclSailValidationException: Failed SHACL validation
test-cases/or/minCountDifferentPath/invalid/case1/query1.rq
org.eclipse.rdf4j.sail.shacl.ShaclSailValidationException: Failed SHACL validation
test-cases/or/minCountDifferentPath/shacl.ttl
org.eclipse.rdf4j.sail.shacl.ShaclSailValidationException: Failed SHACL validation
test-cases/or/minCountDifferentPath/shacl.ttl
org.eclipse.rdf4j.sail.shacl.ShaclSailValidationException: Failed SHACL validation
test-cases/or/minCountDifferentPath/invalid/case1/query1.rq
org.eclipse.rdf4j.sail.shacl.ShaclSailValidationException: Failed SHACL validation
test-cases/or/minCountDifferentPath/shacl.ttl
org.eclipse.rdf4j.sail.shacl.ShaclSailValidationException: Failed SHACL validation
test-cases/or/minCountDifferentPath/shacl.ttl
org.eclipse.rdf4j.sail.shacl.ShaclSailValidationException: Failed SHACL validation
test-cases/or/minCountDifferentPath/invalid/case2/query1.rq
test-cases/or/minCountDifferentPath/invalid/case2/query2.rq
org.eclipse.rdf4j.sail.shacl.ShaclSailValidationException: Failed SHACL validation
test-cases/or/minCountDifferentPath/shacl.ttl
org.eclipse.rdf4j.sail.shacl.ShaclSailValidationException: Failed SHACL validation
test-cases/or/minCountDifferentPath/shacl.ttl
org.eclipse.rdf4j.sail.shacl.ShaclSailValidationException: Failed SHACL validation
test-cases/or/minCountDifferentPath/invalid/case2/query1.rq
test-cases/or/minCountDifferentPath/invalid/case2/query2.rq
org.eclipse.rdf4j.sail.shacl.ShaclSailValidationException: Failed SHACL validation
test-cases/or/minCountDifferentPath/shacl.ttl
org.eclipse.rdf4j.sail.shacl.ShaclSailValidationException: Failed SHACL validation
test-cases/or/minCountDifferentPath/shacl.ttl
org.eclipse.rdf4j.sail.shacl.ShaclSailValidationException: Failed SHACL validation
test-cases/or/minCountDifferentPath/invalid/case2/query1.rq
test-cases/or/minCountDifferentPath/invalid/case2/query2.rq
org.eclipse.rdf4j.sail.shacl.ShaclSailValidationException: Failed SHACL validation
test-cases/or/minCountDifferentPath/shacl.ttl
org.eclipse.rdf4j.sail.shacl.ShaclSailValidationException: Failed SHACL validation
test-cases/or/minCountDifferentPath/shacl.ttl
org.eclipse.rdf4j.sail.shacl.ShaclSailValidationException: Failed SHACL validation
test-cases/or/minCountDifferentPath/invalid/case3/query1.rq
test-cases/or/minCountDifferentPath/invalid/case3/query2.rq
org.eclipse.rdf4j.sail.shacl.ShaclSailValidationException: Failed SHACL validation
test-cases/or/minCountDifferentPath/shacl.ttl
org.eclipse.rdf4j.sail.shacl.ShaclSailValidationException: Failed SHACL validation
test-cases/or/minCountDifferentPath/shacl.ttl
org.eclipse.rdf4j.sail.shacl.ShaclSailValidationException: Failed SHACL validation
test-cases/or/minCountDifferentPath/invalid/case3/query1.rq
test-cases/or/minCountDifferentPath/invalid/case3/query2.rq
org.eclipse.rdf4j.sail.shacl.ShaclSailValidationException: Failed SHACL validation
test-cases/or/minCountDifferentPath/shacl.ttl
org.eclipse.rdf4j.sail.shacl.ShaclSailValidationException: Failed SHACL validation
test-cases/or/minCountDifferentPath/shacl.ttl
org.eclipse.rdf4j.sail.shacl.ShaclSailValidationException: Failed SHACL validation
test-cases/or/minCountDifferentPath/invalid/case3/query1.rq
test-cases/or/minCountDifferentPath/invalid/case3/query2.rq
org.eclipse.rdf4j.sail.shacl.ShaclSailValidationException: Failed SHACL validation
test-cases/or/minCountDifferentPath/shacl.ttl
org.eclipse.rdf4j.sail.shacl.ShaclSailValidationException: Failed SHACL validation
test-cases/or/minCountMaxCount/shacl.ttl
test-cases/or/minCountMaxCount/valid/case1/query1.rq
test-cases/or/minCountMaxCount/shacl.ttl
test-cases/or/minCountMaxCount/shacl.ttl
test-cases/or/minCountMaxCount/valid/case1/query1.rq
test-cases/or/minCountMaxCount/shacl.ttl
test-cases/or/minCountMaxCount/shacl.ttl
test-cases/or/minCountMaxCount/valid/case1/query1.rq
test-cases/or/minCountMaxCount/shacl.ttl
test-cases/or/minCountMaxCount/shacl.ttl
test-cases/or/minCountMaxCount/valid/case2/query1.rq
test-cases/or/minCountMaxCount/valid/case2/query2.rq
test-cases/or/minCountMaxCount/shacl.ttl
test-cases/or/minCountMaxCount/shacl.ttl
test-cases/or/minCountMaxCount/valid/case2/query1.rq
test-cases/or/minCountMaxCount/valid/case2/query2.rq
test-cases/or/minCountMaxCount/shacl.ttl
test-cases/or/minCountMaxCount/shacl.ttl
test-cases/or/minCountMaxCount/valid/case2/query1.rq
test-cases/or/minCountMaxCount/valid/case2/query2.rq
test-cases/or/minCountMaxCount/shacl.ttl
test-cases/or/minCountMaxCount/shacl.ttl
test-cases/or/minCountMaxCount/valid/case3/query1.rq
test-cases/or/minCountMaxCount/valid/case3/query2.rq
test-cases/or/minCountMaxCount/valid/case3/query3.rq
test-cases/or/minCountMaxCount/valid/case3/query4.rq
test-cases/or/minCountMaxCount/shacl.ttl
test-cases/or/minCountMaxCount/shacl.ttl
test-cases/or/minCountMaxCount/valid/case3/query1.rq
test-cases/or/minCountMaxCount/valid/case3/query2.rq
test-cases/or/minCountMaxCount/valid/case3/query3.rq
test-cases/or/minCountMaxCount/valid/case3/query4.rq
test-cases/or/minCountMaxCount/shacl.ttl
test-cases/or/minCountMaxCount/shacl.ttl
test-cases/or/minCountMaxCount/valid/case3/query1.rq
test-cases/or/minCountMaxCount/valid/case3/query2.rq
test-cases/or/minCountMaxCount/valid/case3/query3.rq
test-cases/or/minCountMaxCount/valid/case3/query4.rq
test-cases/or/minCountMaxCount/shacl.ttl
test-cases/or/minCountMaxCount/shacl.ttl
org.eclipse.rdf4j.sail.shacl.ShaclSailValidationException: Failed SHACL validation
test-cases/or/minCountMaxCount/invalid/case1/query1.rq
org.eclipse.rdf4j.sail.shacl.ShaclSailValidationException: Failed SHACL validation
test-cases/or/minCountMaxCount/shacl.ttl
org.eclipse.rdf4j.sail.shacl.ShaclSailValidationException: Failed SHACL validation
test-cases/or/minCountMaxCount/shacl.ttl
org.eclipse.rdf4j.sail.shacl.ShaclSailValidationException: Failed SHACL validation
test-cases/or/minCountMaxCount/invalid/case1/query1.rq
org.eclipse.rdf4j.sail.shacl.ShaclSailValidationException: Failed SHACL validation
test-cases/or/minCountMaxCount/shacl.ttl
org.eclipse.rdf4j.sail.shacl.ShaclSailValidationException: Failed SHACL validation
test-cases/or/minCountMaxCount/shacl.ttl
org.eclipse.rdf4j.sail.shacl.ShaclSailValidationException: Failed SHACL validation
test-cases/or/minCountMaxCount/invalid/case1/query1.rq
org.eclipse.rdf4j.sail.shacl.ShaclSailValidationException: Failed SHACL validation
test-cases/or/minCountMaxCount/shacl.ttl
org.eclipse.rdf4j.sail.shacl.ShaclSailValidationException: Failed SHACL validation
test-cases/or/minCountMaxCount/shacl.ttl
org.eclipse.rdf4j.sail.shacl.ShaclSailValidationException: Failed SHACL validation
test-cases/or/minCountMaxCount/invalid/case2/query1.rq
test-cases/or/minCountMaxCount/invalid/case2/query2.rq
org.eclipse.rdf4j.sail.shacl.ShaclSailValidationException: Failed SHACL validation
test-cases/or/minCountMaxCount/shacl.ttl
org.eclipse.rdf4j.sail.shacl.ShaclSailValidationException: Failed SHACL validation
test-cases/or/minCountMaxCount/shacl.ttl
org.eclipse.rdf4j.sail.shacl.ShaclSailValidationException: Failed SHACL validation
test-cases/or/minCountMaxCount/invalid/case2/query1.rq
test-cases/or/minCountMaxCount/invalid/case2/query2.rq
org.eclipse.rdf4j.sail.shacl.ShaclSailValidationException: Failed SHACL validation
test-cases/or/minCountMaxCount/shacl.ttl
org.eclipse.rdf4j.sail.shacl.ShaclSailValidationException: Failed SHACL validation
test-cases/or/minCountMaxCount/shacl.ttl
org.eclipse.rdf4j.sail.shacl.ShaclSailValidationException: Failed SHACL validation
test-cases/or/minCountMaxCount/invalid/case2/query1.rq
test-cases/or/minCountMaxCount/invalid/case2/query2.rq
org.eclipse.rdf4j.sail.shacl.ShaclSailValidationException: Failed SHACL validation
test-cases/or/minCountMaxCount/shacl.ttl
org.eclipse.rdf4j.sail.shacl.ShaclSailValidationException: Failed SHACL validation
test-cases/or/minCountMaxCount/shacl.ttl
org.eclipse.rdf4j.sail.shacl.ShaclSailValidationException: Failed SHACL validation
test-cases/or/minCountMaxCount/invalid/case3/query1.rq
test-cases/or/minCountMaxCount/invalid/case3/query2.rq
org.eclipse.rdf4j.sail.shacl.ShaclSailValidationException: Failed SHACL validation
test-cases/or/minCountMaxCount/shacl.ttl
org.eclipse.rdf4j.sail.shacl.ShaclSailValidationException: Failed SHACL validation
test-cases/or/minCountMaxCount/shacl.ttl
org.eclipse.rdf4j.sail.shacl.ShaclSailValidationException: Failed SHACL validation
test-cases/or/minCountMaxCount/invalid/case3/query1.rq
test-cases/or/minCountMaxCount/invalid/case3/query2.rq
org.eclipse.rdf4j.sail.shacl.ShaclSailValidationException: Failed SHACL validation
test-cases/or/minCountMaxCount/shacl.ttl
org.eclipse.rdf4j.sail.shacl.ShaclSailValidationException: Failed SHACL validation
test-cases/or/minCountMaxCount/shacl.ttl
org.eclipse.rdf4j.sail.shacl.ShaclSailValidationException: Failed SHACL validation
test-cases/or/minCountMaxCount/invalid/case3/query1.rq
test-cases/or/minCountMaxCount/invalid/case3/query2.rq
org.eclipse.rdf4j.sail.shacl.ShaclSailValidationException: Failed SHACL validation
test-cases/or/minCountMaxCount/shacl.ttl
org.eclipse.rdf4j.sail.shacl.ShaclSailValidationException: Failed SHACL validation
test-cases/or/minCountMaxCount/shacl.ttl
org.eclipse.rdf4j.sail.shacl.ShaclSailValidationException: Failed SHACL validation
test-cases/or/minCountMaxCount/invalid/case4/query1.rq
test-cases/or/minCountMaxCount/invalid/case4/query2.rq
org.eclipse.rdf4j.sail.shacl.ShaclSailValidationException: Failed SHACL validation
test-cases/or/minCountMaxCount/shacl.ttl
org.eclipse.rdf4j.sail.shacl.ShaclSailValidationException: Failed SHACL validation
test-cases/or/minCountMaxCount/shacl.ttl
org.eclipse.rdf4j.sail.shacl.ShaclSailValidationException: Failed SHACL validation
test-cases/or/minCountMaxCount/invalid/case4/query1.rq
test-cases/or/minCountMaxCount/invalid/case4/query2.rq
org.eclipse.rdf4j.sail.shacl.ShaclSailValidationException: Failed SHACL validation
test-cases/or/minCountMaxCount/shacl.ttl
org.eclipse.rdf4j.sail.shacl.ShaclSailValidationException: Failed SHACL validation
test-cases/or/minCountMaxCount/shacl.ttl
org.eclipse.rdf4j.sail.shacl.ShaclSailValidationException: Failed SHACL validation
test-cases/or/minCountMaxCount/invalid/case4/query1.rq
test-cases/or/minCountMaxCount/invalid/case4/query2.rq
org.eclipse.rdf4j.sail.shacl.ShaclSailValidationException: Failed SHACL validation
test-cases/or/minCountMaxCount/shacl.ttl
org.eclipse.rdf4j.sail.shacl.ShaclSailValidationException: Failed SHACL validation
test-cases/or/multiple/shacl.ttl
test-cases/or/multiple/valid/case1/query1.rq
test-cases/or/multiple/shacl.ttl
test-cases/or/multiple/shacl.ttl
test-cases/or/multiple/valid/case1/query1.rq
test-cases/or/multiple/shacl.ttl
test-cases/or/multiple/shacl.ttl
test-cases/or/multiple/valid/case1/query1.rq
test-cases/or/multiple/shacl.ttl
test-cases/or/multiple/shacl.ttl
org.eclipse.rdf4j.sail.shacl.ShaclSailValidationException: Failed SHACL validation
test-cases/or/multiple/invalid/case1/query1.rq
org.eclipse.rdf4j.sail.shacl.ShaclSailValidationException: Failed SHACL validation
test-cases/or/multiple/shacl.ttl
org.eclipse.rdf4j.sail.shacl.ShaclSailValidationException: Failed SHACL validation
test-cases/or/multiple/shacl.ttl
org.eclipse.rdf4j.sail.shacl.ShaclSailValidationException: Failed SHACL validation
test-cases/or/multiple/invalid/case1/query1.rq
org.eclipse.rdf4j.sail.shacl.ShaclSailValidationException: Failed SHACL validation
test-cases/or/multiple/shacl.ttl
org.eclipse.rdf4j.sail.shacl.ShaclSailValidationException: Failed SHACL validation
test-cases/or/multiple/shacl.ttl
org.eclipse.rdf4j.sail.shacl.ShaclSailValidationException: Failed SHACL validation
test-cases/or/multiple/invalid/case1/query1.rq
org.eclipse.rdf4j.sail.shacl.ShaclSailValidationException: Failed SHACL validation
test-cases/or/multiple/shacl.ttl
org.eclipse.rdf4j.sail.shacl.ShaclSailValidationException: Failed SHACL validation
test-cases/or/nodeKindMinLength/shacl.ttl
test-cases/or/nodeKindMinLength/valid/case1/query1.rq
test-cases/or/nodeKindMinLength/shacl.ttl
test-cases/or/nodeKindMinLength/shacl.ttl
test-cases/or/nodeKindMinLength/valid/case1/query1.rq
test-cases/or/nodeKindMinLength/shacl.ttl
test-cases/or/nodeKindMinLength/shacl.ttl
test-cases/or/nodeKindMinLength/valid/case1/query1.rq
test-cases/or/nodeKindMinLength/shacl.ttl
test-cases/or/nodeKindMinLength/shacl.ttl
test-cases/or/nodeKindMinLength/valid/case2/query1.rq
test-cases/or/nodeKindMinLength/valid/case2/query2.rq
test-cases/or/nodeKindMinLength/shacl.ttl
test-cases/or/nodeKindMinLength/shacl.ttl
test-cases/or/nodeKindMinLength/valid/case2/query1.rq
test-cases/or/nodeKindMinLength/valid/case2/query2.rq
test-cases/or/nodeKindMinLength/shacl.ttl
test-cases/or/nodeKindMinLength/shacl.ttl
test-cases/or/nodeKindMinLength/valid/case2/query1.rq
test-cases/or/nodeKindMinLength/valid/case2/query2.rq
test-cases/or/nodeKindMinLength/shacl.ttl
test-cases/or/nodeKindMinLength/shacl.ttl
org.eclipse.rdf4j.sail.shacl.ShaclSailValidationException: Failed SHACL validation
test-cases/or/nodeKindMinLength/invalid/case1/query1.rq
org.eclipse.rdf4j.sail.shacl.ShaclSailValidationException: Failed SHACL validation
test-cases/or/nodeKindMinLength/shacl.ttl
org.eclipse.rdf4j.sail.shacl.ShaclSailValidationException: Failed SHACL validation
test-cases/or/nodeKindMinLength/shacl.ttl
org.eclipse.rdf4j.sail.shacl.ShaclSailValidationException: Failed SHACL validation
test-cases/or/nodeKindMinLength/invalid/case1/query1.rq
org.eclipse.rdf4j.sail.shacl.ShaclSailValidationException: Failed SHACL validation
test-cases/or/nodeKindMinLength/shacl.ttl
org.eclipse.rdf4j.sail.shacl.ShaclSailValidationException: Failed SHACL validation
test-cases/or/nodeKindMinLength/shacl.ttl
org.eclipse.rdf4j.sail.shacl.ShaclSailValidationException: Failed SHACL validation
test-cases/or/nodeKindMinLength/invalid/case1/query1.rq
org.eclipse.rdf4j.sail.shacl.ShaclSailValidationException: Failed SHACL validation
test-cases/or/nodeKindMinLength/shacl.ttl
org.eclipse.rdf4j.sail.shacl.ShaclSailValidationException: Failed SHACL validation
test-cases/or/nodeKindMinLength/shacl.ttl
org.eclipse.rdf4j.sail.shacl.ShaclSailValidationException: Failed SHACL validation
test-cases/or/nodeKindMinLength/invalid/case2/query1.rq
org.eclipse.rdf4j.sail.shacl.ShaclSailValidationException: Failed SHACL validation
test-cases/or/nodeKindMinLength/shacl.ttl
org.eclipse.rdf4j.sail.shacl.ShaclSailValidationException: Failed SHACL validation
test-cases/or/nodeKindMinLength/shacl.ttl
org.eclipse.rdf4j.sail.shacl.ShaclSailValidationException: Failed SHACL validation
test-cases/or/nodeKindMinLength/invalid/case2/query1.rq
org.eclipse.rdf4j.sail.shacl.ShaclSailValidationException: Failed SHACL validation
test-cases/or/nodeKindMinLength/shacl.ttl
org.eclipse.rdf4j.sail.shacl.ShaclSailValidationException: Failed SHACL validation
test-cases/or/nodeKindMinLength/shacl.ttl
org.eclipse.rdf4j.sail.shacl.ShaclSailValidationException: Failed SHACL validation
test-cases/or/nodeKindMinLength/invalid/case2/query1.rq
org.eclipse.rdf4j.sail.shacl.ShaclSailValidationException: Failed SHACL validation
test-cases/or/nodeKindMinLength/shacl.ttl
org.eclipse.rdf4j.sail.shacl.ShaclSailValidationException: Failed SHACL validation
test-cases/or/nodeKindMinLength/shacl.ttl
org.eclipse.rdf4j.sail.shacl.ShaclSailValidationException: Failed SHACL validation
test-cases/or/nodeKindMinLength/invalid/case3/query1.rq
test-cases/or/nodeKindMinLength/invalid/case3/query2.rq
org.eclipse.rdf4j.sail.shacl.ShaclSailValidationException: Failed SHACL validation
test-cases/or/nodeKindMinLength/shacl.ttl
org.eclipse.rdf4j.sail.shacl.ShaclSailValidationException: Failed SHACL validation
test-cases/or/nodeKindMinLength/shacl.ttl
org.eclipse.rdf4j.sail.shacl.ShaclSailValidationException: Failed SHACL validation
test-cases/or/nodeKindMinLength/invalid/case3/query1.rq
test-cases/or/nodeKindMinLength/invalid/case3/query2.rq
org.eclipse.rdf4j.sail.shacl.ShaclSailValidationException: Failed SHACL validation
test-cases/or/nodeKindMinLength/shacl.ttl
org.eclipse.rdf4j.sail.shacl.ShaclSailValidationException: Failed SHACL validation
test-cases/or/nodeKindMinLength/shacl.ttl
org.eclipse.rdf4j.sail.shacl.ShaclSailValidationException: Failed SHACL validation
test-cases/or/nodeKindMinLength/invalid/case3/query1.rq
test-cases/or/nodeKindMinLength/invalid/case3/query2.rq
org.eclipse.rdf4j.sail.shacl.ShaclSailValidationException: Failed SHACL validation
test-cases/or/nodeKindMinLength/shacl.ttl
org.eclipse.rdf4j.sail.shacl.ShaclSailValidationException: Failed SHACL validation
test-cases/or/nodeKindMinLength/shacl.ttl
org.eclipse.rdf4j.sail.shacl.ShaclSailValidationException: Failed SHACL validation
test-cases/or/nodeKindMinLength/invalid/case4/query1.rq
test-cases/or/nodeKindMinLength/invalid/case4/query2.rq
org.eclipse.rdf4j.sail.shacl.ShaclSailValidationException: Failed SHACL validation
test-cases/or/nodeKindMinLength/shacl.ttl
org.eclipse.rdf4j.sail.shacl.ShaclSailValidationException: Failed SHACL validation
test-cases/or/nodeKindMinLength/shacl.ttl
org.eclipse.rdf4j.sail.shacl.ShaclSailValidationException: Failed SHACL validation
test-cases/or/nodeKindMinLength/invalid/case4/query1.rq
test-cases/or/nodeKindMinLength/invalid/case4/query2.rq
org.eclipse.rdf4j.sail.shacl.ShaclSailValidationException: Failed SHACL validation
test-cases/or/nodeKindMinLength/shacl.ttl
org.eclipse.rdf4j.sail.shacl.ShaclSailValidationException: Failed SHACL validation
test-cases/or/nodeKindMinLength/shacl.ttl
org.eclipse.rdf4j.sail.shacl.ShaclSailValidationException: Failed SHACL validation
test-cases/or/nodeKindMinLength/invalid/case4/query1.rq
test-cases/or/nodeKindMinLength/invalid/case4/query2.rq
org.eclipse.rdf4j.sail.shacl.ShaclSailValidationException: Failed SHACL validation
test-cases/or/nodeKindMinLength/shacl.ttl
org.eclipse.rdf4j.sail.shacl.ShaclSailValidationException: Failed SHACL validation
test-cases/or/nodeKindValidateTarget/shacl.ttl
test-cases/or/nodeKindValidateTarget/valid/case1/query1.rq
test-cases/or/nodeKindValidateTarget/shacl.ttl
test-cases/or/nodeKindValidateTarget/shacl.ttl
test-cases/or/nodeKindValidateTarget/valid/case1/query1.rq
test-cases/or/nodeKindValidateTarget/shacl.ttl
test-cases/or/nodeKindValidateTarget/shacl.ttl
test-cases/or/nodeKindValidateTarget/valid/case1/query1.rq
test-cases/or/nodeKindValidateTarget/shacl.ttl
test-cases/or/nodeKindValidateTarget/shacl.ttl
test-cases/or/nodeKindValidateTarget/valid/case2/query1.rq
test-cases/or/nodeKindValidateTarget/shacl.ttl
test-cases/or/nodeKindValidateTarget/shacl.ttl
test-cases/or/nodeKindValidateTarget/valid/case2/query1.rq
test-cases/or/nodeKindValidateTarget/shacl.ttl
test-cases/or/nodeKindValidateTarget/shacl.ttl
test-cases/or/nodeKindValidateTarget/valid/case2/query1.rq
test-cases/or/nodeKindValidateTarget/shacl.ttl
test-cases/or/nodeKindValidateTarget/shacl.ttl
org.eclipse.rdf4j.sail.shacl.ShaclSailValidationException: Failed SHACL validation
test-cases/or/nodeKindValidateTarget/invalid/case1/query1.rq
org.eclipse.rdf4j.sail.shacl.ShaclSailValidationException: Failed SHACL validation
test-cases/or/nodeKindValidateTarget/shacl.ttl
org.eclipse.rdf4j.sail.shacl.ShaclSailValidationException: Failed SHACL validation
test-cases/or/nodeKindValidateTarget/shacl.ttl
org.eclipse.rdf4j.sail.shacl.ShaclSailValidationException: Failed SHACL validation
test-cases/or/nodeKindValidateTarget/invalid/case1/query1.rq
org.eclipse.rdf4j.sail.shacl.ShaclSailValidationException: Failed SHACL validation
test-cases/or/nodeKindValidateTarget/shacl.ttl
org.eclipse.rdf4j.sail.shacl.ShaclSailValidationException: Failed SHACL validation
test-cases/or/nodeKindValidateTarget/shacl.ttl
org.eclipse.rdf4j.sail.shacl.ShaclSailValidationException: Failed SHACL validation
test-cases/or/nodeKindValidateTarget/invalid/case1/query1.rq
org.eclipse.rdf4j.sail.shacl.ShaclSailValidationException: Failed SHACL validation
test-cases/or/nodeKindValidateTarget/shacl.ttl
org.eclipse.rdf4j.sail.shacl.ShaclSailValidationException: Failed SHACL validation
test-cases/or/nodeKindValidateTarget/shacl.ttl
org.eclipse.rdf4j.sail.shacl.ShaclSailValidationException: Failed SHACL validation
test-cases/or/nodeKindValidateTarget/invalid/case2/query1.rq
org.eclipse.rdf4j.sail.shacl.ShaclSailValidationException: Failed SHACL validation
test-cases/or/nodeKindValidateTarget/shacl.ttl
org.eclipse.rdf4j.sail.shacl.ShaclSailValidationException: Failed SHACL validation
test-cases/or/nodeKindValidateTarget/shacl.ttl
org.eclipse.rdf4j.sail.shacl.ShaclSailValidationException: Failed SHACL validation
test-cases/or/nodeKindValidateTarget/invalid/case2/query1.rq
org.eclipse.rdf4j.sail.shacl.ShaclSailValidationException: Failed SHACL validation
test-cases/or/nodeKindValidateTarget/shacl.ttl
org.eclipse.rdf4j.sail.shacl.ShaclSailValidationException: Failed SHACL validation
test-cases/or/nodeKindValidateTarget/shacl.ttl
org.eclipse.rdf4j.sail.shacl.ShaclSailValidationException: Failed SHACL validation
test-cases/or/nodeKindValidateTarget/invalid/case2/query1.rq
org.eclipse.rdf4j.sail.shacl.ShaclSailValidationException: Failed SHACL validation
test-cases/or/nodeKindValidateTarget/shacl.ttl
org.eclipse.rdf4j.sail.shacl.ShaclSailValidationException: Failed SHACL validation
test-cases/or/nodeKindValidateTarget/shacl.ttl
org.eclipse.rdf4j.sail.shacl.ShaclSailValidationException: Failed SHACL validation
test-cases/or/nodeKindValidateTarget/invalid/case3/query1.rq
org.eclipse.rdf4j.sail.shacl.ShaclSailValidationException: Failed SHACL validation
test-cases/or/nodeKindValidateTarget/shacl.ttl
org.eclipse.rdf4j.sail.shacl.ShaclSailValidationException: Failed SHACL validation
test-cases/or/nodeKindValidateTarget/shacl.ttl
org.eclipse.rdf4j.sail.shacl.ShaclSailValidationException: Failed SHACL validation
test-cases/or/nodeKindValidateTarget/invalid/case3/query1.rq
org.eclipse.rdf4j.sail.shacl.ShaclSailValidationException: Failed SHACL validation
test-cases/or/nodeKindValidateTarget/shacl.ttl
org.eclipse.rdf4j.sail.shacl.ShaclSailValidationException: Failed SHACL validation
test-cases/or/nodeKindValidateTarget/shacl.ttl
org.eclipse.rdf4j.sail.shacl.ShaclSailValidationException: Failed SHACL validation
test-cases/or/nodeKindValidateTarget/invalid/case3/query1.rq
org.eclipse.rdf4j.sail.shacl.ShaclSailValidationException: Failed SHACL validation
test-cases/or/nodeKindValidateTarget/shacl.ttl
org.eclipse.rdf4j.sail.shacl.ShaclSailValidationException: Failed SHACL validation
test-cases/or/nodeKindValidateTarget/shacl.ttl
org.eclipse.rdf4j.sail.shacl.ShaclSailValidationException: Failed SHACL validation
test-cases/or/nodeKindValidateTarget/invalid/case4/query1.rq
org.eclipse.rdf4j.sail.shacl.ShaclSailValidationException: Failed SHACL validation
test-cases/or/nodeKindValidateTarget/shacl.ttl
org.eclipse.rdf4j.sail.shacl.ShaclSailValidationException: Failed SHACL validation
test-cases/or/nodeKindValidateTarget/shacl.ttl
org.eclipse.rdf4j.sail.shacl.ShaclSailValidationException: Failed SHACL validation
test-cases/or/nodeKindValidateTarget/invalid/case4/query1.rq
org.eclipse.rdf4j.sail.shacl.ShaclSailValidationException: Failed SHACL validation
test-cases/or/nodeKindValidateTarget/shacl.ttl
org.eclipse.rdf4j.sail.shacl.ShaclSailValidationException: Failed SHACL validation
test-cases/or/nodeKindValidateTarget/shacl.ttl
org.eclipse.rdf4j.sail.shacl.ShaclSailValidationException: Failed SHACL validation
test-cases/or/nodeKindValidateTarget/invalid/case4/query1.rq
org.eclipse.rdf4j.sail.shacl.ShaclSailValidationException: Failed SHACL validation
test-cases/or/nodeKindValidateTarget/shacl.ttl
org.eclipse.rdf4j.sail.shacl.ShaclSailValidationException: Failed SHACL validation
test-cases/pattern/multiple/shacl.ttl
test-cases/pattern/multiple/valid/case1/query1.rq
test-cases/pattern/multiple/shacl.ttl
test-cases/pattern/multiple/shacl.ttl
test-cases/pattern/multiple/valid/case1/query1.rq
test-cases/pattern/multiple/shacl.ttl
test-cases/pattern/multiple/shacl.ttl
test-cases/pattern/multiple/valid/case1/query1.rq
test-cases/pattern/multiple/shacl.ttl
test-cases/pattern/multiple/shacl.ttl
test-cases/pattern/multiple/valid/case2/query1.rq
test-cases/pattern/multiple/shacl.ttl
test-cases/pattern/multiple/shacl.ttl
test-cases/pattern/multiple/valid/case2/query1.rq
test-cases/pattern/multiple/shacl.ttl
test-cases/pattern/multiple/shacl.ttl
test-cases/pattern/multiple/valid/case2/query1.rq
test-cases/pattern/multiple/shacl.ttl
test-cases/pattern/multiple/shacl.ttl
org.eclipse.rdf4j.sail.shacl.ShaclSailValidationException: Failed SHACL validation
test-cases/pattern/multiple/invalid/case1/query1.rq
org.eclipse.rdf4j.sail.shacl.ShaclSailValidationException: Failed SHACL validation
test-cases/pattern/multiple/shacl.ttl
org.eclipse.rdf4j.sail.shacl.ShaclSailValidationException: Failed SHACL validation
test-cases/pattern/multiple/shacl.ttl
org.eclipse.rdf4j.sail.shacl.ShaclSailValidationException: Failed SHACL validation
test-cases/pattern/multiple/invalid/case1/query1.rq
org.eclipse.rdf4j.sail.shacl.ShaclSailValidationException: Failed SHACL validation
test-cases/pattern/multiple/shacl.ttl
org.eclipse.rdf4j.sail.shacl.ShaclSailValidationException: Failed SHACL validation
test-cases/pattern/multiple/shacl.ttl
org.eclipse.rdf4j.sail.shacl.ShaclSailValidationException: Failed SHACL validation
test-cases/pattern/multiple/invalid/case1/query1.rq
org.eclipse.rdf4j.sail.shacl.ShaclSailValidationException: Failed SHACL validation
test-cases/pattern/multiple/shacl.ttl
org.eclipse.rdf4j.sail.shacl.ShaclSailValidationException: Failed SHACL validation
test-cases/pattern/multiple/shacl.ttl
org.eclipse.rdf4j.sail.shacl.ShaclSailValidationException: Failed SHACL validation
test-cases/pattern/multiple/invalid/case2/query1.rq
org.eclipse.rdf4j.sail.shacl.ShaclSailValidationException: Failed SHACL validation
test-cases/pattern/multiple/shacl.ttl
org.eclipse.rdf4j.sail.shacl.ShaclSailValidationException: Failed SHACL validation
test-cases/pattern/multiple/shacl.ttl
org.eclipse.rdf4j.sail.shacl.ShaclSailValidationException: Failed SHACL validation
test-cases/pattern/multiple/invalid/case2/query1.rq
org.eclipse.rdf4j.sail.shacl.ShaclSailValidationException: Failed SHACL validation
test-cases/pattern/multiple/shacl.ttl
org.eclipse.rdf4j.sail.shacl.ShaclSailValidationException: Failed SHACL validation
test-cases/pattern/multiple/shacl.ttl
org.eclipse.rdf4j.sail.shacl.ShaclSailValidationException: Failed SHACL validation
test-cases/pattern/multiple/invalid/case2/query1.rq
org.eclipse.rdf4j.sail.shacl.ShaclSailValidationException: Failed SHACL validation
test-cases/pattern/multiple/shacl.ttl
org.eclipse.rdf4j.sail.shacl.ShaclSailValidationException: Failed SHACL validation
test-cases/pattern/simple/shacl.ttl
test-cases/pattern/simple/valid/case1/query1.rq
test-cases/pattern/simple/shacl.ttl
test-cases/pattern/simple/shacl.ttl
test-cases/pattern/simple/valid/case1/query1.rq
test-cases/pattern/simple/shacl.ttl
test-cases/pattern/simple/shacl.ttl
test-cases/pattern/simple/valid/case1/query1.rq
test-cases/pattern/simple/shacl.ttl
test-cases/pattern/simple/shacl.ttl
test-cases/pattern/simple/valid/case2/query1.rq
test-cases/pattern/simple/valid/case2/query2.rq
test-cases/pattern/simple/shacl.ttl
test-cases/pattern/simple/shacl.ttl
test-cases/pattern/simple/valid/case2/query1.rq
test-cases/pattern/simple/valid/case2/query2.rq
test-cases/pattern/simple/shacl.ttl
test-cases/pattern/simple/shacl.ttl
test-cases/pattern/simple/valid/case2/query1.rq
test-cases/pattern/simple/valid/case2/query2.rq
test-cases/pattern/simple/shacl.ttl
test-cases/pattern/simple/shacl.ttl
test-cases/pattern/simple/valid/case3/query1.rq
test-cases/pattern/simple/valid/case3/query2.rq
test-cases/pattern/simple/shacl.ttl
test-cases/pattern/simple/shacl.ttl
test-cases/pattern/simple/valid/case3/query1.rq
test-cases/pattern/simple/valid/case3/query2.rq
test-cases/pattern/simple/shacl.ttl
test-cases/pattern/simple/shacl.ttl
test-cases/pattern/simple/valid/case3/query1.rq
test-cases/pattern/simple/valid/case3/query2.rq
test-cases/pattern/simple/shacl.ttl
test-cases/pattern/simple/shacl.ttl
test-cases/pattern/simple/valid/case4/query1.rq
test-cases/pattern/simple/shacl.ttl
test-cases/pattern/simple/shacl.ttl
test-cases/pattern/simple/valid/case4/query1.rq
test-cases/pattern/simple/shacl.ttl
test-cases/pattern/simple/shacl.ttl
test-cases/pattern/simple/valid/case4/query1.rq
test-cases/pattern/simple/shacl.ttl
test-cases/pattern/simple/shacl.ttl
test-cases/pattern/simple/valid/case5/query1.rq
test-cases/pattern/simple/shacl.ttl
test-cases/pattern/simple/shacl.ttl
test-cases/pattern/simple/valid/case5/query1.rq
test-cases/pattern/simple/shacl.ttl
test-cases/pattern/simple/shacl.ttl
test-cases/pattern/simple/valid/case5/query1.rq
test-cases/pattern/simple/shacl.ttl
test-cases/pattern/simple/shacl.ttl
org.eclipse.rdf4j.sail.shacl.ShaclSailValidationException: Failed SHACL validation
test-cases/pattern/simple/invalid/case1/query1.rq
org.eclipse.rdf4j.sail.shacl.ShaclSailValidationException: Failed SHACL validation
test-cases/pattern/simple/shacl.ttl
org.eclipse.rdf4j.sail.shacl.ShaclSailValidationException: Failed SHACL validation
test-cases/pattern/simple/shacl.ttl
org.eclipse.rdf4j.sail.shacl.ShaclSailValidationException: Failed SHACL validation
test-cases/pattern/simple/invalid/case1/query1.rq
org.eclipse.rdf4j.sail.shacl.ShaclSailValidationException: Failed SHACL validation
test-cases/pattern/simple/shacl.ttl
org.eclipse.rdf4j.sail.shacl.ShaclSailValidationException: Failed SHACL validation
test-cases/pattern/simple/shacl.ttl
org.eclipse.rdf4j.sail.shacl.ShaclSailValidationException: Failed SHACL validation
test-cases/pattern/simple/invalid/case1/query1.rq
org.eclipse.rdf4j.sail.shacl.ShaclSailValidationException: Failed SHACL validation
test-cases/pattern/simple/shacl.ttl
org.eclipse.rdf4j.sail.shacl.ShaclSailValidationException: Failed SHACL validation
test-cases/pattern/simple/shacl.ttl
org.eclipse.rdf4j.sail.shacl.ShaclSailValidationException: Failed SHACL validation
test-cases/pattern/simple/invalid/case2/query1.rq
test-cases/pattern/simple/invalid/case2/query2.rq
org.eclipse.rdf4j.sail.shacl.ShaclSailValidationException: Failed SHACL validation
test-cases/pattern/simple/shacl.ttl
org.eclipse.rdf4j.sail.shacl.ShaclSailValidationException: Failed SHACL validation
test-cases/pattern/simple/shacl.ttl
org.eclipse.rdf4j.sail.shacl.ShaclSailValidationException: Failed SHACL validation
test-cases/pattern/simple/invalid/case2/query1.rq
test-cases/pattern/simple/invalid/case2/query2.rq
org.eclipse.rdf4j.sail.shacl.ShaclSailValidationException: Failed SHACL validation
test-cases/pattern/simple/shacl.ttl
org.eclipse.rdf4j.sail.shacl.ShaclSailValidationException: Failed SHACL validation
test-cases/pattern/simple/shacl.ttl
org.eclipse.rdf4j.sail.shacl.ShaclSailValidationException: Failed SHACL validation
test-cases/pattern/simple/invalid/case2/query1.rq
test-cases/pattern/simple/invalid/case2/query2.rq
org.eclipse.rdf4j.sail.shacl.ShaclSailValidationException: Failed SHACL validation
test-cases/pattern/simple/shacl.ttl
org.eclipse.rdf4j.sail.shacl.ShaclSailValidationException: Failed SHACL validation
test-cases/pattern/simple/shacl.ttl
org.eclipse.rdf4j.sail.shacl.ShaclSailValidationException: Failed SHACL validation
test-cases/pattern/simple/invalid/case3/query1.rq
test-cases/pattern/simple/invalid/case3/query2.rq
org.eclipse.rdf4j.sail.shacl.ShaclSailValidationException: Failed SHACL validation
test-cases/pattern/simple/shacl.ttl
org.eclipse.rdf4j.sail.shacl.ShaclSailValidationException: Failed SHACL validation
test-cases/pattern/simple/shacl.ttl
org.eclipse.rdf4j.sail.shacl.ShaclSailValidationException: Failed SHACL validation
test-cases/pattern/simple/invalid/case3/query1.rq
test-cases/pattern/simple/invalid/case3/query2.rq
org.eclipse.rdf4j.sail.shacl.ShaclSailValidationException: Failed SHACL validation
test-cases/pattern/simple/shacl.ttl
org.eclipse.rdf4j.sail.shacl.ShaclSailValidationException: Failed SHACL validation
test-cases/pattern/simple/shacl.ttl
org.eclipse.rdf4j.sail.shacl.ShaclSailValidationException: Failed SHACL validation
test-cases/pattern/simple/invalid/case3/query1.rq
test-cases/pattern/simple/invalid/case3/query2.rq
org.eclipse.rdf4j.sail.shacl.ShaclSailValidationException: Failed SHACL validation
test-cases/pattern/simple/shacl.ttl
org.eclipse.rdf4j.sail.shacl.ShaclSailValidationException: Failed SHACL validation
test-cases/pattern/simple/shacl.ttl
org.eclipse.rdf4j.sail.shacl.ShaclSailValidationException: Failed SHACL validation
test-cases/pattern/simple/invalid/case4/query1.rq
test-cases/pattern/simple/invalid/case4/query2.rq
org.eclipse.rdf4j.sail.shacl.ShaclSailValidationException: Failed SHACL validation
test-cases/pattern/simple/shacl.ttl
org.eclipse.rdf4j.sail.shacl.ShaclSailValidationException: Failed SHACL validation
test-cases/pattern/simple/shacl.ttl
org.eclipse.rdf4j.sail.shacl.ShaclSailValidationException: Failed SHACL validation
test-cases/pattern/simple/invalid/case4/query1.rq
test-cases/pattern/simple/invalid/case4/query2.rq
org.eclipse.rdf4j.sail.shacl.ShaclSailValidationException: Failed SHACL validation
test-cases/pattern/simple/shacl.ttl
org.eclipse.rdf4j.sail.shacl.ShaclSailValidationException: Failed SHACL validation
test-cases/pattern/simple/shacl.ttl
org.eclipse.rdf4j.sail.shacl.ShaclSailValidationException: Failed SHACL validation
test-cases/pattern/simple/invalid/case4/query1.rq
test-cases/pattern/simple/invalid/case4/query2.rq
org.eclipse.rdf4j.sail.shacl.ShaclSailValidationException: Failed SHACL validation
test-cases/pattern/simple/shacl.ttl
org.eclipse.rdf4j.sail.shacl.ShaclSailValidationException: Failed SHACL validation
test-cases/pattern/simple/shacl.ttl
org.eclipse.rdf4j.sail.shacl.ShaclSailValidationException: Failed SHACL validation
test-cases/pattern/simple/invalid/case5/query1.rq
test-cases/pattern/simple/invalid/case5/query2.rq
org.eclipse.rdf4j.sail.shacl.ShaclSailValidationException: Failed SHACL validation
test-cases/pattern/simple/shacl.ttl
org.eclipse.rdf4j.sail.shacl.ShaclSailValidationException: Failed SHACL validation
test-cases/pattern/simple/shacl.ttl
org.eclipse.rdf4j.sail.shacl.ShaclSailValidationException: Failed SHACL validation
test-cases/pattern/simple/invalid/case5/query1.rq
test-cases/pattern/simple/invalid/case5/query2.rq
org.eclipse.rdf4j.sail.shacl.ShaclSailValidationException: Failed SHACL validation
test-cases/pattern/simple/shacl.ttl
org.eclipse.rdf4j.sail.shacl.ShaclSailValidationException: Failed SHACL validation
test-cases/pattern/simple/shacl.ttl
org.eclipse.rdf4j.sail.shacl.ShaclSailValidationException: Failed SHACL validation
test-cases/pattern/simple/invalid/case5/query1.rq
test-cases/pattern/simple/invalid/case5/query2.rq
org.eclipse.rdf4j.sail.shacl.ShaclSailValidationException: Failed SHACL validation
test-cases/pattern/simple/shacl.ttl
org.eclipse.rdf4j.sail.shacl.ShaclSailValidationException: Failed SHACL validation
test-cases/pattern/simple/shacl.ttl
org.eclipse.rdf4j.sail.shacl.ShaclSailValidationException: Failed SHACL validation
test-cases/pattern/simple/invalid/case6/query1.rq
org.eclipse.rdf4j.sail.shacl.ShaclSailValidationException: Failed SHACL validation
test-cases/pattern/simple/shacl.ttl
org.eclipse.rdf4j.sail.shacl.ShaclSailValidationException: Failed SHACL validation
test-cases/pattern/simple/shacl.ttl
org.eclipse.rdf4j.sail.shacl.ShaclSailValidationException: Failed SHACL validation
test-cases/pattern/simple/invalid/case6/query1.rq
org.eclipse.rdf4j.sail.shacl.ShaclSailValidationException: Failed SHACL validation
test-cases/pattern/simple/shacl.ttl
org.eclipse.rdf4j.sail.shacl.ShaclSailValidationException: Failed SHACL validation
test-cases/pattern/simple/shacl.ttl
org.eclipse.rdf4j.sail.shacl.ShaclSailValidationException: Failed SHACL validation
test-cases/pattern/simple/invalid/case6/query1.rq
org.eclipse.rdf4j.sail.shacl.ShaclSailValidationException: Failed SHACL validation
test-cases/pattern/simple/shacl.ttl
org.eclipse.rdf4j.sail.shacl.ShaclSailValidationException: Failed SHACL validation
test-cases/propertyShapeWithTarget/simple/shacl.ttl
test-cases/propertyShapeWithTarget/simple/valid/case1/query1.rq
test-cases/propertyShapeWithTarget/simple/shacl.ttl
test-cases/propertyShapeWithTarget/simple/shacl.ttl
test-cases/propertyShapeWithTarget/simple/valid/case1/query1.rq
test-cases/propertyShapeWithTarget/simple/shacl.ttl
test-cases/propertyShapeWithTarget/simple/shacl.ttl
test-cases/propertyShapeWithTarget/simple/valid/case1/query1.rq
test-cases/propertyShapeWithTarget/simple/shacl.ttl
test-cases/propertyShapeWithTarget/simple/shacl.ttl
org.eclipse.rdf4j.sail.shacl.ShaclSailValidationException: Failed SHACL validation
test-cases/propertyShapeWithTarget/simple/invalid/case1/query1.rq
org.eclipse.rdf4j.sail.shacl.ShaclSailValidationException: Failed SHACL validation
test-cases/propertyShapeWithTarget/simple/shacl.ttl
org.eclipse.rdf4j.sail.shacl.ShaclSailValidationException: Failed SHACL validation
test-cases/propertyShapeWithTarget/simple/shacl.ttl
org.eclipse.rdf4j.sail.shacl.ShaclSailValidationException: Failed SHACL validation
test-cases/propertyShapeWithTarget/simple/invalid/case1/query1.rq
org.eclipse.rdf4j.sail.shacl.ShaclSailValidationException: Failed SHACL validation
test-cases/propertyShapeWithTarget/simple/shacl.ttl
org.eclipse.rdf4j.sail.shacl.ShaclSailValidationException: Failed SHACL validation
test-cases/propertyShapeWithTarget/simple/shacl.ttl
org.eclipse.rdf4j.sail.shacl.ShaclSailValidationException: Failed SHACL validation
test-cases/propertyShapeWithTarget/simple/invalid/case1/query1.rq
org.eclipse.rdf4j.sail.shacl.ShaclSailValidationException: Failed SHACL validation
test-cases/propertyShapeWithTarget/simple/shacl.ttl
org.eclipse.rdf4j.sail.shacl.ShaclSailValidationException: Failed SHACL validation
test-cases/uniqueLang/not/shacl.ttl
test-cases/uniqueLang/not/valid/case1/query1.rq
test-cases/uniqueLang/not/shacl.ttl
test-cases/uniqueLang/not/shacl.ttl
test-cases/uniqueLang/not/valid/case1/query1.rq
test-cases/uniqueLang/not/shacl.ttl
test-cases/uniqueLang/not/shacl.ttl
test-cases/uniqueLang/not/valid/case1/query1.rq
test-cases/uniqueLang/not/shacl.ttl
test-cases/uniqueLang/not/shacl.ttl
test-cases/uniqueLang/not/valid/case2/query1.rq
test-cases/uniqueLang/not/valid/case2/query2.rq
test-cases/uniqueLang/not/shacl.ttl
test-cases/uniqueLang/not/shacl.ttl
test-cases/uniqueLang/not/valid/case2/query1.rq
test-cases/uniqueLang/not/valid/case2/query2.rq
test-cases/uniqueLang/not/shacl.ttl
test-cases/uniqueLang/not/shacl.ttl
test-cases/uniqueLang/not/valid/case2/query1.rq
test-cases/uniqueLang/not/valid/case2/query2.rq
test-cases/uniqueLang/not/shacl.ttl
test-cases/uniqueLang/not/shacl.ttl
test-cases/uniqueLang/not/valid/case3/query1.rq
test-cases/uniqueLang/not/valid/case3/query2.rq
test-cases/uniqueLang/not/shacl.ttl
test-cases/uniqueLang/not/shacl.ttl
test-cases/uniqueLang/not/valid/case3/query1.rq
test-cases/uniqueLang/not/valid/case3/query2.rq
test-cases/uniqueLang/not/shacl.ttl
test-cases/uniqueLang/not/shacl.ttl
test-cases/uniqueLang/not/valid/case3/query1.rq
test-cases/uniqueLang/not/valid/case3/query2.rq
test-cases/uniqueLang/not/shacl.ttl
test-cases/uniqueLang/not/shacl.ttl
org.eclipse.rdf4j.sail.shacl.ShaclSailValidationException: Failed SHACL validation
test-cases/uniqueLang/not/invalid/case1/query1.rq
org.eclipse.rdf4j.sail.shacl.ShaclSailValidationException: Failed SHACL validation
test-cases/uniqueLang/not/shacl.ttl
org.eclipse.rdf4j.sail.shacl.ShaclSailValidationException: Failed SHACL validation
test-cases/uniqueLang/not/shacl.ttl
org.eclipse.rdf4j.sail.shacl.ShaclSailValidationException: Failed SHACL validation
test-cases/uniqueLang/not/invalid/case1/query1.rq
org.eclipse.rdf4j.sail.shacl.ShaclSailValidationException: Failed SHACL validation
test-cases/uniqueLang/not/shacl.ttl
org.eclipse.rdf4j.sail.shacl.ShaclSailValidationException: Failed SHACL validation
test-cases/uniqueLang/not/shacl.ttl
org.eclipse.rdf4j.sail.shacl.ShaclSailValidationException: Failed SHACL validation
test-cases/uniqueLang/not/invalid/case1/query1.rq
org.eclipse.rdf4j.sail.shacl.ShaclSailValidationException: Failed SHACL validation
test-cases/uniqueLang/not/shacl.ttl
org.eclipse.rdf4j.sail.shacl.ShaclSailValidationException: Failed SHACL validation
test-cases/uniqueLang/not/shacl.ttl
org.eclipse.rdf4j.sail.shacl.ShaclSailValidationException: Failed SHACL validation
org.eclipse.rdf4j.sail.shacl.ShaclSailValidationException: Failed SHACL validation
test-cases/uniqueLang/not/invalid/case2/query1.rq
test-cases/uniqueLang/not/invalid/case2/query2.rq
org.eclipse.rdf4j.sail.shacl.ShaclSailValidationException: Failed SHACL validation
test-cases/uniqueLang/not/shacl.ttl
org.eclipse.rdf4j.sail.shacl.ShaclSailValidationException: Failed SHACL validation
org.eclipse.rdf4j.sail.shacl.ShaclSailValidationException: Failed SHACL validation
test-cases/uniqueLang/not/shacl.ttl
org.eclipse.rdf4j.sail.shacl.ShaclSailValidationException: Failed SHACL validation
test-cases/uniqueLang/not/invalid/case2/query1.rq
test-cases/uniqueLang/not/invalid/case2/query2.rq
org.eclipse.rdf4j.sail.shacl.ShaclSailValidationException: Failed SHACL validation
test-cases/uniqueLang/not/shacl.ttl
org.eclipse.rdf4j.sail.shacl.ShaclSailValidationException: Failed SHACL validation
test-cases/uniqueLang/not/shacl.ttl
org.eclipse.rdf4j.sail.shacl.ShaclSailValidationException: Failed SHACL validation
test-cases/uniqueLang/not/invalid/case2/query1.rq
test-cases/uniqueLang/not/invalid/case2/query2.rq
org.eclipse.rdf4j.sail.shacl.ShaclSailValidationException: Failed SHACL validation
test-cases/uniqueLang/not/shacl.ttl
org.eclipse.rdf4j.sail.shacl.ShaclSailValidationException: Failed SHACL validation
test-cases/uniqueLang/not/shacl.ttl
org.eclipse.rdf4j.sail.shacl.ShaclSailValidationException: Failed SHACL validation
org.eclipse.rdf4j.sail.shacl.ShaclSailValidationException: Failed SHACL validation
test-cases/uniqueLang/not/invalid/case4/query1.rq
test-cases/uniqueLang/not/invalid/case4/query2.rq
org.eclipse.rdf4j.sail.shacl.ShaclSailValidationException: Failed SHACL validation
test-cases/uniqueLang/not/shacl.ttl
org.eclipse.rdf4j.sail.shacl.ShaclSailValidationException: Failed SHACL validation
org.eclipse.rdf4j.sail.shacl.ShaclSailValidationException: Failed SHACL validation
test-cases/uniqueLang/not/shacl.ttl
org.eclipse.rdf4j.sail.shacl.ShaclSailValidationException: Failed SHACL validation
test-cases/uniqueLang/not/invalid/case4/query1.rq
test-cases/uniqueLang/not/invalid/case4/query2.rq
org.eclipse.rdf4j.sail.shacl.ShaclSailValidationException: Failed SHACL validation
test-cases/uniqueLang/not/shacl.ttl
org.eclipse.rdf4j.sail.shacl.ShaclSailValidationException: Failed SHACL validation
test-cases/uniqueLang/not/shacl.ttl
org.eclipse.rdf4j.sail.shacl.ShaclSailValidationException: Failed SHACL validation
test-cases/uniqueLang/not/invalid/case4/query1.rq
test-cases/uniqueLang/not/invalid/case4/query2.rq
org.eclipse.rdf4j.sail.shacl.ShaclSailValidationException: Failed SHACL validation
test-cases/uniqueLang/not/shacl.ttl
org.eclipse.rdf4j.sail.shacl.ShaclSailValidationException: Failed SHACL validation
test-cases/uniqueLang/not/shacl.ttl
org.eclipse.rdf4j.sail.shacl.ShaclSailValidationException: Failed SHACL validation
test-cases/uniqueLang/not/invalid/case5/query1.rq
org.eclipse.rdf4j.sail.shacl.ShaclSailValidationException: Failed SHACL validation
test-cases/uniqueLang/not/shacl.ttl
org.eclipse.rdf4j.sail.shacl.ShaclSailValidationException: Failed SHACL validation
test-cases/uniqueLang/not/shacl.ttl
org.eclipse.rdf4j.sail.shacl.ShaclSailValidationException: Failed SHACL validation
test-cases/uniqueLang/not/invalid/case5/query1.rq
org.eclipse.rdf4j.sail.shacl.ShaclSailValidationException: Failed SHACL validation
test-cases/uniqueLang/not/shacl.ttl
org.eclipse.rdf4j.sail.shacl.ShaclSailValidationException: Failed SHACL validation
test-cases/uniqueLang/not/shacl.ttl
org.eclipse.rdf4j.sail.shacl.ShaclSailValidationException: Failed SHACL validation
test-cases/uniqueLang/not/invalid/case5/query1.rq
org.eclipse.rdf4j.sail.shacl.ShaclSailValidationException: Failed SHACL validation
test-cases/uniqueLang/not/shacl.ttl
org.eclipse.rdf4j.sail.shacl.ShaclSailValidationException: Failed SHACL validation
test-cases/uniqueLang/not/shacl.ttl
org.eclipse.rdf4j.sail.shacl.ShaclSailValidationException: Failed SHACL validation
test-cases/uniqueLang/not/invalid/case6/query1.rq
org.eclipse.rdf4j.sail.shacl.ShaclSailValidationException: Failed SHACL validation
test-cases/uniqueLang/not/shacl.ttl
org.eclipse.rdf4j.sail.shacl.ShaclSailValidationException: Failed SHACL validation
test-cases/uniqueLang/not/shacl.ttl
org.eclipse.rdf4j.sail.shacl.ShaclSailValidationException: Failed SHACL validation
test-cases/uniqueLang/not/invalid/case6/query1.rq
org.eclipse.rdf4j.sail.shacl.ShaclSailValidationException: Failed SHACL validation
test-cases/uniqueLang/not/shacl.ttl
org.eclipse.rdf4j.sail.shacl.ShaclSailValidationException: Failed SHACL validation
test-cases/uniqueLang/not/shacl.ttl
org.eclipse.rdf4j.sail.shacl.ShaclSailValidationException: Failed SHACL validation
test-cases/uniqueLang/not/invalid/case6/query1.rq
org.eclipse.rdf4j.sail.shacl.ShaclSailValidationException: Failed SHACL validation
test-cases/uniqueLang/not/shacl.ttl
org.eclipse.rdf4j.sail.shacl.ShaclSailValidationException: Failed SHACL validation
test-cases/uniqueLang/not/shacl.ttl
org.eclipse.rdf4j.sail.shacl.ShaclSailValidationException: Failed SHACL validation
test-cases/uniqueLang/not/invalid/case7/query1.rq
org.eclipse.rdf4j.sail.shacl.ShaclSailValidationException: Failed SHACL validation
test-cases/uniqueLang/not/shacl.ttl
org.eclipse.rdf4j.sail.shacl.ShaclSailValidationException: Failed SHACL validation
test-cases/uniqueLang/not/shacl.ttl
org.eclipse.rdf4j.sail.shacl.ShaclSailValidationException: Failed SHACL validation
test-cases/uniqueLang/not/invalid/case7/query1.rq
org.eclipse.rdf4j.sail.shacl.ShaclSailValidationException: Failed SHACL validation
test-cases/uniqueLang/not/shacl.ttl
org.eclipse.rdf4j.sail.shacl.ShaclSailValidationException: Failed SHACL validation
test-cases/uniqueLang/not/shacl.ttl
org.eclipse.rdf4j.sail.shacl.ShaclSailValidationException: Failed SHACL validation
test-cases/uniqueLang/not/invalid/case7/query1.rq
org.eclipse.rdf4j.sail.shacl.ShaclSailValidationException: Failed SHACL validation
test-cases/uniqueLang/not/shacl.ttl
org.eclipse.rdf4j.sail.shacl.ShaclSailValidationException: Failed SHACL validation
test-cases/uniqueLang/not/shacl.ttl
org.eclipse.rdf4j.sail.shacl.ShaclSailValidationException: Failed SHACL validation
org.eclipse.rdf4j.sail.shacl.ShaclSailValidationException: Failed SHACL validation
test-cases/uniqueLang/not/invalid/case8/query1.rq
test-cases/uniqueLang/not/invalid/case8/query2.rq
org.eclipse.rdf4j.sail.shacl.ShaclSailValidationException: Failed SHACL validation
test-cases/uniqueLang/not/shacl.ttl
org.eclipse.rdf4j.sail.shacl.ShaclSailValidationException: Failed SHACL validation
org.eclipse.rdf4j.sail.shacl.ShaclSailValidationException: Failed SHACL validation
test-cases/uniqueLang/not/shacl.ttl
org.eclipse.rdf4j.sail.shacl.ShaclSailValidationException: Failed SHACL validation
org.eclipse.rdf4j.sail.shacl.ShaclSailValidationException: Failed SHACL validation
test-cases/uniqueLang/not/invalid/case8/query1.rq
test-cases/uniqueLang/not/invalid/case8/query2.rq
org.eclipse.rdf4j.sail.shacl.ShaclSailValidationException: Failed SHACL validation
test-cases/uniqueLang/not/shacl.ttl
org.eclipse.rdf4j.sail.shacl.ShaclSailValidationException: Failed SHACL validation
org.eclipse.rdf4j.sail.shacl.ShaclSailValidationException: Failed SHACL validation
test-cases/uniqueLang/not/shacl.ttl
org.eclipse.rdf4j.sail.shacl.ShaclSailValidationException: Failed SHACL validation
org.eclipse.rdf4j.sail.shacl.ShaclSailValidationException: Failed SHACL validation
test-cases/uniqueLang/not/invalid/case8/query1.rq
test-cases/uniqueLang/not/invalid/case8/query2.rq
org.eclipse.rdf4j.sail.shacl.ShaclSailValidationException: Failed SHACL validation
test-cases/uniqueLang/not/shacl.ttl
org.eclipse.rdf4j.sail.shacl.ShaclSailValidationException: Failed SHACL validation
org.eclipse.rdf4j.sail.shacl.ShaclSailValidationException: Failed SHACL validation
test-cases/uniqueLang/not/shacl.ttl
org.eclipse.rdf4j.sail.shacl.ShaclSailValidationException: Failed SHACL validation
test-cases/uniqueLang/not/invalid/case9/query1.rq
test-cases/uniqueLang/not/invalid/case9/query2.rq
org.eclipse.rdf4j.sail.shacl.ShaclSailValidationException: Failed SHACL validation
test-cases/uniqueLang/not/shacl.ttl
org.eclipse.rdf4j.sail.shacl.ShaclSailValidationException: Failed SHACL validation
test-cases/uniqueLang/not/shacl.ttl
org.eclipse.rdf4j.sail.shacl.ShaclSailValidationException: Failed SHACL validation
test-cases/uniqueLang/not/invalid/case9/query1.rq
test-cases/uniqueLang/not/invalid/case9/query2.rq
org.eclipse.rdf4j.sail.shacl.ShaclSailValidationException: Failed SHACL validation
test-cases/uniqueLang/not/shacl.ttl
org.eclipse.rdf4j.sail.shacl.ShaclSailValidationException: Failed SHACL validation
test-cases/uniqueLang/not/shacl.ttl
org.eclipse.rdf4j.sail.shacl.ShaclSailValidationException: Failed SHACL validation
test-cases/uniqueLang/not/invalid/case9/query1.rq
test-cases/uniqueLang/not/invalid/case9/query2.rq
org.eclipse.rdf4j.sail.shacl.ShaclSailValidationException: Failed SHACL validation
test-cases/uniqueLang/not/shacl.ttl
org.eclipse.rdf4j.sail.shacl.ShaclSailValidationException: Failed SHACL validation
test-cases/uniqueLang/not/shacl.ttl
org.eclipse.rdf4j.sail.shacl.ShaclSailValidationException: Failed SHACL validation
org.eclipse.rdf4j.sail.shacl.ShaclSailValidationException: Failed SHACL validation
test-cases/uniqueLang/not/invalid/case10/query1.rq
test-cases/uniqueLang/not/invalid/case10/query2.rq
org.eclipse.rdf4j.sail.shacl.ShaclSailValidationException: Failed SHACL validation
test-cases/uniqueLang/not/shacl.ttl
org.eclipse.rdf4j.sail.shacl.ShaclSailValidationException: Failed SHACL validation
org.eclipse.rdf4j.sail.shacl.ShaclSailValidationException: Failed SHACL validation
test-cases/uniqueLang/not/shacl.ttl
org.eclipse.rdf4j.sail.shacl.ShaclSailValidationException: Failed SHACL validation
test-cases/uniqueLang/not/invalid/case10/query1.rq
test-cases/uniqueLang/not/invalid/case10/query2.rq
org.eclipse.rdf4j.sail.shacl.ShaclSailValidationException: Failed SHACL validation
test-cases/uniqueLang/not/shacl.ttl
org.eclipse.rdf4j.sail.shacl.ShaclSailValidationException: Failed SHACL validation
test-cases/uniqueLang/not/shacl.ttl
org.eclipse.rdf4j.sail.shacl.ShaclSailValidationException: Failed SHACL validation
test-cases/uniqueLang/not/invalid/case10/query1.rq
test-cases/uniqueLang/not/invalid/case10/query2.rq
org.eclipse.rdf4j.sail.shacl.ShaclSailValidationException: Failed SHACL validation
test-cases/uniqueLang/not/shacl.ttl
org.eclipse.rdf4j.sail.shacl.ShaclSailValidationException: Failed SHACL validation
test-cases/uniqueLang/simple/shacl.ttl
test-cases/uniqueLang/simple/valid/case1/query1.rq
test-cases/uniqueLang/simple/shacl.ttl
test-cases/uniqueLang/simple/shacl.ttl
test-cases/uniqueLang/simple/valid/case1/query1.rq
test-cases/uniqueLang/simple/shacl.ttl
test-cases/uniqueLang/simple/shacl.ttl
test-cases/uniqueLang/simple/valid/case1/query1.rq
test-cases/uniqueLang/simple/shacl.ttl
test-cases/uniqueLang/simple/shacl.ttl
test-cases/uniqueLang/simple/valid/case2/query1.rq
test-cases/uniqueLang/simple/valid/case2/query2.rq
test-cases/uniqueLang/simple/shacl.ttl
test-cases/uniqueLang/simple/shacl.ttl
test-cases/uniqueLang/simple/valid/case2/query1.rq
test-cases/uniqueLang/simple/valid/case2/query2.rq
test-cases/uniqueLang/simple/shacl.ttl
test-cases/uniqueLang/simple/shacl.ttl
test-cases/uniqueLang/simple/valid/case2/query1.rq
test-cases/uniqueLang/simple/valid/case2/query2.rq
test-cases/uniqueLang/simple/shacl.ttl
test-cases/uniqueLang/simple/shacl.ttl
test-cases/uniqueLang/simple/valid/case4/query1.rq
test-cases/uniqueLang/simple/valid/case4/query2.rq
test-cases/uniqueLang/simple/shacl.ttl
test-cases/uniqueLang/simple/shacl.ttl
test-cases/uniqueLang/simple/valid/case4/query1.rq
test-cases/uniqueLang/simple/valid/case4/query2.rq
test-cases/uniqueLang/simple/shacl.ttl
test-cases/uniqueLang/simple/shacl.ttl
test-cases/uniqueLang/simple/valid/case4/query1.rq
test-cases/uniqueLang/simple/valid/case4/query2.rq
test-cases/uniqueLang/simple/shacl.ttl
test-cases/uniqueLang/simple/shacl.ttl
test-cases/uniqueLang/simple/valid/case5/query1.rq
test-cases/uniqueLang/simple/shacl.ttl
test-cases/uniqueLang/simple/shacl.ttl
test-cases/uniqueLang/simple/valid/case5/query1.rq
test-cases/uniqueLang/simple/shacl.ttl
test-cases/uniqueLang/simple/shacl.ttl
test-cases/uniqueLang/simple/valid/case5/query1.rq
test-cases/uniqueLang/simple/shacl.ttl
test-cases/uniqueLang/simple/shacl.ttl
test-cases/uniqueLang/simple/valid/case6/query1.rq
test-cases/uniqueLang/simple/shacl.ttl
test-cases/uniqueLang/simple/shacl.ttl
test-cases/uniqueLang/simple/valid/case6/query1.rq
test-cases/uniqueLang/simple/shacl.ttl
test-cases/uniqueLang/simple/shacl.ttl
test-cases/uniqueLang/simple/valid/case6/query1.rq
test-cases/uniqueLang/simple/shacl.ttl
test-cases/uniqueLang/simple/shacl.ttl
test-cases/uniqueLang/simple/valid/case7/query1.rq
test-cases/uniqueLang/simple/shacl.ttl
test-cases/uniqueLang/simple/shacl.ttl
test-cases/uniqueLang/simple/valid/case7/query1.rq
test-cases/uniqueLang/simple/shacl.ttl
test-cases/uniqueLang/simple/shacl.ttl
test-cases/uniqueLang/simple/valid/case7/query1.rq
test-cases/uniqueLang/simple/shacl.ttl
test-cases/uniqueLang/simple/shacl.ttl
org.eclipse.rdf4j.sail.shacl.ShaclSailValidationException: Failed SHACL validation
test-cases/uniqueLang/simple/invalid/case1/query1.rq
org.eclipse.rdf4j.sail.shacl.ShaclSailValidationException: Failed SHACL validation
test-cases/uniqueLang/simple/shacl.ttl
org.eclipse.rdf4j.sail.shacl.ShaclSailValidationException: Failed SHACL validation
test-cases/uniqueLang/simple/shacl.ttl
org.eclipse.rdf4j.sail.shacl.ShaclSailValidationException: Failed SHACL validation
test-cases/uniqueLang/simple/invalid/case1/query1.rq
org.eclipse.rdf4j.sail.shacl.ShaclSailValidationException: Failed SHACL validation
test-cases/uniqueLang/simple/shacl.ttl
org.eclipse.rdf4j.sail.shacl.ShaclSailValidationException: Failed SHACL validation
test-cases/uniqueLang/simple/shacl.ttl
org.eclipse.rdf4j.sail.shacl.ShaclSailValidationException: Failed SHACL validation
test-cases/uniqueLang/simple/invalid/case1/query1.rq
org.eclipse.rdf4j.sail.shacl.ShaclSailValidationException: Failed SHACL validation
test-cases/uniqueLang/simple/shacl.ttl
org.eclipse.rdf4j.sail.shacl.ShaclSailValidationException: Failed SHACL validation
test-cases/uniqueLang/simple/shacl.ttl
org.eclipse.rdf4j.sail.shacl.ShaclSailValidationException: Failed SHACL validation
test-cases/uniqueLang/simple/invalid/case2/query1.rq
test-cases/uniqueLang/simple/invalid/case2/query2.rq
org.eclipse.rdf4j.sail.shacl.ShaclSailValidationException: Failed SHACL validation
test-cases/uniqueLang/simple/shacl.ttl
org.eclipse.rdf4j.sail.shacl.ShaclSailValidationException: Failed SHACL validation
test-cases/uniqueLang/simple/shacl.ttl
org.eclipse.rdf4j.sail.shacl.ShaclSailValidationException: Failed SHACL validation
test-cases/uniqueLang/simple/invalid/case2/query1.rq
test-cases/uniqueLang/simple/invalid/case2/query2.rq
org.eclipse.rdf4j.sail.shacl.ShaclSailValidationException: Failed SHACL validation
test-cases/uniqueLang/simple/shacl.ttl
org.eclipse.rdf4j.sail.shacl.ShaclSailValidationException: Failed SHACL validation
test-cases/uniqueLang/simple/shacl.ttl
org.eclipse.rdf4j.sail.shacl.ShaclSailValidationException: Failed SHACL validation
test-cases/uniqueLang/simple/invalid/case2/query1.rq
test-cases/uniqueLang/simple/invalid/case2/query2.rq
org.eclipse.rdf4j.sail.shacl.ShaclSailValidationException: Failed SHACL validation
test-cases/uniqueLang/simple/shacl.ttl
org.eclipse.rdf4j.sail.shacl.ShaclSailValidationException: Failed SHACL validation
test-cases/uniqueLang/simple/shacl.ttl
org.eclipse.rdf4j.sail.shacl.ShaclSailValidationException: Failed SHACL validation
test-cases/uniqueLang/simple/invalid/case3/query1.rq
test-cases/uniqueLang/simple/invalid/case3/query2.rq
org.eclipse.rdf4j.sail.shacl.ShaclSailValidationException: Failed SHACL validation
test-cases/uniqueLang/simple/shacl.ttl
org.eclipse.rdf4j.sail.shacl.ShaclSailValidationException: Failed SHACL validation
test-cases/uniqueLang/simple/shacl.ttl
org.eclipse.rdf4j.sail.shacl.ShaclSailValidationException: Failed SHACL validation
test-cases/uniqueLang/simple/invalid/case3/query1.rq
test-cases/uniqueLang/simple/invalid/case3/query2.rq
org.eclipse.rdf4j.sail.shacl.ShaclSailValidationException: Failed SHACL validation
test-cases/uniqueLang/simple/shacl.ttl
org.eclipse.rdf4j.sail.shacl.ShaclSailValidationException: Failed SHACL validation
test-cases/uniqueLang/simple/shacl.ttl
org.eclipse.rdf4j.sail.shacl.ShaclSailValidationException: Failed SHACL validation
test-cases/uniqueLang/simple/invalid/case3/query1.rq
test-cases/uniqueLang/simple/invalid/case3/query2.rq
org.eclipse.rdf4j.sail.shacl.ShaclSailValidationException: Failed SHACL validation
test-cases/uniqueLang/simple/shacl.ttl
org.eclipse.rdf4j.sail.shacl.ShaclSailValidationException: Failed SHACL validation
test-cases/uniqueLang/simple/shacl.ttl
org.eclipse.rdf4j.sail.shacl.ShaclSailValidationException: Failed SHACL validation
test-cases/uniqueLang/simple/invalid/case4/query1.rq
test-cases/uniqueLang/simple/invalid/case4/query2.rq
org.eclipse.rdf4j.sail.shacl.ShaclSailValidationException: Failed SHACL validation
test-cases/uniqueLang/simple/shacl.ttl
org.eclipse.rdf4j.sail.shacl.ShaclSailValidationException: Failed SHACL validation
test-cases/uniqueLang/simple/shacl.ttl
org.eclipse.rdf4j.sail.shacl.ShaclSailValidationException: Failed SHACL validation
test-cases/uniqueLang/simple/invalid/case4/query1.rq
test-cases/uniqueLang/simple/invalid/case4/query2.rq
org.eclipse.rdf4j.sail.shacl.ShaclSailValidationException: Failed SHACL validation
test-cases/uniqueLang/simple/shacl.ttl
org.eclipse.rdf4j.sail.shacl.ShaclSailValidationException: Failed SHACL validation
test-cases/uniqueLang/simple/shacl.ttl
org.eclipse.rdf4j.sail.shacl.ShaclSailValidationException: Failed SHACL validation
test-cases/uniqueLang/simple/invalid/case4/query1.rq
test-cases/uniqueLang/simple/invalid/case4/query2.rq
org.eclipse.rdf4j.sail.shacl.ShaclSailValidationException: Failed SHACL validation
test-cases/uniqueLang/simple/shacl.ttl
org.eclipse.rdf4j.sail.shacl.ShaclSailValidationException: Failed SHACL validation
[INFO] Tests run: 6300, Failures: 0, Errors: 0, Skipped: 0, Time elapsed: 61.047 s - in org.eclipse.rdf4j.sail.shacl.ShaclTest
[INFO] Running org.eclipse.rdf4j.sail.shacl.InnerJoinTest
01:43:50.786 [main] INFO  null	EqualsJoin.next():  Tuple{line=["a"], propertyShapes= } :  EqualsJoin{useAsFilter=false}
01:43:50.786 [main] INFO  null	EqualsJoin.next():  Tuple{line=["a"], propertyShapes= } :  EqualsJoin{useAsFilter=false}
01:43:50.786 [main] INFO  null	EqualsJoin.next():  Tuple{line=["c"], propertyShapes= } :  EqualsJoin{useAsFilter=false}
01:43:50.786 [main] INFO  null	EqualsJoin.next():  Tuple{line=["a"], propertyShapes= } :  EqualsJoin{useAsFilter=false}
01:43:50.786 [main] INFO  null	EqualsJoin.next():  Tuple{line=["c"], propertyShapes= } :  EqualsJoin{useAsFilter=false}
01:43:50.786 [main] INFO  null	EqualsJoin.next():  Tuple{line=["c"], propertyShapes= } :  EqualsJoin{useAsFilter=false}
01:43:50.786 [main] INFO  null	EqualsJoin.next():  Tuple{line=["a", "1"], propertyShapes= } :  EqualsJoin{useAsFilter=true}
01:43:50.786 [main] INFO  null	EqualsJoin.next():  Tuple{line=["b", "1"], propertyShapes= } :  EqualsJoin{useAsFilter=true}
01:43:50.786 [main] INFO  null	EqualsJoin.next():  Tuple{line=["b", "1"], propertyShapes= } :  EqualsJoin{useAsFilter=true}
01:43:50.786 [main] INFO  null	EqualsJoin.next():  Tuple{line=["c", "1"], propertyShapes= } :  EqualsJoin{useAsFilter=true}
Tuple{line=["a1", "b1"], propertyShapes= }
Tuple{line=["a2", "b2"], propertyShapes= }
Tuple{line=["a2", "b22"], propertyShapes= }
Tuple{line=["a4", "b4"], propertyShapes= }
01:43:50.790 [main] INFO  null	EqualsJoin.next():  Tuple{line=["a"], propertyShapes= } :  EqualsJoin{useAsFilter=false}
01:43:50.790 [main] INFO  null	EqualsJoin.next():  Tuple{line=["a"], propertyShapes= } :  EqualsJoin{useAsFilter=false}
01:43:50.790 [main] INFO  null	EqualsJoin.next():  Tuple{line=["c"], propertyShapes= } :  EqualsJoin{useAsFilter=false}
01:43:50.790 [main] INFO  null	EqualsJoin.next():  Tuple{line=["a"], propertyShapes= } :  EqualsJoin{useAsFilter=false}
01:43:50.790 [main] INFO  null	EqualsJoin.next():  Tuple{line=["c"], propertyShapes= } :  EqualsJoin{useAsFilter=false}
01:43:50.790 [main] INFO  null	EqualsJoin.next():  Tuple{line=["c"], propertyShapes= } :  EqualsJoin{useAsFilter=false}
01:43:50.790 [main] INFO  null	EqualsJoin.next():  Tuple{line=["a", "1"], propertyShapes= } :  EqualsJoin{useAsFilter=true}
01:43:50.790 [main] INFO  null	EqualsJoin.next():  Tuple{line=["b", "1"], propertyShapes= } :  EqualsJoin{useAsFilter=true}
01:43:50.790 [main] INFO  null	EqualsJoin.next():  Tuple{line=["b", "1"], propertyShapes= } :  EqualsJoin{useAsFilter=true}
01:43:50.790 [main] INFO  null	EqualsJoin.next():  Tuple{line=["c", "1"], propertyShapes= } :  EqualsJoin{useAsFilter=true}
Tuple{line=["a2", "b2"], propertyShapes= }
Tuple{line=["a2", "b22"], propertyShapes= }
Tuple{line=["a4", "b4"], propertyShapes= }
01:43:50.791 [main] INFO  null	EqualsJoin.next():  Tuple{line=["a"], propertyShapes= } :  EqualsJoin{useAsFilter=false}
01:43:50.791 [main] INFO  null	EqualsJoin.next():  Tuple{line=["a"], propertyShapes= } :  EqualsJoin{useAsFilter=false}
01:43:50.791 [main] INFO  null	EqualsJoin.next():  Tuple{line=["c"], propertyShapes= } :  EqualsJoin{useAsFilter=false}
01:43:50.791 [main] INFO  null	EqualsJoin.next():  Tuple{line=["a"], propertyShapes= } :  EqualsJoin{useAsFilter=false}
01:43:50.791 [main] INFO  null	EqualsJoin.next():  Tuple{line=["c"], propertyShapes= } :  EqualsJoin{useAsFilter=false}
01:43:50.791 [main] INFO  null	EqualsJoin.next():  Tuple{line=["c"], propertyShapes= } :  EqualsJoin{useAsFilter=false}
01:43:50.791 [main] INFO  null	EqualsJoin.next():  Tuple{line=["a", "1"], propertyShapes= } :  EqualsJoin{useAsFilter=true}
01:43:50.791 [main] INFO  null	EqualsJoin.next():  Tuple{line=["b", "1"], propertyShapes= } :  EqualsJoin{useAsFilter=true}
01:43:50.791 [main] INFO  null	EqualsJoin.next():  Tuple{line=["b", "1"], propertyShapes= } :  EqualsJoin{useAsFilter=true}
01:43:50.791 [main] INFO  null	EqualsJoin.next():  Tuple{line=["c", "1"], propertyShapes= } :  EqualsJoin{useAsFilter=true}
Tuple{line=["a2", "b2"], propertyShapes= }
Tuple{line=["a2", "b22"], propertyShapes= }
01:43:50.792 [main] INFO  null	EqualsJoin.next():  Tuple{line=["a"], propertyShapes= } :  EqualsJoin{useAsFilter=false}
01:43:50.792 [main] INFO  null	EqualsJoin.next():  Tuple{line=["a"], propertyShapes= } :  EqualsJoin{useAsFilter=false}
01:43:50.792 [main] INFO  null	EqualsJoin.next():  Tuple{line=["c"], propertyShapes= } :  EqualsJoin{useAsFilter=false}
01:43:50.792 [main] INFO  null	EqualsJoin.next():  Tuple{line=["a"], propertyShapes= } :  EqualsJoin{useAsFilter=false}
01:43:50.792 [main] INFO  null	EqualsJoin.next():  Tuple{line=["c"], propertyShapes= } :  EqualsJoin{useAsFilter=false}
01:43:50.792 [main] INFO  null	EqualsJoin.next():  Tuple{line=["c"], propertyShapes= } :  EqualsJoin{useAsFilter=false}
01:43:50.792 [main] INFO  null	EqualsJoin.next():  Tuple{line=["a", "1"], propertyShapes= } :  EqualsJoin{useAsFilter=true}
01:43:50.792 [main] INFO  null	EqualsJoin.next():  Tuple{line=["b", "1"], propertyShapes= } :  EqualsJoin{useAsFilter=true}
01:43:50.792 [main] INFO  null	EqualsJoin.next():  Tuple{line=["b", "1"], propertyShapes= } :  EqualsJoin{useAsFilter=true}
01:43:50.792 [main] INFO  null	EqualsJoin.next():  Tuple{line=["c", "1"], propertyShapes= } :  EqualsJoin{useAsFilter=true}
Tuple{line=["a1", "b1"], propertyShapes= }
Tuple{line=["a1", "b11"], propertyShapes= }
Tuple{line=["a2", "b2"], propertyShapes= }
Tuple{line=["a2", "b22"], propertyShapes= }
01:43:50.793 [main] INFO  null	EqualsJoin.next():  Tuple{line=["a"], propertyShapes= } :  EqualsJoin{useAsFilter=false}
01:43:50.793 [main] INFO  null	EqualsJoin.next():  Tuple{line=["a"], propertyShapes= } :  EqualsJoin{useAsFilter=false}
01:43:50.793 [main] INFO  null	EqualsJoin.next():  Tuple{line=["c"], propertyShapes= } :  EqualsJoin{useAsFilter=false}
01:43:50.793 [main] INFO  null	EqualsJoin.next():  Tuple{line=["a"], propertyShapes= } :  EqualsJoin{useAsFilter=false}
01:43:50.793 [main] INFO  null	EqualsJoin.next():  Tuple{line=["c"], propertyShapes= } :  EqualsJoin{useAsFilter=false}
01:43:50.793 [main] INFO  null	EqualsJoin.next():  Tuple{line=["c"], propertyShapes= } :  EqualsJoin{useAsFilter=false}
01:43:50.793 [main] INFO  null	EqualsJoin.next():  Tuple{line=["a", "1"], propertyShapes= } :  EqualsJoin{useAsFilter=true}
01:43:50.793 [main] INFO  null	EqualsJoin.next():  Tuple{line=["b", "1"], propertyShapes= } :  EqualsJoin{useAsFilter=true}
01:43:50.793 [main] INFO  null	EqualsJoin.next():  Tuple{line=["b", "1"], propertyShapes= } :  EqualsJoin{useAsFilter=true}
01:43:50.793 [main] INFO  null	EqualsJoin.next():  Tuple{line=["c", "1"], propertyShapes= } :  EqualsJoin{useAsFilter=true}
Tuple{line=["a1", "b"], propertyShapes= }
01:43:50.794 [main] INFO  null	EqualsJoin.next():  Tuple{line=["a"], propertyShapes= } :  EqualsJoin{useAsFilter=false}
01:43:50.794 [main] INFO  null	EqualsJoin.next():  Tuple{line=["a"], propertyShapes= } :  EqualsJoin{useAsFilter=false}
01:43:50.794 [main] INFO  null	EqualsJoin.next():  Tuple{line=["c"], propertyShapes= } :  EqualsJoin{useAsFilter=false}
01:43:50.794 [main] INFO  null	EqualsJoin.next():  Tuple{line=["a"], propertyShapes= } :  EqualsJoin{useAsFilter=false}
01:43:50.794 [main] INFO  null	EqualsJoin.next():  Tuple{line=["c"], propertyShapes= } :  EqualsJoin{useAsFilter=false}
01:43:50.794 [main] INFO  null	EqualsJoin.next():  Tuple{line=["c"], propertyShapes= } :  EqualsJoin{useAsFilter=false}
01:43:50.794 [main] INFO  null	EqualsJoin.next():  Tuple{line=["a", "1"], propertyShapes= } :  EqualsJoin{useAsFilter=true}
01:43:50.794 [main] INFO  null	EqualsJoin.next():  Tuple{line=["b", "1"], propertyShapes= } :  EqualsJoin{useAsFilter=true}
01:43:50.794 [main] INFO  null	EqualsJoin.next():  Tuple{line=["b", "1"], propertyShapes= } :  EqualsJoin{useAsFilter=true}
01:43:50.794 [main] INFO  null	EqualsJoin.next():  Tuple{line=["c", "1"], propertyShapes= } :  EqualsJoin{useAsFilter=true}
Tuple{line=["a2", "b"], propertyShapes= }
01:43:50.795 [main] INFO  null	EqualsJoin.next():  Tuple{line=["a"], propertyShapes= } :  EqualsJoin{useAsFilter=false}
01:43:50.795 [main] INFO  null	EqualsJoin.next():  Tuple{line=["a"], propertyShapes= } :  EqualsJoin{useAsFilter=false}
01:43:50.795 [main] INFO  null	EqualsJoin.next():  Tuple{line=["c"], propertyShapes= } :  EqualsJoin{useAsFilter=false}
01:43:50.795 [main] INFO  null	EqualsJoin.next():  Tuple{line=["a"], propertyShapes= } :  EqualsJoin{useAsFilter=false}
01:43:50.795 [main] INFO  null	EqualsJoin.next():  Tuple{line=["c"], propertyShapes= } :  EqualsJoin{useAsFilter=false}
01:43:50.795 [main] INFO  null	EqualsJoin.next():  Tuple{line=["c"], propertyShapes= } :  EqualsJoin{useAsFilter=false}
01:43:50.795 [main] INFO  null	EqualsJoin.next():  Tuple{line=["a", "1"], propertyShapes= } :  EqualsJoin{useAsFilter=true}
01:43:50.795 [main] INFO  null	EqualsJoin.next():  Tuple{line=["b", "1"], propertyShapes= } :  EqualsJoin{useAsFilter=true}
01:43:50.795 [main] INFO  null	EqualsJoin.next():  Tuple{line=["b", "1"], propertyShapes= } :  EqualsJoin{useAsFilter=true}
01:43:50.795 [main] INFO  null	EqualsJoin.next():  Tuple{line=["c", "1"], propertyShapes= } :  EqualsJoin{useAsFilter=true}
01:43:50.796 [main] INFO  null	EqualsJoin.next():  Tuple{line=["a"], propertyShapes= } :  EqualsJoin{useAsFilter=false}
01:43:50.796 [main] INFO  null	EqualsJoin.next():  Tuple{line=["a"], propertyShapes= } :  EqualsJoin{useAsFilter=false}
01:43:50.796 [main] INFO  null	EqualsJoin.next():  Tuple{line=["c"], propertyShapes= } :  EqualsJoin{useAsFilter=false}
01:43:50.796 [main] INFO  null	EqualsJoin.next():  Tuple{line=["a"], propertyShapes= } :  EqualsJoin{useAsFilter=false}
01:43:50.796 [main] INFO  null	EqualsJoin.next():  Tuple{line=["c"], propertyShapes= } :  EqualsJoin{useAsFilter=false}
01:43:50.796 [main] INFO  null	EqualsJoin.next():  Tuple{line=["c"], propertyShapes= } :  EqualsJoin{useAsFilter=false}
01:43:50.796 [main] INFO  null	EqualsJoin.next():  Tuple{line=["a", "1"], propertyShapes= } :  EqualsJoin{useAsFilter=true}
01:43:50.796 [main] INFO  null	EqualsJoin.next():  Tuple{line=["b", "1"], propertyShapes= } :  EqualsJoin{useAsFilter=true}
01:43:50.796 [main] INFO  null	EqualsJoin.next():  Tuple{line=["b", "1"], propertyShapes= } :  EqualsJoin{useAsFilter=true}
01:43:50.796 [main] INFO  null	EqualsJoin.next():  Tuple{line=["c", "1"], propertyShapes= } :  EqualsJoin{useAsFilter=true}
01:43:50.796 [main] INFO  null	EqualsJoin.next():  Tuple{line=["a"], propertyShapes= } :  EqualsJoin{useAsFilter=false}
01:43:50.797 [main] INFO  null	EqualsJoin.next():  Tuple{line=["a"], propertyShapes= } :  EqualsJoin{useAsFilter=false}
01:43:50.797 [main] INFO  null	EqualsJoin.next():  Tuple{line=["c"], propertyShapes= } :  EqualsJoin{useAsFilter=false}
01:43:50.797 [main] INFO  null	EqualsJoin.next():  Tuple{line=["a"], propertyShapes= } :  EqualsJoin{useAsFilter=false}
01:43:50.797 [main] INFO  null	EqualsJoin.next():  Tuple{line=["c"], propertyShapes= } :  EqualsJoin{useAsFilter=false}
01:43:50.797 [main] INFO  null	EqualsJoin.next():  Tuple{line=["c"], propertyShapes= } :  EqualsJoin{useAsFilter=false}
01:43:50.797 [main] INFO  null	EqualsJoin.next():  Tuple{line=["a", "1"], propertyShapes= } :  EqualsJoin{useAsFilter=true}
01:43:50.797 [main] INFO  null	EqualsJoin.next():  Tuple{line=["b", "1"], propertyShapes= } :  EqualsJoin{useAsFilter=true}
01:43:50.797 [main] INFO  null	EqualsJoin.next():  Tuple{line=["b", "1"], propertyShapes= } :  EqualsJoin{useAsFilter=true}
01:43:50.797 [main] INFO  null	EqualsJoin.next():  Tuple{line=["c", "1"], propertyShapes= } :  EqualsJoin{useAsFilter=true}
Tuple{line=["a1", "b1"], propertyShapes= }
Tuple{line=["a2", "b2"], propertyShapes= }
Tuple{line=["a3", "b3"], propertyShapes= }
Tuple{line=["a4", "b4"], propertyShapes= }
01:43:50.797 [main] INFO  null	EqualsJoin.next():  Tuple{line=["a"], propertyShapes= } :  EqualsJoin{useAsFilter=false}
01:43:50.797 [main] INFO  null	EqualsJoin.next():  Tuple{line=["a"], propertyShapes= } :  EqualsJoin{useAsFilter=false}
01:43:50.797 [main] INFO  null	EqualsJoin.next():  Tuple{line=["c"], propertyShapes= } :  EqualsJoin{useAsFilter=false}
01:43:50.797 [main] INFO  null	EqualsJoin.next():  Tuple{line=["a"], propertyShapes= } :  EqualsJoin{useAsFilter=false}
01:43:50.797 [main] INFO  null	EqualsJoin.next():  Tuple{line=["c"], propertyShapes= } :  EqualsJoin{useAsFilter=false}
01:43:50.797 [main] INFO  null	EqualsJoin.next():  Tuple{line=["c"], propertyShapes= } :  EqualsJoin{useAsFilter=false}
01:43:50.797 [main] INFO  null	EqualsJoin.next():  Tuple{line=["a", "1"], propertyShapes= } :  EqualsJoin{useAsFilter=true}
01:43:50.797 [main] INFO  null	EqualsJoin.next():  Tuple{line=["b", "1"], propertyShapes= } :  EqualsJoin{useAsFilter=true}
01:43:50.797 [main] INFO  null	EqualsJoin.next():  Tuple{line=["b", "1"], propertyShapes= } :  EqualsJoin{useAsFilter=true}
01:43:50.798 [main] INFO  null	EqualsJoin.next():  Tuple{line=["c", "1"], propertyShapes= } :  EqualsJoin{useAsFilter=true}
Tuple{line=["a1", "b1"], propertyShapes= }
Tuple{line=["a2", "b2"], propertyShapes= }
01:43:50.798 [main] INFO  null	EqualsJoin.next():  Tuple{line=["a"], propertyShapes= } :  EqualsJoin{useAsFilter=false}
01:43:50.798 [main] INFO  null	EqualsJoin.next():  Tuple{line=["a"], propertyShapes= } :  EqualsJoin{useAsFilter=false}
01:43:50.798 [main] INFO  null	EqualsJoin.next():  Tuple{line=["c"], propertyShapes= } :  EqualsJoin{useAsFilter=false}
01:43:50.798 [main] INFO  null	EqualsJoin.next():  Tuple{line=["a"], propertyShapes= } :  EqualsJoin{useAsFilter=false}
01:43:50.798 [main] INFO  null	EqualsJoin.next():  Tuple{line=["c"], propertyShapes= } :  EqualsJoin{useAsFilter=false}
01:43:50.798 [main] INFO  null	EqualsJoin.next():  Tuple{line=["c"], propertyShapes= } :  EqualsJoin{useAsFilter=false}
01:43:50.798 [main] INFO  null	EqualsJoin.next():  Tuple{line=["a", "1"], propertyShapes= } :  EqualsJoin{useAsFilter=true}
01:43:50.798 [main] INFO  null	EqualsJoin.next():  Tuple{line=["b", "1"], propertyShapes= } :  EqualsJoin{useAsFilter=true}
01:43:50.798 [main] INFO  null	EqualsJoin.next():  Tuple{line=["b", "1"], propertyShapes= } :  EqualsJoin{useAsFilter=true}
01:43:50.798 [main] INFO  null	EqualsJoin.next():  Tuple{line=["c", "1"], propertyShapes= } :  EqualsJoin{useAsFilter=true}
Tuple{line=["a1", "b1"], propertyShapes= }
Tuple{line=["a2", "b2"], propertyShapes= }
Tuple{line=["a3", "b3"], propertyShapes= }
01:43:50.799 [main] INFO  null	EqualsJoin.next():  Tuple{line=["a"], propertyShapes= } :  EqualsJoin{useAsFilter=false}
01:43:50.799 [main] INFO  null	EqualsJoin.next():  Tuple{line=["a"], propertyShapes= } :  EqualsJoin{useAsFilter=false}
01:43:50.799 [main] INFO  null	EqualsJoin.next():  Tuple{line=["c"], propertyShapes= } :  EqualsJoin{useAsFilter=false}
01:43:50.799 [main] INFO  null	EqualsJoin.next():  Tuple{line=["a"], propertyShapes= } :  EqualsJoin{useAsFilter=false}
01:43:50.799 [main] INFO  null	EqualsJoin.next():  Tuple{line=["c"], propertyShapes= } :  EqualsJoin{useAsFilter=false}
01:43:50.799 [main] INFO  null	EqualsJoin.next():  Tuple{line=["c"], propertyShapes= } :  EqualsJoin{useAsFilter=false}
01:43:50.799 [main] INFO  null	EqualsJoin.next():  Tuple{line=["a", "1"], propertyShapes= } :  EqualsJoin{useAsFilter=true}
01:43:50.799 [main] INFO  null	EqualsJoin.next():  Tuple{line=["b", "1"], propertyShapes= } :  EqualsJoin{useAsFilter=true}
01:43:50.799 [main] INFO  null	EqualsJoin.next():  Tuple{line=["b", "1"], propertyShapes= } :  EqualsJoin{useAsFilter=true}
01:43:50.799 [main] INFO  null	EqualsJoin.next():  Tuple{line=["c", "1"], propertyShapes= } :  EqualsJoin{useAsFilter=true}
Tuple{line=["a1", "b1"], propertyShapes= }
Tuple{line=["a2", "b2"], propertyShapes= }
Tuple{line=["a2", "b22"], propertyShapes= }
Tuple{line=["a3", "b3"], propertyShapes= }
Tuple{line=["a4", "b4"], propertyShapes= }
01:43:50.800 [main] INFO  null	EqualsJoin.next():  Tuple{line=["a"], propertyShapes= } :  EqualsJoin{useAsFilter=false}
01:43:50.800 [main] INFO  null	EqualsJoin.next():  Tuple{line=["a"], propertyShapes= } :  EqualsJoin{useAsFilter=false}
01:43:50.800 [main] INFO  null	EqualsJoin.next():  Tuple{line=["c"], propertyShapes= } :  EqualsJoin{useAsFilter=false}
01:43:50.800 [main] INFO  null	EqualsJoin.next():  Tuple{line=["a"], propertyShapes= } :  EqualsJoin{useAsFilter=false}
01:43:50.800 [main] INFO  null	EqualsJoin.next():  Tuple{line=["c"], propertyShapes= } :  EqualsJoin{useAsFilter=false}
01:43:50.800 [main] INFO  null	EqualsJoin.next():  Tuple{line=["c"], propertyShapes= } :  EqualsJoin{useAsFilter=false}
01:43:50.800 [main] INFO  null	EqualsJoin.next():  Tuple{line=["a", "1"], propertyShapes= } :  EqualsJoin{useAsFilter=true}
01:43:50.800 [main] INFO  null	EqualsJoin.next():  Tuple{line=["b", "1"], propertyShapes= } :  EqualsJoin{useAsFilter=true}
01:43:50.800 [main] INFO  null	EqualsJoin.next():  Tuple{line=["b", "1"], propertyShapes= } :  EqualsJoin{useAsFilter=true}
01:43:50.800 [main] INFO  null	EqualsJoin.next():  Tuple{line=["c", "1"], propertyShapes= } :  EqualsJoin{useAsFilter=true}
Tuple{line=["a", "b"], propertyShapes= }
[INFO] Tests run: 13, Failures: 0, Errors: 0, Skipped: 0, Time elapsed: 0 s - in org.eclipse.rdf4j.sail.shacl.InnerJoinTest
[INFO] 
[INFO] Results:
[INFO] 
[WARNING] Tests run: 8527, Failures: 0, Errors: 0, Skipped: 102
[INFO] 
[JENKINS] Recording test results
[INFO] 
[INFO] --- animal-sniffer-maven-plugin:1.16:check (default) @ rdf4j-shacl ---
[INFO] Checking unresolved references to org.codehaus.mojo.signature:java18:1.0
[INFO] 
[INFO] --- maven-jar-plugin:2.3.1:jar (default-jar) @ rdf4j-shacl ---
[INFO] Building jar: /home/hudson/genie.rdf4j/.jenkins/jobs/rdf4j-pr-verify/workspace/core/sail/shacl/target/rdf4j-shacl-3.0.4-SNAPSHOT.jar