Console Output

[INFO] 
[INFO] --------------< org.eclipse.rdf4j:rdf4j-sail-inferencer >---------------
[INFO] Building RDF4J: Inferencer Sails 3.5.0-SNAPSHOT                 [63/104]
[INFO] --------------------------------[ jar ]---------------------------------
[INFO] 
[INFO] --- buildnumber-maven-plugin:1.4:create (default) @ rdf4j-sail-inferencer ---
[INFO] ShortRevision tag detected. The value is '7'.
[INFO] Executing: /bin/sh -c cd '/home/jenkins/agent/workspace/rdf4j-pr-verify/core/sail/inferencer' && 'git' 'rev-parse' '--verify' '--short=7' 'HEAD'
[INFO] Working directory: /home/jenkins/agent/workspace/rdf4j-pr-verify/core/sail/inferencer
[INFO] Storing buildNumber: a620ebc at timestamp: 1603678713286
[WARNING] Cannot get the branch information from the git repository: 
Detecting the current branch failed: fatal: ref HEAD is not a symbolic ref

[INFO] ShortRevision tag detected. The value is '7'.
[INFO] Executing: /bin/sh -c cd '/home/jenkins/agent/workspace/rdf4j-pr-verify/core/sail/inferencer' && 'git' 'rev-parse' '--verify' '--short=7' 'HEAD'
[INFO] Working directory: /home/jenkins/agent/workspace/rdf4j-pr-verify/core/sail/inferencer
[INFO] Storing buildScmBranch: UNKNOWN
[INFO] 
[INFO] --- maven-resources-plugin:3.0.2:resources (default-resources) @ rdf4j-sail-inferencer ---
[INFO] Using 'UTF-8' encoding to copy filtered resources.
[INFO] Copying 1 resource
[INFO] 
[INFO] --- maven-compiler-plugin:3.7.0:compile (default-compile) @ rdf4j-sail-inferencer ---
[INFO] Changes detected - recompiling the module!
[INFO] Compiling 24 source files to /home/jenkins/agent/workspace/rdf4j-pr-verify/core/sail/inferencer/target/classes
[INFO] 
[INFO] --- maven-resources-plugin:3.0.2:testResources (default-testResources) @ rdf4j-sail-inferencer ---
[INFO] Using 'UTF-8' encoding to copy filtered resources.
[INFO] Copying 15 resources
[INFO] 
[INFO] --- maven-compiler-plugin:3.7.0:testCompile (default-testCompile) @ rdf4j-sail-inferencer ---
[INFO] Nothing to compile - all classes are up to date
[INFO] 
[INFO] --- maven-surefire-plugin:2.22.2:test (default-test) @ rdf4j-sail-inferencer ---
[INFO] 
[INFO] -------------------------------------------------------
[INFO]  T E S T S
[INFO] -------------------------------------------------------
[INFO] Running org.eclipse.rdf4j.sail.inferencer.fc.SchemaCachingRDFSInferencerRDFSchemaMemoryRepositoryConnectionTest
-----------
(http://example.org/Man, http://www.w3.org/2000/01/rdf-schema#subClassOf, http://www.w3.org/2000/01/rdf-schema#Resource, http://example.org/graph1) [http://example.org/graph1]
(http://example.org/Man, http://www.w3.org/2000/01/rdf-schema#subClassOf, http://example.org/Man) [null]
(http://example.org/Man, http://www.w3.org/2000/01/rdf-schema#subClassOf, http://example.org/Human) [null]
(http://example.org/Man, http://www.w3.org/2000/01/rdf-schema#subClassOf, http://example.org/Animal) [null]
(http://example.org/Man, http://www.w3.org/2000/01/rdf-schema#subClassOf, http://www.w3.org/2000/01/rdf-schema#Resource, http://example.org/graph3) [http://example.org/graph3]
(http://example.org/Man, http://www.w3.org/2000/01/rdf-schema#subClassOf, http://example.org/Human, http://example.org/graph1) [http://example.org/graph1]
-----------
(http://example.org/bob, http://www.w3.org/1999/02/22-rdf-syntax-ns#type, http://www.w3.org/2000/01/rdf-schema#Resource, http://example.org/graph3) [http://example.org/graph3]
(http://example.org/bob, http://www.w3.org/1999/02/22-rdf-syntax-ns#type, http://example.org/Animal, http://example.org/graph3) [http://example.org/graph3]
(http://example.org/bob, http://www.w3.org/1999/02/22-rdf-syntax-ns#type, http://example.org/Human, http://example.org/graph3) [http://example.org/graph3]
(http://example.org/bob, http://www.w3.org/1999/02/22-rdf-syntax-ns#type, http://example.org/Man, http://example.org/graph3) [http://example.org/graph3]
-----------
02:18:36.101 [Time-limited test] WARN  [Rio error] Illegal language tag char: '_' (6, -1)
02:18:36.119 [Time-limited test] WARN  [Rio error] Illegal language tag char: '_' (6, -1)
-----------
(http://example.org/Man, http://www.w3.org/2000/01/rdf-schema#subClassOf, http://www.w3.org/2000/01/rdf-schema#Resource, http://example.org/graph1) [http://example.org/graph1]
(http://example.org/Man, http://www.w3.org/2000/01/rdf-schema#subClassOf, http://example.org/Man) [null]
(http://example.org/Man, http://www.w3.org/2000/01/rdf-schema#subClassOf, http://example.org/Human) [null]
(http://example.org/Man, http://www.w3.org/2000/01/rdf-schema#subClassOf, http://example.org/Animal) [null]
(http://example.org/Man, http://www.w3.org/2000/01/rdf-schema#subClassOf, http://www.w3.org/2000/01/rdf-schema#Resource, http://example.org/graph3) [http://example.org/graph3]
(http://example.org/Man, http://www.w3.org/2000/01/rdf-schema#subClassOf, http://example.org/Human, http://example.org/graph1) [http://example.org/graph1]
-----------
(http://example.org/bob, http://www.w3.org/1999/02/22-rdf-syntax-ns#type, http://www.w3.org/2000/01/rdf-schema#Resource, http://example.org/graph3) [http://example.org/graph3]
(http://example.org/bob, http://www.w3.org/1999/02/22-rdf-syntax-ns#type, http://example.org/Animal, http://example.org/graph3) [http://example.org/graph3]
(http://example.org/bob, http://www.w3.org/1999/02/22-rdf-syntax-ns#type, http://example.org/Human, http://example.org/graph3) [http://example.org/graph3]
(http://example.org/bob, http://www.w3.org/1999/02/22-rdf-syntax-ns#type, http://example.org/Man, http://example.org/graph3) [http://example.org/graph3]
-----------
02:18:36.884 [Time-limited test] WARN  [Rio error] Illegal language tag char: '_' (6, -1)
02:18:36.894 [Time-limited test] WARN  [Rio error] Illegal language tag char: '_' (6, -1)
-----------
(http://example.org/Man, http://www.w3.org/2000/01/rdf-schema#subClassOf, http://www.w3.org/2000/01/rdf-schema#Resource, http://example.org/graph1) [http://example.org/graph1]
(http://example.org/Man, http://www.w3.org/2000/01/rdf-schema#subClassOf, http://example.org/Man) [null]
(http://example.org/Man, http://www.w3.org/2000/01/rdf-schema#subClassOf, http://example.org/Human) [null]
(http://example.org/Man, http://www.w3.org/2000/01/rdf-schema#subClassOf, http://example.org/Animal) [null]
(http://example.org/Man, http://www.w3.org/2000/01/rdf-schema#subClassOf, http://www.w3.org/2000/01/rdf-schema#Resource, http://example.org/graph3) [http://example.org/graph3]
(http://example.org/Man, http://www.w3.org/2000/01/rdf-schema#subClassOf, http://example.org/Human, http://example.org/graph1) [http://example.org/graph1]
-----------
(http://example.org/bob, http://www.w3.org/1999/02/22-rdf-syntax-ns#type, http://www.w3.org/2000/01/rdf-schema#Resource, http://example.org/graph3) [http://example.org/graph3]
(http://example.org/bob, http://www.w3.org/1999/02/22-rdf-syntax-ns#type, http://example.org/Animal, http://example.org/graph3) [http://example.org/graph3]
(http://example.org/bob, http://www.w3.org/1999/02/22-rdf-syntax-ns#type, http://example.org/Human, http://example.org/graph3) [http://example.org/graph3]
(http://example.org/bob, http://www.w3.org/1999/02/22-rdf-syntax-ns#type, http://example.org/Man, http://example.org/graph3) [http://example.org/graph3]
-----------
02:18:37.349 [Time-limited test] WARN  [Rio error] Illegal language tag char: '_' (6, -1)
02:18:37.356 [Time-limited test] WARN  [Rio error] Illegal language tag char: '_' (6, -1)
-----------
(http://example.org/Man, http://www.w3.org/2000/01/rdf-schema#subClassOf, http://www.w3.org/2000/01/rdf-schema#Resource, http://example.org/graph1) [http://example.org/graph1]
(http://example.org/Man, http://www.w3.org/2000/01/rdf-schema#subClassOf, http://example.org/Man) [null]
(http://example.org/Man, http://www.w3.org/2000/01/rdf-schema#subClassOf, http://example.org/Human) [null]
(http://example.org/Man, http://www.w3.org/2000/01/rdf-schema#subClassOf, http://example.org/Animal) [null]
(http://example.org/Man, http://www.w3.org/2000/01/rdf-schema#subClassOf, http://www.w3.org/2000/01/rdf-schema#Resource, http://example.org/graph3) [http://example.org/graph3]
(http://example.org/Man, http://www.w3.org/2000/01/rdf-schema#subClassOf, http://example.org/Human, http://example.org/graph1) [http://example.org/graph1]
-----------
(http://example.org/bob, http://www.w3.org/1999/02/22-rdf-syntax-ns#type, http://www.w3.org/2000/01/rdf-schema#Resource, http://example.org/graph3) [http://example.org/graph3]
(http://example.org/bob, http://www.w3.org/1999/02/22-rdf-syntax-ns#type, http://example.org/Animal, http://example.org/graph3) [http://example.org/graph3]
(http://example.org/bob, http://www.w3.org/1999/02/22-rdf-syntax-ns#type, http://example.org/Human, http://example.org/graph3) [http://example.org/graph3]
(http://example.org/bob, http://www.w3.org/1999/02/22-rdf-syntax-ns#type, http://example.org/Man, http://example.org/graph3) [http://example.org/graph3]
-----------
02:18:37.825 [Time-limited test] WARN  [Rio error] Illegal language tag char: '_' (6, -1)
02:18:37.833 [Time-limited test] WARN  [Rio error] Illegal language tag char: '_' (6, -1)
-----------
(http://example.org/Man, http://www.w3.org/2000/01/rdf-schema#subClassOf, http://www.w3.org/2000/01/rdf-schema#Resource, http://example.org/graph1) [http://example.org/graph1]
(http://example.org/Man, http://www.w3.org/2000/01/rdf-schema#subClassOf, http://example.org/Man) [null]
(http://example.org/Man, http://www.w3.org/2000/01/rdf-schema#subClassOf, http://example.org/Human) [null]
(http://example.org/Man, http://www.w3.org/2000/01/rdf-schema#subClassOf, http://example.org/Animal) [null]
(http://example.org/Man, http://www.w3.org/2000/01/rdf-schema#subClassOf, http://www.w3.org/2000/01/rdf-schema#Resource, http://example.org/graph3) [http://example.org/graph3]
(http://example.org/Man, http://www.w3.org/2000/01/rdf-schema#subClassOf, http://example.org/Human, http://example.org/graph1) [http://example.org/graph1]
-----------
(http://example.org/bob, http://www.w3.org/1999/02/22-rdf-syntax-ns#type, http://www.w3.org/2000/01/rdf-schema#Resource, http://example.org/graph3) [http://example.org/graph3]
(http://example.org/bob, http://www.w3.org/1999/02/22-rdf-syntax-ns#type, http://example.org/Animal, http://example.org/graph3) [http://example.org/graph3]
(http://example.org/bob, http://www.w3.org/1999/02/22-rdf-syntax-ns#type, http://example.org/Human, http://example.org/graph3) [http://example.org/graph3]
(http://example.org/bob, http://www.w3.org/1999/02/22-rdf-syntax-ns#type, http://example.org/Man, http://example.org/graph3) [http://example.org/graph3]
-----------
02:18:38.394 [Time-limited test] WARN  [Rio error] Illegal language tag char: '_' (6, -1)
02:18:38.404 [Time-limited test] WARN  [Rio error] Illegal language tag char: '_' (6, -1)
[WARNING] Tests run: 435, Failures: 0, Errors: 0, Skipped: 20, Time elapsed: 3.661 s - in org.eclipse.rdf4j.sail.inferencer.fc.SchemaCachingRDFSInferencerRDFSchemaMemoryRepositoryConnectionTest
[INFO] Running org.eclipse.rdf4j.sail.inferencer.fc.MemInferencingTest
02:18:39.115 [main] ERROR exception while uploading input data
java.lang.ClassCastException: class org.eclipse.rdf4j.model.impl.SimpleLiteral cannot be cast to class org.eclipse.rdf4j.model.Resource (org.eclipse.rdf4j.model.impl.SimpleLiteral and org.eclipse.rdf4j.model.Resource are in unnamed module of loader 'app')
	at org.eclipse.rdf4j.sail.inferencer.fc.SchemaCachingRDFSInferencer.addRangeStatement(SchemaCachingRDFSInferencer.java:391)
	at org.eclipse.rdf4j.sail.inferencer.fc.SchemaCachingRDFSInferencerConnection.processForSchemaCache(SchemaCachingRDFSInferencerConnection.java:96)
	at org.eclipse.rdf4j.sail.inferencer.fc.SchemaCachingRDFSInferencerConnection.addStatement(SchemaCachingRDFSInferencerConnection.java:224)
	at org.eclipse.rdf4j.sail.inferencer.fc.SchemaCachingRDFSInferencerConnection.addStatement(SchemaCachingRDFSInferencerConnection.java:207)
	at org.eclipse.rdf4j.sail.InferencingTest.runTest(InferencingTest.java:71)
	at org.eclipse.rdf4j.sail.InferencingTest.testRangeError001(InferencingTest.java:200)
	at java.base/jdk.internal.reflect.NativeMethodAccessorImpl.invoke0(Native Method)
	at java.base/jdk.internal.reflect.NativeMethodAccessorImpl.invoke(NativeMethodAccessorImpl.java:62)
	at java.base/jdk.internal.reflect.DelegatingMethodAccessorImpl.invoke(DelegatingMethodAccessorImpl.java:43)
	at java.base/java.lang.reflect.Method.invoke(Method.java:566)
	at org.junit.runners.model.FrameworkMethod$1.runReflectiveCall(FrameworkMethod.java:59)
	at org.junit.internal.runners.model.ReflectiveCallable.run(ReflectiveCallable.java:12)
	at org.junit.runners.model.FrameworkMethod.invokeExplosively(FrameworkMethod.java:56)
	at org.junit.internal.runners.statements.InvokeMethod.evaluate(InvokeMethod.java:17)
	at org.junit.runners.ParentRunner$3.evaluate(ParentRunner.java:306)
	at org.junit.runners.BlockJUnit4ClassRunner$1.evaluate(BlockJUnit4ClassRunner.java:100)
	at org.junit.runners.ParentRunner.runLeaf(ParentRunner.java:366)
	at org.junit.runners.BlockJUnit4ClassRunner.runChild(BlockJUnit4ClassRunner.java:103)
	at org.junit.runners.BlockJUnit4ClassRunner.runChild(BlockJUnit4ClassRunner.java:63)
	at org.junit.runners.ParentRunner$4.run(ParentRunner.java:331)
	at org.junit.runners.ParentRunner$1.schedule(ParentRunner.java:79)
	at org.junit.runners.ParentRunner.runChildren(ParentRunner.java:329)
	at org.junit.runners.ParentRunner.access$100(ParentRunner.java:66)
	at org.junit.runners.ParentRunner$2.evaluate(ParentRunner.java:293)
	at org.junit.internal.runners.statements.RunBefores.evaluate(RunBefores.java:26)
	at org.junit.runners.ParentRunner$3.evaluate(ParentRunner.java:306)
	at org.junit.runners.ParentRunner.run(ParentRunner.java:413)
	at org.apache.maven.surefire.junit4.JUnit4Provider.execute(JUnit4Provider.java:365)
	at org.apache.maven.surefire.junit4.JUnit4Provider.executeWithRerun(JUnit4Provider.java:273)
	at org.apache.maven.surefire.junit4.JUnit4Provider.executeTestSet(JUnit4Provider.java:238)
	at org.apache.maven.surefire.junit4.JUnit4Provider.invoke(JUnit4Provider.java:159)
	at org.apache.maven.surefire.booter.ForkedBooter.invokeProviderInSameClassLoader(ForkedBooter.java:384)
	at org.apache.maven.surefire.booter.ForkedBooter.runSuitesInProcess(ForkedBooter.java:345)
	at org.apache.maven.surefire.booter.ForkedBooter.execute(ForkedBooter.java:126)
	at org.apache.maven.surefire.booter.ForkedBooter.main(ForkedBooter.java:418)
02:18:39.156 [main] ERROR exception while uploading input data
java.lang.ClassCastException: class org.eclipse.rdf4j.model.impl.SimpleLiteral cannot be cast to class org.eclipse.rdf4j.model.Resource (org.eclipse.rdf4j.model.impl.SimpleLiteral and org.eclipse.rdf4j.model.Resource are in unnamed module of loader 'app')
	at org.eclipse.rdf4j.sail.inferencer.fc.SchemaCachingRDFSInferencer.addSubPropertyOfStatement(SchemaCachingRDFSInferencer.java:385)
	at org.eclipse.rdf4j.sail.inferencer.fc.SchemaCachingRDFSInferencerConnection.processForSchemaCache(SchemaCachingRDFSInferencerConnection.java:93)
	at org.eclipse.rdf4j.sail.inferencer.fc.SchemaCachingRDFSInferencerConnection.addStatement(SchemaCachingRDFSInferencerConnection.java:224)
	at org.eclipse.rdf4j.sail.inferencer.fc.SchemaCachingRDFSInferencerConnection.addStatement(SchemaCachingRDFSInferencerConnection.java:207)
	at org.eclipse.rdf4j.sail.InferencingTest.runTest(InferencingTest.java:71)
	at org.eclipse.rdf4j.sail.InferencingTest.testSubPropertyOfError001(InferencingTest.java:180)
	at java.base/jdk.internal.reflect.NativeMethodAccessorImpl.invoke0(Native Method)
	at java.base/jdk.internal.reflect.NativeMethodAccessorImpl.invoke(NativeMethodAccessorImpl.java:62)
	at java.base/jdk.internal.reflect.DelegatingMethodAccessorImpl.invoke(DelegatingMethodAccessorImpl.java:43)
	at java.base/java.lang.reflect.Method.invoke(Method.java:566)
	at org.junit.runners.model.FrameworkMethod$1.runReflectiveCall(FrameworkMethod.java:59)
	at org.junit.internal.runners.model.ReflectiveCallable.run(ReflectiveCallable.java:12)
	at org.junit.runners.model.FrameworkMethod.invokeExplosively(FrameworkMethod.java:56)
	at org.junit.internal.runners.statements.InvokeMethod.evaluate(InvokeMethod.java:17)
	at org.junit.runners.ParentRunner$3.evaluate(ParentRunner.java:306)
	at org.junit.runners.BlockJUnit4ClassRunner$1.evaluate(BlockJUnit4ClassRunner.java:100)
	at org.junit.runners.ParentRunner.runLeaf(ParentRunner.java:366)
	at org.junit.runners.BlockJUnit4ClassRunner.runChild(BlockJUnit4ClassRunner.java:103)
	at org.junit.runners.BlockJUnit4ClassRunner.runChild(BlockJUnit4ClassRunner.java:63)
	at org.junit.runners.ParentRunner$4.run(ParentRunner.java:331)
	at org.junit.runners.ParentRunner$1.schedule(ParentRunner.java:79)
	at org.junit.runners.ParentRunner.runChildren(ParentRunner.java:329)
	at org.junit.runners.ParentRunner.access$100(ParentRunner.java:66)
	at org.junit.runners.ParentRunner$2.evaluate(ParentRunner.java:293)
	at org.junit.internal.runners.statements.RunBefores.evaluate(RunBefores.java:26)
	at org.junit.runners.ParentRunner$3.evaluate(ParentRunner.java:306)
	at org.junit.runners.ParentRunner.run(ParentRunner.java:413)
	at org.apache.maven.surefire.junit4.JUnit4Provider.execute(JUnit4Provider.java:365)
	at org.apache.maven.surefire.junit4.JUnit4Provider.executeWithRerun(JUnit4Provider.java:273)
	at org.apache.maven.surefire.junit4.JUnit4Provider.executeTestSet(JUnit4Provider.java:238)
	at org.apache.maven.surefire.junit4.JUnit4Provider.invoke(JUnit4Provider.java:159)
	at org.apache.maven.surefire.booter.ForkedBooter.invokeProviderInSameClassLoader(ForkedBooter.java:384)
	at org.apache.maven.surefire.booter.ForkedBooter.runSuitesInProcess(ForkedBooter.java:345)
	at org.apache.maven.surefire.booter.ForkedBooter.execute(ForkedBooter.java:126)
	at org.apache.maven.surefire.booter.ForkedBooter.main(ForkedBooter.java:418)
02:18:39.158 [main] ERROR exception while uploading input data
java.lang.ClassCastException: class org.eclipse.rdf4j.model.impl.SimpleLiteral cannot be cast to class org.eclipse.rdf4j.model.Resource (org.eclipse.rdf4j.model.impl.SimpleLiteral and org.eclipse.rdf4j.model.Resource are in unnamed module of loader 'app')
	at org.eclipse.rdf4j.sail.inferencer.fc.SchemaCachingRDFSInferencer.addSubClassOfStatement(SchemaCachingRDFSInferencer.java:379)
	at org.eclipse.rdf4j.sail.inferencer.fc.SchemaCachingRDFSInferencerConnection.processForSchemaCache(SchemaCachingRDFSInferencerConnection.java:87)
	at org.eclipse.rdf4j.sail.inferencer.fc.SchemaCachingRDFSInferencerConnection.addStatement(SchemaCachingRDFSInferencerConnection.java:224)
	at org.eclipse.rdf4j.sail.inferencer.fc.SchemaCachingRDFSInferencerConnection.addStatement(SchemaCachingRDFSInferencerConnection.java:207)
	at org.eclipse.rdf4j.sail.InferencingTest.runTest(InferencingTest.java:71)
	at org.eclipse.rdf4j.sail.InferencingTest.testTypeError001(InferencingTest.java:235)
	at java.base/jdk.internal.reflect.NativeMethodAccessorImpl.invoke0(Native Method)
	at java.base/jdk.internal.reflect.NativeMethodAccessorImpl.invoke(NativeMethodAccessorImpl.java:62)
	at java.base/jdk.internal.reflect.DelegatingMethodAccessorImpl.invoke(DelegatingMethodAccessorImpl.java:43)
	at java.base/java.lang.reflect.Method.invoke(Method.java:566)
	at org.junit.runners.model.FrameworkMethod$1.runReflectiveCall(FrameworkMethod.java:59)
	at org.junit.internal.runners.model.ReflectiveCallable.run(ReflectiveCallable.java:12)
	at org.junit.runners.model.FrameworkMethod.invokeExplosively(FrameworkMethod.java:56)
	at org.junit.internal.runners.statements.InvokeMethod.evaluate(InvokeMethod.java:17)
	at org.junit.runners.ParentRunner$3.evaluate(ParentRunner.java:306)
	at org.junit.runners.BlockJUnit4ClassRunner$1.evaluate(BlockJUnit4ClassRunner.java:100)
	at org.junit.runners.ParentRunner.runLeaf(ParentRunner.java:366)
	at org.junit.runners.BlockJUnit4ClassRunner.runChild(BlockJUnit4ClassRunner.java:103)
	at org.junit.runners.BlockJUnit4ClassRunner.runChild(BlockJUnit4ClassRunner.java:63)
	at org.junit.runners.ParentRunner$4.run(ParentRunner.java:331)
	at org.junit.runners.ParentRunner$1.schedule(ParentRunner.java:79)
	at org.junit.runners.ParentRunner.runChildren(ParentRunner.java:329)
	at org.junit.runners.ParentRunner.access$100(ParentRunner.java:66)
	at org.junit.runners.ParentRunner$2.evaluate(ParentRunner.java:293)
	at org.junit.internal.runners.statements.RunBefores.evaluate(RunBefores.java:26)
	at org.junit.runners.ParentRunner$3.evaluate(ParentRunner.java:306)
	at org.junit.runners.ParentRunner.run(ParentRunner.java:413)
	at org.apache.maven.surefire.junit4.JUnit4Provider.execute(JUnit4Provider.java:365)
	at org.apache.maven.surefire.junit4.JUnit4Provider.executeWithRerun(JUnit4Provider.java:273)
	at org.apache.maven.surefire.junit4.JUnit4Provider.executeTestSet(JUnit4Provider.java:238)
	at org.apache.maven.surefire.junit4.JUnit4Provider.invoke(JUnit4Provider.java:159)
	at org.apache.maven.surefire.booter.ForkedBooter.invokeProviderInSameClassLoader(ForkedBooter.java:384)
	at org.apache.maven.surefire.booter.ForkedBooter.runSuitesInProcess(ForkedBooter.java:345)
	at org.apache.maven.surefire.booter.ForkedBooter.execute(ForkedBooter.java:126)
	at org.apache.maven.surefire.booter.ForkedBooter.main(ForkedBooter.java:418)
02:18:39.183 [main] ERROR exception while uploading input data
java.lang.ClassCastException: class org.eclipse.rdf4j.model.impl.SimpleLiteral cannot be cast to class org.eclipse.rdf4j.model.Resource (org.eclipse.rdf4j.model.impl.SimpleLiteral and org.eclipse.rdf4j.model.Resource are in unnamed module of loader 'app')
	at org.eclipse.rdf4j.sail.inferencer.fc.SchemaCachingRDFSInferencer.addDomainStatement(SchemaCachingRDFSInferencer.java:397)
	at org.eclipse.rdf4j.sail.inferencer.fc.SchemaCachingRDFSInferencerConnection.processForSchemaCache(SchemaCachingRDFSInferencerConnection.java:99)
	at org.eclipse.rdf4j.sail.inferencer.fc.SchemaCachingRDFSInferencerConnection.addStatement(SchemaCachingRDFSInferencerConnection.java:224)
	at org.eclipse.rdf4j.sail.inferencer.fc.SchemaCachingRDFSInferencerConnection.addStatement(SchemaCachingRDFSInferencerConnection.java:207)
	at org.eclipse.rdf4j.sail.InferencingTest.runTest(InferencingTest.java:71)
	at org.eclipse.rdf4j.sail.InferencingTest.testDomainError001(InferencingTest.java:190)
	at java.base/jdk.internal.reflect.NativeMethodAccessorImpl.invoke0(Native Method)
	at java.base/jdk.internal.reflect.NativeMethodAccessorImpl.invoke(NativeMethodAccessorImpl.java:62)
	at java.base/jdk.internal.reflect.DelegatingMethodAccessorImpl.invoke(DelegatingMethodAccessorImpl.java:43)
	at java.base/java.lang.reflect.Method.invoke(Method.java:566)
	at org.junit.runners.model.FrameworkMethod$1.runReflectiveCall(FrameworkMethod.java:59)
	at org.junit.internal.runners.model.ReflectiveCallable.run(ReflectiveCallable.java:12)
	at org.junit.runners.model.FrameworkMethod.invokeExplosively(FrameworkMethod.java:56)
	at org.junit.internal.runners.statements.InvokeMethod.evaluate(InvokeMethod.java:17)
	at org.junit.runners.ParentRunner$3.evaluate(ParentRunner.java:306)
	at org.junit.runners.BlockJUnit4ClassRunner$1.evaluate(BlockJUnit4ClassRunner.java:100)
	at org.junit.runners.ParentRunner.runLeaf(ParentRunner.java:366)
	at org.junit.runners.BlockJUnit4ClassRunner.runChild(BlockJUnit4ClassRunner.java:103)
	at org.junit.runners.BlockJUnit4ClassRunner.runChild(BlockJUnit4ClassRunner.java:63)
	at org.junit.runners.ParentRunner$4.run(ParentRunner.java:331)
	at org.junit.runners.ParentRunner$1.schedule(ParentRunner.java:79)
	at org.junit.runners.ParentRunner.runChildren(ParentRunner.java:329)
	at org.junit.runners.ParentRunner.access$100(ParentRunner.java:66)
	at org.junit.runners.ParentRunner$2.evaluate(ParentRunner.java:293)
	at org.junit.internal.runners.statements.RunBefores.evaluate(RunBefores.java:26)
	at org.junit.runners.ParentRunner$3.evaluate(ParentRunner.java:306)
	at org.junit.runners.ParentRunner.run(ParentRunner.java:413)
	at org.apache.maven.surefire.junit4.JUnit4Provider.execute(JUnit4Provider.java:365)
	at org.apache.maven.surefire.junit4.JUnit4Provider.executeWithRerun(JUnit4Provider.java:273)
	at org.apache.maven.surefire.junit4.JUnit4Provider.executeTestSet(JUnit4Provider.java:238)
	at org.apache.maven.surefire.junit4.JUnit4Provider.invoke(JUnit4Provider.java:159)
	at org.apache.maven.surefire.booter.ForkedBooter.invokeProviderInSameClassLoader(ForkedBooter.java:384)
	at org.apache.maven.surefire.booter.ForkedBooter.runSuitesInProcess(ForkedBooter.java:345)
	at org.apache.maven.surefire.booter.ForkedBooter.execute(ForkedBooter.java:126)
	at org.apache.maven.surefire.booter.ForkedBooter.main(ForkedBooter.java:418)
02:18:39.191 [main] ERROR exception while uploading input data
java.lang.ClassCastException: class org.eclipse.rdf4j.model.impl.SimpleLiteral cannot be cast to class org.eclipse.rdf4j.model.Resource (org.eclipse.rdf4j.model.impl.SimpleLiteral and org.eclipse.rdf4j.model.Resource are in unnamed module of loader 'app')
	at org.eclipse.rdf4j.sail.inferencer.fc.SchemaCachingRDFSInferencer.addSubClassOfStatement(SchemaCachingRDFSInferencer.java:379)
	at org.eclipse.rdf4j.sail.inferencer.fc.SchemaCachingRDFSInferencerConnection.processForSchemaCache(SchemaCachingRDFSInferencerConnection.java:87)
	at org.eclipse.rdf4j.sail.inferencer.fc.SchemaCachingRDFSInferencerConnection.addStatement(SchemaCachingRDFSInferencerConnection.java:224)
	at org.eclipse.rdf4j.sail.inferencer.fc.SchemaCachingRDFSInferencerConnection.addStatement(SchemaCachingRDFSInferencerConnection.java:207)
	at org.eclipse.rdf4j.sail.InferencingTest.runTest(InferencingTest.java:71)
	at org.eclipse.rdf4j.sail.InferencingTest.testSubClassOfError001(InferencingTest.java:155)
	at java.base/jdk.internal.reflect.NativeMethodAccessorImpl.invoke0(Native Method)
	at java.base/jdk.internal.reflect.NativeMethodAccessorImpl.invoke(NativeMethodAccessorImpl.java:62)
	at java.base/jdk.internal.reflect.DelegatingMethodAccessorImpl.invoke(DelegatingMethodAccessorImpl.java:43)
	at java.base/java.lang.reflect.Method.invoke(Method.java:566)
	at org.junit.runners.model.FrameworkMethod$1.runReflectiveCall(FrameworkMethod.java:59)
	at org.junit.internal.runners.model.ReflectiveCallable.run(ReflectiveCallable.java:12)
	at org.junit.runners.model.FrameworkMethod.invokeExplosively(FrameworkMethod.java:56)
	at org.junit.internal.runners.statements.InvokeMethod.evaluate(InvokeMethod.java:17)
	at org.junit.runners.ParentRunner$3.evaluate(ParentRunner.java:306)
	at org.junit.runners.BlockJUnit4ClassRunner$1.evaluate(BlockJUnit4ClassRunner.java:100)
	at org.junit.runners.ParentRunner.runLeaf(ParentRunner.java:366)
	at org.junit.runners.BlockJUnit4ClassRunner.runChild(BlockJUnit4ClassRunner.java:103)
	at org.junit.runners.BlockJUnit4ClassRunner.runChild(BlockJUnit4ClassRunner.java:63)
	at org.junit.runners.ParentRunner$4.run(ParentRunner.java:331)
	at org.junit.runners.ParentRunner$1.schedule(ParentRunner.java:79)
	at org.junit.runners.ParentRunner.runChildren(ParentRunner.java:329)
	at org.junit.runners.ParentRunner.access$100(ParentRunner.java:66)
	at org.junit.runners.ParentRunner$2.evaluate(ParentRunner.java:293)
	at org.junit.internal.runners.statements.RunBefores.evaluate(RunBefores.java:26)
	at org.junit.runners.ParentRunner$3.evaluate(ParentRunner.java:306)
	at org.junit.runners.ParentRunner.run(ParentRunner.java:413)
	at org.apache.maven.surefire.junit4.JUnit4Provider.execute(JUnit4Provider.java:365)
	at org.apache.maven.surefire.junit4.JUnit4Provider.executeWithRerun(JUnit4Provider.java:273)
	at org.apache.maven.surefire.junit4.JUnit4Provider.executeTestSet(JUnit4Provider.java:238)
	at org.apache.maven.surefire.junit4.JUnit4Provider.invoke(JUnit4Provider.java:159)
	at org.apache.maven.surefire.booter.ForkedBooter.invokeProviderInSameClassLoader(ForkedBooter.java:384)
	at org.apache.maven.surefire.booter.ForkedBooter.runSuitesInProcess(ForkedBooter.java:345)
	at org.apache.maven.surefire.booter.ForkedBooter.execute(ForkedBooter.java:126)
	at org.apache.maven.surefire.booter.ForkedBooter.main(ForkedBooter.java:418)
[INFO] Tests run: 25, Failures: 0, Errors: 0, Skipped: 0, Time elapsed: 0.227 s - in org.eclipse.rdf4j.sail.inferencer.fc.MemInferencingTest
[INFO] Running org.eclipse.rdf4j.sail.inferencer.fc.NativeStoreCustomInferencingTest
[INFO] Tests run: 6, Failures: 0, Errors: 0, Skipped: 0, Time elapsed: 0.587 s - in org.eclipse.rdf4j.sail.inferencer.fc.NativeStoreCustomInferencingTest
[INFO] Running org.eclipse.rdf4j.sail.inferencer.fc.SchemaCachingRDFSInferencerNativeIsolationLevelTest
[INFO] Tests run: 10, Failures: 0, Errors: 0, Skipped: 0, Time elapsed: 4.514 s - in org.eclipse.rdf4j.sail.inferencer.fc.SchemaCachingRDFSInferencerNativeIsolationLevelTest
[INFO] Running org.eclipse.rdf4j.sail.inferencer.fc.InferredContextTest
[INFO] Tests run: 3, Failures: 0, Errors: 0, Skipped: 0, Time elapsed: 0.021 s - in org.eclipse.rdf4j.sail.inferencer.fc.InferredContextTest
[INFO] Running org.eclipse.rdf4j.sail.inferencer.fc.MemCustomInferencingTest
[INFO] Tests run: 6, Failures: 0, Errors: 0, Skipped: 0, Time elapsed: 0.017 s - in org.eclipse.rdf4j.sail.inferencer.fc.MemCustomInferencingTest
[INFO] Running org.eclipse.rdf4j.sail.inferencer.fc.RDFSchemaNativeRepositoryConnectionTest
02:18:47.813 [Time-limited test] WARN  [Rio error] Illegal language tag char: '_' (6, -1)
02:18:48.171 [Time-limited test] WARN  [Rio error] Illegal language tag char: '_' (6, -1)
02:19:07.150 [Time-limited test] WARN  [Rio error] Illegal language tag char: '_' (6, -1)
02:19:07.459 [Time-limited test] WARN  [Rio error] Illegal language tag char: '_' (6, -1)
02:19:26.440 [Time-limited test] WARN  [Rio error] Illegal language tag char: '_' (6, -1)
02:19:26.807 [Time-limited test] WARN  [Rio error] Illegal language tag char: '_' (6, -1)
02:19:46.302 [Time-limited test] WARN  [Rio error] Illegal language tag char: '_' (6, -1)
02:19:46.677 [Time-limited test] WARN  [Rio error] Illegal language tag char: '_' (6, -1)
02:20:05.370 [Time-limited test] WARN  [Rio error] Illegal language tag char: '_' (6, -1)
02:20:05.729 [Time-limited test] WARN  [Rio error] Illegal language tag char: '_' (6, -1)
[INFO] Tests run: 410, Failures: 0, Errors: 0, Skipped: 0, Time elapsed: 96.972 s - in org.eclipse.rdf4j.sail.inferencer.fc.RDFSchemaNativeRepositoryConnectionTest
[INFO] Running org.eclipse.rdf4j.sail.inferencer.fc.SchemaCachingRDFSInferencerNativeRepositoryConnectionTest
-----------
(http://example.org/Man, http://www.w3.org/2000/01/rdf-schema#subClassOf, http://www.w3.org/2000/01/rdf-schema#Resource, http://example.org/graph1) [http://example.org/graph1]
(http://example.org/Man, http://www.w3.org/2000/01/rdf-schema#subClassOf, http://www.w3.org/2000/01/rdf-schema#Resource, http://example.org/graph3) [http://example.org/graph3]
(http://example.org/Man, http://www.w3.org/2000/01/rdf-schema#subClassOf, http://example.org/Man) [null]
(http://example.org/Man, http://www.w3.org/2000/01/rdf-schema#subClassOf, http://example.org/Human) [null]
(http://example.org/Man, http://www.w3.org/2000/01/rdf-schema#subClassOf, http://example.org/Animal) [null]
(http://example.org/Man, http://www.w3.org/2000/01/rdf-schema#subClassOf, http://example.org/Human, http://example.org/graph1) [http://example.org/graph1]
-----------
(http://example.org/bob, http://www.w3.org/1999/02/22-rdf-syntax-ns#type, http://www.w3.org/2000/01/rdf-schema#Resource, http://example.org/graph3) [http://example.org/graph3]
(http://example.org/bob, http://www.w3.org/1999/02/22-rdf-syntax-ns#type, http://example.org/Human, http://example.org/graph3) [http://example.org/graph3]
(http://example.org/bob, http://www.w3.org/1999/02/22-rdf-syntax-ns#type, http://example.org/Animal, http://example.org/graph3) [http://example.org/graph3]
(http://example.org/bob, http://www.w3.org/1999/02/22-rdf-syntax-ns#type, http://example.org/Man, http://example.org/graph3) [http://example.org/graph3]
-----------
02:20:24.567 [Time-limited test] WARN  [Rio error] Illegal language tag char: '_' (6, -1)
02:20:25.009 [Time-limited test] WARN  [Rio error] Illegal language tag char: '_' (6, -1)
-----------
(http://example.org/Man, http://www.w3.org/2000/01/rdf-schema#subClassOf, http://www.w3.org/2000/01/rdf-schema#Resource, http://example.org/graph1) [http://example.org/graph1]
(http://example.org/Man, http://www.w3.org/2000/01/rdf-schema#subClassOf, http://www.w3.org/2000/01/rdf-schema#Resource, http://example.org/graph3) [http://example.org/graph3]
(http://example.org/Man, http://www.w3.org/2000/01/rdf-schema#subClassOf, http://example.org/Man) [null]
(http://example.org/Man, http://www.w3.org/2000/01/rdf-schema#subClassOf, http://example.org/Human) [null]
(http://example.org/Man, http://www.w3.org/2000/01/rdf-schema#subClassOf, http://example.org/Animal) [null]
(http://example.org/Man, http://www.w3.org/2000/01/rdf-schema#subClassOf, http://example.org/Human, http://example.org/graph1) [http://example.org/graph1]
-----------
(http://example.org/bob, http://www.w3.org/1999/02/22-rdf-syntax-ns#type, http://www.w3.org/2000/01/rdf-schema#Resource, http://example.org/graph3) [http://example.org/graph3]
(http://example.org/bob, http://www.w3.org/1999/02/22-rdf-syntax-ns#type, http://example.org/Human, http://example.org/graph3) [http://example.org/graph3]
(http://example.org/bob, http://www.w3.org/1999/02/22-rdf-syntax-ns#type, http://example.org/Animal, http://example.org/graph3) [http://example.org/graph3]
(http://example.org/bob, http://www.w3.org/1999/02/22-rdf-syntax-ns#type, http://example.org/Man, http://example.org/graph3) [http://example.org/graph3]
-----------
02:20:42.823 [Time-limited test] WARN  [Rio error] Illegal language tag char: '_' (6, -1)
02:20:43.156 [Time-limited test] WARN  [Rio error] Illegal language tag char: '_' (6, -1)
-----------
(http://example.org/Man, http://www.w3.org/2000/01/rdf-schema#subClassOf, http://www.w3.org/2000/01/rdf-schema#Resource, http://example.org/graph1) [http://example.org/graph1]
(http://example.org/Man, http://www.w3.org/2000/01/rdf-schema#subClassOf, http://www.w3.org/2000/01/rdf-schema#Resource, http://example.org/graph3) [http://example.org/graph3]
(http://example.org/Man, http://www.w3.org/2000/01/rdf-schema#subClassOf, http://example.org/Man) [null]
(http://example.org/Man, http://www.w3.org/2000/01/rdf-schema#subClassOf, http://example.org/Human) [null]
(http://example.org/Man, http://www.w3.org/2000/01/rdf-schema#subClassOf, http://example.org/Animal) [null]
(http://example.org/Man, http://www.w3.org/2000/01/rdf-schema#subClassOf, http://example.org/Human, http://example.org/graph1) [http://example.org/graph1]
-----------
(http://example.org/bob, http://www.w3.org/1999/02/22-rdf-syntax-ns#type, http://www.w3.org/2000/01/rdf-schema#Resource, http://example.org/graph3) [http://example.org/graph3]
(http://example.org/bob, http://www.w3.org/1999/02/22-rdf-syntax-ns#type, http://example.org/Human, http://example.org/graph3) [http://example.org/graph3]
(http://example.org/bob, http://www.w3.org/1999/02/22-rdf-syntax-ns#type, http://example.org/Animal, http://example.org/graph3) [http://example.org/graph3]
(http://example.org/bob, http://www.w3.org/1999/02/22-rdf-syntax-ns#type, http://example.org/Man, http://example.org/graph3) [http://example.org/graph3]
-----------
02:21:02.295 [Time-limited test] WARN  [Rio error] Illegal language tag char: '_' (6, -1)
02:21:02.703 [Time-limited test] WARN  [Rio error] Illegal language tag char: '_' (6, -1)
-----------
(http://example.org/Man, http://www.w3.org/2000/01/rdf-schema#subClassOf, http://www.w3.org/2000/01/rdf-schema#Resource, http://example.org/graph1) [http://example.org/graph1]
(http://example.org/Man, http://www.w3.org/2000/01/rdf-schema#subClassOf, http://www.w3.org/2000/01/rdf-schema#Resource, http://example.org/graph3) [http://example.org/graph3]
(http://example.org/Man, http://www.w3.org/2000/01/rdf-schema#subClassOf, http://example.org/Man) [null]
(http://example.org/Man, http://www.w3.org/2000/01/rdf-schema#subClassOf, http://example.org/Human) [null]
(http://example.org/Man, http://www.w3.org/2000/01/rdf-schema#subClassOf, http://example.org/Animal) [null]
(http://example.org/Man, http://www.w3.org/2000/01/rdf-schema#subClassOf, http://example.org/Human, http://example.org/graph1) [http://example.org/graph1]
-----------
(http://example.org/bob, http://www.w3.org/1999/02/22-rdf-syntax-ns#type, http://www.w3.org/2000/01/rdf-schema#Resource, http://example.org/graph3) [http://example.org/graph3]
(http://example.org/bob, http://www.w3.org/1999/02/22-rdf-syntax-ns#type, http://example.org/Human, http://example.org/graph3) [http://example.org/graph3]
(http://example.org/bob, http://www.w3.org/1999/02/22-rdf-syntax-ns#type, http://example.org/Animal, http://example.org/graph3) [http://example.org/graph3]
(http://example.org/bob, http://www.w3.org/1999/02/22-rdf-syntax-ns#type, http://example.org/Man, http://example.org/graph3) [http://example.org/graph3]
-----------
02:21:21.334 [Time-limited test] WARN  [Rio error] Illegal language tag char: '_' (6, -1)
02:21:21.668 [Time-limited test] WARN  [Rio error] Illegal language tag char: '_' (6, -1)
-----------
(http://example.org/Man, http://www.w3.org/2000/01/rdf-schema#subClassOf, http://www.w3.org/2000/01/rdf-schema#Resource, http://example.org/graph1) [http://example.org/graph1]
(http://example.org/Man, http://www.w3.org/2000/01/rdf-schema#subClassOf, http://www.w3.org/2000/01/rdf-schema#Resource, http://example.org/graph3) [http://example.org/graph3]
(http://example.org/Man, http://www.w3.org/2000/01/rdf-schema#subClassOf, http://example.org/Man) [null]
(http://example.org/Man, http://www.w3.org/2000/01/rdf-schema#subClassOf, http://example.org/Human) [null]
(http://example.org/Man, http://www.w3.org/2000/01/rdf-schema#subClassOf, http://example.org/Animal) [null]
(http://example.org/Man, http://www.w3.org/2000/01/rdf-schema#subClassOf, http://example.org/Human, http://example.org/graph1) [http://example.org/graph1]
-----------
(http://example.org/bob, http://www.w3.org/1999/02/22-rdf-syntax-ns#type, http://www.w3.org/2000/01/rdf-schema#Resource, http://example.org/graph3) [http://example.org/graph3]
(http://example.org/bob, http://www.w3.org/1999/02/22-rdf-syntax-ns#type, http://example.org/Human, http://example.org/graph3) [http://example.org/graph3]
(http://example.org/bob, http://www.w3.org/1999/02/22-rdf-syntax-ns#type, http://example.org/Animal, http://example.org/graph3) [http://example.org/graph3]
(http://example.org/bob, http://www.w3.org/1999/02/22-rdf-syntax-ns#type, http://example.org/Man, http://example.org/graph3) [http://example.org/graph3]
-----------
02:21:40.271 [Time-limited test] WARN  [Rio error] Illegal language tag char: '_' (6, -1)
02:21:40.622 [Time-limited test] WARN  [Rio error] Illegal language tag char: '_' (6, -1)
[WARNING] Tests run: 415, Failures: 0, Errors: 0, Skipped: 20, Time elapsed: 94.797 s - in org.eclipse.rdf4j.sail.inferencer.fc.SchemaCachingRDFSInferencerNativeRepositoryConnectionTest
[INFO] Running org.eclipse.rdf4j.sail.inferencer.fc.NativeStoreInferencingTest
02:21:56.625 [main] ERROR exception while uploading input data
java.lang.ClassCastException: null
02:21:57.377 [main] ERROR exception while uploading input data
java.lang.ClassCastException: class org.eclipse.rdf4j.model.impl.SimpleLiteral cannot be cast to class org.eclipse.rdf4j.model.Resource (org.eclipse.rdf4j.model.impl.SimpleLiteral and org.eclipse.rdf4j.model.Resource are in unnamed module of loader 'app')
	at org.eclipse.rdf4j.sail.inferencer.fc.SchemaCachingRDFSInferencer.addSubPropertyOfStatement(SchemaCachingRDFSInferencer.java:385)
	at org.eclipse.rdf4j.sail.inferencer.fc.SchemaCachingRDFSInferencerConnection.processForSchemaCache(SchemaCachingRDFSInferencerConnection.java:93)
	at org.eclipse.rdf4j.sail.inferencer.fc.SchemaCachingRDFSInferencerConnection.addStatement(SchemaCachingRDFSInferencerConnection.java:224)
	at org.eclipse.rdf4j.sail.inferencer.fc.SchemaCachingRDFSInferencerConnection.addStatement(SchemaCachingRDFSInferencerConnection.java:207)
	at org.eclipse.rdf4j.sail.InferencingTest.runTest(InferencingTest.java:71)
	at org.eclipse.rdf4j.sail.InferencingTest.testSubPropertyOfError001(InferencingTest.java:180)
	at java.base/jdk.internal.reflect.NativeMethodAccessorImpl.invoke0(Native Method)
	at java.base/jdk.internal.reflect.NativeMethodAccessorImpl.invoke(NativeMethodAccessorImpl.java:62)
	at java.base/jdk.internal.reflect.DelegatingMethodAccessorImpl.invoke(DelegatingMethodAccessorImpl.java:43)
	at java.base/java.lang.reflect.Method.invoke(Method.java:566)
	at org.junit.runners.model.FrameworkMethod$1.runReflectiveCall(FrameworkMethod.java:59)
	at org.junit.internal.runners.model.ReflectiveCallable.run(ReflectiveCallable.java:12)
	at org.junit.runners.model.FrameworkMethod.invokeExplosively(FrameworkMethod.java:56)
	at org.junit.internal.runners.statements.InvokeMethod.evaluate(InvokeMethod.java:17)
	at org.junit.rules.ExternalResource$1.evaluate(ExternalResource.java:54)
	at org.junit.runners.ParentRunner$3.evaluate(ParentRunner.java:306)
	at org.junit.runners.BlockJUnit4ClassRunner$1.evaluate(BlockJUnit4ClassRunner.java:100)
	at org.junit.runners.ParentRunner.runLeaf(ParentRunner.java:366)
	at org.junit.runners.BlockJUnit4ClassRunner.runChild(BlockJUnit4ClassRunner.java:103)
	at org.junit.runners.BlockJUnit4ClassRunner.runChild(BlockJUnit4ClassRunner.java:63)
	at org.junit.runners.ParentRunner$4.run(ParentRunner.java:331)
	at org.junit.runners.ParentRunner$1.schedule(ParentRunner.java:79)
	at org.junit.runners.ParentRunner.runChildren(ParentRunner.java:329)
	at org.junit.runners.ParentRunner.access$100(ParentRunner.java:66)
	at org.junit.runners.ParentRunner$2.evaluate(ParentRunner.java:293)
	at org.junit.internal.runners.statements.RunBefores.evaluate(RunBefores.java:26)
	at org.junit.runners.ParentRunner$3.evaluate(ParentRunner.java:306)
	at org.junit.runners.ParentRunner.run(ParentRunner.java:413)
	at org.apache.maven.surefire.junit4.JUnit4Provider.execute(JUnit4Provider.java:365)
	at org.apache.maven.surefire.junit4.JUnit4Provider.executeWithRerun(JUnit4Provider.java:273)
	at org.apache.maven.surefire.junit4.JUnit4Provider.executeTestSet(JUnit4Provider.java:238)
	at org.apache.maven.surefire.junit4.JUnit4Provider.invoke(JUnit4Provider.java:159)
	at org.apache.maven.surefire.booter.ForkedBooter.invokeProviderInSameClassLoader(ForkedBooter.java:384)
	at org.apache.maven.surefire.booter.ForkedBooter.runSuitesInProcess(ForkedBooter.java:345)
	at org.apache.maven.surefire.booter.ForkedBooter.execute(ForkedBooter.java:126)
	at org.apache.maven.surefire.booter.ForkedBooter.main(ForkedBooter.java:418)
02:21:57.425 [main] ERROR exception while uploading input data
java.lang.ClassCastException: class org.eclipse.rdf4j.model.impl.SimpleLiteral cannot be cast to class org.eclipse.rdf4j.model.Resource (org.eclipse.rdf4j.model.impl.SimpleLiteral and org.eclipse.rdf4j.model.Resource are in unnamed module of loader 'app')
	at org.eclipse.rdf4j.sail.inferencer.fc.SchemaCachingRDFSInferencer.addSubClassOfStatement(SchemaCachingRDFSInferencer.java:379)
	at org.eclipse.rdf4j.sail.inferencer.fc.SchemaCachingRDFSInferencerConnection.processForSchemaCache(SchemaCachingRDFSInferencerConnection.java:87)
	at org.eclipse.rdf4j.sail.inferencer.fc.SchemaCachingRDFSInferencerConnection.addStatement(SchemaCachingRDFSInferencerConnection.java:224)
	at org.eclipse.rdf4j.sail.inferencer.fc.SchemaCachingRDFSInferencerConnection.addStatement(SchemaCachingRDFSInferencerConnection.java:207)
	at org.eclipse.rdf4j.sail.InferencingTest.runTest(InferencingTest.java:71)
	at org.eclipse.rdf4j.sail.InferencingTest.testTypeError001(InferencingTest.java:235)
	at java.base/jdk.internal.reflect.NativeMethodAccessorImpl.invoke0(Native Method)
	at java.base/jdk.internal.reflect.NativeMethodAccessorImpl.invoke(NativeMethodAccessorImpl.java:62)
	at java.base/jdk.internal.reflect.DelegatingMethodAccessorImpl.invoke(DelegatingMethodAccessorImpl.java:43)
	at java.base/java.lang.reflect.Method.invoke(Method.java:566)
	at org.junit.runners.model.FrameworkMethod$1.runReflectiveCall(FrameworkMethod.java:59)
	at org.junit.internal.runners.model.ReflectiveCallable.run(ReflectiveCallable.java:12)
	at org.junit.runners.model.FrameworkMethod.invokeExplosively(FrameworkMethod.java:56)
	at org.junit.internal.runners.statements.InvokeMethod.evaluate(InvokeMethod.java:17)
	at org.junit.rules.ExternalResource$1.evaluate(ExternalResource.java:54)
	at org.junit.runners.ParentRunner$3.evaluate(ParentRunner.java:306)
	at org.junit.runners.BlockJUnit4ClassRunner$1.evaluate(BlockJUnit4ClassRunner.java:100)
	at org.junit.runners.ParentRunner.runLeaf(ParentRunner.java:366)
	at org.junit.runners.BlockJUnit4ClassRunner.runChild(BlockJUnit4ClassRunner.java:103)
	at org.junit.runners.BlockJUnit4ClassRunner.runChild(BlockJUnit4ClassRunner.java:63)
	at org.junit.runners.ParentRunner$4.run(ParentRunner.java:331)
	at org.junit.runners.ParentRunner$1.schedule(ParentRunner.java:79)
	at org.junit.runners.ParentRunner.runChildren(ParentRunner.java:329)
	at org.junit.runners.ParentRunner.access$100(ParentRunner.java:66)
	at org.junit.runners.ParentRunner$2.evaluate(ParentRunner.java:293)
	at org.junit.internal.runners.statements.RunBefores.evaluate(RunBefores.java:26)
	at org.junit.runners.ParentRunner$3.evaluate(ParentRunner.java:306)
	at org.junit.runners.ParentRunner.run(ParentRunner.java:413)
	at org.apache.maven.surefire.junit4.JUnit4Provider.execute(JUnit4Provider.java:365)
	at org.apache.maven.surefire.junit4.JUnit4Provider.executeWithRerun(JUnit4Provider.java:273)
	at org.apache.maven.surefire.junit4.JUnit4Provider.executeTestSet(JUnit4Provider.java:238)
	at org.apache.maven.surefire.junit4.JUnit4Provider.invoke(JUnit4Provider.java:159)
	at org.apache.maven.surefire.booter.ForkedBooter.invokeProviderInSameClassLoader(ForkedBooter.java:384)
	at org.apache.maven.surefire.booter.ForkedBooter.runSuitesInProcess(ForkedBooter.java:345)
	at org.apache.maven.surefire.booter.ForkedBooter.execute(ForkedBooter.java:126)
	at org.apache.maven.surefire.booter.ForkedBooter.main(ForkedBooter.java:418)
02:21:57.719 [main] ERROR exception while uploading input data
java.lang.ClassCastException: class org.eclipse.rdf4j.model.impl.SimpleLiteral cannot be cast to class org.eclipse.rdf4j.model.Resource (org.eclipse.rdf4j.model.impl.SimpleLiteral and org.eclipse.rdf4j.model.Resource are in unnamed module of loader 'app')
	at org.eclipse.rdf4j.sail.inferencer.fc.SchemaCachingRDFSInferencer.addDomainStatement(SchemaCachingRDFSInferencer.java:397)
	at org.eclipse.rdf4j.sail.inferencer.fc.SchemaCachingRDFSInferencerConnection.processForSchemaCache(SchemaCachingRDFSInferencerConnection.java:99)
	at org.eclipse.rdf4j.sail.inferencer.fc.SchemaCachingRDFSInferencerConnection.addStatement(SchemaCachingRDFSInferencerConnection.java:224)
	at org.eclipse.rdf4j.sail.inferencer.fc.SchemaCachingRDFSInferencerConnection.addStatement(SchemaCachingRDFSInferencerConnection.java:207)
	at org.eclipse.rdf4j.sail.InferencingTest.runTest(InferencingTest.java:71)
	at org.eclipse.rdf4j.sail.InferencingTest.testDomainError001(InferencingTest.java:190)
	at java.base/jdk.internal.reflect.NativeMethodAccessorImpl.invoke0(Native Method)
	at java.base/jdk.internal.reflect.NativeMethodAccessorImpl.invoke(NativeMethodAccessorImpl.java:62)
	at java.base/jdk.internal.reflect.DelegatingMethodAccessorImpl.invoke(DelegatingMethodAccessorImpl.java:43)
	at java.base/java.lang.reflect.Method.invoke(Method.java:566)
	at org.junit.runners.model.FrameworkMethod$1.runReflectiveCall(FrameworkMethod.java:59)
	at org.junit.internal.runners.model.ReflectiveCallable.run(ReflectiveCallable.java:12)
	at org.junit.runners.model.FrameworkMethod.invokeExplosively(FrameworkMethod.java:56)
	at org.junit.internal.runners.statements.InvokeMethod.evaluate(InvokeMethod.java:17)
	at org.junit.rules.ExternalResource$1.evaluate(ExternalResource.java:54)
	at org.junit.runners.ParentRunner$3.evaluate(ParentRunner.java:306)
	at org.junit.runners.BlockJUnit4ClassRunner$1.evaluate(BlockJUnit4ClassRunner.java:100)
	at org.junit.runners.ParentRunner.runLeaf(ParentRunner.java:366)
	at org.junit.runners.BlockJUnit4ClassRunner.runChild(BlockJUnit4ClassRunner.java:103)
	at org.junit.runners.BlockJUnit4ClassRunner.runChild(BlockJUnit4ClassRunner.java:63)
	at org.junit.runners.ParentRunner$4.run(ParentRunner.java:331)
	at org.junit.runners.ParentRunner$1.schedule(ParentRunner.java:79)
	at org.junit.runners.ParentRunner.runChildren(ParentRunner.java:329)
	at org.junit.runners.ParentRunner.access$100(ParentRunner.java:66)
	at org.junit.runners.ParentRunner$2.evaluate(ParentRunner.java:293)
	at org.junit.internal.runners.statements.RunBefores.evaluate(RunBefores.java:26)
	at org.junit.runners.ParentRunner$3.evaluate(ParentRunner.java:306)
	at org.junit.runners.ParentRunner.run(ParentRunner.java:413)
	at org.apache.maven.surefire.junit4.JUnit4Provider.execute(JUnit4Provider.java:365)
	at org.apache.maven.surefire.junit4.JUnit4Provider.executeWithRerun(JUnit4Provider.java:273)
	at org.apache.maven.surefire.junit4.JUnit4Provider.executeTestSet(JUnit4Provider.java:238)
	at org.apache.maven.surefire.junit4.JUnit4Provider.invoke(JUnit4Provider.java:159)
	at org.apache.maven.surefire.booter.ForkedBooter.invokeProviderInSameClassLoader(ForkedBooter.java:384)
	at org.apache.maven.surefire.booter.ForkedBooter.runSuitesInProcess(ForkedBooter.java:345)
	at org.apache.maven.surefire.booter.ForkedBooter.execute(ForkedBooter.java:126)
	at org.apache.maven.surefire.booter.ForkedBooter.main(ForkedBooter.java:418)
02:21:57.850 [main] ERROR exception while uploading input data
java.lang.ClassCastException: class org.eclipse.rdf4j.model.impl.SimpleLiteral cannot be cast to class org.eclipse.rdf4j.model.Resource (org.eclipse.rdf4j.model.impl.SimpleLiteral and org.eclipse.rdf4j.model.Resource are in unnamed module of loader 'app')
	at org.eclipse.rdf4j.sail.inferencer.fc.SchemaCachingRDFSInferencer.addSubClassOfStatement(SchemaCachingRDFSInferencer.java:379)
	at org.eclipse.rdf4j.sail.inferencer.fc.SchemaCachingRDFSInferencerConnection.processForSchemaCache(SchemaCachingRDFSInferencerConnection.java:87)
	at org.eclipse.rdf4j.sail.inferencer.fc.SchemaCachingRDFSInferencerConnection.addStatement(SchemaCachingRDFSInferencerConnection.java:224)
	at org.eclipse.rdf4j.sail.inferencer.fc.SchemaCachingRDFSInferencerConnection.addStatement(SchemaCachingRDFSInferencerConnection.java:207)
	at org.eclipse.rdf4j.sail.InferencingTest.runTest(InferencingTest.java:71)
	at org.eclipse.rdf4j.sail.InferencingTest.testSubClassOfError001(InferencingTest.java:155)
	at java.base/jdk.internal.reflect.NativeMethodAccessorImpl.invoke0(Native Method)
	at java.base/jdk.internal.reflect.NativeMethodAccessorImpl.invoke(NativeMethodAccessorImpl.java:62)
	at java.base/jdk.internal.reflect.DelegatingMethodAccessorImpl.invoke(DelegatingMethodAccessorImpl.java:43)
	at java.base/java.lang.reflect.Method.invoke(Method.java:566)
	at org.junit.runners.model.FrameworkMethod$1.runReflectiveCall(FrameworkMethod.java:59)
	at org.junit.internal.runners.model.ReflectiveCallable.run(ReflectiveCallable.java:12)
	at org.junit.runners.model.FrameworkMethod.invokeExplosively(FrameworkMethod.java:56)
	at org.junit.internal.runners.statements.InvokeMethod.evaluate(InvokeMethod.java:17)
	at org.junit.rules.ExternalResource$1.evaluate(ExternalResource.java:54)
	at org.junit.runners.ParentRunner$3.evaluate(ParentRunner.java:306)
	at org.junit.runners.BlockJUnit4ClassRunner$1.evaluate(BlockJUnit4ClassRunner.java:100)
	at org.junit.runners.ParentRunner.runLeaf(ParentRunner.java:366)
	at org.junit.runners.BlockJUnit4ClassRunner.runChild(BlockJUnit4ClassRunner.java:103)
	at org.junit.runners.BlockJUnit4ClassRunner.runChild(BlockJUnit4ClassRunner.java:63)
	at org.junit.runners.ParentRunner$4.run(ParentRunner.java:331)
	at org.junit.runners.ParentRunner$1.schedule(ParentRunner.java:79)
	at org.junit.runners.ParentRunner.runChildren(ParentRunner.java:329)
	at org.junit.runners.ParentRunner.access$100(ParentRunner.java:66)
	at org.junit.runners.ParentRunner$2.evaluate(ParentRunner.java:293)
	at org.junit.internal.runners.statements.RunBefores.evaluate(RunBefores.java:26)
	at org.junit.runners.ParentRunner$3.evaluate(ParentRunner.java:306)
	at org.junit.runners.ParentRunner.run(ParentRunner.java:413)
	at org.apache.maven.surefire.junit4.JUnit4Provider.execute(JUnit4Provider.java:365)
	at org.apache.maven.surefire.junit4.JUnit4Provider.executeWithRerun(JUnit4Provider.java:273)
	at org.apache.maven.surefire.junit4.JUnit4Provider.executeTestSet(JUnit4Provider.java:238)
	at org.apache.maven.surefire.junit4.JUnit4Provider.invoke(JUnit4Provider.java:159)
	at org.apache.maven.surefire.booter.ForkedBooter.invokeProviderInSameClassLoader(ForkedBooter.java:384)
	at org.apache.maven.surefire.booter.ForkedBooter.runSuitesInProcess(ForkedBooter.java:345)
	at org.apache.maven.surefire.booter.ForkedBooter.execute(ForkedBooter.java:126)
	at org.apache.maven.surefire.booter.ForkedBooter.main(ForkedBooter.java:418)
[INFO] Tests run: 21, Failures: 0, Errors: 0, Skipped: 0, Time elapsed: 2.035 s - in org.eclipse.rdf4j.sail.inferencer.fc.NativeStoreInferencingTest
[INFO] Running org.eclipse.rdf4j.sail.inferencer.fc.SchemaCachingRDFSInferencerIsolationLevelTest
[INFO] Tests run: 10, Failures: 0, Errors: 0, Skipped: 0, Time elapsed: 0.814 s - in org.eclipse.rdf4j.sail.inferencer.fc.SchemaCachingRDFSInferencerIsolationLevelTest
[INFO] Running org.eclipse.rdf4j.sail.inferencer.fc.CustomGraphQueryInferencerRepositoryConnectionTest
02:21:58.996 [Time-limited test] WARN  [Rio error] Illegal language tag char: '_' (6, -1)
02:21:59.000 [Time-limited test] WARN  [Rio error] Illegal language tag char: '_' (6, -1)
02:21:59.128 [Time-limited test] WARN  [Rio error] Illegal language tag char: '_' (6, -1)
02:21:59.130 [Time-limited test] WARN  [Rio error] Illegal language tag char: '_' (6, -1)
02:21:59.225 [Time-limited test] WARN  [Rio error] Illegal language tag char: '_' (6, -1)
02:21:59.227 [Time-limited test] WARN  [Rio error] Illegal language tag char: '_' (6, -1)
02:21:59.316 [Time-limited test] WARN  [Rio error] Illegal language tag char: '_' (6, -1)
02:21:59.318 [Time-limited test] WARN  [Rio error] Illegal language tag char: '_' (6, -1)
02:21:59.408 [Time-limited test] WARN  [Rio error] Illegal language tag char: '_' (6, -1)
02:21:59.410 [Time-limited test] WARN  [Rio error] Illegal language tag char: '_' (6, -1)
02:21:59.491 [Time-limited test] WARN  [Rio error] Illegal language tag char: '_' (6, -1)
02:21:59.493 [Time-limited test] WARN  [Rio error] Illegal language tag char: '_' (6, -1)
[INFO] Tests run: 432, Failures: 0, Errors: 0, Skipped: 0, Time elapsed: 0.56 s - in org.eclipse.rdf4j.sail.inferencer.fc.CustomGraphQueryInferencerRepositoryConnectionTest
[INFO] Running org.eclipse.rdf4j.sail.inferencer.fc.RDFSchemaMemoryRepositoryConnectionTest
02:21:59.701 [Time-limited test] WARN  [Rio error] Illegal language tag char: '_' (6, -1)
02:21:59.715 [Time-limited test] WARN  [Rio error] Illegal language tag char: '_' (6, -1)
02:22:00.443 [Time-limited test] WARN  [Rio error] Illegal language tag char: '_' (6, -1)
02:22:00.457 [Time-limited test] WARN  [Rio error] Illegal language tag char: '_' (6, -1)
02:22:01.127 [Time-limited test] WARN  [Rio error] Illegal language tag char: '_' (6, -1)
02:22:01.141 [Time-limited test] WARN  [Rio error] Illegal language tag char: '_' (6, -1)
02:22:01.819 [Time-limited test] WARN  [Rio error] Illegal language tag char: '_' (6, -1)
02:22:01.833 [Time-limited test] WARN  [Rio error] Illegal language tag char: '_' (6, -1)
02:22:02.561 [Time-limited test] WARN  [Rio error] Illegal language tag char: '_' (6, -1)
02:22:02.576 [Time-limited test] WARN  [Rio error] Illegal language tag char: '_' (6, -1)
[INFO] Tests run: 410, Failures: 0, Errors: 0, Skipped: 0, Time elapsed: 3.75 s - in org.eclipse.rdf4j.sail.inferencer.fc.RDFSchemaMemoryRepositoryConnectionTest
[INFO] 
[INFO] Results:
[INFO] 
[WARNING] Tests run: 2183, Failures: 0, Errors: 0, Skipped: 40
[INFO] 
[JENKINS] Recording test results
[INFO] 
[INFO] --- animal-sniffer-maven-plugin:1.16:check (default) @ rdf4j-sail-inferencer ---
[INFO] Checking unresolved references to org.codehaus.mojo.signature:java18:1.0
[INFO] 
[INFO] --- maven-jar-plugin:2.3.1:jar (default-jar) @ rdf4j-sail-inferencer ---
[INFO] Building jar: /home/jenkins/agent/workspace/rdf4j-pr-verify/core/sail/inferencer/target/rdf4j-sail-inferencer-3.5.0-SNAPSHOT.jar
[INFO] 
[INFO] --- japicmp-maven-plugin:0.14.3:cmp (default) @ rdf4j-sail-inferencer ---
[INFO] Written file '/home/jenkins/agent/workspace/rdf4j-pr-verify/core/sail/inferencer/target/japicmp/japicmp.diff'.
[INFO] Written file '/home/jenkins/agent/workspace/rdf4j-pr-verify/core/sail/inferencer/target/japicmp/japicmp.xml'.
[INFO] Written file '/home/jenkins/agent/workspace/rdf4j-pr-verify/core/sail/inferencer/target/japicmp/japicmp.html'.