SuccessConsole Output

Started calculate disk usage of build
Finished Calculation of disk usage of build in 0 seconds
Started calculate disk usage of workspace
Finished Calculation of disk usage of workspace in 0 seconds
[INFO] 
[INFO] --------------< org.eclipse.rdf4j:rdf4j-sail-inferencer >---------------
[INFO] Building RDF4J: Inferencer Sails 3.1.0-SNAPSHOT                  [44/73]
[INFO] --------------------------------[ jar ]---------------------------------
[INFO] 
[INFO] --- buildnumber-maven-plugin:1.4:create (default) @ rdf4j-sail-inferencer ---
[INFO] ShortRevision tag detected. The value is '7'.
[INFO] Executing: /bin/sh -c cd '/home/hudson/genie.rdf4j/.jenkins/jobs/rdf4j-pr-verify/workspace/core/sail/inferencer' && 'git' 'rev-parse' '--verify' '--short=7' 'HEAD'
[INFO] Working directory: /home/hudson/genie.rdf4j/.jenkins/jobs/rdf4j-pr-verify/workspace/core/sail/inferencer
[INFO] Storing buildNumber: 419fced at timestamp: 1575721718194
[WARNING] Cannot get the branch information from the git repository: 
Detecting the current branch failed: fatal: ref HEAD is not a symbolic ref

[INFO] ShortRevision tag detected. The value is '7'.
[INFO] Executing: /bin/sh -c cd '/home/hudson/genie.rdf4j/.jenkins/jobs/rdf4j-pr-verify/workspace/core/sail/inferencer' && 'git' 'rev-parse' '--verify' '--short=7' 'HEAD'
[INFO] Working directory: /home/hudson/genie.rdf4j/.jenkins/jobs/rdf4j-pr-verify/workspace/core/sail/inferencer
[INFO] Storing buildScmBranch: UNKNOWN
[INFO] 
[INFO] --- maven-enforcer-plugin:1.4.1:enforce (enforce-bytecode-version) @ rdf4j-sail-inferencer ---
[INFO] Adding ignore: META-INF/**/module-info
[INFO] 
[INFO] --- formatter-maven-plugin:2.8.1:validate (default) @ rdf4j-sail-inferencer ---
[INFO] Using 'UTF-8' encoding to format source files.
[INFO] Number of files to be formatted: 36
[INFO] Successfully formatted:          0 file(s)
[INFO] Fail to format:                  0 file(s)
[INFO] Skipped:                         36 file(s)
[INFO] Read only skipped:               0 file(s)
[INFO] Approximate time taken:          0s
[INFO] 
[INFO] --- maven-resources-plugin:3.0.2:resources (default-resources) @ rdf4j-sail-inferencer ---
[INFO] Using 'UTF-8' encoding to copy filtered resources.
[INFO] Copying 1 resource
[INFO] 
[INFO] --- maven-compiler-plugin:3.7.0:compile (default-compile) @ rdf4j-sail-inferencer ---
[INFO] Changes detected - recompiling the module!
[INFO] Compiling 24 source files to /home/hudson/genie.rdf4j/.jenkins/jobs/rdf4j-pr-verify/workspace/core/sail/inferencer/target/classes
[INFO] 
[INFO] --- maven-resources-plugin:3.0.2:testResources (default-testResources) @ rdf4j-sail-inferencer ---
[INFO] Using 'UTF-8' encoding to copy filtered resources.
[INFO] Copying 14 resources
[INFO] 
[INFO] --- maven-compiler-plugin:3.7.0:testCompile (default-testCompile) @ rdf4j-sail-inferencer ---
[INFO] Changes detected - recompiling the module!
[INFO] Compiling 12 source files to /home/hudson/genie.rdf4j/.jenkins/jobs/rdf4j-pr-verify/workspace/core/sail/inferencer/target/test-classes
[INFO] 
[INFO] --- maven-surefire-plugin:2.22.2:test (default-test) @ rdf4j-sail-inferencer ---
[INFO] 
[INFO] -------------------------------------------------------
[INFO]  T E S T S
[INFO] -------------------------------------------------------
[INFO] Running org.eclipse.rdf4j.sail.inferencer.fc.SchemaCachingRDFSInferencerRDFSchemaMemoryRepositoryConnectionTest
-----------
(http://example.org/Man, http://www.w3.org/2000/01/rdf-schema#subClassOf, http://www.w3.org/2000/01/rdf-schema#Resource) [http://example.org/graph1]
(http://example.org/Man, http://www.w3.org/2000/01/rdf-schema#subClassOf, http://example.org/Man) [null]
(http://example.org/Man, http://www.w3.org/2000/01/rdf-schema#subClassOf, http://example.org/Animal) [null]
(http://example.org/Man, http://www.w3.org/2000/01/rdf-schema#subClassOf, http://www.w3.org/2000/01/rdf-schema#Resource) [http://example.org/graph3]
(http://example.org/Man, http://www.w3.org/2000/01/rdf-schema#subClassOf, http://example.org/Human) [http://example.org/graph1]
-----------
(http://example.org/bob, http://www.w3.org/1999/02/22-rdf-syntax-ns#type, http://www.w3.org/2000/01/rdf-schema#Resource) [http://example.org/graph3]
(http://example.org/bob, http://www.w3.org/1999/02/22-rdf-syntax-ns#type, http://example.org/Animal) [http://example.org/graph3]
(http://example.org/bob, http://www.w3.org/1999/02/22-rdf-syntax-ns#type, http://example.org/Human) [http://example.org/graph3]
(http://example.org/bob, http://www.w3.org/1999/02/22-rdf-syntax-ns#type, http://example.org/Man) [http://example.org/graph3]
-----------
[Time-limited test] WARN org.eclipse.rdf4j.rio.helpers.ParseErrorLogger - [Rio error] Illegal language tag char: '_' (6, -1)
[Time-limited test] WARN org.eclipse.rdf4j.rio.helpers.ParseErrorLogger - [Rio error] Illegal language tag char: '_' (6, -1)
-----------
(http://example.org/Man, http://www.w3.org/2000/01/rdf-schema#subClassOf, http://www.w3.org/2000/01/rdf-schema#Resource) [http://example.org/graph1]
(http://example.org/Man, http://www.w3.org/2000/01/rdf-schema#subClassOf, http://example.org/Man) [null]
(http://example.org/Man, http://www.w3.org/2000/01/rdf-schema#subClassOf, http://example.org/Animal) [null]
(http://example.org/Man, http://www.w3.org/2000/01/rdf-schema#subClassOf, http://www.w3.org/2000/01/rdf-schema#Resource) [http://example.org/graph3]
(http://example.org/Man, http://www.w3.org/2000/01/rdf-schema#subClassOf, http://example.org/Human) [http://example.org/graph1]
-----------
(http://example.org/bob, http://www.w3.org/1999/02/22-rdf-syntax-ns#type, http://www.w3.org/2000/01/rdf-schema#Resource) [http://example.org/graph3]
(http://example.org/bob, http://www.w3.org/1999/02/22-rdf-syntax-ns#type, http://example.org/Animal) [http://example.org/graph3]
(http://example.org/bob, http://www.w3.org/1999/02/22-rdf-syntax-ns#type, http://example.org/Human) [http://example.org/graph3]
(http://example.org/bob, http://www.w3.org/1999/02/22-rdf-syntax-ns#type, http://example.org/Man) [http://example.org/graph3]
-----------
[Time-limited test] WARN org.eclipse.rdf4j.rio.helpers.ParseErrorLogger - [Rio error] Illegal language tag char: '_' (6, -1)
[Time-limited test] WARN org.eclipse.rdf4j.rio.helpers.ParseErrorLogger - [Rio error] Illegal language tag char: '_' (6, -1)
-----------
(http://example.org/Man, http://www.w3.org/2000/01/rdf-schema#subClassOf, http://www.w3.org/2000/01/rdf-schema#Resource) [http://example.org/graph1]
(http://example.org/Man, http://www.w3.org/2000/01/rdf-schema#subClassOf, http://example.org/Man) [null]
(http://example.org/Man, http://www.w3.org/2000/01/rdf-schema#subClassOf, http://example.org/Animal) [null]
(http://example.org/Man, http://www.w3.org/2000/01/rdf-schema#subClassOf, http://www.w3.org/2000/01/rdf-schema#Resource) [http://example.org/graph3]
(http://example.org/Man, http://www.w3.org/2000/01/rdf-schema#subClassOf, http://example.org/Human) [http://example.org/graph1]
-----------
(http://example.org/bob, http://www.w3.org/1999/02/22-rdf-syntax-ns#type, http://www.w3.org/2000/01/rdf-schema#Resource) [http://example.org/graph3]
(http://example.org/bob, http://www.w3.org/1999/02/22-rdf-syntax-ns#type, http://example.org/Animal) [http://example.org/graph3]
(http://example.org/bob, http://www.w3.org/1999/02/22-rdf-syntax-ns#type, http://example.org/Human) [http://example.org/graph3]
(http://example.org/bob, http://www.w3.org/1999/02/22-rdf-syntax-ns#type, http://example.org/Man) [http://example.org/graph3]
-----------
[Time-limited test] WARN org.eclipse.rdf4j.rio.helpers.ParseErrorLogger - [Rio error] Illegal language tag char: '_' (6, -1)
[Time-limited test] WARN org.eclipse.rdf4j.rio.helpers.ParseErrorLogger - [Rio error] Illegal language tag char: '_' (6, -1)
-----------
(http://example.org/Man, http://www.w3.org/2000/01/rdf-schema#subClassOf, http://www.w3.org/2000/01/rdf-schema#Resource) [http://example.org/graph1]
(http://example.org/Man, http://www.w3.org/2000/01/rdf-schema#subClassOf, http://example.org/Man) [null]
(http://example.org/Man, http://www.w3.org/2000/01/rdf-schema#subClassOf, http://example.org/Animal) [null]
(http://example.org/Man, http://www.w3.org/2000/01/rdf-schema#subClassOf, http://www.w3.org/2000/01/rdf-schema#Resource) [http://example.org/graph3]
(http://example.org/Man, http://www.w3.org/2000/01/rdf-schema#subClassOf, http://example.org/Human) [http://example.org/graph1]
-----------
(http://example.org/bob, http://www.w3.org/1999/02/22-rdf-syntax-ns#type, http://www.w3.org/2000/01/rdf-schema#Resource) [http://example.org/graph3]
(http://example.org/bob, http://www.w3.org/1999/02/22-rdf-syntax-ns#type, http://example.org/Animal) [http://example.org/graph3]
(http://example.org/bob, http://www.w3.org/1999/02/22-rdf-syntax-ns#type, http://example.org/Human) [http://example.org/graph3]
(http://example.org/bob, http://www.w3.org/1999/02/22-rdf-syntax-ns#type, http://example.org/Man) [http://example.org/graph3]
-----------
[Time-limited test] WARN org.eclipse.rdf4j.rio.helpers.ParseErrorLogger - [Rio error] Illegal language tag char: '_' (6, -1)
[Time-limited test] WARN org.eclipse.rdf4j.rio.helpers.ParseErrorLogger - [Rio error] Illegal language tag char: '_' (6, -1)
-----------
(http://example.org/Man, http://www.w3.org/2000/01/rdf-schema#subClassOf, http://www.w3.org/2000/01/rdf-schema#Resource) [http://example.org/graph1]
(http://example.org/Man, http://www.w3.org/2000/01/rdf-schema#subClassOf, http://example.org/Man) [null]
(http://example.org/Man, http://www.w3.org/2000/01/rdf-schema#subClassOf, http://example.org/Animal) [null]
(http://example.org/Man, http://www.w3.org/2000/01/rdf-schema#subClassOf, http://www.w3.org/2000/01/rdf-schema#Resource) [http://example.org/graph3]
(http://example.org/Man, http://www.w3.org/2000/01/rdf-schema#subClassOf, http://example.org/Human) [http://example.org/graph1]
-----------
(http://example.org/bob, http://www.w3.org/1999/02/22-rdf-syntax-ns#type, http://www.w3.org/2000/01/rdf-schema#Resource) [http://example.org/graph3]
(http://example.org/bob, http://www.w3.org/1999/02/22-rdf-syntax-ns#type, http://example.org/Animal) [http://example.org/graph3]
(http://example.org/bob, http://www.w3.org/1999/02/22-rdf-syntax-ns#type, http://example.org/Human) [http://example.org/graph3]
(http://example.org/bob, http://www.w3.org/1999/02/22-rdf-syntax-ns#type, http://example.org/Man) [http://example.org/graph3]
-----------
[Time-limited test] WARN org.eclipse.rdf4j.rio.helpers.ParseErrorLogger - [Rio error] Illegal language tag char: '_' (6, -1)
[Time-limited test] WARN org.eclipse.rdf4j.rio.helpers.ParseErrorLogger - [Rio error] Illegal language tag char: '_' (6, -1)
[WARNING] Tests run: 425, Failures: 0, Errors: 0, Skipped: 20, Time elapsed: 4.383 s - in org.eclipse.rdf4j.sail.inferencer.fc.SchemaCachingRDFSInferencerRDFSchemaMemoryRepositoryConnectionTest
[INFO] Running org.eclipse.rdf4j.sail.inferencer.fc.NativeStoreCustomInferencingTest
[INFO] Tests run: 6, Failures: 0, Errors: 0, Skipped: 0, Time elapsed: 1.814 s - in org.eclipse.rdf4j.sail.inferencer.fc.NativeStoreCustomInferencingTest
[INFO] Running org.eclipse.rdf4j.sail.inferencer.fc.RDFSchemaNativeRepositoryConnectionTest
[Time-limited test] WARN org.eclipse.rdf4j.rio.helpers.ParseErrorLogger - [Rio error] Illegal language tag char: '_' (6, -1)
[Time-limited test] WARN org.eclipse.rdf4j.rio.helpers.ParseErrorLogger - [Rio error] Illegal language tag char: '_' (6, -1)
[Time-limited test] WARN org.eclipse.rdf4j.rio.helpers.ParseErrorLogger - [Rio error] Illegal language tag char: '_' (6, -1)
[Time-limited test] WARN org.eclipse.rdf4j.rio.helpers.ParseErrorLogger - [Rio error] Illegal language tag char: '_' (6, -1)
[Time-limited test] WARN org.eclipse.rdf4j.rio.helpers.ParseErrorLogger - [Rio error] Illegal language tag char: '_' (6, -1)
[Time-limited test] WARN org.eclipse.rdf4j.rio.helpers.ParseErrorLogger - [Rio error] Illegal language tag char: '_' (6, -1)
[Time-limited test] WARN org.eclipse.rdf4j.rio.helpers.ParseErrorLogger - [Rio error] Illegal language tag char: '_' (6, -1)
[Time-limited test] WARN org.eclipse.rdf4j.rio.helpers.ParseErrorLogger - [Rio error] Illegal language tag char: '_' (6, -1)
[Time-limited test] WARN org.eclipse.rdf4j.rio.helpers.ParseErrorLogger - [Rio error] Illegal language tag char: '_' (6, -1)
[Time-limited test] WARN org.eclipse.rdf4j.rio.helpers.ParseErrorLogger - [Rio error] Illegal language tag char: '_' (6, -1)
[INFO] Tests run: 400, Failures: 0, Errors: 0, Skipped: 0, Time elapsed: 355.87 s - in org.eclipse.rdf4j.sail.inferencer.fc.RDFSchemaNativeRepositoryConnectionTest
[INFO] Running org.eclipse.rdf4j.sail.inferencer.fc.NativeStoreInferencingTest
[main] ERROR org.eclipse.rdf4j.sail.InferencingTest - exception while uploading input data
java.lang.ClassCastException: org.eclipse.rdf4j.model.impl.SimpleLiteral cannot be cast to org.eclipse.rdf4j.model.Resource
	at org.eclipse.rdf4j.sail.inferencer.fc.SchemaCachingRDFSInferencer.addRangeStatement(SchemaCachingRDFSInferencer.java:394)
	at org.eclipse.rdf4j.sail.inferencer.fc.SchemaCachingRDFSInferencerConnection.processForSchemaCache(SchemaCachingRDFSInferencerConnection.java:96)
	at org.eclipse.rdf4j.sail.inferencer.fc.SchemaCachingRDFSInferencerConnection.addStatement(SchemaCachingRDFSInferencerConnection.java:224)
	at org.eclipse.rdf4j.sail.inferencer.fc.SchemaCachingRDFSInferencerConnection.addStatement(SchemaCachingRDFSInferencerConnection.java:207)
	at org.eclipse.rdf4j.sail.InferencingTest.runTest(InferencingTest.java:72)
	at org.eclipse.rdf4j.sail.InferencingTest.testRangeError001(InferencingTest.java:201)
	at sun.reflect.NativeMethodAccessorImpl.invoke0(Native Method)
	at sun.reflect.NativeMethodAccessorImpl.invoke(NativeMethodAccessorImpl.java:62)
	at sun.reflect.DelegatingMethodAccessorImpl.invoke(DelegatingMethodAccessorImpl.java:43)
	at java.lang.reflect.Method.invoke(Method.java:498)
	at org.junit.runners.model.FrameworkMethod$1.runReflectiveCall(FrameworkMethod.java:50)
	at org.junit.internal.runners.model.ReflectiveCallable.run(ReflectiveCallable.java:12)
	at org.junit.runners.model.FrameworkMethod.invokeExplosively(FrameworkMethod.java:47)
	at org.junit.internal.runners.statements.InvokeMethod.evaluate(InvokeMethod.java:17)
	at org.junit.rules.ExternalResource$1.evaluate(ExternalResource.java:48)
	at org.junit.rules.RunRules.evaluate(RunRules.java:20)
	at org.junit.runners.ParentRunner.runLeaf(ParentRunner.java:325)
	at org.junit.runners.BlockJUnit4ClassRunner.runChild(BlockJUnit4ClassRunner.java:78)
	at org.junit.runners.BlockJUnit4ClassRunner.runChild(BlockJUnit4ClassRunner.java:57)
	at org.junit.runners.ParentRunner$3.run(ParentRunner.java:290)
	at org.junit.runners.ParentRunner$1.schedule(ParentRunner.java:71)
	at org.junit.runners.ParentRunner.runChildren(ParentRunner.java:288)
	at org.junit.runners.ParentRunner.access$000(ParentRunner.java:58)
	at org.junit.runners.ParentRunner$2.evaluate(ParentRunner.java:268)
	at org.junit.internal.runners.statements.RunBefores.evaluate(RunBefores.java:26)
	at org.junit.runners.ParentRunner.run(ParentRunner.java:363)
	at org.apache.maven.surefire.junit4.JUnit4Provider.execute(JUnit4Provider.java:365)
	at org.apache.maven.surefire.junit4.JUnit4Provider.executeWithRerun(JUnit4Provider.java:273)
	at org.apache.maven.surefire.junit4.JUnit4Provider.executeTestSet(JUnit4Provider.java:238)
	at org.apache.maven.surefire.junit4.JUnit4Provider.invoke(JUnit4Provider.java:159)
	at org.apache.maven.surefire.booter.ForkedBooter.invokeProviderInSameClassLoader(ForkedBooter.java:384)
	at org.apache.maven.surefire.booter.ForkedBooter.runSuitesInProcess(ForkedBooter.java:345)
	at org.apache.maven.surefire.booter.ForkedBooter.execute(ForkedBooter.java:126)
	at org.apache.maven.surefire.booter.ForkedBooter.main(ForkedBooter.java:418)
[main] ERROR org.eclipse.rdf4j.sail.InferencingTest - exception while uploading input data
java.lang.ClassCastException: org.eclipse.rdf4j.model.impl.SimpleLiteral cannot be cast to org.eclipse.rdf4j.model.Resource
	at org.eclipse.rdf4j.sail.inferencer.fc.SchemaCachingRDFSInferencer.addSubPropertyOfStatement(SchemaCachingRDFSInferencer.java:388)
	at org.eclipse.rdf4j.sail.inferencer.fc.SchemaCachingRDFSInferencerConnection.processForSchemaCache(SchemaCachingRDFSInferencerConnection.java:93)
	at org.eclipse.rdf4j.sail.inferencer.fc.SchemaCachingRDFSInferencerConnection.addStatement(SchemaCachingRDFSInferencerConnection.java:224)
	at org.eclipse.rdf4j.sail.inferencer.fc.SchemaCachingRDFSInferencerConnection.addStatement(SchemaCachingRDFSInferencerConnection.java:207)
	at org.eclipse.rdf4j.sail.InferencingTest.runTest(InferencingTest.java:72)
	at org.eclipse.rdf4j.sail.InferencingTest.testSubPropertyOfError001(InferencingTest.java:181)
	at sun.reflect.NativeMethodAccessorImpl.invoke0(Native Method)
	at sun.reflect.NativeMethodAccessorImpl.invoke(NativeMethodAccessorImpl.java:62)
	at sun.reflect.DelegatingMethodAccessorImpl.invoke(DelegatingMethodAccessorImpl.java:43)
	at java.lang.reflect.Method.invoke(Method.java:498)
	at org.junit.runners.model.FrameworkMethod$1.runReflectiveCall(FrameworkMethod.java:50)
	at org.junit.internal.runners.model.ReflectiveCallable.run(ReflectiveCallable.java:12)
	at org.junit.runners.model.FrameworkMethod.invokeExplosively(FrameworkMethod.java:47)
	at org.junit.internal.runners.statements.InvokeMethod.evaluate(InvokeMethod.java:17)
	at org.junit.rules.ExternalResource$1.evaluate(ExternalResource.java:48)
	at org.junit.rules.RunRules.evaluate(RunRules.java:20)
	at org.junit.runners.ParentRunner.runLeaf(ParentRunner.java:325)
	at org.junit.runners.BlockJUnit4ClassRunner.runChild(BlockJUnit4ClassRunner.java:78)
	at org.junit.runners.BlockJUnit4ClassRunner.runChild(BlockJUnit4ClassRunner.java:57)
	at org.junit.runners.ParentRunner$3.run(ParentRunner.java:290)
	at org.junit.runners.ParentRunner$1.schedule(ParentRunner.java:71)
	at org.junit.runners.ParentRunner.runChildren(ParentRunner.java:288)
	at org.junit.runners.ParentRunner.access$000(ParentRunner.java:58)
	at org.junit.runners.ParentRunner$2.evaluate(ParentRunner.java:268)
	at org.junit.internal.runners.statements.RunBefores.evaluate(RunBefores.java:26)
	at org.junit.runners.ParentRunner.run(ParentRunner.java:363)
	at org.apache.maven.surefire.junit4.JUnit4Provider.execute(JUnit4Provider.java:365)
	at org.apache.maven.surefire.junit4.JUnit4Provider.executeWithRerun(JUnit4Provider.java:273)
	at org.apache.maven.surefire.junit4.JUnit4Provider.executeTestSet(JUnit4Provider.java:238)
	at org.apache.maven.surefire.junit4.JUnit4Provider.invoke(JUnit4Provider.java:159)
	at org.apache.maven.surefire.booter.ForkedBooter.invokeProviderInSameClassLoader(ForkedBooter.java:384)
	at org.apache.maven.surefire.booter.ForkedBooter.runSuitesInProcess(ForkedBooter.java:345)
	at org.apache.maven.surefire.booter.ForkedBooter.execute(ForkedBooter.java:126)
	at org.apache.maven.surefire.booter.ForkedBooter.main(ForkedBooter.java:418)
[main] ERROR org.eclipse.rdf4j.sail.InferencingTest - exception while uploading input data
java.lang.ClassCastException: org.eclipse.rdf4j.model.impl.SimpleLiteral cannot be cast to org.eclipse.rdf4j.model.Resource
	at org.eclipse.rdf4j.sail.inferencer.fc.SchemaCachingRDFSInferencer.addSubClassOfStatement(SchemaCachingRDFSInferencer.java:382)
	at org.eclipse.rdf4j.sail.inferencer.fc.SchemaCachingRDFSInferencerConnection.processForSchemaCache(SchemaCachingRDFSInferencerConnection.java:87)
	at org.eclipse.rdf4j.sail.inferencer.fc.SchemaCachingRDFSInferencerConnection.addStatement(SchemaCachingRDFSInferencerConnection.java:224)
	at org.eclipse.rdf4j.sail.inferencer.fc.SchemaCachingRDFSInferencerConnection.addStatement(SchemaCachingRDFSInferencerConnection.java:207)
	at org.eclipse.rdf4j.sail.InferencingTest.runTest(InferencingTest.java:72)
	at org.eclipse.rdf4j.sail.InferencingTest.testTypeError001(InferencingTest.java:236)
	at sun.reflect.NativeMethodAccessorImpl.invoke0(Native Method)
	at sun.reflect.NativeMethodAccessorImpl.invoke(NativeMethodAccessorImpl.java:62)
	at sun.reflect.DelegatingMethodAccessorImpl.invoke(DelegatingMethodAccessorImpl.java:43)
	at java.lang.reflect.Method.invoke(Method.java:498)
	at org.junit.runners.model.FrameworkMethod$1.runReflectiveCall(FrameworkMethod.java:50)
	at org.junit.internal.runners.model.ReflectiveCallable.run(ReflectiveCallable.java:12)
	at org.junit.runners.model.FrameworkMethod.invokeExplosively(FrameworkMethod.java:47)
	at org.junit.internal.runners.statements.InvokeMethod.evaluate(InvokeMethod.java:17)
	at org.junit.rules.ExternalResource$1.evaluate(ExternalResource.java:48)
	at org.junit.rules.RunRules.evaluate(RunRules.java:20)
	at org.junit.runners.ParentRunner.runLeaf(ParentRunner.java:325)
	at org.junit.runners.BlockJUnit4ClassRunner.runChild(BlockJUnit4ClassRunner.java:78)
	at org.junit.runners.BlockJUnit4ClassRunner.runChild(BlockJUnit4ClassRunner.java:57)
	at org.junit.runners.ParentRunner$3.run(ParentRunner.java:290)
	at org.junit.runners.ParentRunner$1.schedule(ParentRunner.java:71)
	at org.junit.runners.ParentRunner.runChildren(ParentRunner.java:288)
	at org.junit.runners.ParentRunner.access$000(ParentRunner.java:58)
	at org.junit.runners.ParentRunner$2.evaluate(ParentRunner.java:268)
	at org.junit.internal.runners.statements.RunBefores.evaluate(RunBefores.java:26)
	at org.junit.runners.ParentRunner.run(ParentRunner.java:363)
	at org.apache.maven.surefire.junit4.JUnit4Provider.execute(JUnit4Provider.java:365)
	at org.apache.maven.surefire.junit4.JUnit4Provider.executeWithRerun(JUnit4Provider.java:273)
	at org.apache.maven.surefire.junit4.JUnit4Provider.executeTestSet(JUnit4Provider.java:238)
	at org.apache.maven.surefire.junit4.JUnit4Provider.invoke(JUnit4Provider.java:159)
	at org.apache.maven.surefire.booter.ForkedBooter.invokeProviderInSameClassLoader(ForkedBooter.java:384)
	at org.apache.maven.surefire.booter.ForkedBooter.runSuitesInProcess(ForkedBooter.java:345)
	at org.apache.maven.surefire.booter.ForkedBooter.execute(ForkedBooter.java:126)
	at org.apache.maven.surefire.booter.ForkedBooter.main(ForkedBooter.java:418)
[main] ERROR org.eclipse.rdf4j.sail.InferencingTest - exception while uploading input data
java.lang.ClassCastException: org.eclipse.rdf4j.model.impl.SimpleLiteral cannot be cast to org.eclipse.rdf4j.model.Resource
	at org.eclipse.rdf4j.sail.inferencer.fc.SchemaCachingRDFSInferencer.addDomainStatement(SchemaCachingRDFSInferencer.java:400)
	at org.eclipse.rdf4j.sail.inferencer.fc.SchemaCachingRDFSInferencerConnection.processForSchemaCache(SchemaCachingRDFSInferencerConnection.java:99)
	at org.eclipse.rdf4j.sail.inferencer.fc.SchemaCachingRDFSInferencerConnection.addStatement(SchemaCachingRDFSInferencerConnection.java:224)
	at org.eclipse.rdf4j.sail.inferencer.fc.SchemaCachingRDFSInferencerConnection.addStatement(SchemaCachingRDFSInferencerConnection.java:207)
	at org.eclipse.rdf4j.sail.InferencingTest.runTest(InferencingTest.java:72)
	at org.eclipse.rdf4j.sail.InferencingTest.testDomainError001(InferencingTest.java:191)
	at sun.reflect.NativeMethodAccessorImpl.invoke0(Native Method)
	at sun.reflect.NativeMethodAccessorImpl.invoke(NativeMethodAccessorImpl.java:62)
	at sun.reflect.DelegatingMethodAccessorImpl.invoke(DelegatingMethodAccessorImpl.java:43)
	at java.lang.reflect.Method.invoke(Method.java:498)
	at org.junit.runners.model.FrameworkMethod$1.runReflectiveCall(FrameworkMethod.java:50)
	at org.junit.internal.runners.model.ReflectiveCallable.run(ReflectiveCallable.java:12)
	at org.junit.runners.model.FrameworkMethod.invokeExplosively(FrameworkMethod.java:47)
	at org.junit.internal.runners.statements.InvokeMethod.evaluate(InvokeMethod.java:17)
	at org.junit.rules.ExternalResource$1.evaluate(ExternalResource.java:48)
	at org.junit.rules.RunRules.evaluate(RunRules.java:20)
	at org.junit.runners.ParentRunner.runLeaf(ParentRunner.java:325)
	at org.junit.runners.BlockJUnit4ClassRunner.runChild(BlockJUnit4ClassRunner.java:78)
	at org.junit.runners.BlockJUnit4ClassRunner.runChild(BlockJUnit4ClassRunner.java:57)
	at org.junit.runners.ParentRunner$3.run(ParentRunner.java:290)
	at org.junit.runners.ParentRunner$1.schedule(ParentRunner.java:71)
	at org.junit.runners.ParentRunner.runChildren(ParentRunner.java:288)
	at org.junit.runners.ParentRunner.access$000(ParentRunner.java:58)
	at org.junit.runners.ParentRunner$2.evaluate(ParentRunner.java:268)
	at org.junit.internal.runners.statements.RunBefores.evaluate(RunBefores.java:26)
	at org.junit.runners.ParentRunner.run(ParentRunner.java:363)
	at org.apache.maven.surefire.junit4.JUnit4Provider.execute(JUnit4Provider.java:365)
	at org.apache.maven.surefire.junit4.JUnit4Provider.executeWithRerun(JUnit4Provider.java:273)
	at org.apache.maven.surefire.junit4.JUnit4Provider.executeTestSet(JUnit4Provider.java:238)
	at org.apache.maven.surefire.junit4.JUnit4Provider.invoke(JUnit4Provider.java:159)
	at org.apache.maven.surefire.booter.ForkedBooter.invokeProviderInSameClassLoader(ForkedBooter.java:384)
	at org.apache.maven.surefire.booter.ForkedBooter.runSuitesInProcess(ForkedBooter.java:345)
	at org.apache.maven.surefire.booter.ForkedBooter.execute(ForkedBooter.java:126)
	at org.apache.maven.surefire.booter.ForkedBooter.main(ForkedBooter.java:418)
[main] ERROR org.eclipse.rdf4j.sail.InferencingTest - exception while uploading input data
java.lang.ClassCastException: org.eclipse.rdf4j.model.impl.SimpleLiteral cannot be cast to org.eclipse.rdf4j.model.Resource
	at org.eclipse.rdf4j.sail.inferencer.fc.SchemaCachingRDFSInferencer.addSubClassOfStatement(SchemaCachingRDFSInferencer.java:382)
	at org.eclipse.rdf4j.sail.inferencer.fc.SchemaCachingRDFSInferencerConnection.processForSchemaCache(SchemaCachingRDFSInferencerConnection.java:87)
	at org.eclipse.rdf4j.sail.inferencer.fc.SchemaCachingRDFSInferencerConnection.addStatement(SchemaCachingRDFSInferencerConnection.java:224)
	at org.eclipse.rdf4j.sail.inferencer.fc.SchemaCachingRDFSInferencerConnection.addStatement(SchemaCachingRDFSInferencerConnection.java:207)
	at org.eclipse.rdf4j.sail.InferencingTest.runTest(InferencingTest.java:72)
	at org.eclipse.rdf4j.sail.InferencingTest.testSubClassOfError001(InferencingTest.java:156)
	at sun.reflect.NativeMethodAccessorImpl.invoke0(Native Method)
	at sun.reflect.NativeMethodAccessorImpl.invoke(NativeMethodAccessorImpl.java:62)
	at sun.reflect.DelegatingMethodAccessorImpl.invoke(DelegatingMethodAccessorImpl.java:43)
	at java.lang.reflect.Method.invoke(Method.java:498)
	at org.junit.runners.model.FrameworkMethod$1.runReflectiveCall(FrameworkMethod.java:50)
	at org.junit.internal.runners.model.ReflectiveCallable.run(ReflectiveCallable.java:12)
	at org.junit.runners.model.FrameworkMethod.invokeExplosively(FrameworkMethod.java:47)
	at org.junit.internal.runners.statements.InvokeMethod.evaluate(InvokeMethod.java:17)
	at org.junit.rules.ExternalResource$1.evaluate(ExternalResource.java:48)
	at org.junit.rules.RunRules.evaluate(RunRules.java:20)
	at org.junit.runners.ParentRunner.runLeaf(ParentRunner.java:325)
	at org.junit.runners.BlockJUnit4ClassRunner.runChild(BlockJUnit4ClassRunner.java:78)
	at org.junit.runners.BlockJUnit4ClassRunner.runChild(BlockJUnit4ClassRunner.java:57)
	at org.junit.runners.ParentRunner$3.run(ParentRunner.java:290)
	at org.junit.runners.ParentRunner$1.schedule(ParentRunner.java:71)
	at org.junit.runners.ParentRunner.runChildren(ParentRunner.java:288)
	at org.junit.runners.ParentRunner.access$000(ParentRunner.java:58)
	at org.junit.runners.ParentRunner$2.evaluate(ParentRunner.java:268)
	at org.junit.internal.runners.statements.RunBefores.evaluate(RunBefores.java:26)
	at org.junit.runners.ParentRunner.run(ParentRunner.java:363)
	at org.apache.maven.surefire.junit4.JUnit4Provider.execute(JUnit4Provider.java:365)
	at org.apache.maven.surefire.junit4.JUnit4Provider.executeWithRerun(JUnit4Provider.java:273)
	at org.apache.maven.surefire.junit4.JUnit4Provider.executeTestSet(JUnit4Provider.java:238)
	at org.apache.maven.surefire.junit4.JUnit4Provider.invoke(JUnit4Provider.java:159)
	at org.apache.maven.surefire.booter.ForkedBooter.invokeProviderInSameClassLoader(ForkedBooter.java:384)
	at org.apache.maven.surefire.booter.ForkedBooter.runSuitesInProcess(ForkedBooter.java:345)
	at org.apache.maven.surefire.booter.ForkedBooter.execute(ForkedBooter.java:126)
	at org.apache.maven.surefire.booter.ForkedBooter.main(ForkedBooter.java:418)
[INFO] Tests run: 21, Failures: 0, Errors: 0, Skipped: 0, Time elapsed: 5.866 s - in org.eclipse.rdf4j.sail.inferencer.fc.NativeStoreInferencingTest
[INFO] Running org.eclipse.rdf4j.sail.inferencer.fc.SchemaCachingRDFSInferencerIsolationLevelTest
[INFO] Tests run: 6, Failures: 0, Errors: 0, Skipped: 0, Time elapsed: 1.562 s - in org.eclipse.rdf4j.sail.inferencer.fc.SchemaCachingRDFSInferencerIsolationLevelTest
[INFO] Running org.eclipse.rdf4j.sail.inferencer.fc.CustomGraphQueryInferencerRepositoryConnectionTest
[Time-limited test] WARN org.eclipse.rdf4j.rio.helpers.ParseErrorLogger - [Rio error] Illegal language tag char: '_' (6, -1)
[Time-limited test] WARN org.eclipse.rdf4j.rio.helpers.ParseErrorLogger - [Rio error] Illegal language tag char: '_' (6, -1)
[Time-limited test] WARN org.eclipse.rdf4j.rio.helpers.ParseErrorLogger - [Rio error] Illegal language tag char: '_' (6, -1)
[Time-limited test] WARN org.eclipse.rdf4j.rio.helpers.ParseErrorLogger - [Rio error] Illegal language tag char: '_' (6, -1)
[Time-limited test] WARN org.eclipse.rdf4j.rio.helpers.ParseErrorLogger - [Rio error] Illegal language tag char: '_' (6, -1)
[Time-limited test] WARN org.eclipse.rdf4j.rio.helpers.ParseErrorLogger - [Rio error] Illegal language tag char: '_' (6, -1)
[Time-limited test] WARN org.eclipse.rdf4j.rio.helpers.ParseErrorLogger - [Rio error] Illegal language tag char: '_' (6, -1)
[Time-limited test] WARN org.eclipse.rdf4j.rio.helpers.ParseErrorLogger - [Rio error] Illegal language tag char: '_' (6, -1)
[Time-limited test] WARN org.eclipse.rdf4j.rio.helpers.ParseErrorLogger - [Rio error] Illegal language tag char: '_' (6, -1)
[Time-limited test] WARN org.eclipse.rdf4j.rio.helpers.ParseErrorLogger - [Rio error] Illegal language tag char: '_' (6, -1)
[Time-limited test] WARN org.eclipse.rdf4j.rio.helpers.ParseErrorLogger - [Rio error] Illegal language tag char: '_' (6, -1)
[Time-limited test] WARN org.eclipse.rdf4j.rio.helpers.ParseErrorLogger - [Rio error] Illegal language tag char: '_' (6, -1)
[INFO] Tests run: 420, Failures: 0, Errors: 0, Skipped: 0, Time elapsed: 0.65 s - in org.eclipse.rdf4j.sail.inferencer.fc.CustomGraphQueryInferencerRepositoryConnectionTest
[INFO] Running org.eclipse.rdf4j.sail.inferencer.fc.MemInferencingTest
[main] ERROR org.eclipse.rdf4j.sail.InferencingTest - exception while uploading input data
java.lang.ClassCastException
[main] ERROR org.eclipse.rdf4j.sail.InferencingTest - exception while uploading input data
java.lang.ClassCastException: org.eclipse.rdf4j.model.impl.SimpleLiteral cannot be cast to org.eclipse.rdf4j.model.Resource
	at org.eclipse.rdf4j.sail.inferencer.fc.SchemaCachingRDFSInferencer.addSubPropertyOfStatement(SchemaCachingRDFSInferencer.java:388)
	at org.eclipse.rdf4j.sail.inferencer.fc.SchemaCachingRDFSInferencerConnection.processForSchemaCache(SchemaCachingRDFSInferencerConnection.java:93)
	at org.eclipse.rdf4j.sail.inferencer.fc.SchemaCachingRDFSInferencerConnection.addStatement(SchemaCachingRDFSInferencerConnection.java:224)
	at org.eclipse.rdf4j.sail.inferencer.fc.SchemaCachingRDFSInferencerConnection.addStatement(SchemaCachingRDFSInferencerConnection.java:207)
	at org.eclipse.rdf4j.sail.InferencingTest.runTest(InferencingTest.java:72)
	at org.eclipse.rdf4j.sail.InferencingTest.testSubPropertyOfError001(InferencingTest.java:181)
	at sun.reflect.NativeMethodAccessorImpl.invoke0(Native Method)
	at sun.reflect.NativeMethodAccessorImpl.invoke(NativeMethodAccessorImpl.java:62)
	at sun.reflect.DelegatingMethodAccessorImpl.invoke(DelegatingMethodAccessorImpl.java:43)
	at java.lang.reflect.Method.invoke(Method.java:498)
	at org.junit.runners.model.FrameworkMethod$1.runReflectiveCall(FrameworkMethod.java:50)
	at org.junit.internal.runners.model.ReflectiveCallable.run(ReflectiveCallable.java:12)
	at org.junit.runners.model.FrameworkMethod.invokeExplosively(FrameworkMethod.java:47)
	at org.junit.internal.runners.statements.InvokeMethod.evaluate(InvokeMethod.java:17)
	at org.junit.runners.ParentRunner.runLeaf(ParentRunner.java:325)
	at org.junit.runners.BlockJUnit4ClassRunner.runChild(BlockJUnit4ClassRunner.java:78)
	at org.junit.runners.BlockJUnit4ClassRunner.runChild(BlockJUnit4ClassRunner.java:57)
	at org.junit.runners.ParentRunner$3.run(ParentRunner.java:290)
	at org.junit.runners.ParentRunner$1.schedule(ParentRunner.java:71)
	at org.junit.runners.ParentRunner.runChildren(ParentRunner.java:288)
	at org.junit.runners.ParentRunner.access$000(ParentRunner.java:58)
	at org.junit.runners.ParentRunner$2.evaluate(ParentRunner.java:268)
	at org.junit.internal.runners.statements.RunBefores.evaluate(RunBefores.java:26)
	at org.junit.runners.ParentRunner.run(ParentRunner.java:363)
	at org.apache.maven.surefire.junit4.JUnit4Provider.execute(JUnit4Provider.java:365)
	at org.apache.maven.surefire.junit4.JUnit4Provider.executeWithRerun(JUnit4Provider.java:273)
	at org.apache.maven.surefire.junit4.JUnit4Provider.executeTestSet(JUnit4Provider.java:238)
	at org.apache.maven.surefire.junit4.JUnit4Provider.invoke(JUnit4Provider.java:159)
	at org.apache.maven.surefire.booter.ForkedBooter.invokeProviderInSameClassLoader(ForkedBooter.java:384)
	at org.apache.maven.surefire.booter.ForkedBooter.runSuitesInProcess(ForkedBooter.java:345)
	at org.apache.maven.surefire.booter.ForkedBooter.execute(ForkedBooter.java:126)
	at org.apache.maven.surefire.booter.ForkedBooter.main(ForkedBooter.java:418)
[main] ERROR org.eclipse.rdf4j.sail.InferencingTest - exception while uploading input data
java.lang.ClassCastException: org.eclipse.rdf4j.model.impl.SimpleLiteral cannot be cast to org.eclipse.rdf4j.model.Resource
	at org.eclipse.rdf4j.sail.inferencer.fc.SchemaCachingRDFSInferencer.addSubClassOfStatement(SchemaCachingRDFSInferencer.java:382)
	at org.eclipse.rdf4j.sail.inferencer.fc.SchemaCachingRDFSInferencerConnection.processForSchemaCache(SchemaCachingRDFSInferencerConnection.java:87)
	at org.eclipse.rdf4j.sail.inferencer.fc.SchemaCachingRDFSInferencerConnection.addStatement(SchemaCachingRDFSInferencerConnection.java:224)
	at org.eclipse.rdf4j.sail.inferencer.fc.SchemaCachingRDFSInferencerConnection.addStatement(SchemaCachingRDFSInferencerConnection.java:207)
	at org.eclipse.rdf4j.sail.InferencingTest.runTest(InferencingTest.java:72)
	at org.eclipse.rdf4j.sail.InferencingTest.testTypeError001(InferencingTest.java:236)
	at sun.reflect.NativeMethodAccessorImpl.invoke0(Native Method)
	at sun.reflect.NativeMethodAccessorImpl.invoke(NativeMethodAccessorImpl.java:62)
	at sun.reflect.DelegatingMethodAccessorImpl.invoke(DelegatingMethodAccessorImpl.java:43)
	at java.lang.reflect.Method.invoke(Method.java:498)
	at org.junit.runners.model.FrameworkMethod$1.runReflectiveCall(FrameworkMethod.java:50)
	at org.junit.internal.runners.model.ReflectiveCallable.run(ReflectiveCallable.java:12)
	at org.junit.runners.model.FrameworkMethod.invokeExplosively(FrameworkMethod.java:47)
	at org.junit.internal.runners.statements.InvokeMethod.evaluate(InvokeMethod.java:17)
	at org.junit.runners.ParentRunner.runLeaf(ParentRunner.java:325)
	at org.junit.runners.BlockJUnit4ClassRunner.runChild(BlockJUnit4ClassRunner.java:78)
	at org.junit.runners.BlockJUnit4ClassRunner.runChild(BlockJUnit4ClassRunner.java:57)
	at org.junit.runners.ParentRunner$3.run(ParentRunner.java:290)
	at org.junit.runners.ParentRunner$1.schedule(ParentRunner.java:71)
	at org.junit.runners.ParentRunner.runChildren(ParentRunner.java:288)
	at org.junit.runners.ParentRunner.access$000(ParentRunner.java:58)
	at org.junit.runners.ParentRunner$2.evaluate(ParentRunner.java:268)
	at org.junit.internal.runners.statements.RunBefores.evaluate(RunBefores.java:26)
	at org.junit.runners.ParentRunner.run(ParentRunner.java:363)
	at org.apache.maven.surefire.junit4.JUnit4Provider.execute(JUnit4Provider.java:365)
	at org.apache.maven.surefire.junit4.JUnit4Provider.executeWithRerun(JUnit4Provider.java:273)
	at org.apache.maven.surefire.junit4.JUnit4Provider.executeTestSet(JUnit4Provider.java:238)
	at org.apache.maven.surefire.junit4.JUnit4Provider.invoke(JUnit4Provider.java:159)
	at org.apache.maven.surefire.booter.ForkedBooter.invokeProviderInSameClassLoader(ForkedBooter.java:384)
	at org.apache.maven.surefire.booter.ForkedBooter.runSuitesInProcess(ForkedBooter.java:345)
	at org.apache.maven.surefire.booter.ForkedBooter.execute(ForkedBooter.java:126)
	at org.apache.maven.surefire.booter.ForkedBooter.main(ForkedBooter.java:418)
[main] ERROR org.eclipse.rdf4j.sail.InferencingTest - exception while uploading input data
java.lang.ClassCastException
[main] ERROR org.eclipse.rdf4j.sail.InferencingTest - exception while uploading input data
java.lang.ClassCastException
[INFO] Tests run: 25, Failures: 0, Errors: 0, Skipped: 0, Time elapsed: 0.226 s - in org.eclipse.rdf4j.sail.inferencer.fc.MemInferencingTest
[INFO] Running org.eclipse.rdf4j.sail.inferencer.fc.RDFSchemaMemoryRepositoryConnectionTest
[Time-limited test] WARN org.eclipse.rdf4j.rio.helpers.ParseErrorLogger - [Rio error] Illegal language tag char: '_' (6, -1)
[Time-limited test] WARN org.eclipse.rdf4j.rio.helpers.ParseErrorLogger - [Rio error] Illegal language tag char: '_' (6, -1)
[Time-limited test] WARN org.eclipse.rdf4j.rio.helpers.ParseErrorLogger - [Rio error] Illegal language tag char: '_' (6, -1)
[Time-limited test] WARN org.eclipse.rdf4j.rio.helpers.ParseErrorLogger - [Rio error] Illegal language tag char: '_' (6, -1)
[Time-limited test] WARN org.eclipse.rdf4j.rio.helpers.ParseErrorLogger - [Rio error] Illegal language tag char: '_' (6, -1)
[Time-limited test] WARN org.eclipse.rdf4j.rio.helpers.ParseErrorLogger - [Rio error] Illegal language tag char: '_' (6, -1)
[Time-limited test] WARN org.eclipse.rdf4j.rio.helpers.ParseErrorLogger - [Rio error] Illegal language tag char: '_' (6, -1)
[Time-limited test] WARN org.eclipse.rdf4j.rio.helpers.ParseErrorLogger - [Rio error] Illegal language tag char: '_' (6, -1)
[Time-limited test] WARN org.eclipse.rdf4j.rio.helpers.ParseErrorLogger - [Rio error] Illegal language tag char: '_' (6, -1)
[Time-limited test] WARN org.eclipse.rdf4j.rio.helpers.ParseErrorLogger - [Rio error] Illegal language tag char: '_' (6, -1)
[INFO] Tests run: 400, Failures: 0, Errors: 0, Skipped: 0, Time elapsed: 5.682 s - in org.eclipse.rdf4j.sail.inferencer.fc.RDFSchemaMemoryRepositoryConnectionTest
[INFO] Running org.eclipse.rdf4j.sail.inferencer.fc.InferredContextTest
[INFO] Tests run: 3, Failures: 0, Errors: 0, Skipped: 0, Time elapsed: 0.009 s - in org.eclipse.rdf4j.sail.inferencer.fc.InferredContextTest
[INFO] Running org.eclipse.rdf4j.sail.inferencer.fc.SchemaCachingRDFSInferencerNativeRepositoryConnectionTest
-----------
(http://example.org/Man, http://www.w3.org/2000/01/rdf-schema#subClassOf, http://www.w3.org/2000/01/rdf-schema#Resource) [http://example.org/graph1]
(http://example.org/Man, http://www.w3.org/2000/01/rdf-schema#subClassOf, http://www.w3.org/2000/01/rdf-schema#Resource) [http://example.org/graph3]
(http://example.org/Man, http://www.w3.org/2000/01/rdf-schema#subClassOf, http://example.org/Man) [null]
(http://example.org/Man, http://www.w3.org/2000/01/rdf-schema#subClassOf, http://example.org/Animal) [null]
(http://example.org/Man, http://www.w3.org/2000/01/rdf-schema#subClassOf, http://example.org/Human) [http://example.org/graph1]
-----------
(http://example.org/bob, http://www.w3.org/1999/02/22-rdf-syntax-ns#type, http://www.w3.org/2000/01/rdf-schema#Resource) [http://example.org/graph3]
(http://example.org/bob, http://www.w3.org/1999/02/22-rdf-syntax-ns#type, http://example.org/Human) [http://example.org/graph3]
(http://example.org/bob, http://www.w3.org/1999/02/22-rdf-syntax-ns#type, http://example.org/Animal) [http://example.org/graph3]
(http://example.org/bob, http://www.w3.org/1999/02/22-rdf-syntax-ns#type, http://example.org/Man) [http://example.org/graph3]
-----------
[Time-limited test] WARN org.eclipse.rdf4j.rio.helpers.ParseErrorLogger - [Rio error] Illegal language tag char: '_' (6, -1)
[Time-limited test] WARN org.eclipse.rdf4j.rio.helpers.ParseErrorLogger - [Rio error] Illegal language tag char: '_' (6, -1)
-----------
(http://example.org/Man, http://www.w3.org/2000/01/rdf-schema#subClassOf, http://www.w3.org/2000/01/rdf-schema#Resource) [http://example.org/graph1]
(http://example.org/Man, http://www.w3.org/2000/01/rdf-schema#subClassOf, http://www.w3.org/2000/01/rdf-schema#Resource) [http://example.org/graph3]
(http://example.org/Man, http://www.w3.org/2000/01/rdf-schema#subClassOf, http://example.org/Man) [null]
(http://example.org/Man, http://www.w3.org/2000/01/rdf-schema#subClassOf, http://example.org/Animal) [null]
(http://example.org/Man, http://www.w3.org/2000/01/rdf-schema#subClassOf, http://example.org/Human) [http://example.org/graph1]
-----------
(http://example.org/bob, http://www.w3.org/1999/02/22-rdf-syntax-ns#type, http://www.w3.org/2000/01/rdf-schema#Resource) [http://example.org/graph3]
(http://example.org/bob, http://www.w3.org/1999/02/22-rdf-syntax-ns#type, http://example.org/Human) [http://example.org/graph3]
(http://example.org/bob, http://www.w3.org/1999/02/22-rdf-syntax-ns#type, http://example.org/Animal) [http://example.org/graph3]
(http://example.org/bob, http://www.w3.org/1999/02/22-rdf-syntax-ns#type, http://example.org/Man) [http://example.org/graph3]
-----------
[Time-limited test] WARN org.eclipse.rdf4j.rio.helpers.ParseErrorLogger - [Rio error] Illegal language tag char: '_' (6, -1)
[Time-limited test] WARN org.eclipse.rdf4j.rio.helpers.ParseErrorLogger - [Rio error] Illegal language tag char: '_' (6, -1)
-----------
(http://example.org/Man, http://www.w3.org/2000/01/rdf-schema#subClassOf, http://www.w3.org/2000/01/rdf-schema#Resource) [http://example.org/graph1]
(http://example.org/Man, http://www.w3.org/2000/01/rdf-schema#subClassOf, http://www.w3.org/2000/01/rdf-schema#Resource) [http://example.org/graph3]
(http://example.org/Man, http://www.w3.org/2000/01/rdf-schema#subClassOf, http://example.org/Man) [null]
(http://example.org/Man, http://www.w3.org/2000/01/rdf-schema#subClassOf, http://example.org/Animal) [null]
(http://example.org/Man, http://www.w3.org/2000/01/rdf-schema#subClassOf, http://example.org/Human) [http://example.org/graph1]
-----------
(http://example.org/bob, http://www.w3.org/1999/02/22-rdf-syntax-ns#type, http://www.w3.org/2000/01/rdf-schema#Resource) [http://example.org/graph3]
(http://example.org/bob, http://www.w3.org/1999/02/22-rdf-syntax-ns#type, http://example.org/Human) [http://example.org/graph3]
(http://example.org/bob, http://www.w3.org/1999/02/22-rdf-syntax-ns#type, http://example.org/Animal) [http://example.org/graph3]
(http://example.org/bob, http://www.w3.org/1999/02/22-rdf-syntax-ns#type, http://example.org/Man) [http://example.org/graph3]
-----------
[Time-limited test] WARN org.eclipse.rdf4j.rio.helpers.ParseErrorLogger - [Rio error] Illegal language tag char: '_' (6, -1)
[Time-limited test] WARN org.eclipse.rdf4j.rio.helpers.ParseErrorLogger - [Rio error] Illegal language tag char: '_' (6, -1)
-----------
(http://example.org/Man, http://www.w3.org/2000/01/rdf-schema#subClassOf, http://www.w3.org/2000/01/rdf-schema#Resource) [http://example.org/graph1]
(http://example.org/Man, http://www.w3.org/2000/01/rdf-schema#subClassOf, http://www.w3.org/2000/01/rdf-schema#Resource) [http://example.org/graph3]
(http://example.org/Man, http://www.w3.org/2000/01/rdf-schema#subClassOf, http://example.org/Man) [null]
(http://example.org/Man, http://www.w3.org/2000/01/rdf-schema#subClassOf, http://example.org/Animal) [null]
(http://example.org/Man, http://www.w3.org/2000/01/rdf-schema#subClassOf, http://example.org/Human) [http://example.org/graph1]
-----------
(http://example.org/bob, http://www.w3.org/1999/02/22-rdf-syntax-ns#type, http://www.w3.org/2000/01/rdf-schema#Resource) [http://example.org/graph3]
(http://example.org/bob, http://www.w3.org/1999/02/22-rdf-syntax-ns#type, http://example.org/Human) [http://example.org/graph3]
(http://example.org/bob, http://www.w3.org/1999/02/22-rdf-syntax-ns#type, http://example.org/Animal) [http://example.org/graph3]
(http://example.org/bob, http://www.w3.org/1999/02/22-rdf-syntax-ns#type, http://example.org/Man) [http://example.org/graph3]
-----------
[Time-limited test] WARN org.eclipse.rdf4j.rio.helpers.ParseErrorLogger - [Rio error] Illegal language tag char: '_' (6, -1)
[Time-limited test] WARN org.eclipse.rdf4j.rio.helpers.ParseErrorLogger - [Rio error] Illegal language tag char: '_' (6, -1)
-----------
(http://example.org/Man, http://www.w3.org/2000/01/rdf-schema#subClassOf, http://www.w3.org/2000/01/rdf-schema#Resource) [http://example.org/graph1]
(http://example.org/Man, http://www.w3.org/2000/01/rdf-schema#subClassOf, http://example.org/Man) [null]
(http://example.org/Man, http://www.w3.org/2000/01/rdf-schema#subClassOf, http://example.org/Animal) [null]
(http://example.org/Man, http://www.w3.org/2000/01/rdf-schema#subClassOf, http://www.w3.org/2000/01/rdf-schema#Resource) [http://example.org/graph3]
(http://example.org/Man, http://www.w3.org/2000/01/rdf-schema#subClassOf, http://example.org/Human) [http://example.org/graph1]
-----------
(http://example.org/bob, http://www.w3.org/1999/02/22-rdf-syntax-ns#type, http://www.w3.org/2000/01/rdf-schema#Resource) [http://example.org/graph3]
(http://example.org/bob, http://www.w3.org/1999/02/22-rdf-syntax-ns#type, http://example.org/Animal) [http://example.org/graph3]
(http://example.org/bob, http://www.w3.org/1999/02/22-rdf-syntax-ns#type, http://example.org/Human) [http://example.org/graph3]
(http://example.org/bob, http://www.w3.org/1999/02/22-rdf-syntax-ns#type, http://example.org/Man) [http://example.org/graph3]
-----------
[Time-limited test] WARN org.eclipse.rdf4j.rio.helpers.ParseErrorLogger - [Rio error] Illegal language tag char: '_' (6, -1)
[Time-limited test] WARN org.eclipse.rdf4j.rio.helpers.ParseErrorLogger - [Rio error] Illegal language tag char: '_' (6, -1)
[WARNING] Tests run: 405, Failures: 0, Errors: 0, Skipped: 20, Time elapsed: 236.766 s - in org.eclipse.rdf4j.sail.inferencer.fc.SchemaCachingRDFSInferencerNativeRepositoryConnectionTest
[INFO] Running org.eclipse.rdf4j.sail.inferencer.fc.MemCustomInferencingTest
[INFO] Tests run: 6, Failures: 0, Errors: 0, Skipped: 0, Time elapsed: 0 s - in org.eclipse.rdf4j.sail.inferencer.fc.MemCustomInferencingTest
[INFO] 
[INFO] Results:
[INFO] 
[WARNING] Tests run: 2117, Failures: 0, Errors: 0, Skipped: 40
[INFO] 
[JENKINS] Recording test results
[INFO] 
[INFO] --- animal-sniffer-maven-plugin:1.16:check (default) @ rdf4j-sail-inferencer ---
[INFO] Checking unresolved references to org.codehaus.mojo.signature:java18:1.0
[INFO] 
[INFO] --- maven-jar-plugin:2.3.1:jar (default-jar) @ rdf4j-sail-inferencer ---
[INFO] Building jar: /home/hudson/genie.rdf4j/.jenkins/jobs/rdf4j-pr-verify/workspace/core/sail/inferencer/target/rdf4j-sail-inferencer-3.1.0-SNAPSHOT.jar
[INFO] 
[INFO] --- japicmp-maven-plugin:0.14.0:cmp (default) @ rdf4j-sail-inferencer ---
[INFO] Written file '/jobs/genie.rdf4j/rdf4j-pr-verify/workspace/core/sail/inferencer/target/japicmp/japicmp.diff'.
[INFO] Written file '/jobs/genie.rdf4j/rdf4j-pr-verify/workspace/core/sail/inferencer/target/japicmp/japicmp.xml'.
[INFO] Written file '/jobs/genie.rdf4j/rdf4j-pr-verify/workspace/core/sail/inferencer/target/japicmp/japicmp.html'.