SuccessConsole Output

Started calculate disk usage of build
Finished Calculation of disk usage of build in 0 seconds
Started calculate disk usage of workspace
Finished Calculation of disk usage of workspace in 0 seconds
[INFO] 
[INFO] ------------------< org.eclipse.rdf4j:rdf4j-console >-------------------
[INFO] Building RDF4J: Console 3.1.0-SNAPSHOT                           [68/81]
[INFO] --------------------------------[ jar ]---------------------------------
[INFO] 
[INFO] --- buildnumber-maven-plugin:1.4:create (default) @ rdf4j-console ---
[INFO] ShortRevision tag detected. The value is '7'.
[INFO] Executing: /bin/sh -c cd '/home/hudson/genie.rdf4j/.jenkins/jobs/rdf4j-pr-verify/workspace/tools/console' && 'git' 'rev-parse' '--verify' '--short=7' 'HEAD'
[INFO] Working directory: /home/hudson/genie.rdf4j/.jenkins/jobs/rdf4j-pr-verify/workspace/tools/console
[INFO] Storing buildNumber: 5d8ecec at timestamp: 1576094330934
[WARNING] Cannot get the branch information from the git repository: 
Detecting the current branch failed: fatal: ref HEAD is not a symbolic ref

[INFO] ShortRevision tag detected. The value is '7'.
[INFO] Executing: /bin/sh -c cd '/home/hudson/genie.rdf4j/.jenkins/jobs/rdf4j-pr-verify/workspace/tools/console' && 'git' 'rev-parse' '--verify' '--short=7' 'HEAD'
[INFO] Working directory: /home/hudson/genie.rdf4j/.jenkins/jobs/rdf4j-pr-verify/workspace/tools/console
[INFO] Storing buildScmBranch: UNKNOWN
[INFO] 
[INFO] --- maven-enforcer-plugin:1.4.1:enforce (enforce-bytecode-version) @ rdf4j-console ---
[INFO] Adding ignore: META-INF/**/module-info
[INFO] 
[INFO] --- formatter-maven-plugin:2.8.1:validate (default) @ rdf4j-console ---
[INFO] Using 'UTF-8' encoding to format source files.
[INFO] Number of files to be formatted: 61
[INFO] Html formatting is skipped
[INFO] Successfully formatted:          0 file(s)
[INFO] Fail to format:                  0 file(s)
[INFO] Skipped:                         61 file(s)
[INFO] Read only skipped:               0 file(s)
[INFO] Approximate time taken:          0s
[INFO] 
[INFO] --- maven-resources-plugin:3.0.2:resources (default-resources) @ rdf4j-console ---
[INFO] Using 'UTF-8' encoding to copy filtered resources.
[INFO] skip non existing resourceDirectory /home/hudson/genie.rdf4j/.jenkins/jobs/rdf4j-pr-verify/workspace/tools/console/src/main/resources
[INFO] 
[INFO] --- maven-compiler-plugin:3.7.0:compile (default-compile) @ rdf4j-console ---
[INFO] Changes detected - recompiling the module!
[INFO] Compiling 42 source files to /home/hudson/genie.rdf4j/.jenkins/jobs/rdf4j-pr-verify/workspace/tools/console/target/classes
[INFO] 
[INFO] --- maven-resources-plugin:3.0.2:testResources (default-testResources) @ rdf4j-console ---
[INFO] Using 'UTF-8' encoding to copy filtered resources.
[INFO] Copying 29 resources
[INFO] 
[INFO] --- maven-compiler-plugin:3.7.0:testCompile (default-testCompile) @ rdf4j-console ---
[INFO] Changes detected - recompiling the module!
[INFO] Compiling 18 source files to /home/hudson/genie.rdf4j/.jenkins/jobs/rdf4j-pr-verify/workspace/tools/console/target/test-classes
[INFO] 
[INFO] --- maven-surefire-plugin:2.22.2:test (default-test) @ rdf4j-console ---
[INFO] 
[INFO] -------------------------------------------------------
[INFO]  T E S T S
[INFO] -------------------------------------------------------
[INFO] Running org.eclipse.rdf4j.console.setting.PrefixesTest
[INFO] Tests run: 3, Failures: 0, Errors: 0, Skipped: 0, Time elapsed: 0.63 s - in org.eclipse.rdf4j.console.setting.PrefixesTest
[INFO] Running org.eclipse.rdf4j.console.setting.LogLevelTest
14:58:55.666 [main] ERROR unknown logging level: chatty
[INFO] Tests run: 4, Failures: 0, Errors: 0, Skipped: 0, Time elapsed: 0.029 s - in org.eclipse.rdf4j.console.setting.LogLevelTest
[INFO] Running org.eclipse.rdf4j.console.setting.QueryPrefixTest
[INFO] Tests run: 1, Failures: 0, Errors: 0, Skipped: 0, Time elapsed: 0.001 s - in org.eclipse.rdf4j.console.setting.QueryPrefixTest
[INFO] Running org.eclipse.rdf4j.console.setting.ShowPrefixTest
[INFO] Tests run: 1, Failures: 0, Errors: 0, Skipped: 0, Time elapsed: 0 s - in org.eclipse.rdf4j.console.setting.ShowPrefixTest
[INFO] Running org.eclipse.rdf4j.console.setting.ConsoleWidthTest
[INFO] Tests run: 1, Failures: 0, Errors: 0, Skipped: 0, Time elapsed: 0 s - in org.eclipse.rdf4j.console.setting.ConsoleWidthTest
[INFO] Running org.eclipse.rdf4j.console.command.SetParametersTest
14:58:55.717 [main] ERROR Unknown parameter: unknown
[INFO] Tests run: 1, Failures: 0, Errors: 0, Skipped: 0, Time elapsed: 0.021 s - in org.eclipse.rdf4j.console.command.SetParametersTest
[INFO] Running org.eclipse.rdf4j.console.command.LoadTest
[MockitoHint] LoadTest.testLoad (see javadoc for MockitoHint):
[MockitoHint] 1. Unused -> at org.eclipse.rdf4j.console.command.LoadTest.setUp(LoadTest.java:49)

[MockitoHint] LoadTest.testLoadWorkDir (see javadoc for MockitoHint):
[MockitoHint] 1. Unused -> at org.eclipse.rdf4j.console.command.LoadTest.setUp(LoadTest.java:49)

[INFO] Tests run: 2, Failures: 0, Errors: 0, Skipped: 0, Time elapsed: 0.225 s - in org.eclipse.rdf4j.console.command.LoadTest
[INFO] Running org.eclipse.rdf4j.console.command.ConvertTest
14:58:56.209 [main] ERROR No RDF writer for /tmp/genie.rdf4j/junit3781646159349292938/alien.qyx
[MockitoHint] ConvertTest.testConvertInvalidFormat (see javadoc for MockitoHint):
[MockitoHint] 1. Unused -> at org.eclipse.rdf4j.console.command.ConvertTest.setup(ConvertTest.java:39)

14:58:56.217 [main] ERROR Failed to convert data
org.eclipse.rdf4j.rio.RDFParseException: Expected '<' or '_', found: e [line 1, column 101]
	at org.eclipse.rdf4j.rio.ntriples.NTriplesParser.parseSubject(NTriplesParser.java:313)
	at org.eclipse.rdf4j.rio.ntriples.NTriplesParser.parseTriple(NTriplesParser.java:252)
	at org.eclipse.rdf4j.rio.ntriples.NTriplesParser.parse(NTriplesParser.java:160)
	at org.eclipse.rdf4j.rio.ntriples.NTriplesParser.parse(NTriplesParser.java:109)
	at org.eclipse.rdf4j.console.command.Convert.convert(Convert.java:139)
	at org.eclipse.rdf4j.console.command.Convert.execute(Convert.java:74)
	at org.eclipse.rdf4j.console.command.ConvertTest.testConvertParseError(ConvertTest.java:92)
	at sun.reflect.NativeMethodAccessorImpl.invoke0(Native Method)
	at sun.reflect.NativeMethodAccessorImpl.invoke(NativeMethodAccessorImpl.java:62)
	at sun.reflect.DelegatingMethodAccessorImpl.invoke(DelegatingMethodAccessorImpl.java:43)
	at java.lang.reflect.Method.invoke(Method.java:498)
	at org.junit.runners.model.FrameworkMethod$1.runReflectiveCall(FrameworkMethod.java:50)
	at org.junit.internal.runners.model.ReflectiveCallable.run(ReflectiveCallable.java:12)
	at org.junit.runners.model.FrameworkMethod.invokeExplosively(FrameworkMethod.java:47)
	at org.junit.internal.runners.statements.InvokeMethod.evaluate(InvokeMethod.java:17)
	at org.junit.internal.runners.statements.RunBefores.evaluate(RunBefores.java:26)
	at org.junit.internal.runners.statements.RunAfters.evaluate(RunAfters.java:27)
	at org.mockito.internal.junit.JUnitRule$1.evaluateSafely(JUnitRule.java:52)
	at org.mockito.internal.junit.JUnitRule$1.evaluate(JUnitRule.java:43)
	at org.junit.rules.ExternalResource$1.evaluate(ExternalResource.java:48)
	at org.junit.rules.RunRules.evaluate(RunRules.java:20)
	at org.junit.runners.ParentRunner.runLeaf(ParentRunner.java:325)
	at org.junit.runners.BlockJUnit4ClassRunner.runChild(BlockJUnit4ClassRunner.java:78)
	at org.junit.runners.BlockJUnit4ClassRunner.runChild(BlockJUnit4ClassRunner.java:57)
	at org.junit.runners.ParentRunner$3.run(ParentRunner.java:290)
	at org.junit.runners.ParentRunner$1.schedule(ParentRunner.java:71)
	at org.junit.runners.ParentRunner.runChildren(ParentRunner.java:288)
	at org.junit.runners.ParentRunner.access$000(ParentRunner.java:58)
	at org.junit.runners.ParentRunner$2.evaluate(ParentRunner.java:268)
	at org.junit.runners.ParentRunner.run(ParentRunner.java:363)
	at org.apache.maven.surefire.junit4.JUnit4Provider.execute(JUnit4Provider.java:365)
	at org.apache.maven.surefire.junit4.JUnit4Provider.executeWithRerun(JUnit4Provider.java:273)
	at org.apache.maven.surefire.junit4.JUnit4Provider.executeTestSet(JUnit4Provider.java:238)
	at org.apache.maven.surefire.junit4.JUnit4Provider.invoke(JUnit4Provider.java:159)
	at org.apache.maven.surefire.booter.ForkedBooter.invokeProviderInSameClassLoader(ForkedBooter.java:384)
	at org.apache.maven.surefire.booter.ForkedBooter.runSuitesInProcess(ForkedBooter.java:345)
	at org.apache.maven.surefire.booter.ForkedBooter.execute(ForkedBooter.java:126)
	at org.apache.maven.surefire.booter.ForkedBooter.main(ForkedBooter.java:418)
[INFO] Tests run: 4, Failures: 0, Errors: 0, Skipped: 0, Time elapsed: 0.262 s - in org.eclipse.rdf4j.console.command.ConvertTest
[INFO] Running org.eclipse.rdf4j.console.command.ExportTest
[MockitoHint] ExportTest.testExportWorkDir (see javadoc for MockitoHint):
[MockitoHint] 1. Unused -> at org.eclipse.rdf4j.console.command.ExportTest.setUp(ExportTest.java:46)

[MockitoHint] ExportTest.testExportAll (see javadoc for MockitoHint):
[MockitoHint] 1. Unused -> at org.eclipse.rdf4j.console.command.ExportTest.setUp(ExportTest.java:46)

[MockitoHint] ExportTest.testExportContexts (see javadoc for MockitoHint):
[MockitoHint] 1. Unused -> at org.eclipse.rdf4j.console.command.ExportTest.setUp(ExportTest.java:46)

[INFO] Tests run: 3, Failures: 0, Errors: 0, Skipped: 0, Time elapsed: 0.132 s - in org.eclipse.rdf4j.console.command.ExportTest
[INFO] Running org.eclipse.rdf4j.console.command.VerifyTest
14:58:56.800 [main] ERROR Unexpected RDFParseException
org.eclipse.rdf4j.rio.RDFParseException: 'missing type' was not recognised, and could not be verified, with datatype http://example.rdf4j.org/type/wrong [line 1]
	at org.eclipse.rdf4j.rio.helpers.RDFParserHelper.reportError(RDFParserHelper.java:265)
	at org.eclipse.rdf4j.rio.helpers.RDFParserHelper.createLiteral(RDFParserHelper.java:180)
	at org.eclipse.rdf4j.rio.helpers.AbstractRDFParser.createLiteral(AbstractRDFParser.java:530)
	at org.eclipse.rdf4j.rio.turtle.TurtleParser.parseQuotedLiteral(TurtleParser.java:665)
	at org.eclipse.rdf4j.rio.turtle.TurtleParser.parseValue(TurtleParser.java:584)
	at org.eclipse.rdf4j.rio.turtle.TurtleParser.parseObject(TurtleParser.java:461)
	at org.eclipse.rdf4j.rio.turtle.TurtleParser.parseObjectList(TurtleParser.java:389)
	at org.eclipse.rdf4j.rio.turtle.TurtleParser.parsePredicateObjectList(TurtleParser.java:362)
	at org.eclipse.rdf4j.rio.turtle.TurtleParser.parseTriples(TurtleParser.java:349)
	at org.eclipse.rdf4j.rio.turtle.TurtleParser.parseStatement(TurtleParser.java:216)
	at org.eclipse.rdf4j.rio.turtle.TurtleParser.parse(TurtleParser.java:178)
	at org.eclipse.rdf4j.rio.turtle.TurtleParser.parse(TurtleParser.java:130)
	at org.eclipse.rdf4j.console.command.Verify.verify(Verify.java:145)
	at org.eclipse.rdf4j.console.command.Verify.execute(Verify.java:97)
	at org.eclipse.rdf4j.console.command.VerifyTest.testVerifyMissingType(VerifyTest.java:97)
	at sun.reflect.NativeMethodAccessorImpl.invoke0(Native Method)
	at sun.reflect.NativeMethodAccessorImpl.invoke(NativeMethodAccessorImpl.java:62)
	at sun.reflect.DelegatingMethodAccessorImpl.invoke(DelegatingMethodAccessorImpl.java:43)
	at java.lang.reflect.Method.invoke(Method.java:498)
	at org.junit.runners.model.FrameworkMethod$1.runReflectiveCall(FrameworkMethod.java:50)
	at org.junit.internal.runners.model.ReflectiveCallable.run(ReflectiveCallable.java:12)
	at org.junit.runners.model.FrameworkMethod.invokeExplosively(FrameworkMethod.java:47)
	at org.junit.internal.runners.statements.InvokeMethod.evaluate(InvokeMethod.java:17)
	at org.junit.internal.runners.statements.RunBefores.evaluate(RunBefores.java:26)
	at org.junit.internal.runners.statements.RunAfters.evaluate(RunAfters.java:27)
	at org.mockito.internal.junit.JUnitRule$1.evaluateSafely(JUnitRule.java:52)
	at org.mockito.internal.junit.JUnitRule$1.evaluate(JUnitRule.java:43)
	at org.junit.rules.ExternalResource$1.evaluate(ExternalResource.java:48)
	at org.junit.rules.RunRules.evaluate(RunRules.java:20)
	at org.junit.runners.ParentRunner.runLeaf(ParentRunner.java:325)
	at org.junit.runners.BlockJUnit4ClassRunner.runChild(BlockJUnit4ClassRunner.java:78)
	at org.junit.runners.BlockJUnit4ClassRunner.runChild(BlockJUnit4ClassRunner.java:57)
	at org.junit.runners.ParentRunner$3.run(ParentRunner.java:290)
	at org.junit.runners.ParentRunner$1.schedule(ParentRunner.java:71)
	at org.junit.runners.ParentRunner.runChildren(ParentRunner.java:288)
	at org.junit.runners.ParentRunner.access$000(ParentRunner.java:58)
	at org.junit.runners.ParentRunner$2.evaluate(ParentRunner.java:268)
	at org.junit.runners.ParentRunner.run(ParentRunner.java:363)
	at org.apache.maven.surefire.junit4.JUnit4Provider.execute(JUnit4Provider.java:365)
	at org.apache.maven.surefire.junit4.JUnit4Provider.executeWithRerun(JUnit4Provider.java:273)
	at org.apache.maven.surefire.junit4.JUnit4Provider.executeTestSet(JUnit4Provider.java:238)
	at org.apache.maven.surefire.junit4.JUnit4Provider.invoke(JUnit4Provider.java:159)
	at org.apache.maven.surefire.booter.ForkedBooter.invokeProviderInSameClassLoader(ForkedBooter.java:384)
	at org.apache.maven.surefire.booter.ForkedBooter.runSuitesInProcess(ForkedBooter.java:345)
	at org.apache.maven.surefire.booter.ForkedBooter.execute(ForkedBooter.java:126)
	at org.apache.maven.surefire.booter.ForkedBooter.main(ForkedBooter.java:418)
14:58:56.904 [main] ERROR SHACL validation failed, writing report to /tmp/genie.rdf4j/junit6983367143064562324/junit120411530757266785.tmp
14:58:56.945 [main] ERROR Unexpected RDFParseException
org.eclipse.rdf4j.rio.RDFParseException: Unexpected end of file
	at org.eclipse.rdf4j.rio.turtle.TurtleParser.throwEOFException(TurtleParser.java:1317)
	at org.eclipse.rdf4j.rio.turtle.TurtleParser.parseValue(TurtleParser.java:589)
	at org.eclipse.rdf4j.rio.turtle.TurtleParser.parsePredicate(TurtleParser.java:434)
	at org.eclipse.rdf4j.rio.turtle.TurtleParser.parsePredicateObjectList(TurtleParser.java:358)
	at org.eclipse.rdf4j.rio.turtle.TurtleParser.parseTriples(TurtleParser.java:349)
	at org.eclipse.rdf4j.rio.turtle.TurtleParser.parseStatement(TurtleParser.java:216)
	at org.eclipse.rdf4j.rio.turtle.TurtleParser.parse(TurtleParser.java:178)
	at org.eclipse.rdf4j.rio.turtle.TurtleParser.parse(TurtleParser.java:130)
	at org.eclipse.rdf4j.console.command.Verify.verify(Verify.java:145)
	at org.eclipse.rdf4j.console.command.Verify.execute(Verify.java:97)
	at org.eclipse.rdf4j.console.command.VerifyTest.testVerifyBrokenFile(VerifyTest.java:91)
	at sun.reflect.NativeMethodAccessorImpl.invoke0(Native Method)
	at sun.reflect.NativeMethodAccessorImpl.invoke(NativeMethodAccessorImpl.java:62)
	at sun.reflect.DelegatingMethodAccessorImpl.invoke(DelegatingMethodAccessorImpl.java:43)
	at java.lang.reflect.Method.invoke(Method.java:498)
	at org.junit.runners.model.FrameworkMethod$1.runReflectiveCall(FrameworkMethod.java:50)
	at org.junit.internal.runners.model.ReflectiveCallable.run(ReflectiveCallable.java:12)
	at org.junit.runners.model.FrameworkMethod.invokeExplosively(FrameworkMethod.java:47)
	at org.junit.internal.runners.statements.InvokeMethod.evaluate(InvokeMethod.java:17)
	at org.junit.internal.runners.statements.RunBefores.evaluate(RunBefores.java:26)
	at org.junit.internal.runners.statements.RunAfters.evaluate(RunAfters.java:27)
	at org.mockito.internal.junit.JUnitRule$1.evaluateSafely(JUnitRule.java:52)
	at org.mockito.internal.junit.JUnitRule$1.evaluate(JUnitRule.java:43)
	at org.junit.rules.ExternalResource$1.evaluate(ExternalResource.java:48)
	at org.junit.rules.RunRules.evaluate(RunRules.java:20)
	at org.junit.runners.ParentRunner.runLeaf(ParentRunner.java:325)
	at org.junit.runners.BlockJUnit4ClassRunner.runChild(BlockJUnit4ClassRunner.java:78)
	at org.junit.runners.BlockJUnit4ClassRunner.runChild(BlockJUnit4ClassRunner.java:57)
	at org.junit.runners.ParentRunner$3.run(ParentRunner.java:290)
	at org.junit.runners.ParentRunner$1.schedule(ParentRunner.java:71)
	at org.junit.runners.ParentRunner.runChildren(ParentRunner.java:288)
	at org.junit.runners.ParentRunner.access$000(ParentRunner.java:58)
	at org.junit.runners.ParentRunner$2.evaluate(ParentRunner.java:268)
	at org.junit.runners.ParentRunner.run(ParentRunner.java:363)
	at org.apache.maven.surefire.junit4.JUnit4Provider.execute(JUnit4Provider.java:365)
	at org.apache.maven.surefire.junit4.JUnit4Provider.executeWithRerun(JUnit4Provider.java:273)
	at org.apache.maven.surefire.junit4.JUnit4Provider.executeTestSet(JUnit4Provider.java:238)
	at org.apache.maven.surefire.junit4.JUnit4Provider.invoke(JUnit4Provider.java:159)
	at org.apache.maven.surefire.booter.ForkedBooter.invokeProviderInSameClassLoader(ForkedBooter.java:384)
	at org.apache.maven.surefire.booter.ForkedBooter.runSuitesInProcess(ForkedBooter.java:345)
	at org.apache.maven.surefire.booter.ForkedBooter.execute(ForkedBooter.java:126)
	at org.apache.maven.surefire.booter.ForkedBooter.main(ForkedBooter.java:418)
14:58:57.013 [main] ERROR Unexpected RDFParseException
org.eclipse.rdf4j.rio.RDFParseException: Expected a letter, found '1' [line 1]
	at org.eclipse.rdf4j.rio.helpers.RDFParserHelper.reportError(RDFParserHelper.java:265)
	at org.eclipse.rdf4j.rio.helpers.AbstractRDFParser.reportError(AbstractRDFParser.java:628)
	at org.eclipse.rdf4j.rio.turtle.TurtleParser.reportError(TurtleParser.java:1297)
	at org.eclipse.rdf4j.rio.turtle.TurtleParser.parseQuotedLiteral(TurtleParser.java:619)
	at org.eclipse.rdf4j.rio.turtle.TurtleParser.parseValue(TurtleParser.java:584)
	at org.eclipse.rdf4j.rio.turtle.TurtleParser.parseObject(TurtleParser.java:461)
	at org.eclipse.rdf4j.rio.turtle.TurtleParser.parseObjectList(TurtleParser.java:389)
	at org.eclipse.rdf4j.rio.turtle.TurtleParser.parsePredicateObjectList(TurtleParser.java:362)
	at org.eclipse.rdf4j.rio.turtle.TurtleParser.parseTriples(TurtleParser.java:349)
	at org.eclipse.rdf4j.rio.turtle.TurtleParser.parseStatement(TurtleParser.java:216)
	at org.eclipse.rdf4j.rio.turtle.TurtleParser.parse(TurtleParser.java:178)
	at org.eclipse.rdf4j.rio.turtle.TurtleParser.parse(TurtleParser.java:130)
	at org.eclipse.rdf4j.console.command.Verify.verify(Verify.java:145)
	at org.eclipse.rdf4j.console.command.Verify.execute(Verify.java:97)
	at org.eclipse.rdf4j.console.command.VerifyTest.testVerifyWrongLang(VerifyTest.java:109)
	at sun.reflect.NativeMethodAccessorImpl.invoke0(Native Method)
	at sun.reflect.NativeMethodAccessorImpl.invoke(NativeMethodAccessorImpl.java:62)
	at sun.reflect.DelegatingMethodAccessorImpl.invoke(DelegatingMethodAccessorImpl.java:43)
	at java.lang.reflect.Method.invoke(Method.java:498)
	at org.junit.runners.model.FrameworkMethod$1.runReflectiveCall(FrameworkMethod.java:50)
	at org.junit.internal.runners.model.ReflectiveCallable.run(ReflectiveCallable.java:12)
	at org.junit.runners.model.FrameworkMethod.invokeExplosively(FrameworkMethod.java:47)
	at org.junit.internal.runners.statements.InvokeMethod.evaluate(InvokeMethod.java:17)
	at org.junit.internal.runners.statements.RunBefores.evaluate(RunBefores.java:26)
	at org.junit.internal.runners.statements.RunAfters.evaluate(RunAfters.java:27)
	at org.mockito.internal.junit.JUnitRule$1.evaluateSafely(JUnitRule.java:52)
	at org.mockito.internal.junit.JUnitRule$1.evaluate(JUnitRule.java:43)
	at org.junit.rules.ExternalResource$1.evaluate(ExternalResource.java:48)
	at org.junit.rules.RunRules.evaluate(RunRules.java:20)
	at org.junit.runners.ParentRunner.runLeaf(ParentRunner.java:325)
	at org.junit.runners.BlockJUnit4ClassRunner.runChild(BlockJUnit4ClassRunner.java:78)
	at org.junit.runners.BlockJUnit4ClassRunner.runChild(BlockJUnit4ClassRunner.java:57)
	at org.junit.runners.ParentRunner$3.run(ParentRunner.java:290)
	at org.junit.runners.ParentRunner$1.schedule(ParentRunner.java:71)
	at org.junit.runners.ParentRunner.runChildren(ParentRunner.java:288)
	at org.junit.runners.ParentRunner.access$000(ParentRunner.java:58)
	at org.junit.runners.ParentRunner$2.evaluate(ParentRunner.java:268)
	at org.junit.runners.ParentRunner.run(ParentRunner.java:363)
	at org.apache.maven.surefire.junit4.JUnit4Provider.execute(JUnit4Provider.java:365)
	at org.apache.maven.surefire.junit4.JUnit4Provider.executeWithRerun(JUnit4Provider.java:273)
	at org.apache.maven.surefire.junit4.JUnit4Provider.executeTestSet(JUnit4Provider.java:238)
	at org.apache.maven.surefire.junit4.JUnit4Provider.invoke(JUnit4Provider.java:159)
	at org.apache.maven.surefire.booter.ForkedBooter.invokeProviderInSameClassLoader(ForkedBooter.java:384)
	at org.apache.maven.surefire.booter.ForkedBooter.runSuitesInProcess(ForkedBooter.java:345)
	at org.apache.maven.surefire.booter.ForkedBooter.execute(ForkedBooter.java:126)
	at org.apache.maven.surefire.booter.ForkedBooter.main(ForkedBooter.java:418)
14:58:57.035 [main] ERROR No parser available for this RDF format
org.eclipse.rdf4j.rio.UnsupportedRDFormatException: Did not recognise RDF format string file:/home/hudson/genie.rdf4j/.jenkins/jobs/rdf4j-pr-verify/workspace/tools/console/does-not-exist.docx
	at org.eclipse.rdf4j.rio.Rio.lambda$unsupportedFormat$1(Rio.java:577)
	at java.util.Optional.orElseThrow(Optional.java:290)
	at org.eclipse.rdf4j.console.command.Verify.verify(Verify.java:124)
	at org.eclipse.rdf4j.console.command.Verify.execute(Verify.java:97)
	at org.eclipse.rdf4j.console.command.VerifyTest.testVerifyWrongFormat(VerifyTest.java:69)
	at sun.reflect.NativeMethodAccessorImpl.invoke0(Native Method)
	at sun.reflect.NativeMethodAccessorImpl.invoke(NativeMethodAccessorImpl.java:62)
	at sun.reflect.DelegatingMethodAccessorImpl.invoke(DelegatingMethodAccessorImpl.java:43)
	at java.lang.reflect.Method.invoke(Method.java:498)
	at org.junit.runners.model.FrameworkMethod$1.runReflectiveCall(FrameworkMethod.java:50)
	at org.junit.internal.runners.model.ReflectiveCallable.run(ReflectiveCallable.java:12)
	at org.junit.runners.model.FrameworkMethod.invokeExplosively(FrameworkMethod.java:47)
	at org.junit.internal.runners.statements.InvokeMethod.evaluate(InvokeMethod.java:17)
	at org.junit.internal.runners.statements.RunBefores.evaluate(RunBefores.java:26)
	at org.junit.internal.runners.statements.RunAfters.evaluate(RunAfters.java:27)
	at org.mockito.internal.junit.JUnitRule$1.evaluateSafely(JUnitRule.java:52)
	at org.mockito.internal.junit.JUnitRule$1.evaluate(JUnitRule.java:43)
	at org.junit.rules.ExternalResource$1.evaluate(ExternalResource.java:48)
	at org.junit.rules.RunRules.evaluate(RunRules.java:20)
	at org.junit.runners.ParentRunner.runLeaf(ParentRunner.java:325)
	at org.junit.runners.BlockJUnit4ClassRunner.runChild(BlockJUnit4ClassRunner.java:78)
	at org.junit.runners.BlockJUnit4ClassRunner.runChild(BlockJUnit4ClassRunner.java:57)
	at org.junit.runners.ParentRunner$3.run(ParentRunner.java:290)
	at org.junit.runners.ParentRunner$1.schedule(ParentRunner.java:71)
	at org.junit.runners.ParentRunner.runChildren(ParentRunner.java:288)
	at org.junit.runners.ParentRunner.access$000(ParentRunner.java:58)
	at org.junit.runners.ParentRunner$2.evaluate(ParentRunner.java:268)
	at org.junit.runners.ParentRunner.run(ParentRunner.java:363)
	at org.apache.maven.surefire.junit4.JUnit4Provider.execute(JUnit4Provider.java:365)
	at org.apache.maven.surefire.junit4.JUnit4Provider.executeWithRerun(JUnit4Provider.java:273)
	at org.apache.maven.surefire.junit4.JUnit4Provider.executeTestSet(JUnit4Provider.java:238)
	at org.apache.maven.surefire.junit4.JUnit4Provider.invoke(JUnit4Provider.java:159)
	at org.apache.maven.surefire.booter.ForkedBooter.invokeProviderInSameClassLoader(ForkedBooter.java:384)
	at org.apache.maven.surefire.booter.ForkedBooter.runSuitesInProcess(ForkedBooter.java:345)
	at org.apache.maven.surefire.booter.ForkedBooter.execute(ForkedBooter.java:126)
	at org.apache.maven.surefire.booter.ForkedBooter.main(ForkedBooter.java:418)
14:58:57.077 [main] ERROR Unexpected RDFParseException
org.eclipse.rdf4j.rio.RDFParseException: IRI included an unencoded space: '32' [line 1]
	at org.eclipse.rdf4j.rio.helpers.RDFParserHelper.reportError(RDFParserHelper.java:265)
	at org.eclipse.rdf4j.rio.helpers.AbstractRDFParser.reportError(AbstractRDFParser.java:628)
	at org.eclipse.rdf4j.rio.turtle.TurtleParser.reportError(TurtleParser.java:1297)
	at org.eclipse.rdf4j.rio.turtle.TurtleParser.parseURI(TurtleParser.java:902)
	at org.eclipse.rdf4j.rio.turtle.TurtleParser.parseValue(TurtleParser.java:575)
	at org.eclipse.rdf4j.rio.turtle.TurtleParser.parseSubject(TurtleParser.java:406)
	at org.eclipse.rdf4j.rio.turtle.TurtleParser.parseTriples(TurtleParser.java:347)
	at org.eclipse.rdf4j.rio.turtle.TurtleParser.parseStatement(TurtleParser.java:216)
	at org.eclipse.rdf4j.rio.turtle.TurtleParser.parse(TurtleParser.java:178)
	at org.eclipse.rdf4j.rio.turtle.TurtleParser.parse(TurtleParser.java:130)
	at org.eclipse.rdf4j.console.command.Verify.verify(Verify.java:145)
	at org.eclipse.rdf4j.console.command.Verify.execute(Verify.java:97)
	at org.eclipse.rdf4j.console.command.VerifyTest.testVerifySpaceIRI(VerifyTest.java:103)
	at sun.reflect.NativeMethodAccessorImpl.invoke0(Native Method)
	at sun.reflect.NativeMethodAccessorImpl.invoke(NativeMethodAccessorImpl.java:62)
	at sun.reflect.DelegatingMethodAccessorImpl.invoke(DelegatingMethodAccessorImpl.java:43)
	at java.lang.reflect.Method.invoke(Method.java:498)
	at org.junit.runners.model.FrameworkMethod$1.runReflectiveCall(FrameworkMethod.java:50)
	at org.junit.internal.runners.model.ReflectiveCallable.run(ReflectiveCallable.java:12)
	at org.junit.runners.model.FrameworkMethod.invokeExplosively(FrameworkMethod.java:47)
	at org.junit.internal.runners.statements.InvokeMethod.evaluate(InvokeMethod.java:17)
	at org.junit.internal.runners.statements.RunBefores.evaluate(RunBefores.java:26)
	at org.junit.internal.runners.statements.RunAfters.evaluate(RunAfters.java:27)
	at org.mockito.internal.junit.JUnitRule$1.evaluateSafely(JUnitRule.java:52)
	at org.mockito.internal.junit.JUnitRule$1.evaluate(JUnitRule.java:43)
	at org.junit.rules.ExternalResource$1.evaluate(ExternalResource.java:48)
	at org.junit.rules.RunRules.evaluate(RunRules.java:20)
	at org.junit.runners.ParentRunner.runLeaf(ParentRunner.java:325)
	at org.junit.runners.BlockJUnit4ClassRunner.runChild(BlockJUnit4ClassRunner.java:78)
	at org.junit.runners.BlockJUnit4ClassRunner.runChild(BlockJUnit4ClassRunner.java:57)
	at org.junit.runners.ParentRunner$3.run(ParentRunner.java:290)
	at org.junit.runners.ParentRunner$1.schedule(ParentRunner.java:71)
	at org.junit.runners.ParentRunner.runChildren(ParentRunner.java:288)
	at org.junit.runners.ParentRunner.access$000(ParentRunner.java:58)
	at org.junit.runners.ParentRunner$2.evaluate(ParentRunner.java:268)
	at org.junit.runners.ParentRunner.run(ParentRunner.java:363)
	at org.apache.maven.surefire.junit4.JUnit4Provider.execute(JUnit4Provider.java:365)
	at org.apache.maven.surefire.junit4.JUnit4Provider.executeWithRerun(JUnit4Provider.java:273)
	at org.apache.maven.surefire.junit4.JUnit4Provider.executeTestSet(JUnit4Provider.java:238)
	at org.apache.maven.surefire.junit4.JUnit4Provider.invoke(JUnit4Provider.java:159)
	at org.apache.maven.surefire.booter.ForkedBooter.invokeProviderInSameClassLoader(ForkedBooter.java:384)
	at org.apache.maven.surefire.booter.ForkedBooter.runSuitesInProcess(ForkedBooter.java:345)
	at org.apache.maven.surefire.booter.ForkedBooter.execute(ForkedBooter.java:126)
	at org.apache.maven.surefire.booter.ForkedBooter.main(ForkedBooter.java:418)
[INFO] Tests run: 10, Failures: 0, Errors: 0, Skipped: 0, Time elapsed: 0.769 s - in org.eclipse.rdf4j.console.command.VerifyTest
[INFO] Running org.eclipse.rdf4j.console.command.DropTest
[MockitoHint] DropTest.testUserAbortedUnsafeDropBeforeWarning (see javadoc for MockitoHint):
[MockitoHint] 1. Unused -> at org.eclipse.rdf4j.console.command.DropTest.setUp(DropTest.java:50)

[INFO] Tests run: 3, Failures: 0, Errors: 0, Skipped: 0, Time elapsed: 0.156 s - in org.eclipse.rdf4j.console.command.DropTest
[INFO] Running org.eclipse.rdf4j.console.command.FederateTest
14:58:57.322 [main] DEBUG Initializing MemoryStore...
14:58:57.323 [main] DEBUG Initializing data file...
14:58:57.323 [main] DEBUG Data file initialized
14:58:57.323 [main] DEBUG MemoryStore initialized
14:58:57.343 [main] DEBUG syncing data to file...
14:58:57.344 [main] DEBUG Data synced to file
14:58:57.389 [main] DEBUG Initializing MemoryStore...
14:58:57.390 [main] DEBUG Initializing data file...
14:58:57.391 [main] DEBUG Data file initialized
14:58:57.391 [main] DEBUG MemoryStore initialized
14:58:57.434 [main] DEBUG syncing data to file...
14:58:57.436 [main] DEBUG Data synced to file
14:58:57.482 [main] DEBUG Federate called with federation ID = fedID, and member ID's = [sparql][alien][http].
  Distinct set to false, and readonly set to true.

14:58:57.486 [main] DEBUG Federation repository root node: _:node1drr8m02kx216
14:58:57.487 [main] DEBUG _:node1drr8m02kx216 http://www.w3.org/1999/02/22-rdf-syntax-ns#type http://www.openrdf.org/config/repository#Repository
14:58:57.487 [main] DEBUG _:node1drr8m02kx216 http://www.openrdf.org/config/repository#repositoryID "fedID"
14:58:57.487 [main] DEBUG _:node1drr8m02kx216 http://www.w3.org/2000/01/rdf-schema#label "Test Federation Title"
14:58:57.487 [main] DEBUG _:node1drr8m02kx216 http://www.openrdf.org/config/repository#repositoryImpl _:node1drr8m02kx217
14:58:57.487 [main] DEBUG _:node1drr8m02kx217 http://www.openrdf.org/config/repository#repositoryType "openrdf:SailRepository"
14:58:57.488 [main] DEBUG _:node1drr8m02kx217 http://www.openrdf.org/config/repository/sail#sailImpl _:node1drr8m02kx218
14:58:57.488 [main] DEBUG _:node1drr8m02kx218 http://www.openrdf.org/config/sail#sailType "openrdf:Federation"
14:58:57.488 [main] DEBUG _:node1drr8m02kx218 http://www.openrdf.org/config/sail/federation#readOnly "true"^^<http://www.w3.org/2001/XMLSchema#boolean>
14:58:57.488 [main] DEBUG _:node1drr8m02kx218 http://www.openrdf.org/config/sail/federation#distinct "false"^^<http://www.w3.org/2001/XMLSchema#boolean>
14:58:57.488 [main] DEBUG Adding member: sparql
14:58:57.488 [main] DEBUG _:node1drr8m02kx218 http://www.openrdf.org/config/sail/federation#member _:node1drr8m02kx219
14:58:57.489 [main] DEBUG _:node1drr8m02kx219 http://www.openrdf.org/config/repository#repositoryType "openrdf:SPARQLRepository"
14:58:57.490 [main] DEBUG _:node1drr8m02kx219 http://www.openrdf.org/config/repository/sparql#query-endpoint http://localhost:8080/openrdf-sesame/repositories/sparql
14:58:57.490 [main] DEBUG Added member sparql: 
14:58:57.490 [main] DEBUG Adding member: alien
14:58:57.490 [main] DEBUG _:node1drr8m02kx218 http://www.openrdf.org/config/sail/federation#member _:node1drr8m02kx222
14:58:57.491 [main] DEBUG _:node1drr8m02kx222 http://www.openrdf.org/config/repository#repositoryType "openrdf:ProxyRepository"
14:58:57.491 [main] DEBUG _:node1drr8m02kx222 http://www.openrdf.org/config/repository/proxy#proxiedID "alien"
14:58:57.491 [main] DEBUG Added member alien: 
14:58:57.491 [main] DEBUG Adding member: http
14:58:57.491 [main] DEBUG _:node1drr8m02kx218 http://www.openrdf.org/config/sail/federation#member _:node1drr8m02kx225
14:58:57.492 [main] DEBUG _:node1drr8m02kx225 http://www.openrdf.org/config/repository#repositoryType "openrdf:HTTPRepository"
14:58:57.493 [main] DEBUG _:node1drr8m02kx225 http://www.openrdf.org/config/repository/http#repositoryURL http://localhost:8080/openrdf-sesame/repositories/http
14:58:57.493 [main] DEBUG Added member http: 
14:58:57.520 [main] DEBUG Initializing MemoryStore...
14:58:57.521 [main] DEBUG Initializing data file...
14:58:57.522 [main] DEBUG Data file initialized
14:58:57.522 [main] DEBUG MemoryStore initialized
14:58:57.523 [main] DEBUG syncing data to file...
14:58:57.524 [main] DEBUG Data synced to file
14:58:57.528 [main] DEBUG Initializing MemoryStore...
14:58:57.528 [main] DEBUG Initializing data file...
14:58:57.529 [main] DEBUG Data file initialized
14:58:57.529 [main] DEBUG MemoryStore initialized
14:58:57.530 [main] DEBUG syncing data to file...
14:58:57.531 [main] DEBUG Data synced to file
14:58:57.539 [main] ERROR Duplicate repository id's specified.
[MockitoHint] FederateTest.testDuplicateMembersPrintsError (see javadoc for MockitoHint):
[MockitoHint] 1. Unused -> at org.eclipse.rdf4j.console.command.FederateTest.setUp(FederateTest.java:87)
[MockitoHint] 2. Unused -> at org.eclipse.rdf4j.console.command.FederateTest.setUp(FederateTest.java:88)

14:58:57.546 [main] DEBUG Initializing MemoryStore...
14:58:57.547 [main] DEBUG Initializing data file...
14:58:57.547 [main] DEBUG Data file initialized
14:58:57.547 [main] DEBUG MemoryStore initialized
14:58:57.549 [main] DEBUG syncing data to file...
14:58:57.549 [main] DEBUG Data synced to file
14:58:57.553 [main] DEBUG Initializing MemoryStore...
14:58:57.553 [main] DEBUG Initializing data file...
14:58:57.554 [main] DEBUG Data file initialized
14:58:57.554 [main] DEBUG MemoryStore initialized
14:58:57.556 [main] DEBUG syncing data to file...
14:58:57.557 [main] DEBUG Data synced to file
14:58:57.565 [main] DEBUG Federate called with federation ID = alien, and member ID's = [fedID][scary].
  Distinct set to false, and readonly set to true.

14:58:57.566 [main] ERROR alien already exists.
[MockitoHint] FederateTest.testFedAlreadyExistsPrintsSpecificError (see javadoc for MockitoHint):
[MockitoHint] 1. Unused -> at org.eclipse.rdf4j.console.command.FederateTest.setUp(FederateTest.java:88)

14:58:57.573 [main] DEBUG Initializing MemoryStore...
14:58:57.574 [main] DEBUG Initializing data file...
14:58:57.574 [main] DEBUG Data file initialized
14:58:57.574 [main] DEBUG MemoryStore initialized
14:58:57.576 [main] DEBUG syncing data to file...
14:58:57.577 [main] DEBUG Data synced to file
14:58:57.580 [main] DEBUG Initializing MemoryStore...
14:58:57.581 [main] DEBUG Initializing data file...
14:58:57.581 [main] DEBUG Data file initialized
14:58:57.581 [main] DEBUG MemoryStore initialized
14:58:57.582 [main] DEBUG syncing data to file...
14:58:57.583 [main] DEBUG Data synced to file
14:58:57.591 [main] DEBUG Federate called with federation ID = fedID, and member ID's = [alien][scary].
  Distinct set to true, and readonly set to false.

14:58:57.592 [main] DEBUG Federation repository root node: _:node1drr8m02kx338
14:58:57.592 [main] DEBUG _:node1drr8m02kx338 http://www.w3.org/1999/02/22-rdf-syntax-ns#type http://www.openrdf.org/config/repository#Repository
14:58:57.593 [main] DEBUG _:node1drr8m02kx338 http://www.openrdf.org/config/repository#repositoryID "fedID"
14:58:57.593 [main] DEBUG _:node1drr8m02kx338 http://www.w3.org/2000/01/rdf-schema#label "Test Federation Title"
14:58:57.593 [main] DEBUG _:node1drr8m02kx338 http://www.openrdf.org/config/repository#repositoryImpl _:node1drr8m02kx339
14:58:57.593 [main] DEBUG _:node1drr8m02kx339 http://www.openrdf.org/config/repository#repositoryType "openrdf:SailRepository"
14:58:57.593 [main] DEBUG _:node1drr8m02kx339 http://www.openrdf.org/config/repository/sail#sailImpl _:node1drr8m02kx340
14:58:57.593 [main] DEBUG _:node1drr8m02kx340 http://www.openrdf.org/config/sail#sailType "openrdf:Federation"
14:58:57.593 [main] DEBUG _:node1drr8m02kx340 http://www.openrdf.org/config/sail/federation#readOnly "false"^^<http://www.w3.org/2001/XMLSchema#boolean>
14:58:57.593 [main] DEBUG _:node1drr8m02kx340 http://www.openrdf.org/config/sail/federation#distinct "true"^^<http://www.w3.org/2001/XMLSchema#boolean>
14:58:57.593 [main] DEBUG Adding member: alien
14:58:57.593 [main] DEBUG _:node1drr8m02kx340 http://www.openrdf.org/config/sail/federation#member _:node1drr8m02kx341
14:58:57.593 [main] DEBUG _:node1drr8m02kx341 http://www.openrdf.org/config/repository#repositoryType "openrdf:ProxyRepository"
14:58:57.593 [main] DEBUG _:node1drr8m02kx341 http://www.openrdf.org/config/repository/proxy#proxiedID "alien"
14:58:57.594 [main] DEBUG Added member alien: 
14:58:57.594 [main] DEBUG Adding member: scary
14:58:57.594 [main] DEBUG _:node1drr8m02kx340 http://www.openrdf.org/config/sail/federation#member _:node1drr8m02kx344
14:58:57.594 [main] DEBUG _:node1drr8m02kx344 http://www.openrdf.org/config/repository#repositoryType "openrdf:ProxyRepository"
14:58:57.594 [main] DEBUG _:node1drr8m02kx344 http://www.openrdf.org/config/repository/proxy#proxiedID "scary"
14:58:57.594 [main] DEBUG Added member scary: 
14:58:57.619 [main] DEBUG Initializing MemoryStore...
14:58:57.620 [main] DEBUG Initializing data file...
14:58:57.620 [main] DEBUG Data file initialized
14:58:57.620 [main] DEBUG MemoryStore initialized
14:58:57.623 [main] DEBUG syncing data to file...
14:58:57.624 [main] DEBUG Data synced to file
14:58:57.628 [main] DEBUG Initializing MemoryStore...
14:58:57.630 [main] DEBUG Initializing data file...
14:58:57.630 [main] DEBUG Data file initialized
14:58:57.630 [main] DEBUG MemoryStore initialized
14:58:57.632 [main] DEBUG syncing data to file...
14:58:57.633 [main] DEBUG Data synced to file
14:58:57.641 [main] DEBUG Federate called with federation ID = fedID, and member ID's = [sparql][sparql2].
  Distinct set to false, and readonly set to false.

14:58:57.643 [main] ERROR sparql is read-only.
14:58:57.645 [main] ERROR sparql2 is read-only.
[MockitoHint] FederateTest.testSparqlAndNotReadOnlyPrintsError (see javadoc for MockitoHint):
[MockitoHint] 1. Unused -> at org.eclipse.rdf4j.console.command.FederateTest.setUp(FederateTest.java:88)

14:58:57.652 [main] DEBUG Initializing MemoryStore...
14:58:57.654 [main] DEBUG Initializing data file...
14:58:57.655 [main] DEBUG Data file initialized
14:58:57.655 [main] DEBUG MemoryStore initialized
14:58:57.657 [main] DEBUG syncing data to file...
14:58:57.657 [main] DEBUG Data synced to file
14:58:57.660 [main] DEBUG Initializing MemoryStore...
14:58:57.661 [main] DEBUG Initializing data file...
14:58:57.662 [main] DEBUG Data file initialized
14:58:57.662 [main] DEBUG MemoryStore initialized
14:58:57.664 [main] DEBUG syncing data to file...
14:58:57.665 [main] DEBUG Data synced to file
[MockitoHint] FederateTest.testNoArgumentsPrintsHelp (see javadoc for MockitoHint):
[MockitoHint] 1. Unused -> at org.eclipse.rdf4j.console.command.FederateTest.setUp(FederateTest.java:87)
[MockitoHint] 2. Unused -> at org.eclipse.rdf4j.console.command.FederateTest.setUp(FederateTest.java:88)

14:58:57.682 [main] DEBUG Initializing MemoryStore...
14:58:57.683 [main] DEBUG Initializing data file...
14:58:57.684 [main] DEBUG Data file initialized
14:58:57.684 [main] DEBUG MemoryStore initialized
14:58:57.685 [main] DEBUG syncing data to file...
14:58:57.686 [main] DEBUG Data synced to file
14:58:57.690 [main] DEBUG Initializing MemoryStore...
14:58:57.691 [main] DEBUG Initializing data file...
14:58:57.692 [main] DEBUG Data file initialized
14:58:57.692 [main] DEBUG MemoryStore initialized
14:58:57.693 [main] DEBUG syncing data to file...
14:58:57.694 [main] DEBUG Data synced to file
14:58:57.702 [main] DEBUG Federate called with federation ID = type=memory, and member ID's = [fedID][alien][scary].
  Distinct set to false, and readonly set to true.

14:58:57.702 [main] ERROR fedID does not exist.
[MockitoHint] FederateTest.testInvalidArgumentPrintsError (see javadoc for MockitoHint):
[MockitoHint] 1. Unused -> at org.eclipse.rdf4j.console.command.FederateTest.setUp(FederateTest.java:88)

14:58:57.710 [main] DEBUG Initializing MemoryStore...
14:58:57.711 [main] DEBUG Initializing data file...
14:58:57.711 [main] DEBUG Data file initialized
14:58:57.711 [main] DEBUG MemoryStore initialized
14:58:57.713 [main] DEBUG syncing data to file...
14:58:57.714 [main] DEBUG Data synced to file
14:58:57.717 [main] DEBUG Initializing MemoryStore...
14:58:57.718 [main] DEBUG Initializing data file...
14:58:57.718 [main] DEBUG Data file initialized
14:58:57.719 [main] DEBUG MemoryStore initialized
14:58:57.720 [main] DEBUG syncing data to file...
14:58:57.722 [main] DEBUG Data synced to file
14:58:57.730 [main] DEBUG Federate called with federation ID = fedID, and member ID's = [sparql][sparql2].
  Distinct set to false, and readonly set to true.

14:58:57.732 [main] DEBUG Federation repository root node: _:node1drr8m02kx494
14:58:57.732 [main] DEBUG _:node1drr8m02kx494 http://www.w3.org/1999/02/22-rdf-syntax-ns#type http://www.openrdf.org/config/repository#Repository
14:58:57.732 [main] DEBUG _:node1drr8m02kx494 http://www.openrdf.org/config/repository#repositoryID "fedID"
14:58:57.732 [main] DEBUG _:node1drr8m02kx494 http://www.w3.org/2000/01/rdf-schema#label "Test Federation Title"
14:58:57.732 [main] DEBUG _:node1drr8m02kx494 http://www.openrdf.org/config/repository#repositoryImpl _:node1drr8m02kx495
14:58:57.732 [main] DEBUG _:node1drr8m02kx495 http://www.openrdf.org/config/repository#repositoryType "openrdf:SailRepository"
14:58:57.732 [main] DEBUG _:node1drr8m02kx495 http://www.openrdf.org/config/repository/sail#sailImpl _:node1drr8m02kx496
14:58:57.732 [main] DEBUG _:node1drr8m02kx496 http://www.openrdf.org/config/sail#sailType "openrdf:Federation"
14:58:57.732 [main] DEBUG _:node1drr8m02kx496 http://www.openrdf.org/config/sail/federation#readOnly "true"^^<http://www.w3.org/2001/XMLSchema#boolean>
14:58:57.732 [main] DEBUG _:node1drr8m02kx496 http://www.openrdf.org/config/sail/federation#distinct "false"^^<http://www.w3.org/2001/XMLSchema#boolean>
14:58:57.732 [main] DEBUG Adding member: sparql
14:58:57.732 [main] DEBUG _:node1drr8m02kx496 http://www.openrdf.org/config/sail/federation#member _:node1drr8m02kx497
14:58:57.733 [main] DEBUG _:node1drr8m02kx497 http://www.openrdf.org/config/repository#repositoryType "openrdf:SPARQLRepository"
14:58:57.733 [main] DEBUG _:node1drr8m02kx497 http://www.openrdf.org/config/repository/sparql#query-endpoint http://localhost:8080/openrdf-sesame/repositories/sparql
14:58:57.734 [main] DEBUG Added member sparql: 
14:58:57.734 [main] DEBUG Adding member: sparql2
14:58:57.734 [main] DEBUG _:node1drr8m02kx496 http://www.openrdf.org/config/sail/federation#member _:node1drr8m02kx500
14:58:57.734 [main] DEBUG _:node1drr8m02kx500 http://www.openrdf.org/config/repository#repositoryType "openrdf:SPARQLRepository"
14:58:57.735 [main] DEBUG _:node1drr8m02kx500 http://www.openrdf.org/config/repository/sparql#query-endpoint http://localhost:8080/openrdf-sesame/repositories/sparql
14:58:57.735 [main] DEBUG Added member sparql2: 
14:58:57.747 [main] DEBUG Initializing MemoryStore...
14:58:57.748 [main] DEBUG Initializing data file...
14:58:57.748 [main] DEBUG Data file initialized
14:58:57.748 [main] DEBUG MemoryStore initialized
14:58:57.749 [main] DEBUG syncing data to file...
14:58:57.750 [main] DEBUG Data synced to file
14:58:57.752 [main] DEBUG Initializing MemoryStore...
14:58:57.752 [main] DEBUG Initializing data file...
14:58:57.752 [main] DEBUG Data file initialized
14:58:57.752 [main] DEBUG MemoryStore initialized
14:58:57.753 [main] DEBUG syncing data to file...
14:58:57.754 [main] DEBUG Data synced to file
14:58:57.760 [main] DEBUG Federate called with federation ID = fedID, and member ID's = [http][sparql].
  Distinct set to false, and readonly set to true.

14:58:57.761 [main] DEBUG Federation repository root node: _:node1drr8m02kx549
14:58:57.762 [main] DEBUG _:node1drr8m02kx549 http://www.w3.org/1999/02/22-rdf-syntax-ns#type http://www.openrdf.org/config/repository#Repository
14:58:57.762 [main] DEBUG _:node1drr8m02kx549 http://www.openrdf.org/config/repository#repositoryID "fedID"
14:58:57.764 [main] DEBUG _:node1drr8m02kx549 http://www.w3.org/2000/01/rdf-schema#label "Test Federation Title"
14:58:57.764 [main] DEBUG _:node1drr8m02kx549 http://www.openrdf.org/config/repository#repositoryImpl _:node1drr8m02kx550
14:58:57.764 [main] DEBUG _:node1drr8m02kx550 http://www.openrdf.org/config/repository#repositoryType "openrdf:SailRepository"
14:58:57.764 [main] DEBUG _:node1drr8m02kx550 http://www.openrdf.org/config/repository/sail#sailImpl _:node1drr8m02kx551
14:58:57.764 [main] DEBUG _:node1drr8m02kx551 http://www.openrdf.org/config/sail#sailType "openrdf:Federation"
14:58:57.764 [main] DEBUG _:node1drr8m02kx551 http://www.openrdf.org/config/sail/federation#readOnly "true"^^<http://www.w3.org/2001/XMLSchema#boolean>
14:58:57.764 [main] DEBUG _:node1drr8m02kx551 http://www.openrdf.org/config/sail/federation#distinct "false"^^<http://www.w3.org/2001/XMLSchema#boolean>
14:58:57.764 [main] DEBUG Adding member: http
14:58:57.764 [main] DEBUG _:node1drr8m02kx551 http://www.openrdf.org/config/sail/federation#member _:node1drr8m02kx552
14:58:57.765 [main] DEBUG _:node1drr8m02kx552 http://www.openrdf.org/config/repository#repositoryType "openrdf:HTTPRepository"
14:58:57.766 [main] DEBUG _:node1drr8m02kx552 http://www.openrdf.org/config/repository/http#repositoryURL http://localhost:8080/openrdf-sesame/repositories/http
14:58:57.766 [main] DEBUG Added member http: 
14:58:57.766 [main] DEBUG Adding member: sparql
14:58:57.766 [main] DEBUG _:node1drr8m02kx551 http://www.openrdf.org/config/sail/federation#member _:node1drr8m02kx555
14:58:57.766 [main] DEBUG _:node1drr8m02kx555 http://www.openrdf.org/config/repository#repositoryType "openrdf:SPARQLRepository"
14:58:57.767 [main] DEBUG _:node1drr8m02kx555 http://www.openrdf.org/config/repository/sparql#query-endpoint http://localhost:8080/openrdf-sesame/repositories/sparql
14:58:57.767 [main] DEBUG Added member sparql: 
14:58:57.775 [main] DEBUG Initializing MemoryStore...
14:58:57.776 [main] DEBUG Initializing data file...
14:58:57.776 [main] DEBUG Data file initialized
14:58:57.776 [main] DEBUG MemoryStore initialized
14:58:57.777 [main] DEBUG syncing data to file...
14:58:57.778 [main] DEBUG Data synced to file
14:58:57.780 [main] DEBUG Initializing MemoryStore...
14:58:57.780 [main] DEBUG Initializing data file...
14:58:57.780 [main] DEBUG Data file initialized
14:58:57.780 [main] DEBUG MemoryStore initialized
14:58:57.781 [main] DEBUG syncing data to file...
14:58:57.782 [main] DEBUG Data synced to file
14:58:57.786 [main] DEBUG Federate called with federation ID = fedID, and member ID's = [alien][FreeLunch].
  Distinct set to false, and readonly set to true.

14:58:57.787 [main] ERROR FreeLunch does not exist.
[MockitoHint] FederateTest.testNonexistentMemberPrintsSpecificError (see javadoc for MockitoHint):
[MockitoHint] 1. Unused -> at org.eclipse.rdf4j.console.command.FederateTest.setUp(FederateTest.java:88)

14:58:57.793 [main] DEBUG Initializing MemoryStore...
14:58:57.793 [main] DEBUG Initializing data file...
14:58:57.793 [main] DEBUG Data file initialized
14:58:57.793 [main] DEBUG MemoryStore initialized
14:58:57.794 [main] DEBUG syncing data to file...
14:58:57.795 [main] DEBUG Data synced to file
14:58:57.797 [main] DEBUG Initializing MemoryStore...
14:58:57.798 [main] DEBUG Initializing data file...
14:58:57.798 [main] DEBUG Data file initialized
14:58:57.798 [main] DEBUG MemoryStore initialized
14:58:57.799 [main] DEBUG syncing data to file...
14:58:57.799 [main] DEBUG Data synced to file
14:58:57.804 [main] ERROR Duplicate repository id's specified.
[MockitoHint] FederateTest.testFedSameAsMemberPrintsError (see javadoc for MockitoHint):
[MockitoHint] 1. Unused -> at org.eclipse.rdf4j.console.command.FederateTest.setUp(FederateTest.java:87)
[MockitoHint] 2. Unused -> at org.eclipse.rdf4j.console.command.FederateTest.setUp(FederateTest.java:88)

14:58:57.811 [main] DEBUG Initializing MemoryStore...
14:58:57.812 [main] DEBUG Initializing data file...
14:58:57.812 [main] DEBUG Data file initialized
14:58:57.812 [main] DEBUG MemoryStore initialized
14:58:57.813 [main] DEBUG syncing data to file...
14:58:57.814 [main] DEBUG Data synced to file
14:58:57.816 [main] DEBUG Initializing MemoryStore...
14:58:57.817 [main] DEBUG Initializing data file...
14:58:57.817 [main] DEBUG Data file initialized
14:58:57.817 [main] DEBUG MemoryStore initialized
14:58:57.818 [main] DEBUG syncing data to file...
14:58:57.818 [main] DEBUG Data synced to file
[MockitoHint] FederateTest.testTwoArgumentsPrintsHelp (see javadoc for MockitoHint):
[MockitoHint] 1. Unused -> at org.eclipse.rdf4j.console.command.FederateTest.setUp(FederateTest.java:87)
[MockitoHint] 2. Unused -> at org.eclipse.rdf4j.console.command.FederateTest.setUp(FederateTest.java:88)

14:58:57.832 [main] DEBUG Initializing MemoryStore...
14:58:57.833 [main] DEBUG Initializing data file...
14:58:57.834 [main] DEBUG Data file initialized
14:58:57.834 [main] DEBUG MemoryStore initialized
14:58:57.836 [main] DEBUG syncing data to file...
14:58:57.837 [main] DEBUG Data synced to file
14:58:57.841 [main] DEBUG Initializing MemoryStore...
14:58:57.842 [main] DEBUG Initializing data file...
14:58:57.842 [main] DEBUG Data file initialized
14:58:57.842 [main] DEBUG MemoryStore initialized
14:58:57.843 [main] DEBUG syncing data to file...
14:58:57.843 [main] DEBUG Data synced to file
14:58:57.849 [main] DEBUG Federate called with federation ID = fedID, and member ID's = [alien][scary].
  Distinct set to false, and readonly set to true.

14:58:57.850 [main] DEBUG Federation repository root node: _:node1drr8m02kx692
14:58:57.851 [main] DEBUG _:node1drr8m02kx692 http://www.w3.org/1999/02/22-rdf-syntax-ns#type http://www.openrdf.org/config/repository#Repository
14:58:57.851 [main] DEBUG _:node1drr8m02kx692 http://www.openrdf.org/config/repository#repositoryID "fedID"
14:58:57.851 [main] DEBUG _:node1drr8m02kx692 http://www.w3.org/2000/01/rdf-schema#label "Test Federation Title"
14:58:57.851 [main] DEBUG _:node1drr8m02kx692 http://www.openrdf.org/config/repository#repositoryImpl _:node1drr8m02kx693
14:58:57.851 [main] DEBUG _:node1drr8m02kx693 http://www.openrdf.org/config/repository#repositoryType "openrdf:SailRepository"
14:58:57.851 [main] DEBUG _:node1drr8m02kx693 http://www.openrdf.org/config/repository/sail#sailImpl _:node1drr8m02kx694
14:58:57.851 [main] DEBUG _:node1drr8m02kx694 http://www.openrdf.org/config/sail#sailType "openrdf:Federation"
14:58:57.851 [main] DEBUG _:node1drr8m02kx694 http://www.openrdf.org/config/sail/federation#readOnly "true"^^<http://www.w3.org/2001/XMLSchema#boolean>
14:58:57.851 [main] DEBUG _:node1drr8m02kx694 http://www.openrdf.org/config/sail/federation#distinct "false"^^<http://www.w3.org/2001/XMLSchema#boolean>
14:58:57.851 [main] DEBUG Adding member: alien
14:58:57.851 [main] DEBUG _:node1drr8m02kx694 http://www.openrdf.org/config/sail/federation#member _:node1drr8m02kx695
14:58:57.851 [main] DEBUG _:node1drr8m02kx695 http://www.openrdf.org/config/repository#repositoryType "openrdf:ProxyRepository"
14:58:57.851 [main] DEBUG _:node1drr8m02kx695 http://www.openrdf.org/config/repository/proxy#proxiedID "alien"
14:58:57.851 [main] DEBUG Added member alien: 
14:58:57.851 [main] DEBUG Adding member: scary
14:58:57.852 [main] DEBUG _:node1drr8m02kx694 http://www.openrdf.org/config/sail/federation#member _:node1drr8m02kx698
14:58:57.852 [main] DEBUG _:node1drr8m02kx698 http://www.openrdf.org/config/repository#repositoryType "openrdf:ProxyRepository"
14:58:57.852 [main] DEBUG _:node1drr8m02kx698 http://www.openrdf.org/config/repository/proxy#proxiedID "scary"
14:58:57.852 [main] DEBUG Added member scary: 
14:58:57.867 [main] DEBUG Initializing MemoryStore...
14:58:57.868 [main] DEBUG Initializing data file...
14:58:57.869 [main] DEBUG Data file initialized
14:58:57.869 [main] DEBUG MemoryStore initialized
14:58:57.870 [main] DEBUG syncing data to file...
14:58:57.870 [main] DEBUG Data synced to file
14:58:57.875 [main] DEBUG Initializing MemoryStore...
14:58:57.876 [main] DEBUG Initializing data file...
14:58:57.879 [main] DEBUG Data file initialized
14:58:57.879 [main] DEBUG MemoryStore initialized
14:58:57.882 [main] DEBUG syncing data to file...
14:58:57.883 [main] DEBUG Data synced to file
[MockitoHint] FederateTest.testOneArgumentPrintsHelp (see javadoc for MockitoHint):
[MockitoHint] 1. Unused -> at org.eclipse.rdf4j.console.command.FederateTest.setUp(FederateTest.java:87)
[MockitoHint] 2. Unused -> at org.eclipse.rdf4j.console.command.FederateTest.setUp(FederateTest.java:88)

14:58:57.899 [main] DEBUG Initializing MemoryStore...
14:58:57.899 [main] DEBUG Initializing data file...
14:58:57.899 [main] DEBUG Data file initialized
14:58:57.900 [main] DEBUG MemoryStore initialized
14:58:57.901 [main] DEBUG syncing data to file...
14:58:57.902 [main] DEBUG Data synced to file
14:58:57.904 [main] DEBUG Initializing MemoryStore...
14:58:57.905 [main] DEBUG Initializing data file...
14:58:57.905 [main] DEBUG Data file initialized
14:58:57.905 [main] DEBUG MemoryStore initialized
14:58:57.906 [main] DEBUG syncing data to file...
14:58:57.907 [main] DEBUG Data synced to file
14:58:57.913 [main] DEBUG Federate called with federation ID = fedID, and member ID's = [http][http2].
  Distinct set to false, and readonly set to true.

14:58:57.914 [main] DEBUG Federation repository root node: _:node1drr8m02kx784
14:58:57.915 [main] DEBUG _:node1drr8m02kx784 http://www.w3.org/1999/02/22-rdf-syntax-ns#type http://www.openrdf.org/config/repository#Repository
14:58:57.915 [main] DEBUG _:node1drr8m02kx784 http://www.openrdf.org/config/repository#repositoryID "fedID"
14:58:57.915 [main] DEBUG _:node1drr8m02kx784 http://www.w3.org/2000/01/rdf-schema#label "Test Federation Title"
14:58:57.915 [main] DEBUG _:node1drr8m02kx784 http://www.openrdf.org/config/repository#repositoryImpl _:node1drr8m02kx785
14:58:57.915 [main] DEBUG _:node1drr8m02kx785 http://www.openrdf.org/config/repository#repositoryType "openrdf:SailRepository"
14:58:57.915 [main] DEBUG _:node1drr8m02kx785 http://www.openrdf.org/config/repository/sail#sailImpl _:node1drr8m02kx786
14:58:57.915 [main] DEBUG _:node1drr8m02kx786 http://www.openrdf.org/config/sail#sailType "openrdf:Federation"
14:58:57.915 [main] DEBUG _:node1drr8m02kx786 http://www.openrdf.org/config/sail/federation#readOnly "true"^^<http://www.w3.org/2001/XMLSchema#boolean>
14:58:57.915 [main] DEBUG _:node1drr8m02kx786 http://www.openrdf.org/config/sail/federation#distinct "false"^^<http://www.w3.org/2001/XMLSchema#boolean>
14:58:57.915 [main] DEBUG Adding member: http
14:58:57.915 [main] DEBUG _:node1drr8m02kx786 http://www.openrdf.org/config/sail/federation#member _:node1drr8m02kx787
14:58:57.915 [main] DEBUG _:node1drr8m02kx787 http://www.openrdf.org/config/repository#repositoryType "openrdf:HTTPRepository"
14:58:57.916 [main] DEBUG _:node1drr8m02kx787 http://www.openrdf.org/config/repository/http#repositoryURL http://localhost:8080/openrdf-sesame/repositories/http
14:58:57.916 [main] DEBUG Added member http: 
14:58:57.916 [main] DEBUG Adding member: http2
14:58:57.916 [main] DEBUG _:node1drr8m02kx786 http://www.openrdf.org/config/sail/federation#member _:node1drr8m02kx790
14:58:57.916 [main] DEBUG _:node1drr8m02kx790 http://www.openrdf.org/config/repository#repositoryType "openrdf:HTTPRepository"
14:58:57.917 [main] DEBUG _:node1drr8m02kx790 http://www.openrdf.org/config/repository/http#repositoryURL http://localhost:8080/openrdf-sesame/repositories/http
14:58:57.917 [main] DEBUG Added member http2: 
[INFO] Tests run: 15, Failures: 0, Errors: 0, Skipped: 0, Time elapsed: 0.647 s - in org.eclipse.rdf4j.console.command.FederateTest
[INFO] Running org.eclipse.rdf4j.console.command.SparqlTest
[MockitoHint] SparqlTest.testInputFile (see javadoc for MockitoHint):
[MockitoHint] 1. Unused -> at org.eclipse.rdf4j.console.command.SparqlTest.setUp(SparqlTest.java:49)

14:58:58.026 [main] ERROR No suitable result writer found
[MockitoHint] SparqlTest.testSelectError (see javadoc for MockitoHint):
[MockitoHint] 1. Unused -> at org.eclipse.rdf4j.console.command.SparqlTest.setUp(SparqlTest.java:49)

[MockitoHint] SparqlTest.testSelectMissingBindings (see javadoc for MockitoHint):
[MockitoHint] 1. Unused -> at org.eclipse.rdf4j.console.command.SparqlTest.setUp(SparqlTest.java:49)

[MockitoHint] SparqlTest.testInputFileWorkdir (see javadoc for MockitoHint):
[MockitoHint] 1. Unused -> at org.eclipse.rdf4j.console.command.SparqlTest.setUp(SparqlTest.java:49)

[INFO] Tests run: 9, Failures: 0, Errors: 0, Skipped: 0, Time elapsed: 0.176 s - in org.eclipse.rdf4j.console.command.SparqlTest
[INFO] Running org.eclipse.rdf4j.console.UtilTest
 one, two
 three
 four
 five, six
 seven
 eight
[INFO] Tests run: 4, Failures: 0, Errors: 0, Skipped: 0, Time elapsed: 0 s - in org.eclipse.rdf4j.console.UtilTest
[INFO] Running org.eclipse.rdf4j.console.ConsoleIOTest
[INFO] Tests run: 3, Failures: 0, Errors: 0, Skipped: 0, Time elapsed: 0.033 s - in org.eclipse.rdf4j.console.ConsoleIOTest
[INFO] 
[INFO] Results:
[INFO] 
[INFO] Tests run: 64, Failures: 0, Errors: 0, Skipped: 0
[INFO] 
[JENKINS] Recording test results
[INFO] 
[INFO] --- animal-sniffer-maven-plugin:1.16:check (default) @ rdf4j-console ---
[INFO] Checking unresolved references to org.codehaus.mojo.signature:java18:1.0
[INFO] 
[INFO] --- maven-jar-plugin:2.3.1:jar (default-jar) @ rdf4j-console ---
[INFO] Building jar: /home/hudson/genie.rdf4j/.jenkins/jobs/rdf4j-pr-verify/workspace/tools/console/target/rdf4j-console-3.1.0-SNAPSHOT.jar