SuccessConsole Output

Started calculate disk usage of build
Finished Calculation of disk usage of build in 0 seconds
Started calculate disk usage of workspace
Finished Calculation of disk usage of workspace in 0 seconds
[INFO] 
[INFO] ------------------< org.eclipse.rdf4j:rdf4j-console >-------------------
[INFO] Building RDF4J: Console 3.1.0-SNAPSHOT                           [70/85]
[INFO] --------------------------------[ jar ]---------------------------------
[INFO] 
[INFO] --- buildnumber-maven-plugin:1.4:create (default) @ rdf4j-console ---
[INFO] ShortRevision tag detected. The value is '7'.
[INFO] Executing: /bin/sh -c cd '/home/hudson/genie.rdf4j/.jenkins/jobs/rdf4j-pr-verify/workspace/tools/console' && 'git' 'rev-parse' '--verify' '--short=7' 'HEAD'
[INFO] Working directory: /home/hudson/genie.rdf4j/.jenkins/jobs/rdf4j-pr-verify/workspace/tools/console
[INFO] Storing buildNumber: 95d5a4b at timestamp: 1576089059391
[WARNING] Cannot get the branch information from the git repository: 
Detecting the current branch failed: fatal: ref HEAD is not a symbolic ref

[INFO] ShortRevision tag detected. The value is '7'.
[INFO] Executing: /bin/sh -c cd '/home/hudson/genie.rdf4j/.jenkins/jobs/rdf4j-pr-verify/workspace/tools/console' && 'git' 'rev-parse' '--verify' '--short=7' 'HEAD'
[INFO] Working directory: /home/hudson/genie.rdf4j/.jenkins/jobs/rdf4j-pr-verify/workspace/tools/console
[INFO] Storing buildScmBranch: UNKNOWN
[INFO] 
[INFO] --- maven-enforcer-plugin:1.4.1:enforce (enforce-bytecode-version) @ rdf4j-console ---
[INFO] Adding ignore: META-INF/**/module-info
[INFO] 
[INFO] --- formatter-maven-plugin:2.8.1:validate (default) @ rdf4j-console ---
[INFO] Using 'UTF-8' encoding to format source files.
[INFO] Number of files to be formatted: 61
[INFO] Html formatting is skipped
[INFO] Successfully formatted:          0 file(s)
[INFO] Fail to format:                  0 file(s)
[INFO] Skipped:                         61 file(s)
[INFO] Read only skipped:               0 file(s)
[INFO] Approximate time taken:          0s
[INFO] 
[INFO] --- maven-resources-plugin:3.0.2:resources (default-resources) @ rdf4j-console ---
[INFO] Using 'UTF-8' encoding to copy filtered resources.
[INFO] skip non existing resourceDirectory /home/hudson/genie.rdf4j/.jenkins/jobs/rdf4j-pr-verify/workspace/tools/console/src/main/resources
[INFO] 
[INFO] --- maven-compiler-plugin:3.7.0:compile (default-compile) @ rdf4j-console ---
[INFO] Changes detected - recompiling the module!
[INFO] Compiling 42 source files to /home/hudson/genie.rdf4j/.jenkins/jobs/rdf4j-pr-verify/workspace/tools/console/target/classes
[INFO] 
[INFO] --- maven-resources-plugin:3.0.2:testResources (default-testResources) @ rdf4j-console ---
[INFO] Using 'UTF-8' encoding to copy filtered resources.
[INFO] Copying 29 resources
[INFO] 
[INFO] --- maven-compiler-plugin:3.7.0:testCompile (default-testCompile) @ rdf4j-console ---
[INFO] Changes detected - recompiling the module!
[INFO] Compiling 18 source files to /home/hudson/genie.rdf4j/.jenkins/jobs/rdf4j-pr-verify/workspace/tools/console/target/test-classes
[INFO] 
[INFO] --- maven-surefire-plugin:2.22.2:test (default-test) @ rdf4j-console ---
[INFO] 
[INFO] -------------------------------------------------------
[INFO]  T E S T S
[INFO] -------------------------------------------------------
[INFO] Running org.eclipse.rdf4j.console.setting.PrefixesTest
[INFO] Tests run: 3, Failures: 0, Errors: 0, Skipped: 0, Time elapsed: 0.64 s - in org.eclipse.rdf4j.console.setting.PrefixesTest
[INFO] Running org.eclipse.rdf4j.console.setting.LogLevelTest
13:31:04.833 [main] ERROR unknown logging level: chatty
[INFO] Tests run: 4, Failures: 0, Errors: 0, Skipped: 0, Time elapsed: 0.013 s - in org.eclipse.rdf4j.console.setting.LogLevelTest
[INFO] Running org.eclipse.rdf4j.console.setting.QueryPrefixTest
[INFO] Tests run: 1, Failures: 0, Errors: 0, Skipped: 0, Time elapsed: 0 s - in org.eclipse.rdf4j.console.setting.QueryPrefixTest
[INFO] Running org.eclipse.rdf4j.console.setting.ShowPrefixTest
[INFO] Tests run: 1, Failures: 0, Errors: 0, Skipped: 0, Time elapsed: 0 s - in org.eclipse.rdf4j.console.setting.ShowPrefixTest
[INFO] Running org.eclipse.rdf4j.console.setting.ConsoleWidthTest
[INFO] Tests run: 1, Failures: 0, Errors: 0, Skipped: 0, Time elapsed: 0 s - in org.eclipse.rdf4j.console.setting.ConsoleWidthTest
[INFO] Running org.eclipse.rdf4j.console.command.SetParametersTest
13:31:04.867 [main] ERROR Unknown parameter: unknown
[INFO] Tests run: 1, Failures: 0, Errors: 0, Skipped: 0, Time elapsed: 0.022 s - in org.eclipse.rdf4j.console.command.SetParametersTest
[INFO] Running org.eclipse.rdf4j.console.command.LoadTest
[MockitoHint] LoadTest.testLoad (see javadoc for MockitoHint):
[MockitoHint] 1. Unused -> at org.eclipse.rdf4j.console.command.LoadTest.setUp(LoadTest.java:49)

[MockitoHint] LoadTest.testLoadWorkDir (see javadoc for MockitoHint):
[MockitoHint] 1. Unused -> at org.eclipse.rdf4j.console.command.LoadTest.setUp(LoadTest.java:49)

[INFO] Tests run: 2, Failures: 0, Errors: 0, Skipped: 0, Time elapsed: 0.184 s - in org.eclipse.rdf4j.console.command.LoadTest
[INFO] Running org.eclipse.rdf4j.console.command.ConvertTest
13:31:05.539 [main] ERROR No RDF writer for /tmp/genie.rdf4j/junit4608800371990721841/alien.qyx
[MockitoHint] ConvertTest.testConvertInvalidFormat (see javadoc for MockitoHint):
[MockitoHint] 1. Unused -> at org.eclipse.rdf4j.console.command.ConvertTest.setup(ConvertTest.java:39)

13:31:05.552 [main] ERROR Failed to convert data
org.eclipse.rdf4j.rio.RDFParseException: Expected '<' or '_', found: e [line 1, column 101]
	at org.eclipse.rdf4j.rio.ntriples.NTriplesParser.parseSubject(NTriplesParser.java:313)
	at org.eclipse.rdf4j.rio.ntriples.NTriplesParser.parseTriple(NTriplesParser.java:252)
	at org.eclipse.rdf4j.rio.ntriples.NTriplesParser.parse(NTriplesParser.java:160)
	at org.eclipse.rdf4j.rio.ntriples.NTriplesParser.parse(NTriplesParser.java:109)
	at org.eclipse.rdf4j.console.command.Convert.convert(Convert.java:139)
	at org.eclipse.rdf4j.console.command.Convert.execute(Convert.java:74)
	at org.eclipse.rdf4j.console.command.ConvertTest.testConvertParseError(ConvertTest.java:92)
	at sun.reflect.NativeMethodAccessorImpl.invoke0(Native Method)
	at sun.reflect.NativeMethodAccessorImpl.invoke(NativeMethodAccessorImpl.java:62)
	at sun.reflect.DelegatingMethodAccessorImpl.invoke(DelegatingMethodAccessorImpl.java:43)
	at java.lang.reflect.Method.invoke(Method.java:498)
	at org.junit.runners.model.FrameworkMethod$1.runReflectiveCall(FrameworkMethod.java:50)
	at org.junit.internal.runners.model.ReflectiveCallable.run(ReflectiveCallable.java:12)
	at org.junit.runners.model.FrameworkMethod.invokeExplosively(FrameworkMethod.java:47)
	at org.junit.internal.runners.statements.InvokeMethod.evaluate(InvokeMethod.java:17)
	at org.junit.internal.runners.statements.RunBefores.evaluate(RunBefores.java:26)
	at org.junit.internal.runners.statements.RunAfters.evaluate(RunAfters.java:27)
	at org.mockito.internal.junit.JUnitRule$1.evaluateSafely(JUnitRule.java:52)
	at org.mockito.internal.junit.JUnitRule$1.evaluate(JUnitRule.java:43)
	at org.junit.rules.ExternalResource$1.evaluate(ExternalResource.java:48)
	at org.junit.rules.RunRules.evaluate(RunRules.java:20)
	at org.junit.runners.ParentRunner.runLeaf(ParentRunner.java:325)
	at org.junit.runners.BlockJUnit4ClassRunner.runChild(BlockJUnit4ClassRunner.java:78)
	at org.junit.runners.BlockJUnit4ClassRunner.runChild(BlockJUnit4ClassRunner.java:57)
	at org.junit.runners.ParentRunner$3.run(ParentRunner.java:290)
	at org.junit.runners.ParentRunner$1.schedule(ParentRunner.java:71)
	at org.junit.runners.ParentRunner.runChildren(ParentRunner.java:288)
	at org.junit.runners.ParentRunner.access$000(ParentRunner.java:58)
	at org.junit.runners.ParentRunner$2.evaluate(ParentRunner.java:268)
	at org.junit.runners.ParentRunner.run(ParentRunner.java:363)
	at org.apache.maven.surefire.junit4.JUnit4Provider.execute(JUnit4Provider.java:365)
	at org.apache.maven.surefire.junit4.JUnit4Provider.executeWithRerun(JUnit4Provider.java:273)
	at org.apache.maven.surefire.junit4.JUnit4Provider.executeTestSet(JUnit4Provider.java:238)
	at org.apache.maven.surefire.junit4.JUnit4Provider.invoke(JUnit4Provider.java:159)
	at org.apache.maven.surefire.booter.ForkedBooter.invokeProviderInSameClassLoader(ForkedBooter.java:384)
	at org.apache.maven.surefire.booter.ForkedBooter.runSuitesInProcess(ForkedBooter.java:345)
	at org.apache.maven.surefire.booter.ForkedBooter.execute(ForkedBooter.java:126)
	at org.apache.maven.surefire.booter.ForkedBooter.main(ForkedBooter.java:418)
[INFO] Tests run: 4, Failures: 0, Errors: 0, Skipped: 0, Time elapsed: 0.493 s - in org.eclipse.rdf4j.console.command.ConvertTest
[INFO] Running org.eclipse.rdf4j.console.command.ExportTest
[MockitoHint] ExportTest.testExportWorkDir (see javadoc for MockitoHint):
[MockitoHint] 1. Unused -> at org.eclipse.rdf4j.console.command.ExportTest.setUp(ExportTest.java:46)

[MockitoHint] ExportTest.testExportAll (see javadoc for MockitoHint):
[MockitoHint] 1. Unused -> at org.eclipse.rdf4j.console.command.ExportTest.setUp(ExportTest.java:46)

[MockitoHint] ExportTest.testExportContexts (see javadoc for MockitoHint):
[MockitoHint] 1. Unused -> at org.eclipse.rdf4j.console.command.ExportTest.setUp(ExportTest.java:46)

[INFO] Tests run: 3, Failures: 0, Errors: 0, Skipped: 0, Time elapsed: 0.075 s - in org.eclipse.rdf4j.console.command.ExportTest
[INFO] Running org.eclipse.rdf4j.console.command.VerifyTest
13:31:06.031 [main] ERROR Unexpected RDFParseException
org.eclipse.rdf4j.rio.RDFParseException: 'missing type' was not recognised, and could not be verified, with datatype http://example.rdf4j.org/type/wrong [line 1]
	at org.eclipse.rdf4j.rio.helpers.RDFParserHelper.reportError(RDFParserHelper.java:265)
	at org.eclipse.rdf4j.rio.helpers.RDFParserHelper.createLiteral(RDFParserHelper.java:180)
	at org.eclipse.rdf4j.rio.helpers.AbstractRDFParser.createLiteral(AbstractRDFParser.java:530)
	at org.eclipse.rdf4j.rio.turtle.TurtleParser.parseQuotedLiteral(TurtleParser.java:665)
	at org.eclipse.rdf4j.rio.turtle.TurtleParser.parseValue(TurtleParser.java:584)
	at org.eclipse.rdf4j.rio.turtle.TurtleParser.parseObject(TurtleParser.java:461)
	at org.eclipse.rdf4j.rio.turtle.TurtleParser.parseObjectList(TurtleParser.java:389)
	at org.eclipse.rdf4j.rio.turtle.TurtleParser.parsePredicateObjectList(TurtleParser.java:362)
	at org.eclipse.rdf4j.rio.turtle.TurtleParser.parseTriples(TurtleParser.java:349)
	at org.eclipse.rdf4j.rio.turtle.TurtleParser.parseStatement(TurtleParser.java:216)
	at org.eclipse.rdf4j.rio.turtle.TurtleParser.parse(TurtleParser.java:178)
	at org.eclipse.rdf4j.rio.turtle.TurtleParser.parse(TurtleParser.java:130)
	at org.eclipse.rdf4j.console.command.Verify.verify(Verify.java:145)
	at org.eclipse.rdf4j.console.command.Verify.execute(Verify.java:97)
	at org.eclipse.rdf4j.console.command.VerifyTest.testVerifyMissingType(VerifyTest.java:97)
	at sun.reflect.NativeMethodAccessorImpl.invoke0(Native Method)
	at sun.reflect.NativeMethodAccessorImpl.invoke(NativeMethodAccessorImpl.java:62)
	at sun.reflect.DelegatingMethodAccessorImpl.invoke(DelegatingMethodAccessorImpl.java:43)
	at java.lang.reflect.Method.invoke(Method.java:498)
	at org.junit.runners.model.FrameworkMethod$1.runReflectiveCall(FrameworkMethod.java:50)
	at org.junit.internal.runners.model.ReflectiveCallable.run(ReflectiveCallable.java:12)
	at org.junit.runners.model.FrameworkMethod.invokeExplosively(FrameworkMethod.java:47)
	at org.junit.internal.runners.statements.InvokeMethod.evaluate(InvokeMethod.java:17)
	at org.junit.internal.runners.statements.RunBefores.evaluate(RunBefores.java:26)
	at org.junit.internal.runners.statements.RunAfters.evaluate(RunAfters.java:27)
	at org.mockito.internal.junit.JUnitRule$1.evaluateSafely(JUnitRule.java:52)
	at org.mockito.internal.junit.JUnitRule$1.evaluate(JUnitRule.java:43)
	at org.junit.rules.ExternalResource$1.evaluate(ExternalResource.java:48)
	at org.junit.rules.RunRules.evaluate(RunRules.java:20)
	at org.junit.runners.ParentRunner.runLeaf(ParentRunner.java:325)
	at org.junit.runners.BlockJUnit4ClassRunner.runChild(BlockJUnit4ClassRunner.java:78)
	at org.junit.runners.BlockJUnit4ClassRunner.runChild(BlockJUnit4ClassRunner.java:57)
	at org.junit.runners.ParentRunner$3.run(ParentRunner.java:290)
	at org.junit.runners.ParentRunner$1.schedule(ParentRunner.java:71)
	at org.junit.runners.ParentRunner.runChildren(ParentRunner.java:288)
	at org.junit.runners.ParentRunner.access$000(ParentRunner.java:58)
	at org.junit.runners.ParentRunner$2.evaluate(ParentRunner.java:268)
	at org.junit.runners.ParentRunner.run(ParentRunner.java:363)
	at org.apache.maven.surefire.junit4.JUnit4Provider.execute(JUnit4Provider.java:365)
	at org.apache.maven.surefire.junit4.JUnit4Provider.executeWithRerun(JUnit4Provider.java:273)
	at org.apache.maven.surefire.junit4.JUnit4Provider.executeTestSet(JUnit4Provider.java:238)
	at org.apache.maven.surefire.junit4.JUnit4Provider.invoke(JUnit4Provider.java:159)
	at org.apache.maven.surefire.booter.ForkedBooter.invokeProviderInSameClassLoader(ForkedBooter.java:384)
	at org.apache.maven.surefire.booter.ForkedBooter.runSuitesInProcess(ForkedBooter.java:345)
	at org.apache.maven.surefire.booter.ForkedBooter.execute(ForkedBooter.java:126)
	at org.apache.maven.surefire.booter.ForkedBooter.main(ForkedBooter.java:418)
13:31:06.081 [main] ERROR SHACL validation failed, writing report to /tmp/genie.rdf4j/junit2888590959284634310/junit3515944404343070207.tmp
13:31:06.096 [main] ERROR Unexpected RDFParseException
org.eclipse.rdf4j.rio.RDFParseException: Unexpected end of file
	at org.eclipse.rdf4j.rio.turtle.TurtleParser.throwEOFException(TurtleParser.java:1317)
	at org.eclipse.rdf4j.rio.turtle.TurtleParser.parseValue(TurtleParser.java:589)
	at org.eclipse.rdf4j.rio.turtle.TurtleParser.parsePredicate(TurtleParser.java:434)
	at org.eclipse.rdf4j.rio.turtle.TurtleParser.parsePredicateObjectList(TurtleParser.java:358)
	at org.eclipse.rdf4j.rio.turtle.TurtleParser.parseTriples(TurtleParser.java:349)
	at org.eclipse.rdf4j.rio.turtle.TurtleParser.parseStatement(TurtleParser.java:216)
	at org.eclipse.rdf4j.rio.turtle.TurtleParser.parse(TurtleParser.java:178)
	at org.eclipse.rdf4j.rio.turtle.TurtleParser.parse(TurtleParser.java:130)
	at org.eclipse.rdf4j.console.command.Verify.verify(Verify.java:145)
	at org.eclipse.rdf4j.console.command.Verify.execute(Verify.java:97)
	at org.eclipse.rdf4j.console.command.VerifyTest.testVerifyBrokenFile(VerifyTest.java:91)
	at sun.reflect.NativeMethodAccessorImpl.invoke0(Native Method)
	at sun.reflect.NativeMethodAccessorImpl.invoke(NativeMethodAccessorImpl.java:62)
	at sun.reflect.DelegatingMethodAccessorImpl.invoke(DelegatingMethodAccessorImpl.java:43)
	at java.lang.reflect.Method.invoke(Method.java:498)
	at org.junit.runners.model.FrameworkMethod$1.runReflectiveCall(FrameworkMethod.java:50)
	at org.junit.internal.runners.model.ReflectiveCallable.run(ReflectiveCallable.java:12)
	at org.junit.runners.model.FrameworkMethod.invokeExplosively(FrameworkMethod.java:47)
	at org.junit.internal.runners.statements.InvokeMethod.evaluate(InvokeMethod.java:17)
	at org.junit.internal.runners.statements.RunBefores.evaluate(RunBefores.java:26)
	at org.junit.internal.runners.statements.RunAfters.evaluate(RunAfters.java:27)
	at org.mockito.internal.junit.JUnitRule$1.evaluateSafely(JUnitRule.java:52)
	at org.mockito.internal.junit.JUnitRule$1.evaluate(JUnitRule.java:43)
	at org.junit.rules.ExternalResource$1.evaluate(ExternalResource.java:48)
	at org.junit.rules.RunRules.evaluate(RunRules.java:20)
	at org.junit.runners.ParentRunner.runLeaf(ParentRunner.java:325)
	at org.junit.runners.BlockJUnit4ClassRunner.runChild(BlockJUnit4ClassRunner.java:78)
	at org.junit.runners.BlockJUnit4ClassRunner.runChild(BlockJUnit4ClassRunner.java:57)
	at org.junit.runners.ParentRunner$3.run(ParentRunner.java:290)
	at org.junit.runners.ParentRunner$1.schedule(ParentRunner.java:71)
	at org.junit.runners.ParentRunner.runChildren(ParentRunner.java:288)
	at org.junit.runners.ParentRunner.access$000(ParentRunner.java:58)
	at org.junit.runners.ParentRunner$2.evaluate(ParentRunner.java:268)
	at org.junit.runners.ParentRunner.run(ParentRunner.java:363)
	at org.apache.maven.surefire.junit4.JUnit4Provider.execute(JUnit4Provider.java:365)
	at org.apache.maven.surefire.junit4.JUnit4Provider.executeWithRerun(JUnit4Provider.java:273)
	at org.apache.maven.surefire.junit4.JUnit4Provider.executeTestSet(JUnit4Provider.java:238)
	at org.apache.maven.surefire.junit4.JUnit4Provider.invoke(JUnit4Provider.java:159)
	at org.apache.maven.surefire.booter.ForkedBooter.invokeProviderInSameClassLoader(ForkedBooter.java:384)
	at org.apache.maven.surefire.booter.ForkedBooter.runSuitesInProcess(ForkedBooter.java:345)
	at org.apache.maven.surefire.booter.ForkedBooter.execute(ForkedBooter.java:126)
	at org.apache.maven.surefire.booter.ForkedBooter.main(ForkedBooter.java:418)
13:31:06.110 [main] ERROR Unexpected RDFParseException
org.eclipse.rdf4j.rio.RDFParseException: Expected a letter, found '1' [line 1]
	at org.eclipse.rdf4j.rio.helpers.RDFParserHelper.reportError(RDFParserHelper.java:265)
	at org.eclipse.rdf4j.rio.helpers.AbstractRDFParser.reportError(AbstractRDFParser.java:628)
	at org.eclipse.rdf4j.rio.turtle.TurtleParser.reportError(TurtleParser.java:1297)
	at org.eclipse.rdf4j.rio.turtle.TurtleParser.parseQuotedLiteral(TurtleParser.java:619)
	at org.eclipse.rdf4j.rio.turtle.TurtleParser.parseValue(TurtleParser.java:584)
	at org.eclipse.rdf4j.rio.turtle.TurtleParser.parseObject(TurtleParser.java:461)
	at org.eclipse.rdf4j.rio.turtle.TurtleParser.parseObjectList(TurtleParser.java:389)
	at org.eclipse.rdf4j.rio.turtle.TurtleParser.parsePredicateObjectList(TurtleParser.java:362)
	at org.eclipse.rdf4j.rio.turtle.TurtleParser.parseTriples(TurtleParser.java:349)
	at org.eclipse.rdf4j.rio.turtle.TurtleParser.parseStatement(TurtleParser.java:216)
	at org.eclipse.rdf4j.rio.turtle.TurtleParser.parse(TurtleParser.java:178)
	at org.eclipse.rdf4j.rio.turtle.TurtleParser.parse(TurtleParser.java:130)
	at org.eclipse.rdf4j.console.command.Verify.verify(Verify.java:145)
	at org.eclipse.rdf4j.console.command.Verify.execute(Verify.java:97)
	at org.eclipse.rdf4j.console.command.VerifyTest.testVerifyWrongLang(VerifyTest.java:109)
	at sun.reflect.NativeMethodAccessorImpl.invoke0(Native Method)
	at sun.reflect.NativeMethodAccessorImpl.invoke(NativeMethodAccessorImpl.java:62)
	at sun.reflect.DelegatingMethodAccessorImpl.invoke(DelegatingMethodAccessorImpl.java:43)
	at java.lang.reflect.Method.invoke(Method.java:498)
	at org.junit.runners.model.FrameworkMethod$1.runReflectiveCall(FrameworkMethod.java:50)
	at org.junit.internal.runners.model.ReflectiveCallable.run(ReflectiveCallable.java:12)
	at org.junit.runners.model.FrameworkMethod.invokeExplosively(FrameworkMethod.java:47)
	at org.junit.internal.runners.statements.InvokeMethod.evaluate(InvokeMethod.java:17)
	at org.junit.internal.runners.statements.RunBefores.evaluate(RunBefores.java:26)
	at org.junit.internal.runners.statements.RunAfters.evaluate(RunAfters.java:27)
	at org.mockito.internal.junit.JUnitRule$1.evaluateSafely(JUnitRule.java:52)
	at org.mockito.internal.junit.JUnitRule$1.evaluate(JUnitRule.java:43)
	at org.junit.rules.ExternalResource$1.evaluate(ExternalResource.java:48)
	at org.junit.rules.RunRules.evaluate(RunRules.java:20)
	at org.junit.runners.ParentRunner.runLeaf(ParentRunner.java:325)
	at org.junit.runners.BlockJUnit4ClassRunner.runChild(BlockJUnit4ClassRunner.java:78)
	at org.junit.runners.BlockJUnit4ClassRunner.runChild(BlockJUnit4ClassRunner.java:57)
	at org.junit.runners.ParentRunner$3.run(ParentRunner.java:290)
	at org.junit.runners.ParentRunner$1.schedule(ParentRunner.java:71)
	at org.junit.runners.ParentRunner.runChildren(ParentRunner.java:288)
	at org.junit.runners.ParentRunner.access$000(ParentRunner.java:58)
	at org.junit.runners.ParentRunner$2.evaluate(ParentRunner.java:268)
	at org.junit.runners.ParentRunner.run(ParentRunner.java:363)
	at org.apache.maven.surefire.junit4.JUnit4Provider.execute(JUnit4Provider.java:365)
	at org.apache.maven.surefire.junit4.JUnit4Provider.executeWithRerun(JUnit4Provider.java:273)
	at org.apache.maven.surefire.junit4.JUnit4Provider.executeTestSet(JUnit4Provider.java:238)
	at org.apache.maven.surefire.junit4.JUnit4Provider.invoke(JUnit4Provider.java:159)
	at org.apache.maven.surefire.booter.ForkedBooter.invokeProviderInSameClassLoader(ForkedBooter.java:384)
	at org.apache.maven.surefire.booter.ForkedBooter.runSuitesInProcess(ForkedBooter.java:345)
	at org.apache.maven.surefire.booter.ForkedBooter.execute(ForkedBooter.java:126)
	at org.apache.maven.surefire.booter.ForkedBooter.main(ForkedBooter.java:418)
13:31:06.125 [main] ERROR No parser available for this RDF format
org.eclipse.rdf4j.rio.UnsupportedRDFormatException: Did not recognise RDF format string file:/home/hudson/genie.rdf4j/.jenkins/jobs/rdf4j-pr-verify/workspace/tools/console/does-not-exist.docx
	at org.eclipse.rdf4j.rio.Rio.lambda$unsupportedFormat$1(Rio.java:577)
	at java.util.Optional.orElseThrow(Optional.java:290)
	at org.eclipse.rdf4j.console.command.Verify.verify(Verify.java:124)
	at org.eclipse.rdf4j.console.command.Verify.execute(Verify.java:97)
	at org.eclipse.rdf4j.console.command.VerifyTest.testVerifyWrongFormat(VerifyTest.java:69)
	at sun.reflect.NativeMethodAccessorImpl.invoke0(Native Method)
	at sun.reflect.NativeMethodAccessorImpl.invoke(NativeMethodAccessorImpl.java:62)
	at sun.reflect.DelegatingMethodAccessorImpl.invoke(DelegatingMethodAccessorImpl.java:43)
	at java.lang.reflect.Method.invoke(Method.java:498)
	at org.junit.runners.model.FrameworkMethod$1.runReflectiveCall(FrameworkMethod.java:50)
	at org.junit.internal.runners.model.ReflectiveCallable.run(ReflectiveCallable.java:12)
	at org.junit.runners.model.FrameworkMethod.invokeExplosively(FrameworkMethod.java:47)
	at org.junit.internal.runners.statements.InvokeMethod.evaluate(InvokeMethod.java:17)
	at org.junit.internal.runners.statements.RunBefores.evaluate(RunBefores.java:26)
	at org.junit.internal.runners.statements.RunAfters.evaluate(RunAfters.java:27)
	at org.mockito.internal.junit.JUnitRule$1.evaluateSafely(JUnitRule.java:52)
	at org.mockito.internal.junit.JUnitRule$1.evaluate(JUnitRule.java:43)
	at org.junit.rules.ExternalResource$1.evaluate(ExternalResource.java:48)
	at org.junit.rules.RunRules.evaluate(RunRules.java:20)
	at org.junit.runners.ParentRunner.runLeaf(ParentRunner.java:325)
	at org.junit.runners.BlockJUnit4ClassRunner.runChild(BlockJUnit4ClassRunner.java:78)
	at org.junit.runners.BlockJUnit4ClassRunner.runChild(BlockJUnit4ClassRunner.java:57)
	at org.junit.runners.ParentRunner$3.run(ParentRunner.java:290)
	at org.junit.runners.ParentRunner$1.schedule(ParentRunner.java:71)
	at org.junit.runners.ParentRunner.runChildren(ParentRunner.java:288)
	at org.junit.runners.ParentRunner.access$000(ParentRunner.java:58)
	at org.junit.runners.ParentRunner$2.evaluate(ParentRunner.java:268)
	at org.junit.runners.ParentRunner.run(ParentRunner.java:363)
	at org.apache.maven.surefire.junit4.JUnit4Provider.execute(JUnit4Provider.java:365)
	at org.apache.maven.surefire.junit4.JUnit4Provider.executeWithRerun(JUnit4Provider.java:273)
	at org.apache.maven.surefire.junit4.JUnit4Provider.executeTestSet(JUnit4Provider.java:238)
	at org.apache.maven.surefire.junit4.JUnit4Provider.invoke(JUnit4Provider.java:159)
	at org.apache.maven.surefire.booter.ForkedBooter.invokeProviderInSameClassLoader(ForkedBooter.java:384)
	at org.apache.maven.surefire.booter.ForkedBooter.runSuitesInProcess(ForkedBooter.java:345)
	at org.apache.maven.surefire.booter.ForkedBooter.execute(ForkedBooter.java:126)
	at org.apache.maven.surefire.booter.ForkedBooter.main(ForkedBooter.java:418)
13:31:06.141 [main] ERROR Unexpected RDFParseException
org.eclipse.rdf4j.rio.RDFParseException: IRI included an unencoded space: '32' [line 1]
	at org.eclipse.rdf4j.rio.helpers.RDFParserHelper.reportError(RDFParserHelper.java:265)
	at org.eclipse.rdf4j.rio.helpers.AbstractRDFParser.reportError(AbstractRDFParser.java:628)
	at org.eclipse.rdf4j.rio.turtle.TurtleParser.reportError(TurtleParser.java:1297)
	at org.eclipse.rdf4j.rio.turtle.TurtleParser.parseURI(TurtleParser.java:902)
	at org.eclipse.rdf4j.rio.turtle.TurtleParser.parseValue(TurtleParser.java:575)
	at org.eclipse.rdf4j.rio.turtle.TurtleParser.parseSubject(TurtleParser.java:406)
	at org.eclipse.rdf4j.rio.turtle.TurtleParser.parseTriples(TurtleParser.java:347)
	at org.eclipse.rdf4j.rio.turtle.TurtleParser.parseStatement(TurtleParser.java:216)
	at org.eclipse.rdf4j.rio.turtle.TurtleParser.parse(TurtleParser.java:178)
	at org.eclipse.rdf4j.rio.turtle.TurtleParser.parse(TurtleParser.java:130)
	at org.eclipse.rdf4j.console.command.Verify.verify(Verify.java:145)
	at org.eclipse.rdf4j.console.command.Verify.execute(Verify.java:97)
	at org.eclipse.rdf4j.console.command.VerifyTest.testVerifySpaceIRI(VerifyTest.java:103)
	at sun.reflect.NativeMethodAccessorImpl.invoke0(Native Method)
	at sun.reflect.NativeMethodAccessorImpl.invoke(NativeMethodAccessorImpl.java:62)
	at sun.reflect.DelegatingMethodAccessorImpl.invoke(DelegatingMethodAccessorImpl.java:43)
	at java.lang.reflect.Method.invoke(Method.java:498)
	at org.junit.runners.model.FrameworkMethod$1.runReflectiveCall(FrameworkMethod.java:50)
	at org.junit.internal.runners.model.ReflectiveCallable.run(ReflectiveCallable.java:12)
	at org.junit.runners.model.FrameworkMethod.invokeExplosively(FrameworkMethod.java:47)
	at org.junit.internal.runners.statements.InvokeMethod.evaluate(InvokeMethod.java:17)
	at org.junit.internal.runners.statements.RunBefores.evaluate(RunBefores.java:26)
	at org.junit.internal.runners.statements.RunAfters.evaluate(RunAfters.java:27)
	at org.mockito.internal.junit.JUnitRule$1.evaluateSafely(JUnitRule.java:52)
	at org.mockito.internal.junit.JUnitRule$1.evaluate(JUnitRule.java:43)
	at org.junit.rules.ExternalResource$1.evaluate(ExternalResource.java:48)
	at org.junit.rules.RunRules.evaluate(RunRules.java:20)
	at org.junit.runners.ParentRunner.runLeaf(ParentRunner.java:325)
	at org.junit.runners.BlockJUnit4ClassRunner.runChild(BlockJUnit4ClassRunner.java:78)
	at org.junit.runners.BlockJUnit4ClassRunner.runChild(BlockJUnit4ClassRunner.java:57)
	at org.junit.runners.ParentRunner$3.run(ParentRunner.java:290)
	at org.junit.runners.ParentRunner$1.schedule(ParentRunner.java:71)
	at org.junit.runners.ParentRunner.runChildren(ParentRunner.java:288)
	at org.junit.runners.ParentRunner.access$000(ParentRunner.java:58)
	at org.junit.runners.ParentRunner$2.evaluate(ParentRunner.java:268)
	at org.junit.runners.ParentRunner.run(ParentRunner.java:363)
	at org.apache.maven.surefire.junit4.JUnit4Provider.execute(JUnit4Provider.java:365)
	at org.apache.maven.surefire.junit4.JUnit4Provider.executeWithRerun(JUnit4Provider.java:273)
	at org.apache.maven.surefire.junit4.JUnit4Provider.executeTestSet(JUnit4Provider.java:238)
	at org.apache.maven.surefire.junit4.JUnit4Provider.invoke(JUnit4Provider.java:159)
	at org.apache.maven.surefire.booter.ForkedBooter.invokeProviderInSameClassLoader(ForkedBooter.java:384)
	at org.apache.maven.surefire.booter.ForkedBooter.runSuitesInProcess(ForkedBooter.java:345)
	at org.apache.maven.surefire.booter.ForkedBooter.execute(ForkedBooter.java:126)
	at org.apache.maven.surefire.booter.ForkedBooter.main(ForkedBooter.java:418)
[INFO] Tests run: 10, Failures: 0, Errors: 0, Skipped: 0, Time elapsed: 0.534 s - in org.eclipse.rdf4j.console.command.VerifyTest
[INFO] Running org.eclipse.rdf4j.console.command.DropTest
[MockitoHint] DropTest.testUserAbortedUnsafeDropBeforeWarning (see javadoc for MockitoHint):
[MockitoHint] 1. Unused -> at org.eclipse.rdf4j.console.command.DropTest.setUp(DropTest.java:50)

[INFO] Tests run: 3, Failures: 0, Errors: 0, Skipped: 0, Time elapsed: 13.165 s - in org.eclipse.rdf4j.console.command.DropTest
[INFO] Running org.eclipse.rdf4j.console.command.FederateTest
13:31:19.365 [main] DEBUG Initializing MemoryStore...
13:31:19.366 [main] DEBUG Initializing data file...
13:31:19.366 [main] DEBUG Data file initialized
13:31:19.366 [main] DEBUG MemoryStore initialized
13:31:19.368 [main] DEBUG syncing data to file...
13:31:19.369 [main] DEBUG Data synced to file
13:31:19.374 [main] DEBUG Initializing MemoryStore...
13:31:19.375 [main] DEBUG Initializing data file...
13:31:19.376 [main] DEBUG Data file initialized
13:31:19.376 [main] DEBUG MemoryStore initialized
13:31:19.378 [main] DEBUG syncing data to file...
13:31:19.379 [main] DEBUG Data synced to file
13:31:19.396 [main] DEBUG Federate called with federation ID = fedID, and member ID's = [sparql][alien][http].
  Distinct set to false, and readonly set to true.

13:31:19.399 [main] DEBUG Federation repository root node: _:node1drr3l4p4x216
13:31:19.401 [main] DEBUG _:node1drr3l4p4x216 http://www.w3.org/1999/02/22-rdf-syntax-ns#type http://www.openrdf.org/config/repository#Repository
13:31:19.401 [main] DEBUG _:node1drr3l4p4x216 http://www.openrdf.org/config/repository#repositoryID "fedID"
13:31:19.401 [main] DEBUG _:node1drr3l4p4x216 http://www.w3.org/2000/01/rdf-schema#label "Test Federation Title"
13:31:19.401 [main] DEBUG _:node1drr3l4p4x216 http://www.openrdf.org/config/repository#repositoryImpl _:node1drr3l4p4x217
13:31:19.402 [main] DEBUG _:node1drr3l4p4x217 http://www.openrdf.org/config/repository#repositoryType "openrdf:SailRepository"
13:31:19.402 [main] DEBUG _:node1drr3l4p4x217 http://www.openrdf.org/config/repository/sail#sailImpl _:node1drr3l4p4x218
13:31:19.402 [main] DEBUG _:node1drr3l4p4x218 http://www.openrdf.org/config/sail#sailType "openrdf:Federation"
13:31:19.402 [main] DEBUG _:node1drr3l4p4x218 http://www.openrdf.org/config/sail/federation#readOnly "true"^^<http://www.w3.org/2001/XMLSchema#boolean>
13:31:19.403 [main] DEBUG _:node1drr3l4p4x218 http://www.openrdf.org/config/sail/federation#distinct "false"^^<http://www.w3.org/2001/XMLSchema#boolean>
13:31:19.403 [main] DEBUG Adding member: sparql
13:31:19.403 [main] DEBUG _:node1drr3l4p4x218 http://www.openrdf.org/config/sail/federation#member _:node1drr3l4p4x219
13:31:19.403 [main] DEBUG _:node1drr3l4p4x219 http://www.openrdf.org/config/repository#repositoryType "openrdf:SPARQLRepository"
13:31:19.404 [main] DEBUG _:node1drr3l4p4x219 http://www.openrdf.org/config/repository/sparql#query-endpoint http://localhost:8080/openrdf-sesame/repositories/sparql
13:31:19.404 [main] DEBUG Added member sparql: 
13:31:19.404 [main] DEBUG Adding member: alien
13:31:19.404 [main] DEBUG _:node1drr3l4p4x218 http://www.openrdf.org/config/sail/federation#member _:node1drr3l4p4x222
13:31:19.405 [main] DEBUG _:node1drr3l4p4x222 http://www.openrdf.org/config/repository#repositoryType "openrdf:ProxyRepository"
13:31:19.405 [main] DEBUG _:node1drr3l4p4x222 http://www.openrdf.org/config/repository/proxy#proxiedID "alien"
13:31:19.405 [main] DEBUG Added member alien: 
13:31:19.405 [main] DEBUG Adding member: http
13:31:19.405 [main] DEBUG _:node1drr3l4p4x218 http://www.openrdf.org/config/sail/federation#member _:node1drr3l4p4x225
13:31:19.406 [main] DEBUG _:node1drr3l4p4x225 http://www.openrdf.org/config/repository#repositoryType "openrdf:HTTPRepository"
13:31:19.407 [main] DEBUG _:node1drr3l4p4x225 http://www.openrdf.org/config/repository/http#repositoryURL http://localhost:8080/openrdf-sesame/repositories/http
13:31:19.407 [main] DEBUG Added member http: 
13:31:19.438 [main] DEBUG Initializing MemoryStore...
13:31:19.439 [main] DEBUG Initializing data file...
13:31:19.439 [main] DEBUG Data file initialized
13:31:19.439 [main] DEBUG MemoryStore initialized
13:31:19.441 [main] DEBUG syncing data to file...
13:31:19.442 [main] DEBUG Data synced to file
13:31:19.445 [main] DEBUG Initializing MemoryStore...
13:31:19.447 [main] DEBUG Initializing data file...
13:31:19.447 [main] DEBUG Data file initialized
13:31:19.447 [main] DEBUG MemoryStore initialized
13:31:19.448 [main] DEBUG syncing data to file...
13:31:19.449 [main] DEBUG Data synced to file
13:31:19.459 [main] ERROR Duplicate repository id's specified.
[MockitoHint] FederateTest.testDuplicateMembersPrintsError (see javadoc for MockitoHint):
[MockitoHint] 1. Unused -> at org.eclipse.rdf4j.console.command.FederateTest.setUp(FederateTest.java:87)
[MockitoHint] 2. Unused -> at org.eclipse.rdf4j.console.command.FederateTest.setUp(FederateTest.java:88)

13:31:19.469 [main] DEBUG Initializing MemoryStore...
13:31:19.470 [main] DEBUG Initializing data file...
13:31:19.470 [main] DEBUG Data file initialized
13:31:19.471 [main] DEBUG MemoryStore initialized
13:31:19.472 [main] DEBUG syncing data to file...
13:31:19.473 [main] DEBUG Data synced to file
13:31:19.476 [main] DEBUG Initializing MemoryStore...
13:31:19.477 [main] DEBUG Initializing data file...
13:31:19.477 [main] DEBUG Data file initialized
13:31:19.477 [main] DEBUG MemoryStore initialized
13:31:19.478 [main] DEBUG syncing data to file...
13:31:19.479 [main] DEBUG Data synced to file
13:31:19.486 [main] DEBUG Federate called with federation ID = alien, and member ID's = [fedID][scary].
  Distinct set to false, and readonly set to true.

13:31:19.487 [main] ERROR alien already exists.
[MockitoHint] FederateTest.testFedAlreadyExistsPrintsSpecificError (see javadoc for MockitoHint):
[MockitoHint] 1. Unused -> at org.eclipse.rdf4j.console.command.FederateTest.setUp(FederateTest.java:88)

13:31:19.495 [main] DEBUG Initializing MemoryStore...
13:31:19.496 [main] DEBUG Initializing data file...
13:31:19.496 [main] DEBUG Data file initialized
13:31:19.496 [main] DEBUG MemoryStore initialized
13:31:19.498 [main] DEBUG syncing data to file...
13:31:19.498 [main] DEBUG Data synced to file
13:31:19.501 [main] DEBUG Initializing MemoryStore...
13:31:19.502 [main] DEBUG Initializing data file...
13:31:19.502 [main] DEBUG Data file initialized
13:31:19.502 [main] DEBUG MemoryStore initialized
13:31:19.503 [main] DEBUG syncing data to file...
13:31:19.504 [main] DEBUG Data synced to file
13:31:19.511 [main] DEBUG Federate called with federation ID = fedID, and member ID's = [alien][scary].
  Distinct set to true, and readonly set to false.

13:31:19.512 [main] DEBUG Federation repository root node: _:node1drr3l4p4x338
13:31:19.512 [main] DEBUG _:node1drr3l4p4x338 http://www.w3.org/1999/02/22-rdf-syntax-ns#type http://www.openrdf.org/config/repository#Repository
13:31:19.513 [main] DEBUG _:node1drr3l4p4x338 http://www.openrdf.org/config/repository#repositoryID "fedID"
13:31:19.513 [main] DEBUG _:node1drr3l4p4x338 http://www.w3.org/2000/01/rdf-schema#label "Test Federation Title"
13:31:19.513 [main] DEBUG _:node1drr3l4p4x338 http://www.openrdf.org/config/repository#repositoryImpl _:node1drr3l4p4x339
13:31:19.513 [main] DEBUG _:node1drr3l4p4x339 http://www.openrdf.org/config/repository#repositoryType "openrdf:SailRepository"
13:31:19.513 [main] DEBUG _:node1drr3l4p4x339 http://www.openrdf.org/config/repository/sail#sailImpl _:node1drr3l4p4x340
13:31:19.513 [main] DEBUG _:node1drr3l4p4x340 http://www.openrdf.org/config/sail#sailType "openrdf:Federation"
13:31:19.513 [main] DEBUG _:node1drr3l4p4x340 http://www.openrdf.org/config/sail/federation#readOnly "false"^^<http://www.w3.org/2001/XMLSchema#boolean>
13:31:19.513 [main] DEBUG _:node1drr3l4p4x340 http://www.openrdf.org/config/sail/federation#distinct "true"^^<http://www.w3.org/2001/XMLSchema#boolean>
13:31:19.513 [main] DEBUG Adding member: alien
13:31:19.513 [main] DEBUG _:node1drr3l4p4x340 http://www.openrdf.org/config/sail/federation#member _:node1drr3l4p4x341
13:31:19.513 [main] DEBUG _:node1drr3l4p4x341 http://www.openrdf.org/config/repository#repositoryType "openrdf:ProxyRepository"
13:31:19.513 [main] DEBUG _:node1drr3l4p4x341 http://www.openrdf.org/config/repository/proxy#proxiedID "alien"
13:31:19.513 [main] DEBUG Added member alien: 
13:31:19.513 [main] DEBUG Adding member: scary
13:31:19.513 [main] DEBUG _:node1drr3l4p4x340 http://www.openrdf.org/config/sail/federation#member _:node1drr3l4p4x344
13:31:19.514 [main] DEBUG _:node1drr3l4p4x344 http://www.openrdf.org/config/repository#repositoryType "openrdf:ProxyRepository"
13:31:19.514 [main] DEBUG _:node1drr3l4p4x344 http://www.openrdf.org/config/repository/proxy#proxiedID "scary"
13:31:19.514 [main] DEBUG Added member scary: 
13:31:19.536 [main] DEBUG Initializing MemoryStore...
13:31:19.537 [main] DEBUG Initializing data file...
13:31:19.538 [main] DEBUG Data file initialized
13:31:19.538 [main] DEBUG MemoryStore initialized
13:31:19.539 [main] DEBUG syncing data to file...
13:31:19.540 [main] DEBUG Data synced to file
13:31:19.545 [main] DEBUG Initializing MemoryStore...
13:31:19.546 [main] DEBUG Initializing data file...
13:31:19.546 [main] DEBUG Data file initialized
13:31:19.546 [main] DEBUG MemoryStore initialized
13:31:19.548 [main] DEBUG syncing data to file...
13:31:19.549 [main] DEBUG Data synced to file
13:31:19.557 [main] DEBUG Federate called with federation ID = fedID, and member ID's = [sparql][sparql2].
  Distinct set to false, and readonly set to false.

13:31:19.559 [main] ERROR sparql is read-only.
13:31:19.560 [main] ERROR sparql2 is read-only.
[MockitoHint] FederateTest.testSparqlAndNotReadOnlyPrintsError (see javadoc for MockitoHint):
[MockitoHint] 1. Unused -> at org.eclipse.rdf4j.console.command.FederateTest.setUp(FederateTest.java:88)

13:31:19.568 [main] DEBUG Initializing MemoryStore...
13:31:19.569 [main] DEBUG Initializing data file...
13:31:19.569 [main] DEBUG Data file initialized
13:31:19.569 [main] DEBUG MemoryStore initialized
13:31:19.571 [main] DEBUG syncing data to file...
13:31:19.571 [main] DEBUG Data synced to file
13:31:19.574 [main] DEBUG Initializing MemoryStore...
13:31:19.575 [main] DEBUG Initializing data file...
13:31:19.575 [main] DEBUG Data file initialized
13:31:19.575 [main] DEBUG MemoryStore initialized
13:31:19.576 [main] DEBUG syncing data to file...
13:31:19.577 [main] DEBUG Data synced to file
[MockitoHint] FederateTest.testNoArgumentsPrintsHelp (see javadoc for MockitoHint):
[MockitoHint] 1. Unused -> at org.eclipse.rdf4j.console.command.FederateTest.setUp(FederateTest.java:87)
[MockitoHint] 2. Unused -> at org.eclipse.rdf4j.console.command.FederateTest.setUp(FederateTest.java:88)

13:31:19.592 [main] DEBUG Initializing MemoryStore...
13:31:19.593 [main] DEBUG Initializing data file...
13:31:19.593 [main] DEBUG Data file initialized
13:31:19.593 [main] DEBUG MemoryStore initialized
13:31:19.595 [main] DEBUG syncing data to file...
13:31:19.595 [main] DEBUG Data synced to file
13:31:19.598 [main] DEBUG Initializing MemoryStore...
13:31:19.598 [main] DEBUG Initializing data file...
13:31:19.599 [main] DEBUG Data file initialized
13:31:19.599 [main] DEBUG MemoryStore initialized
13:31:19.600 [main] DEBUG syncing data to file...
13:31:19.600 [main] DEBUG Data synced to file
13:31:19.606 [main] DEBUG Federate called with federation ID = type=memory, and member ID's = [fedID][alien][scary].
  Distinct set to false, and readonly set to true.

13:31:19.606 [main] ERROR fedID does not exist.
[MockitoHint] FederateTest.testInvalidArgumentPrintsError (see javadoc for MockitoHint):
[MockitoHint] 1. Unused -> at org.eclipse.rdf4j.console.command.FederateTest.setUp(FederateTest.java:88)

13:31:19.614 [main] DEBUG Initializing MemoryStore...
13:31:19.615 [main] DEBUG Initializing data file...
13:31:19.615 [main] DEBUG Data file initialized
13:31:19.615 [main] DEBUG MemoryStore initialized
13:31:19.617 [main] DEBUG syncing data to file...
13:31:19.617 [main] DEBUG Data synced to file
13:31:19.620 [main] DEBUG Initializing MemoryStore...
13:31:19.621 [main] DEBUG Initializing data file...
13:31:19.621 [main] DEBUG Data file initialized
13:31:19.621 [main] DEBUG MemoryStore initialized
13:31:19.622 [main] DEBUG syncing data to file...
13:31:19.623 [main] DEBUG Data synced to file
13:31:19.630 [main] DEBUG Federate called with federation ID = fedID, and member ID's = [sparql][sparql2].
  Distinct set to false, and readonly set to true.

13:31:19.631 [main] DEBUG Federation repository root node: _:node1drr3l4p4x494
13:31:19.631 [main] DEBUG _:node1drr3l4p4x494 http://www.w3.org/1999/02/22-rdf-syntax-ns#type http://www.openrdf.org/config/repository#Repository
13:31:19.631 [main] DEBUG _:node1drr3l4p4x494 http://www.openrdf.org/config/repository#repositoryID "fedID"
13:31:19.631 [main] DEBUG _:node1drr3l4p4x494 http://www.w3.org/2000/01/rdf-schema#label "Test Federation Title"
13:31:19.631 [main] DEBUG _:node1drr3l4p4x494 http://www.openrdf.org/config/repository#repositoryImpl _:node1drr3l4p4x495
13:31:19.631 [main] DEBUG _:node1drr3l4p4x495 http://www.openrdf.org/config/repository#repositoryType "openrdf:SailRepository"
13:31:19.631 [main] DEBUG _:node1drr3l4p4x495 http://www.openrdf.org/config/repository/sail#sailImpl _:node1drr3l4p4x496
13:31:19.631 [main] DEBUG _:node1drr3l4p4x496 http://www.openrdf.org/config/sail#sailType "openrdf:Federation"
13:31:19.631 [main] DEBUG _:node1drr3l4p4x496 http://www.openrdf.org/config/sail/federation#readOnly "true"^^<http://www.w3.org/2001/XMLSchema#boolean>
13:31:19.631 [main] DEBUG _:node1drr3l4p4x496 http://www.openrdf.org/config/sail/federation#distinct "false"^^<http://www.w3.org/2001/XMLSchema#boolean>
13:31:19.631 [main] DEBUG Adding member: sparql
13:31:19.631 [main] DEBUG _:node1drr3l4p4x496 http://www.openrdf.org/config/sail/federation#member _:node1drr3l4p4x497
13:31:19.632 [main] DEBUG _:node1drr3l4p4x497 http://www.openrdf.org/config/repository#repositoryType "openrdf:SPARQLRepository"
13:31:19.632 [main] DEBUG _:node1drr3l4p4x497 http://www.openrdf.org/config/repository/sparql#query-endpoint http://localhost:8080/openrdf-sesame/repositories/sparql
13:31:19.632 [main] DEBUG Added member sparql: 
13:31:19.632 [main] DEBUG Adding member: sparql2
13:31:19.632 [main] DEBUG _:node1drr3l4p4x496 http://www.openrdf.org/config/sail/federation#member _:node1drr3l4p4x500
13:31:19.633 [main] DEBUG _:node1drr3l4p4x500 http://www.openrdf.org/config/repository#repositoryType "openrdf:SPARQLRepository"
13:31:19.633 [main] DEBUG _:node1drr3l4p4x500 http://www.openrdf.org/config/repository/sparql#query-endpoint http://localhost:8080/openrdf-sesame/repositories/sparql
13:31:19.633 [main] DEBUG Added member sparql2: 
13:31:19.645 [main] DEBUG Initializing MemoryStore...
13:31:19.646 [main] DEBUG Initializing data file...
13:31:19.646 [main] DEBUG Data file initialized
13:31:19.646 [main] DEBUG MemoryStore initialized
13:31:19.648 [main] DEBUG syncing data to file...
13:31:19.648 [main] DEBUG Data synced to file
13:31:19.651 [main] DEBUG Initializing MemoryStore...
13:31:19.652 [main] DEBUG Initializing data file...
13:31:19.652 [main] DEBUG Data file initialized
13:31:19.652 [main] DEBUG MemoryStore initialized
13:31:19.654 [main] DEBUG syncing data to file...
13:31:19.654 [main] DEBUG Data synced to file
13:31:19.662 [main] DEBUG Federate called with federation ID = fedID, and member ID's = [http][sparql].
  Distinct set to false, and readonly set to true.

13:31:19.663 [main] DEBUG Federation repository root node: _:node1drr3l4p4x549
13:31:19.663 [main] DEBUG _:node1drr3l4p4x549 http://www.w3.org/1999/02/22-rdf-syntax-ns#type http://www.openrdf.org/config/repository#Repository
13:31:19.663 [main] DEBUG _:node1drr3l4p4x549 http://www.openrdf.org/config/repository#repositoryID "fedID"
13:31:19.663 [main] DEBUG _:node1drr3l4p4x549 http://www.w3.org/2000/01/rdf-schema#label "Test Federation Title"
13:31:19.663 [main] DEBUG _:node1drr3l4p4x549 http://www.openrdf.org/config/repository#repositoryImpl _:node1drr3l4p4x550
13:31:19.663 [main] DEBUG _:node1drr3l4p4x550 http://www.openrdf.org/config/repository#repositoryType "openrdf:SailRepository"
13:31:19.663 [main] DEBUG _:node1drr3l4p4x550 http://www.openrdf.org/config/repository/sail#sailImpl _:node1drr3l4p4x551
13:31:19.663 [main] DEBUG _:node1drr3l4p4x551 http://www.openrdf.org/config/sail#sailType "openrdf:Federation"
13:31:19.663 [main] DEBUG _:node1drr3l4p4x551 http://www.openrdf.org/config/sail/federation#readOnly "true"^^<http://www.w3.org/2001/XMLSchema#boolean>
13:31:19.663 [main] DEBUG _:node1drr3l4p4x551 http://www.openrdf.org/config/sail/federation#distinct "false"^^<http://www.w3.org/2001/XMLSchema#boolean>
13:31:19.663 [main] DEBUG Adding member: http
13:31:19.663 [main] DEBUG _:node1drr3l4p4x551 http://www.openrdf.org/config/sail/federation#member _:node1drr3l4p4x552
13:31:19.664 [main] DEBUG _:node1drr3l4p4x552 http://www.openrdf.org/config/repository#repositoryType "openrdf:HTTPRepository"
13:31:19.665 [main] DEBUG _:node1drr3l4p4x552 http://www.openrdf.org/config/repository/http#repositoryURL http://localhost:8080/openrdf-sesame/repositories/http
13:31:19.665 [main] DEBUG Added member http: 
13:31:19.665 [main] DEBUG Adding member: sparql
13:31:19.665 [main] DEBUG _:node1drr3l4p4x551 http://www.openrdf.org/config/sail/federation#member _:node1drr3l4p4x555
13:31:19.665 [main] DEBUG _:node1drr3l4p4x555 http://www.openrdf.org/config/repository#repositoryType "openrdf:SPARQLRepository"
13:31:19.666 [main] DEBUG _:node1drr3l4p4x555 http://www.openrdf.org/config/repository/sparql#query-endpoint http://localhost:8080/openrdf-sesame/repositories/sparql
13:31:19.666 [main] DEBUG Added member sparql: 
13:31:19.680 [main] DEBUG Initializing MemoryStore...
13:31:19.681 [main] DEBUG Initializing data file...
13:31:19.682 [main] DEBUG Data file initialized
13:31:19.682 [main] DEBUG MemoryStore initialized
13:31:19.683 [main] DEBUG syncing data to file...
13:31:19.683 [main] DEBUG Data synced to file
13:31:19.686 [main] DEBUG Initializing MemoryStore...
13:31:19.687 [main] DEBUG Initializing data file...
13:31:19.688 [main] DEBUG Data file initialized
13:31:19.688 [main] DEBUG MemoryStore initialized
13:31:19.690 [main] DEBUG syncing data to file...
13:31:19.690 [main] DEBUG Data synced to file
13:31:19.697 [main] DEBUG Federate called with federation ID = fedID, and member ID's = [alien][FreeLunch].
  Distinct set to false, and readonly set to true.

13:31:19.698 [main] ERROR FreeLunch does not exist.
[MockitoHint] FederateTest.testNonexistentMemberPrintsSpecificError (see javadoc for MockitoHint):
[MockitoHint] 1. Unused -> at org.eclipse.rdf4j.console.command.FederateTest.setUp(FederateTest.java:88)

13:31:19.705 [main] DEBUG Initializing MemoryStore...
13:31:19.706 [main] DEBUG Initializing data file...
13:31:19.706 [main] DEBUG Data file initialized
13:31:19.706 [main] DEBUG MemoryStore initialized
13:31:19.708 [main] DEBUG syncing data to file...
13:31:19.708 [main] DEBUG Data synced to file
13:31:19.710 [main] DEBUG Initializing MemoryStore...
13:31:19.711 [main] DEBUG Initializing data file...
13:31:19.711 [main] DEBUG Data file initialized
13:31:19.711 [main] DEBUG MemoryStore initialized
13:31:19.713 [main] DEBUG syncing data to file...
13:31:19.713 [main] DEBUG Data synced to file
13:31:19.722 [main] ERROR Duplicate repository id's specified.
[MockitoHint] FederateTest.testFedSameAsMemberPrintsError (see javadoc for MockitoHint):
[MockitoHint] 1. Unused -> at org.eclipse.rdf4j.console.command.FederateTest.setUp(FederateTest.java:87)
[MockitoHint] 2. Unused -> at org.eclipse.rdf4j.console.command.FederateTest.setUp(FederateTest.java:88)

13:31:19.731 [main] DEBUG Initializing MemoryStore...
13:31:19.732 [main] DEBUG Initializing data file...
13:31:19.732 [main] DEBUG Data file initialized
13:31:19.733 [main] DEBUG MemoryStore initialized
13:31:19.734 [main] DEBUG syncing data to file...
13:31:19.734 [main] DEBUG Data synced to file
13:31:19.737 [main] DEBUG Initializing MemoryStore...
13:31:19.737 [main] DEBUG Initializing data file...
13:31:19.737 [main] DEBUG Data file initialized
13:31:19.738 [main] DEBUG MemoryStore initialized
13:31:19.739 [main] DEBUG syncing data to file...
13:31:19.739 [main] DEBUG Data synced to file
[MockitoHint] FederateTest.testTwoArgumentsPrintsHelp (see javadoc for MockitoHint):
[MockitoHint] 1. Unused -> at org.eclipse.rdf4j.console.command.FederateTest.setUp(FederateTest.java:87)
[MockitoHint] 2. Unused -> at org.eclipse.rdf4j.console.command.FederateTest.setUp(FederateTest.java:88)

13:31:19.752 [main] DEBUG Initializing MemoryStore...
13:31:19.753 [main] DEBUG Initializing data file...
13:31:19.754 [main] DEBUG Data file initialized
13:31:19.754 [main] DEBUG MemoryStore initialized
13:31:19.755 [main] DEBUG syncing data to file...
13:31:19.755 [main] DEBUG Data synced to file
13:31:19.758 [main] DEBUG Initializing MemoryStore...
13:31:19.758 [main] DEBUG Initializing data file...
13:31:19.759 [main] DEBUG Data file initialized
13:31:19.759 [main] DEBUG MemoryStore initialized
13:31:19.760 [main] DEBUG syncing data to file...
13:31:19.760 [main] DEBUG Data synced to file
13:31:19.766 [main] DEBUG Federate called with federation ID = fedID, and member ID's = [alien][scary].
  Distinct set to false, and readonly set to true.

13:31:19.767 [main] DEBUG Federation repository root node: _:node1drr3l4p4x692
13:31:19.767 [main] DEBUG _:node1drr3l4p4x692 http://www.w3.org/1999/02/22-rdf-syntax-ns#type http://www.openrdf.org/config/repository#Repository
13:31:19.767 [main] DEBUG _:node1drr3l4p4x692 http://www.openrdf.org/config/repository#repositoryID "fedID"
13:31:19.767 [main] DEBUG _:node1drr3l4p4x692 http://www.w3.org/2000/01/rdf-schema#label "Test Federation Title"
13:31:19.767 [main] DEBUG _:node1drr3l4p4x692 http://www.openrdf.org/config/repository#repositoryImpl _:node1drr3l4p4x693
13:31:19.767 [main] DEBUG _:node1drr3l4p4x693 http://www.openrdf.org/config/repository#repositoryType "openrdf:SailRepository"
13:31:19.767 [main] DEBUG _:node1drr3l4p4x693 http://www.openrdf.org/config/repository/sail#sailImpl _:node1drr3l4p4x694
13:31:19.767 [main] DEBUG _:node1drr3l4p4x694 http://www.openrdf.org/config/sail#sailType "openrdf:Federation"
13:31:19.767 [main] DEBUG _:node1drr3l4p4x694 http://www.openrdf.org/config/sail/federation#readOnly "true"^^<http://www.w3.org/2001/XMLSchema#boolean>
13:31:19.767 [main] DEBUG _:node1drr3l4p4x694 http://www.openrdf.org/config/sail/federation#distinct "false"^^<http://www.w3.org/2001/XMLSchema#boolean>
13:31:19.767 [main] DEBUG Adding member: alien
13:31:19.767 [main] DEBUG _:node1drr3l4p4x694 http://www.openrdf.org/config/sail/federation#member _:node1drr3l4p4x695
13:31:19.768 [main] DEBUG _:node1drr3l4p4x695 http://www.openrdf.org/config/repository#repositoryType "openrdf:ProxyRepository"
13:31:19.768 [main] DEBUG _:node1drr3l4p4x695 http://www.openrdf.org/config/repository/proxy#proxiedID "alien"
13:31:19.768 [main] DEBUG Added member alien: 
13:31:19.768 [main] DEBUG Adding member: scary
13:31:19.768 [main] DEBUG _:node1drr3l4p4x694 http://www.openrdf.org/config/sail/federation#member _:node1drr3l4p4x698
13:31:19.769 [main] DEBUG _:node1drr3l4p4x698 http://www.openrdf.org/config/repository#repositoryType "openrdf:ProxyRepository"
13:31:19.769 [main] DEBUG _:node1drr3l4p4x698 http://www.openrdf.org/config/repository/proxy#proxiedID "scary"
13:31:19.769 [main] DEBUG Added member scary: 
13:31:19.788 [main] DEBUG Initializing MemoryStore...
13:31:19.789 [main] DEBUG Initializing data file...
13:31:19.790 [main] DEBUG Data file initialized
13:31:19.790 [main] DEBUG MemoryStore initialized
13:31:19.791 [main] DEBUG syncing data to file...
13:31:19.792 [main] DEBUG Data synced to file
13:31:19.795 [main] DEBUG Initializing MemoryStore...
13:31:19.796 [main] DEBUG Initializing data file...
13:31:19.796 [main] DEBUG Data file initialized
13:31:19.796 [main] DEBUG MemoryStore initialized
13:31:19.797 [main] DEBUG syncing data to file...
13:31:19.798 [main] DEBUG Data synced to file
[MockitoHint] FederateTest.testOneArgumentPrintsHelp (see javadoc for MockitoHint):
[MockitoHint] 1. Unused -> at org.eclipse.rdf4j.console.command.FederateTest.setUp(FederateTest.java:87)
[MockitoHint] 2. Unused -> at org.eclipse.rdf4j.console.command.FederateTest.setUp(FederateTest.java:88)

13:31:19.811 [main] DEBUG Initializing MemoryStore...
13:31:19.811 [main] DEBUG Initializing data file...
13:31:19.812 [main] DEBUG Data file initialized
13:31:19.812 [main] DEBUG MemoryStore initialized
13:31:19.813 [main] DEBUG syncing data to file...
13:31:19.813 [main] DEBUG Data synced to file
13:31:19.815 [main] DEBUG Initializing MemoryStore...
13:31:19.815 [main] DEBUG Initializing data file...
13:31:19.815 [main] DEBUG Data file initialized
13:31:19.815 [main] DEBUG MemoryStore initialized
13:31:19.816 [main] DEBUG syncing data to file...
13:31:19.817 [main] DEBUG Data synced to file
13:31:19.822 [main] DEBUG Federate called with federation ID = fedID, and member ID's = [http][http2].
  Distinct set to false, and readonly set to true.

13:31:19.823 [main] DEBUG Federation repository root node: _:node1drr3l4p4x784
13:31:19.823 [main] DEBUG _:node1drr3l4p4x784 http://www.w3.org/1999/02/22-rdf-syntax-ns#type http://www.openrdf.org/config/repository#Repository
13:31:19.823 [main] DEBUG _:node1drr3l4p4x784 http://www.openrdf.org/config/repository#repositoryID "fedID"
13:31:19.823 [main] DEBUG _:node1drr3l4p4x784 http://www.w3.org/2000/01/rdf-schema#label "Test Federation Title"
13:31:19.823 [main] DEBUG _:node1drr3l4p4x784 http://www.openrdf.org/config/repository#repositoryImpl _:node1drr3l4p4x785
13:31:19.823 [main] DEBUG _:node1drr3l4p4x785 http://www.openrdf.org/config/repository#repositoryType "openrdf:SailRepository"
13:31:19.823 [main] DEBUG _:node1drr3l4p4x785 http://www.openrdf.org/config/repository/sail#sailImpl _:node1drr3l4p4x786
13:31:19.823 [main] DEBUG _:node1drr3l4p4x786 http://www.openrdf.org/config/sail#sailType "openrdf:Federation"
13:31:19.823 [main] DEBUG _:node1drr3l4p4x786 http://www.openrdf.org/config/sail/federation#readOnly "true"^^<http://www.w3.org/2001/XMLSchema#boolean>
13:31:19.823 [main] DEBUG _:node1drr3l4p4x786 http://www.openrdf.org/config/sail/federation#distinct "false"^^<http://www.w3.org/2001/XMLSchema#boolean>
13:31:19.823 [main] DEBUG Adding member: http
13:31:19.823 [main] DEBUG _:node1drr3l4p4x786 http://www.openrdf.org/config/sail/federation#member _:node1drr3l4p4x787
13:31:19.823 [main] DEBUG _:node1drr3l4p4x787 http://www.openrdf.org/config/repository#repositoryType "openrdf:HTTPRepository"
13:31:19.824 [main] DEBUG _:node1drr3l4p4x787 http://www.openrdf.org/config/repository/http#repositoryURL http://localhost:8080/openrdf-sesame/repositories/http
13:31:19.824 [main] DEBUG Added member http: 
13:31:19.824 [main] DEBUG Adding member: http2
13:31:19.824 [main] DEBUG _:node1drr3l4p4x786 http://www.openrdf.org/config/sail/federation#member _:node1drr3l4p4x790
13:31:19.824 [main] DEBUG _:node1drr3l4p4x790 http://www.openrdf.org/config/repository#repositoryType "openrdf:HTTPRepository"
13:31:19.824 [main] DEBUG _:node1drr3l4p4x790 http://www.openrdf.org/config/repository/http#repositoryURL http://localhost:8080/openrdf-sesame/repositories/http
13:31:19.824 [main] DEBUG Added member http2: 
[INFO] Tests run: 15, Failures: 0, Errors: 0, Skipped: 0, Time elapsed: 0.486 s - in org.eclipse.rdf4j.console.command.FederateTest
[INFO] Running org.eclipse.rdf4j.console.command.SparqlTest
[MockitoHint] SparqlTest.testInputFile (see javadoc for MockitoHint):
[MockitoHint] 1. Unused -> at org.eclipse.rdf4j.console.command.SparqlTest.setUp(SparqlTest.java:49)

13:31:19.864 [main] ERROR No suitable result writer found
[MockitoHint] SparqlTest.testSelectError (see javadoc for MockitoHint):
[MockitoHint] 1. Unused -> at org.eclipse.rdf4j.console.command.SparqlTest.setUp(SparqlTest.java:49)

[MockitoHint] SparqlTest.testSelectMissingBindings (see javadoc for MockitoHint):
[MockitoHint] 1. Unused -> at org.eclipse.rdf4j.console.command.SparqlTest.setUp(SparqlTest.java:49)

[MockitoHint] SparqlTest.testInputFileWorkdir (see javadoc for MockitoHint):
[MockitoHint] 1. Unused -> at org.eclipse.rdf4j.console.command.SparqlTest.setUp(SparqlTest.java:49)

[INFO] Tests run: 9, Failures: 0, Errors: 0, Skipped: 0, Time elapsed: 0.126 s - in org.eclipse.rdf4j.console.command.SparqlTest
[INFO] Running org.eclipse.rdf4j.console.UtilTest
 one, two
 three
 four
 five, six
 seven
 eight
[INFO] Tests run: 4, Failures: 0, Errors: 0, Skipped: 0, Time elapsed: 0.001 s - in org.eclipse.rdf4j.console.UtilTest
[INFO] Running org.eclipse.rdf4j.console.ConsoleIOTest
[INFO] Tests run: 3, Failures: 0, Errors: 0, Skipped: 0, Time elapsed: 0.035 s - in org.eclipse.rdf4j.console.ConsoleIOTest
[INFO] 
[INFO] Results:
[INFO] 
[INFO] Tests run: 64, Failures: 0, Errors: 0, Skipped: 0
[INFO] 
[JENKINS] Recording test results
[INFO] 
[INFO] --- animal-sniffer-maven-plugin:1.16:check (default) @ rdf4j-console ---
[INFO] Checking unresolved references to org.codehaus.mojo.signature:java18:1.0
[INFO] 
[INFO] --- maven-jar-plugin:2.3.1:jar (default-jar) @ rdf4j-console ---
[INFO] Building jar: /home/hudson/genie.rdf4j/.jenkins/jobs/rdf4j-pr-verify/workspace/tools/console/target/rdf4j-console-3.1.0-SNAPSHOT.jar