SuccessConsole Output

Started calculate disk usage of build
Finished Calculation of disk usage of build in 0 seconds
Started calculate disk usage of workspace
Finished Calculation of disk usage of workspace in 0 seconds
[INFO] 
[INFO] ------------------< org.eclipse.rdf4j:rdf4j-console >-------------------
[INFO] Building RDF4J: Console 3.1.0-SNAPSHOT                           [70/85]
[INFO] --------------------------------[ jar ]---------------------------------
[INFO] 
[INFO] --- buildnumber-maven-plugin:1.4:create (default) @ rdf4j-console ---
[INFO] ShortRevision tag detected. The value is '7'.
[INFO] Executing: /bin/sh -c cd '/home/hudson/genie.rdf4j/.jenkins/jobs/rdf4j-pr-verify/workspace/tools/console' && 'git' 'rev-parse' '--verify' '--short=7' 'HEAD'
[INFO] Working directory: /home/hudson/genie.rdf4j/.jenkins/jobs/rdf4j-pr-verify/workspace/tools/console
[INFO] Storing buildNumber: 95d5a4b at timestamp: 1576083466858
[WARNING] Cannot get the branch information from the git repository: 
Detecting the current branch failed: fatal: ref HEAD is not a symbolic ref

[INFO] ShortRevision tag detected. The value is '7'.
[INFO] Executing: /bin/sh -c cd '/home/hudson/genie.rdf4j/.jenkins/jobs/rdf4j-pr-verify/workspace/tools/console' && 'git' 'rev-parse' '--verify' '--short=7' 'HEAD'
[INFO] Working directory: /home/hudson/genie.rdf4j/.jenkins/jobs/rdf4j-pr-verify/workspace/tools/console
[INFO] Storing buildScmBranch: UNKNOWN
[INFO] 
[INFO] --- maven-enforcer-plugin:1.4.1:enforce (enforce-bytecode-version) @ rdf4j-console ---
[INFO] Adding ignore: META-INF/**/module-info
[INFO] 
[INFO] --- formatter-maven-plugin:2.8.1:validate (default) @ rdf4j-console ---
[INFO] Using 'UTF-8' encoding to format source files.
[INFO] Number of files to be formatted: 61
[INFO] Html formatting is skipped
[INFO] Successfully formatted:          0 file(s)
[INFO] Fail to format:                  0 file(s)
[INFO] Skipped:                         61 file(s)
[INFO] Read only skipped:               0 file(s)
[INFO] Approximate time taken:          0s
[INFO] 
[INFO] --- maven-resources-plugin:3.0.2:resources (default-resources) @ rdf4j-console ---
[INFO] Using 'UTF-8' encoding to copy filtered resources.
[INFO] skip non existing resourceDirectory /home/hudson/genie.rdf4j/.jenkins/jobs/rdf4j-pr-verify/workspace/tools/console/src/main/resources
[INFO] 
[INFO] --- maven-compiler-plugin:3.7.0:compile (default-compile) @ rdf4j-console ---
[INFO] Changes detected - recompiling the module!
[INFO] Compiling 42 source files to /home/hudson/genie.rdf4j/.jenkins/jobs/rdf4j-pr-verify/workspace/tools/console/target/classes
[INFO] 
[INFO] --- maven-resources-plugin:3.0.2:testResources (default-testResources) @ rdf4j-console ---
[INFO] Using 'UTF-8' encoding to copy filtered resources.
[INFO] Copying 29 resources
[INFO] 
[INFO] --- maven-compiler-plugin:3.7.0:testCompile (default-testCompile) @ rdf4j-console ---
[INFO] Changes detected - recompiling the module!
[INFO] Compiling 18 source files to /home/hudson/genie.rdf4j/.jenkins/jobs/rdf4j-pr-verify/workspace/tools/console/target/test-classes
[INFO] 
[INFO] --- maven-surefire-plugin:2.22.2:test (default-test) @ rdf4j-console ---
[INFO] 
[INFO] -------------------------------------------------------
[INFO]  T E S T S
[INFO] -------------------------------------------------------
[INFO] Running org.eclipse.rdf4j.console.setting.PrefixesTest
[INFO] Tests run: 3, Failures: 0, Errors: 0, Skipped: 0, Time elapsed: 0.585 s - in org.eclipse.rdf4j.console.setting.PrefixesTest
[INFO] Running org.eclipse.rdf4j.console.setting.LogLevelTest
11:57:51.464 [main] ERROR unknown logging level: chatty
[INFO] Tests run: 4, Failures: 0, Errors: 0, Skipped: 0, Time elapsed: 0.012 s - in org.eclipse.rdf4j.console.setting.LogLevelTest
[INFO] Running org.eclipse.rdf4j.console.setting.QueryPrefixTest
[INFO] Tests run: 1, Failures: 0, Errors: 0, Skipped: 0, Time elapsed: 0 s - in org.eclipse.rdf4j.console.setting.QueryPrefixTest
[INFO] Running org.eclipse.rdf4j.console.setting.ShowPrefixTest
[INFO] Tests run: 1, Failures: 0, Errors: 0, Skipped: 0, Time elapsed: 0 s - in org.eclipse.rdf4j.console.setting.ShowPrefixTest
[INFO] Running org.eclipse.rdf4j.console.setting.ConsoleWidthTest
[INFO] Tests run: 1, Failures: 0, Errors: 0, Skipped: 0, Time elapsed: 0 s - in org.eclipse.rdf4j.console.setting.ConsoleWidthTest
[INFO] Running org.eclipse.rdf4j.console.command.SetParametersTest
11:57:51.494 [main] ERROR Unknown parameter: unknown
[INFO] Tests run: 1, Failures: 0, Errors: 0, Skipped: 0, Time elapsed: 0.019 s - in org.eclipse.rdf4j.console.command.SetParametersTest
[INFO] Running org.eclipse.rdf4j.console.command.LoadTest
[MockitoHint] LoadTest.testLoad (see javadoc for MockitoHint):
[MockitoHint] 1. Unused -> at org.eclipse.rdf4j.console.command.LoadTest.setUp(LoadTest.java:49)

[MockitoHint] LoadTest.testLoadWorkDir (see javadoc for MockitoHint):
[MockitoHint] 1. Unused -> at org.eclipse.rdf4j.console.command.LoadTest.setUp(LoadTest.java:49)

[INFO] Tests run: 2, Failures: 0, Errors: 0, Skipped: 0, Time elapsed: 0.169 s - in org.eclipse.rdf4j.console.command.LoadTest
[INFO] Running org.eclipse.rdf4j.console.command.ConvertTest
11:57:51.892 [main] ERROR No RDF writer for /tmp/genie.rdf4j/junit9188390719873599402/alien.qyx
[MockitoHint] ConvertTest.testConvertInvalidFormat (see javadoc for MockitoHint):
[MockitoHint] 1. Unused -> at org.eclipse.rdf4j.console.command.ConvertTest.setup(ConvertTest.java:39)

11:57:51.898 [main] ERROR Failed to convert data
org.eclipse.rdf4j.rio.RDFParseException: Expected '<' or '_', found: e [line 1, column 101]
	at org.eclipse.rdf4j.rio.ntriples.NTriplesParser.parseSubject(NTriplesParser.java:313)
	at org.eclipse.rdf4j.rio.ntriples.NTriplesParser.parseTriple(NTriplesParser.java:252)
	at org.eclipse.rdf4j.rio.ntriples.NTriplesParser.parse(NTriplesParser.java:160)
	at org.eclipse.rdf4j.rio.ntriples.NTriplesParser.parse(NTriplesParser.java:109)
	at org.eclipse.rdf4j.console.command.Convert.convert(Convert.java:139)
	at org.eclipse.rdf4j.console.command.Convert.execute(Convert.java:74)
	at org.eclipse.rdf4j.console.command.ConvertTest.testConvertParseError(ConvertTest.java:92)
	at sun.reflect.NativeMethodAccessorImpl.invoke0(Native Method)
	at sun.reflect.NativeMethodAccessorImpl.invoke(NativeMethodAccessorImpl.java:62)
	at sun.reflect.DelegatingMethodAccessorImpl.invoke(DelegatingMethodAccessorImpl.java:43)
	at java.lang.reflect.Method.invoke(Method.java:498)
	at org.junit.runners.model.FrameworkMethod$1.runReflectiveCall(FrameworkMethod.java:50)
	at org.junit.internal.runners.model.ReflectiveCallable.run(ReflectiveCallable.java:12)
	at org.junit.runners.model.FrameworkMethod.invokeExplosively(FrameworkMethod.java:47)
	at org.junit.internal.runners.statements.InvokeMethod.evaluate(InvokeMethod.java:17)
	at org.junit.internal.runners.statements.RunBefores.evaluate(RunBefores.java:26)
	at org.junit.internal.runners.statements.RunAfters.evaluate(RunAfters.java:27)
	at org.mockito.internal.junit.JUnitRule$1.evaluateSafely(JUnitRule.java:52)
	at org.mockito.internal.junit.JUnitRule$1.evaluate(JUnitRule.java:43)
	at org.junit.rules.ExternalResource$1.evaluate(ExternalResource.java:48)
	at org.junit.rules.RunRules.evaluate(RunRules.java:20)
	at org.junit.runners.ParentRunner.runLeaf(ParentRunner.java:325)
	at org.junit.runners.BlockJUnit4ClassRunner.runChild(BlockJUnit4ClassRunner.java:78)
	at org.junit.runners.BlockJUnit4ClassRunner.runChild(BlockJUnit4ClassRunner.java:57)
	at org.junit.runners.ParentRunner$3.run(ParentRunner.java:290)
	at org.junit.runners.ParentRunner$1.schedule(ParentRunner.java:71)
	at org.junit.runners.ParentRunner.runChildren(ParentRunner.java:288)
	at org.junit.runners.ParentRunner.access$000(ParentRunner.java:58)
	at org.junit.runners.ParentRunner$2.evaluate(ParentRunner.java:268)
	at org.junit.runners.ParentRunner.run(ParentRunner.java:363)
	at org.apache.maven.surefire.junit4.JUnit4Provider.execute(JUnit4Provider.java:365)
	at org.apache.maven.surefire.junit4.JUnit4Provider.executeWithRerun(JUnit4Provider.java:273)
	at org.apache.maven.surefire.junit4.JUnit4Provider.executeTestSet(JUnit4Provider.java:238)
	at org.apache.maven.surefire.junit4.JUnit4Provider.invoke(JUnit4Provider.java:159)
	at org.apache.maven.surefire.booter.ForkedBooter.invokeProviderInSameClassLoader(ForkedBooter.java:384)
	at org.apache.maven.surefire.booter.ForkedBooter.runSuitesInProcess(ForkedBooter.java:345)
	at org.apache.maven.surefire.booter.ForkedBooter.execute(ForkedBooter.java:126)
	at org.apache.maven.surefire.booter.ForkedBooter.main(ForkedBooter.java:418)
[INFO] Tests run: 4, Failures: 0, Errors: 0, Skipped: 0, Time elapsed: 0.228 s - in org.eclipse.rdf4j.console.command.ConvertTest
[INFO] Running org.eclipse.rdf4j.console.command.ExportTest
[MockitoHint] ExportTest.testExportWorkDir (see javadoc for MockitoHint):
[MockitoHint] 1. Unused -> at org.eclipse.rdf4j.console.command.ExportTest.setUp(ExportTest.java:46)

[MockitoHint] ExportTest.testExportAll (see javadoc for MockitoHint):
[MockitoHint] 1. Unused -> at org.eclipse.rdf4j.console.command.ExportTest.setUp(ExportTest.java:46)

[MockitoHint] ExportTest.testExportContexts (see javadoc for MockitoHint):
[MockitoHint] 1. Unused -> at org.eclipse.rdf4j.console.command.ExportTest.setUp(ExportTest.java:46)

[INFO] Tests run: 3, Failures: 0, Errors: 0, Skipped: 0, Time elapsed: 0.045 s - in org.eclipse.rdf4j.console.command.ExportTest
[INFO] Running org.eclipse.rdf4j.console.command.VerifyTest
11:57:52.278 [main] ERROR Unexpected RDFParseException
org.eclipse.rdf4j.rio.RDFParseException: 'missing type' was not recognised, and could not be verified, with datatype http://example.rdf4j.org/type/wrong [line 1]
	at org.eclipse.rdf4j.rio.helpers.RDFParserHelper.reportError(RDFParserHelper.java:265)
	at org.eclipse.rdf4j.rio.helpers.RDFParserHelper.createLiteral(RDFParserHelper.java:180)
	at org.eclipse.rdf4j.rio.helpers.AbstractRDFParser.createLiteral(AbstractRDFParser.java:530)
	at org.eclipse.rdf4j.rio.turtle.TurtleParser.parseQuotedLiteral(TurtleParser.java:665)
	at org.eclipse.rdf4j.rio.turtle.TurtleParser.parseValue(TurtleParser.java:584)
	at org.eclipse.rdf4j.rio.turtle.TurtleParser.parseObject(TurtleParser.java:461)
	at org.eclipse.rdf4j.rio.turtle.TurtleParser.parseObjectList(TurtleParser.java:389)
	at org.eclipse.rdf4j.rio.turtle.TurtleParser.parsePredicateObjectList(TurtleParser.java:362)
	at org.eclipse.rdf4j.rio.turtle.TurtleParser.parseTriples(TurtleParser.java:349)
	at org.eclipse.rdf4j.rio.turtle.TurtleParser.parseStatement(TurtleParser.java:216)
	at org.eclipse.rdf4j.rio.turtle.TurtleParser.parse(TurtleParser.java:178)
	at org.eclipse.rdf4j.rio.turtle.TurtleParser.parse(TurtleParser.java:130)
	at org.eclipse.rdf4j.console.command.Verify.verify(Verify.java:145)
	at org.eclipse.rdf4j.console.command.Verify.execute(Verify.java:97)
	at org.eclipse.rdf4j.console.command.VerifyTest.testVerifyMissingType(VerifyTest.java:97)
	at sun.reflect.NativeMethodAccessorImpl.invoke0(Native Method)
	at sun.reflect.NativeMethodAccessorImpl.invoke(NativeMethodAccessorImpl.java:62)
	at sun.reflect.DelegatingMethodAccessorImpl.invoke(DelegatingMethodAccessorImpl.java:43)
	at java.lang.reflect.Method.invoke(Method.java:498)
	at org.junit.runners.model.FrameworkMethod$1.runReflectiveCall(FrameworkMethod.java:50)
	at org.junit.internal.runners.model.ReflectiveCallable.run(ReflectiveCallable.java:12)
	at org.junit.runners.model.FrameworkMethod.invokeExplosively(FrameworkMethod.java:47)
	at org.junit.internal.runners.statements.InvokeMethod.evaluate(InvokeMethod.java:17)
	at org.junit.internal.runners.statements.RunBefores.evaluate(RunBefores.java:26)
	at org.junit.internal.runners.statements.RunAfters.evaluate(RunAfters.java:27)
	at org.mockito.internal.junit.JUnitRule$1.evaluateSafely(JUnitRule.java:52)
	at org.mockito.internal.junit.JUnitRule$1.evaluate(JUnitRule.java:43)
	at org.junit.rules.ExternalResource$1.evaluate(ExternalResource.java:48)
	at org.junit.rules.RunRules.evaluate(RunRules.java:20)
	at org.junit.runners.ParentRunner.runLeaf(ParentRunner.java:325)
	at org.junit.runners.BlockJUnit4ClassRunner.runChild(BlockJUnit4ClassRunner.java:78)
	at org.junit.runners.BlockJUnit4ClassRunner.runChild(BlockJUnit4ClassRunner.java:57)
	at org.junit.runners.ParentRunner$3.run(ParentRunner.java:290)
	at org.junit.runners.ParentRunner$1.schedule(ParentRunner.java:71)
	at org.junit.runners.ParentRunner.runChildren(ParentRunner.java:288)
	at org.junit.runners.ParentRunner.access$000(ParentRunner.java:58)
	at org.junit.runners.ParentRunner$2.evaluate(ParentRunner.java:268)
	at org.junit.runners.ParentRunner.run(ParentRunner.java:363)
	at org.apache.maven.surefire.junit4.JUnit4Provider.execute(JUnit4Provider.java:365)
	at org.apache.maven.surefire.junit4.JUnit4Provider.executeWithRerun(JUnit4Provider.java:273)
	at org.apache.maven.surefire.junit4.JUnit4Provider.executeTestSet(JUnit4Provider.java:238)
	at org.apache.maven.surefire.junit4.JUnit4Provider.invoke(JUnit4Provider.java:159)
	at org.apache.maven.surefire.booter.ForkedBooter.invokeProviderInSameClassLoader(ForkedBooter.java:384)
	at org.apache.maven.surefire.booter.ForkedBooter.runSuitesInProcess(ForkedBooter.java:345)
	at org.apache.maven.surefire.booter.ForkedBooter.execute(ForkedBooter.java:126)
	at org.apache.maven.surefire.booter.ForkedBooter.main(ForkedBooter.java:418)
11:57:52.352 [main] ERROR SHACL validation failed, writing report to /tmp/genie.rdf4j/junit5900431564890837536/junit3891544709955917294.tmp
11:57:52.364 [main] ERROR Unexpected RDFParseException
org.eclipse.rdf4j.rio.RDFParseException: Unexpected end of file
	at org.eclipse.rdf4j.rio.turtle.TurtleParser.throwEOFException(TurtleParser.java:1317)
	at org.eclipse.rdf4j.rio.turtle.TurtleParser.parseValue(TurtleParser.java:589)
	at org.eclipse.rdf4j.rio.turtle.TurtleParser.parsePredicate(TurtleParser.java:434)
	at org.eclipse.rdf4j.rio.turtle.TurtleParser.parsePredicateObjectList(TurtleParser.java:358)
	at org.eclipse.rdf4j.rio.turtle.TurtleParser.parseTriples(TurtleParser.java:349)
	at org.eclipse.rdf4j.rio.turtle.TurtleParser.parseStatement(TurtleParser.java:216)
	at org.eclipse.rdf4j.rio.turtle.TurtleParser.parse(TurtleParser.java:178)
	at org.eclipse.rdf4j.rio.turtle.TurtleParser.parse(TurtleParser.java:130)
	at org.eclipse.rdf4j.console.command.Verify.verify(Verify.java:145)
	at org.eclipse.rdf4j.console.command.Verify.execute(Verify.java:97)
	at org.eclipse.rdf4j.console.command.VerifyTest.testVerifyBrokenFile(VerifyTest.java:91)
	at sun.reflect.NativeMethodAccessorImpl.invoke0(Native Method)
	at sun.reflect.NativeMethodAccessorImpl.invoke(NativeMethodAccessorImpl.java:62)
	at sun.reflect.DelegatingMethodAccessorImpl.invoke(DelegatingMethodAccessorImpl.java:43)
	at java.lang.reflect.Method.invoke(Method.java:498)
	at org.junit.runners.model.FrameworkMethod$1.runReflectiveCall(FrameworkMethod.java:50)
	at org.junit.internal.runners.model.ReflectiveCallable.run(ReflectiveCallable.java:12)
	at org.junit.runners.model.FrameworkMethod.invokeExplosively(FrameworkMethod.java:47)
	at org.junit.internal.runners.statements.InvokeMethod.evaluate(InvokeMethod.java:17)
	at org.junit.internal.runners.statements.RunBefores.evaluate(RunBefores.java:26)
	at org.junit.internal.runners.statements.RunAfters.evaluate(RunAfters.java:27)
	at org.mockito.internal.junit.JUnitRule$1.evaluateSafely(JUnitRule.java:52)
	at org.mockito.internal.junit.JUnitRule$1.evaluate(JUnitRule.java:43)
	at org.junit.rules.ExternalResource$1.evaluate(ExternalResource.java:48)
	at org.junit.rules.RunRules.evaluate(RunRules.java:20)
	at org.junit.runners.ParentRunner.runLeaf(ParentRunner.java:325)
	at org.junit.runners.BlockJUnit4ClassRunner.runChild(BlockJUnit4ClassRunner.java:78)
	at org.junit.runners.BlockJUnit4ClassRunner.runChild(BlockJUnit4ClassRunner.java:57)
	at org.junit.runners.ParentRunner$3.run(ParentRunner.java:290)
	at org.junit.runners.ParentRunner$1.schedule(ParentRunner.java:71)
	at org.junit.runners.ParentRunner.runChildren(ParentRunner.java:288)
	at org.junit.runners.ParentRunner.access$000(ParentRunner.java:58)
	at org.junit.runners.ParentRunner$2.evaluate(ParentRunner.java:268)
	at org.junit.runners.ParentRunner.run(ParentRunner.java:363)
	at org.apache.maven.surefire.junit4.JUnit4Provider.execute(JUnit4Provider.java:365)
	at org.apache.maven.surefire.junit4.JUnit4Provider.executeWithRerun(JUnit4Provider.java:273)
	at org.apache.maven.surefire.junit4.JUnit4Provider.executeTestSet(JUnit4Provider.java:238)
	at org.apache.maven.surefire.junit4.JUnit4Provider.invoke(JUnit4Provider.java:159)
	at org.apache.maven.surefire.booter.ForkedBooter.invokeProviderInSameClassLoader(ForkedBooter.java:384)
	at org.apache.maven.surefire.booter.ForkedBooter.runSuitesInProcess(ForkedBooter.java:345)
	at org.apache.maven.surefire.booter.ForkedBooter.execute(ForkedBooter.java:126)
	at org.apache.maven.surefire.booter.ForkedBooter.main(ForkedBooter.java:418)
11:57:52.374 [main] ERROR Unexpected RDFParseException
org.eclipse.rdf4j.rio.RDFParseException: Expected a letter, found '1' [line 1]
	at org.eclipse.rdf4j.rio.helpers.RDFParserHelper.reportError(RDFParserHelper.java:265)
	at org.eclipse.rdf4j.rio.helpers.AbstractRDFParser.reportError(AbstractRDFParser.java:628)
	at org.eclipse.rdf4j.rio.turtle.TurtleParser.reportError(TurtleParser.java:1297)
	at org.eclipse.rdf4j.rio.turtle.TurtleParser.parseQuotedLiteral(TurtleParser.java:619)
	at org.eclipse.rdf4j.rio.turtle.TurtleParser.parseValue(TurtleParser.java:584)
	at org.eclipse.rdf4j.rio.turtle.TurtleParser.parseObject(TurtleParser.java:461)
	at org.eclipse.rdf4j.rio.turtle.TurtleParser.parseObjectList(TurtleParser.java:389)
	at org.eclipse.rdf4j.rio.turtle.TurtleParser.parsePredicateObjectList(TurtleParser.java:362)
	at org.eclipse.rdf4j.rio.turtle.TurtleParser.parseTriples(TurtleParser.java:349)
	at org.eclipse.rdf4j.rio.turtle.TurtleParser.parseStatement(TurtleParser.java:216)
	at org.eclipse.rdf4j.rio.turtle.TurtleParser.parse(TurtleParser.java:178)
	at org.eclipse.rdf4j.rio.turtle.TurtleParser.parse(TurtleParser.java:130)
	at org.eclipse.rdf4j.console.command.Verify.verify(Verify.java:145)
	at org.eclipse.rdf4j.console.command.Verify.execute(Verify.java:97)
	at org.eclipse.rdf4j.console.command.VerifyTest.testVerifyWrongLang(VerifyTest.java:109)
	at sun.reflect.NativeMethodAccessorImpl.invoke0(Native Method)
	at sun.reflect.NativeMethodAccessorImpl.invoke(NativeMethodAccessorImpl.java:62)
	at sun.reflect.DelegatingMethodAccessorImpl.invoke(DelegatingMethodAccessorImpl.java:43)
	at java.lang.reflect.Method.invoke(Method.java:498)
	at org.junit.runners.model.FrameworkMethod$1.runReflectiveCall(FrameworkMethod.java:50)
	at org.junit.internal.runners.model.ReflectiveCallable.run(ReflectiveCallable.java:12)
	at org.junit.runners.model.FrameworkMethod.invokeExplosively(FrameworkMethod.java:47)
	at org.junit.internal.runners.statements.InvokeMethod.evaluate(InvokeMethod.java:17)
	at org.junit.internal.runners.statements.RunBefores.evaluate(RunBefores.java:26)
	at org.junit.internal.runners.statements.RunAfters.evaluate(RunAfters.java:27)
	at org.mockito.internal.junit.JUnitRule$1.evaluateSafely(JUnitRule.java:52)
	at org.mockito.internal.junit.JUnitRule$1.evaluate(JUnitRule.java:43)
	at org.junit.rules.ExternalResource$1.evaluate(ExternalResource.java:48)
	at org.junit.rules.RunRules.evaluate(RunRules.java:20)
	at org.junit.runners.ParentRunner.runLeaf(ParentRunner.java:325)
	at org.junit.runners.BlockJUnit4ClassRunner.runChild(BlockJUnit4ClassRunner.java:78)
	at org.junit.runners.BlockJUnit4ClassRunner.runChild(BlockJUnit4ClassRunner.java:57)
	at org.junit.runners.ParentRunner$3.run(ParentRunner.java:290)
	at org.junit.runners.ParentRunner$1.schedule(ParentRunner.java:71)
	at org.junit.runners.ParentRunner.runChildren(ParentRunner.java:288)
	at org.junit.runners.ParentRunner.access$000(ParentRunner.java:58)
	at org.junit.runners.ParentRunner$2.evaluate(ParentRunner.java:268)
	at org.junit.runners.ParentRunner.run(ParentRunner.java:363)
	at org.apache.maven.surefire.junit4.JUnit4Provider.execute(JUnit4Provider.java:365)
	at org.apache.maven.surefire.junit4.JUnit4Provider.executeWithRerun(JUnit4Provider.java:273)
	at org.apache.maven.surefire.junit4.JUnit4Provider.executeTestSet(JUnit4Provider.java:238)
	at org.apache.maven.surefire.junit4.JUnit4Provider.invoke(JUnit4Provider.java:159)
	at org.apache.maven.surefire.booter.ForkedBooter.invokeProviderInSameClassLoader(ForkedBooter.java:384)
	at org.apache.maven.surefire.booter.ForkedBooter.runSuitesInProcess(ForkedBooter.java:345)
	at org.apache.maven.surefire.booter.ForkedBooter.execute(ForkedBooter.java:126)
	at org.apache.maven.surefire.booter.ForkedBooter.main(ForkedBooter.java:418)
11:57:52.385 [main] ERROR No parser available for this RDF format
org.eclipse.rdf4j.rio.UnsupportedRDFormatException: Did not recognise RDF format string file:/home/hudson/genie.rdf4j/.jenkins/jobs/rdf4j-pr-verify/workspace/tools/console/does-not-exist.docx
	at org.eclipse.rdf4j.rio.Rio.lambda$unsupportedFormat$1(Rio.java:577)
	at java.util.Optional.orElseThrow(Optional.java:290)
	at org.eclipse.rdf4j.console.command.Verify.verify(Verify.java:124)
	at org.eclipse.rdf4j.console.command.Verify.execute(Verify.java:97)
	at org.eclipse.rdf4j.console.command.VerifyTest.testVerifyWrongFormat(VerifyTest.java:69)
	at sun.reflect.NativeMethodAccessorImpl.invoke0(Native Method)
	at sun.reflect.NativeMethodAccessorImpl.invoke(NativeMethodAccessorImpl.java:62)
	at sun.reflect.DelegatingMethodAccessorImpl.invoke(DelegatingMethodAccessorImpl.java:43)
	at java.lang.reflect.Method.invoke(Method.java:498)
	at org.junit.runners.model.FrameworkMethod$1.runReflectiveCall(FrameworkMethod.java:50)
	at org.junit.internal.runners.model.ReflectiveCallable.run(ReflectiveCallable.java:12)
	at org.junit.runners.model.FrameworkMethod.invokeExplosively(FrameworkMethod.java:47)
	at org.junit.internal.runners.statements.InvokeMethod.evaluate(InvokeMethod.java:17)
	at org.junit.internal.runners.statements.RunBefores.evaluate(RunBefores.java:26)
	at org.junit.internal.runners.statements.RunAfters.evaluate(RunAfters.java:27)
	at org.mockito.internal.junit.JUnitRule$1.evaluateSafely(JUnitRule.java:52)
	at org.mockito.internal.junit.JUnitRule$1.evaluate(JUnitRule.java:43)
	at org.junit.rules.ExternalResource$1.evaluate(ExternalResource.java:48)
	at org.junit.rules.RunRules.evaluate(RunRules.java:20)
	at org.junit.runners.ParentRunner.runLeaf(ParentRunner.java:325)
	at org.junit.runners.BlockJUnit4ClassRunner.runChild(BlockJUnit4ClassRunner.java:78)
	at org.junit.runners.BlockJUnit4ClassRunner.runChild(BlockJUnit4ClassRunner.java:57)
	at org.junit.runners.ParentRunner$3.run(ParentRunner.java:290)
	at org.junit.runners.ParentRunner$1.schedule(ParentRunner.java:71)
	at org.junit.runners.ParentRunner.runChildren(ParentRunner.java:288)
	at org.junit.runners.ParentRunner.access$000(ParentRunner.java:58)
	at org.junit.runners.ParentRunner$2.evaluate(ParentRunner.java:268)
	at org.junit.runners.ParentRunner.run(ParentRunner.java:363)
	at org.apache.maven.surefire.junit4.JUnit4Provider.execute(JUnit4Provider.java:365)
	at org.apache.maven.surefire.junit4.JUnit4Provider.executeWithRerun(JUnit4Provider.java:273)
	at org.apache.maven.surefire.junit4.JUnit4Provider.executeTestSet(JUnit4Provider.java:238)
	at org.apache.maven.surefire.junit4.JUnit4Provider.invoke(JUnit4Provider.java:159)
	at org.apache.maven.surefire.booter.ForkedBooter.invokeProviderInSameClassLoader(ForkedBooter.java:384)
	at org.apache.maven.surefire.booter.ForkedBooter.runSuitesInProcess(ForkedBooter.java:345)
	at org.apache.maven.surefire.booter.ForkedBooter.execute(ForkedBooter.java:126)
	at org.apache.maven.surefire.booter.ForkedBooter.main(ForkedBooter.java:418)
11:57:52.399 [main] ERROR Unexpected RDFParseException
org.eclipse.rdf4j.rio.RDFParseException: IRI included an unencoded space: '32' [line 1]
	at org.eclipse.rdf4j.rio.helpers.RDFParserHelper.reportError(RDFParserHelper.java:265)
	at org.eclipse.rdf4j.rio.helpers.AbstractRDFParser.reportError(AbstractRDFParser.java:628)
	at org.eclipse.rdf4j.rio.turtle.TurtleParser.reportError(TurtleParser.java:1297)
	at org.eclipse.rdf4j.rio.turtle.TurtleParser.parseURI(TurtleParser.java:902)
	at org.eclipse.rdf4j.rio.turtle.TurtleParser.parseValue(TurtleParser.java:575)
	at org.eclipse.rdf4j.rio.turtle.TurtleParser.parseSubject(TurtleParser.java:406)
	at org.eclipse.rdf4j.rio.turtle.TurtleParser.parseTriples(TurtleParser.java:347)
	at org.eclipse.rdf4j.rio.turtle.TurtleParser.parseStatement(TurtleParser.java:216)
	at org.eclipse.rdf4j.rio.turtle.TurtleParser.parse(TurtleParser.java:178)
	at org.eclipse.rdf4j.rio.turtle.TurtleParser.parse(TurtleParser.java:130)
	at org.eclipse.rdf4j.console.command.Verify.verify(Verify.java:145)
	at org.eclipse.rdf4j.console.command.Verify.execute(Verify.java:97)
	at org.eclipse.rdf4j.console.command.VerifyTest.testVerifySpaceIRI(VerifyTest.java:103)
	at sun.reflect.NativeMethodAccessorImpl.invoke0(Native Method)
	at sun.reflect.NativeMethodAccessorImpl.invoke(NativeMethodAccessorImpl.java:62)
	at sun.reflect.DelegatingMethodAccessorImpl.invoke(DelegatingMethodAccessorImpl.java:43)
	at java.lang.reflect.Method.invoke(Method.java:498)
	at org.junit.runners.model.FrameworkMethod$1.runReflectiveCall(FrameworkMethod.java:50)
	at org.junit.internal.runners.model.ReflectiveCallable.run(ReflectiveCallable.java:12)
	at org.junit.runners.model.FrameworkMethod.invokeExplosively(FrameworkMethod.java:47)
	at org.junit.internal.runners.statements.InvokeMethod.evaluate(InvokeMethod.java:17)
	at org.junit.internal.runners.statements.RunBefores.evaluate(RunBefores.java:26)
	at org.junit.internal.runners.statements.RunAfters.evaluate(RunAfters.java:27)
	at org.mockito.internal.junit.JUnitRule$1.evaluateSafely(JUnitRule.java:52)
	at org.mockito.internal.junit.JUnitRule$1.evaluate(JUnitRule.java:43)
	at org.junit.rules.ExternalResource$1.evaluate(ExternalResource.java:48)
	at org.junit.rules.RunRules.evaluate(RunRules.java:20)
	at org.junit.runners.ParentRunner.runLeaf(ParentRunner.java:325)
	at org.junit.runners.BlockJUnit4ClassRunner.runChild(BlockJUnit4ClassRunner.java:78)
	at org.junit.runners.BlockJUnit4ClassRunner.runChild(BlockJUnit4ClassRunner.java:57)
	at org.junit.runners.ParentRunner$3.run(ParentRunner.java:290)
	at org.junit.runners.ParentRunner$1.schedule(ParentRunner.java:71)
	at org.junit.runners.ParentRunner.runChildren(ParentRunner.java:288)
	at org.junit.runners.ParentRunner.access$000(ParentRunner.java:58)
	at org.junit.runners.ParentRunner$2.evaluate(ParentRunner.java:268)
	at org.junit.runners.ParentRunner.run(ParentRunner.java:363)
	at org.apache.maven.surefire.junit4.JUnit4Provider.execute(JUnit4Provider.java:365)
	at org.apache.maven.surefire.junit4.JUnit4Provider.executeWithRerun(JUnit4Provider.java:273)
	at org.apache.maven.surefire.junit4.JUnit4Provider.executeTestSet(JUnit4Provider.java:238)
	at org.apache.maven.surefire.junit4.JUnit4Provider.invoke(JUnit4Provider.java:159)
	at org.apache.maven.surefire.booter.ForkedBooter.invokeProviderInSameClassLoader(ForkedBooter.java:384)
	at org.apache.maven.surefire.booter.ForkedBooter.runSuitesInProcess(ForkedBooter.java:345)
	at org.apache.maven.surefire.booter.ForkedBooter.execute(ForkedBooter.java:126)
	at org.apache.maven.surefire.booter.ForkedBooter.main(ForkedBooter.java:418)
[INFO] Tests run: 10, Failures: 0, Errors: 0, Skipped: 0, Time elapsed: 0.477 s - in org.eclipse.rdf4j.console.command.VerifyTest
[INFO] Running org.eclipse.rdf4j.console.command.DropTest
[MockitoHint] DropTest.testUserAbortedUnsafeDropBeforeWarning (see javadoc for MockitoHint):
[MockitoHint] 1. Unused -> at org.eclipse.rdf4j.console.command.DropTest.setUp(DropTest.java:50)

[INFO] Tests run: 3, Failures: 0, Errors: 0, Skipped: 0, Time elapsed: 0.105 s - in org.eclipse.rdf4j.console.command.DropTest
[INFO] Running org.eclipse.rdf4j.console.command.FederateTest
11:57:52.557 [main] DEBUG Initializing MemoryStore...
11:57:52.558 [main] DEBUG Initializing data file...
11:57:52.558 [main] DEBUG Data file initialized
11:57:52.558 [main] DEBUG MemoryStore initialized
11:57:52.561 [main] DEBUG syncing data to file...
11:57:52.562 [main] DEBUG Data synced to file
11:57:52.566 [main] DEBUG Initializing MemoryStore...
11:57:52.567 [main] DEBUG Initializing data file...
11:57:52.568 [main] DEBUG Data file initialized
11:57:52.568 [main] DEBUG MemoryStore initialized
11:57:52.570 [main] DEBUG syncing data to file...
11:57:52.572 [main] DEBUG Data synced to file
11:57:52.591 [main] DEBUG Federate called with federation ID = fedID, and member ID's = [sparql][alien][http].
  Distinct set to false, and readonly set to true.

11:57:52.595 [main] DEBUG Federation repository root node: _:node1drquaeijx216
11:57:52.597 [main] DEBUG _:node1drquaeijx216 http://www.w3.org/1999/02/22-rdf-syntax-ns#type http://www.openrdf.org/config/repository#Repository
11:57:52.597 [main] DEBUG _:node1drquaeijx216 http://www.openrdf.org/config/repository#repositoryID "fedID"
11:57:52.597 [main] DEBUG _:node1drquaeijx216 http://www.w3.org/2000/01/rdf-schema#label "Test Federation Title"
11:57:52.597 [main] DEBUG _:node1drquaeijx216 http://www.openrdf.org/config/repository#repositoryImpl _:node1drquaeijx217
11:57:52.597 [main] DEBUG _:node1drquaeijx217 http://www.openrdf.org/config/repository#repositoryType "openrdf:SailRepository"
11:57:52.597 [main] DEBUG _:node1drquaeijx217 http://www.openrdf.org/config/repository/sail#sailImpl _:node1drquaeijx218
11:57:52.598 [main] DEBUG _:node1drquaeijx218 http://www.openrdf.org/config/sail#sailType "openrdf:Federation"
11:57:52.598 [main] DEBUG _:node1drquaeijx218 http://www.openrdf.org/config/sail/federation#readOnly "true"^^<http://www.w3.org/2001/XMLSchema#boolean>
11:57:52.599 [main] DEBUG _:node1drquaeijx218 http://www.openrdf.org/config/sail/federation#distinct "false"^^<http://www.w3.org/2001/XMLSchema#boolean>
11:57:52.599 [main] DEBUG Adding member: sparql
11:57:52.599 [main] DEBUG _:node1drquaeijx218 http://www.openrdf.org/config/sail/federation#member _:node1drquaeijx219
11:57:52.600 [main] DEBUG _:node1drquaeijx219 http://www.openrdf.org/config/repository#repositoryType "openrdf:SPARQLRepository"
11:57:52.601 [main] DEBUG _:node1drquaeijx219 http://www.openrdf.org/config/repository/sparql#query-endpoint http://localhost:8080/openrdf-sesame/repositories/sparql
11:57:52.601 [main] DEBUG Added member sparql: 
11:57:52.601 [main] DEBUG Adding member: alien
11:57:52.601 [main] DEBUG _:node1drquaeijx218 http://www.openrdf.org/config/sail/federation#member _:node1drquaeijx222
11:57:52.603 [main] DEBUG _:node1drquaeijx222 http://www.openrdf.org/config/repository#repositoryType "openrdf:ProxyRepository"
11:57:52.603 [main] DEBUG _:node1drquaeijx222 http://www.openrdf.org/config/repository/proxy#proxiedID "alien"
11:57:52.603 [main] DEBUG Added member alien: 
11:57:52.603 [main] DEBUG Adding member: http
11:57:52.603 [main] DEBUG _:node1drquaeijx218 http://www.openrdf.org/config/sail/federation#member _:node1drquaeijx225
11:57:52.604 [main] DEBUG _:node1drquaeijx225 http://www.openrdf.org/config/repository#repositoryType "openrdf:HTTPRepository"
11:57:52.605 [main] DEBUG _:node1drquaeijx225 http://www.openrdf.org/config/repository/http#repositoryURL http://localhost:8080/openrdf-sesame/repositories/http
11:57:52.605 [main] DEBUG Added member http: 
11:57:52.664 [main] DEBUG Initializing MemoryStore...
11:57:52.666 [main] DEBUG Initializing data file...
11:57:52.666 [main] DEBUG Data file initialized
11:57:52.667 [main] DEBUG MemoryStore initialized
11:57:52.670 [main] DEBUG syncing data to file...
11:57:52.672 [main] DEBUG Data synced to file
11:57:52.680 [main] DEBUG Initializing MemoryStore...
11:57:52.681 [main] DEBUG Initializing data file...
11:57:52.681 [main] DEBUG Data file initialized
11:57:52.681 [main] DEBUG MemoryStore initialized
11:57:52.683 [main] DEBUG syncing data to file...
11:57:52.683 [main] DEBUG Data synced to file
11:57:52.689 [main] ERROR Duplicate repository id's specified.
[MockitoHint] FederateTest.testDuplicateMembersPrintsError (see javadoc for MockitoHint):
[MockitoHint] 1. Unused -> at org.eclipse.rdf4j.console.command.FederateTest.setUp(FederateTest.java:87)
[MockitoHint] 2. Unused -> at org.eclipse.rdf4j.console.command.FederateTest.setUp(FederateTest.java:88)

11:57:52.695 [main] DEBUG Initializing MemoryStore...
11:57:52.696 [main] DEBUG Initializing data file...
11:57:52.696 [main] DEBUG Data file initialized
11:57:52.696 [main] DEBUG MemoryStore initialized
11:57:52.698 [main] DEBUG syncing data to file...
11:57:52.698 [main] DEBUG Data synced to file
11:57:52.701 [main] DEBUG Initializing MemoryStore...
11:57:52.701 [main] DEBUG Initializing data file...
11:57:52.702 [main] DEBUG Data file initialized
11:57:52.702 [main] DEBUG MemoryStore initialized
11:57:52.703 [main] DEBUG syncing data to file...
11:57:52.703 [main] DEBUG Data synced to file
11:57:52.712 [main] DEBUG Federate called with federation ID = alien, and member ID's = [fedID][scary].
  Distinct set to false, and readonly set to true.

11:57:52.713 [main] ERROR alien already exists.
[MockitoHint] FederateTest.testFedAlreadyExistsPrintsSpecificError (see javadoc for MockitoHint):
[MockitoHint] 1. Unused -> at org.eclipse.rdf4j.console.command.FederateTest.setUp(FederateTest.java:88)

11:57:52.720 [main] DEBUG Initializing MemoryStore...
11:57:52.720 [main] DEBUG Initializing data file...
11:57:52.720 [main] DEBUG Data file initialized
11:57:52.720 [main] DEBUG MemoryStore initialized
11:57:52.723 [main] DEBUG syncing data to file...
11:57:52.723 [main] DEBUG Data synced to file
11:57:52.727 [main] DEBUG Initializing MemoryStore...
11:57:52.727 [main] DEBUG Initializing data file...
11:57:52.727 [main] DEBUG Data file initialized
11:57:52.727 [main] DEBUG MemoryStore initialized
11:57:52.729 [main] DEBUG syncing data to file...
11:57:52.730 [main] DEBUG Data synced to file
11:57:52.740 [main] DEBUG Federate called with federation ID = fedID, and member ID's = [alien][scary].
  Distinct set to true, and readonly set to false.

11:57:52.741 [main] DEBUG Federation repository root node: _:node1drquaeijx338
11:57:52.741 [main] DEBUG _:node1drquaeijx338 http://www.w3.org/1999/02/22-rdf-syntax-ns#type http://www.openrdf.org/config/repository#Repository
11:57:52.741 [main] DEBUG _:node1drquaeijx338 http://www.openrdf.org/config/repository#repositoryID "fedID"
11:57:52.742 [main] DEBUG _:node1drquaeijx338 http://www.w3.org/2000/01/rdf-schema#label "Test Federation Title"
11:57:52.742 [main] DEBUG _:node1drquaeijx338 http://www.openrdf.org/config/repository#repositoryImpl _:node1drquaeijx339
11:57:52.742 [main] DEBUG _:node1drquaeijx339 http://www.openrdf.org/config/repository#repositoryType "openrdf:SailRepository"
11:57:52.742 [main] DEBUG _:node1drquaeijx339 http://www.openrdf.org/config/repository/sail#sailImpl _:node1drquaeijx340
11:57:52.742 [main] DEBUG _:node1drquaeijx340 http://www.openrdf.org/config/sail#sailType "openrdf:Federation"
11:57:52.742 [main] DEBUG _:node1drquaeijx340 http://www.openrdf.org/config/sail/federation#readOnly "false"^^<http://www.w3.org/2001/XMLSchema#boolean>
11:57:52.742 [main] DEBUG _:node1drquaeijx340 http://www.openrdf.org/config/sail/federation#distinct "true"^^<http://www.w3.org/2001/XMLSchema#boolean>
11:57:52.742 [main] DEBUG Adding member: alien
11:57:52.742 [main] DEBUG _:node1drquaeijx340 http://www.openrdf.org/config/sail/federation#member _:node1drquaeijx341
11:57:52.742 [main] DEBUG _:node1drquaeijx341 http://www.openrdf.org/config/repository#repositoryType "openrdf:ProxyRepository"
11:57:52.742 [main] DEBUG _:node1drquaeijx341 http://www.openrdf.org/config/repository/proxy#proxiedID "alien"
11:57:52.742 [main] DEBUG Added member alien: 
11:57:52.742 [main] DEBUG Adding member: scary
11:57:52.743 [main] DEBUG _:node1drquaeijx340 http://www.openrdf.org/config/sail/federation#member _:node1drquaeijx344
11:57:52.743 [main] DEBUG _:node1drquaeijx344 http://www.openrdf.org/config/repository#repositoryType "openrdf:ProxyRepository"
11:57:52.743 [main] DEBUG _:node1drquaeijx344 http://www.openrdf.org/config/repository/proxy#proxiedID "scary"
11:57:52.743 [main] DEBUG Added member scary: 
11:57:52.766 [main] DEBUG Initializing MemoryStore...
11:57:52.767 [main] DEBUG Initializing data file...
11:57:52.767 [main] DEBUG Data file initialized
11:57:52.767 [main] DEBUG MemoryStore initialized
11:57:52.769 [main] DEBUG syncing data to file...
11:57:52.770 [main] DEBUG Data synced to file
11:57:52.773 [main] DEBUG Initializing MemoryStore...
11:57:52.774 [main] DEBUG Initializing data file...
11:57:52.774 [main] DEBUG Data file initialized
11:57:52.774 [main] DEBUG MemoryStore initialized
11:57:52.776 [main] DEBUG syncing data to file...
11:57:52.777 [main] DEBUG Data synced to file
11:57:52.785 [main] DEBUG Federate called with federation ID = fedID, and member ID's = [sparql][sparql2].
  Distinct set to false, and readonly set to false.

11:57:52.787 [main] ERROR sparql is read-only.
11:57:52.788 [main] ERROR sparql2 is read-only.
[MockitoHint] FederateTest.testSparqlAndNotReadOnlyPrintsError (see javadoc for MockitoHint):
[MockitoHint] 1. Unused -> at org.eclipse.rdf4j.console.command.FederateTest.setUp(FederateTest.java:88)

11:57:52.795 [main] DEBUG Initializing MemoryStore...
11:57:52.796 [main] DEBUG Initializing data file...
11:57:52.797 [main] DEBUG Data file initialized
11:57:52.797 [main] DEBUG MemoryStore initialized
11:57:52.798 [main] DEBUG syncing data to file...
11:57:52.799 [main] DEBUG Data synced to file
11:57:52.801 [main] DEBUG Initializing MemoryStore...
11:57:52.801 [main] DEBUG Initializing data file...
11:57:52.801 [main] DEBUG Data file initialized
11:57:52.801 [main] DEBUG MemoryStore initialized
11:57:52.802 [main] DEBUG syncing data to file...
11:57:52.803 [main] DEBUG Data synced to file
[MockitoHint] FederateTest.testNoArgumentsPrintsHelp (see javadoc for MockitoHint):
[MockitoHint] 1. Unused -> at org.eclipse.rdf4j.console.command.FederateTest.setUp(FederateTest.java:87)
[MockitoHint] 2. Unused -> at org.eclipse.rdf4j.console.command.FederateTest.setUp(FederateTest.java:88)

11:57:52.813 [main] DEBUG Initializing MemoryStore...
11:57:52.813 [main] DEBUG Initializing data file...
11:57:52.814 [main] DEBUG Data file initialized
11:57:52.814 [main] DEBUG MemoryStore initialized
11:57:52.815 [main] DEBUG syncing data to file...
11:57:52.815 [main] DEBUG Data synced to file
11:57:52.817 [main] DEBUG Initializing MemoryStore...
11:57:52.818 [main] DEBUG Initializing data file...
11:57:52.818 [main] DEBUG Data file initialized
11:57:52.818 [main] DEBUG MemoryStore initialized
11:57:52.819 [main] DEBUG syncing data to file...
11:57:52.819 [main] DEBUG Data synced to file
11:57:52.824 [main] DEBUG Federate called with federation ID = type=memory, and member ID's = [fedID][alien][scary].
  Distinct set to false, and readonly set to true.

11:57:52.824 [main] ERROR fedID does not exist.
[MockitoHint] FederateTest.testInvalidArgumentPrintsError (see javadoc for MockitoHint):
[MockitoHint] 1. Unused -> at org.eclipse.rdf4j.console.command.FederateTest.setUp(FederateTest.java:88)

11:57:52.830 [main] DEBUG Initializing MemoryStore...
11:57:52.831 [main] DEBUG Initializing data file...
11:57:52.831 [main] DEBUG Data file initialized
11:57:52.831 [main] DEBUG MemoryStore initialized
11:57:52.833 [main] DEBUG syncing data to file...
11:57:52.834 [main] DEBUG Data synced to file
11:57:52.837 [main] DEBUG Initializing MemoryStore...
11:57:52.837 [main] DEBUG Initializing data file...
11:57:52.837 [main] DEBUG Data file initialized
11:57:52.837 [main] DEBUG MemoryStore initialized
11:57:52.838 [main] DEBUG syncing data to file...
11:57:52.839 [main] DEBUG Data synced to file
11:57:52.843 [main] DEBUG Federate called with federation ID = fedID, and member ID's = [sparql][sparql2].
  Distinct set to false, and readonly set to true.

11:57:52.844 [main] DEBUG Federation repository root node: _:node1drquaeijx494
11:57:52.844 [main] DEBUG _:node1drquaeijx494 http://www.w3.org/1999/02/22-rdf-syntax-ns#type http://www.openrdf.org/config/repository#Repository
11:57:52.844 [main] DEBUG _:node1drquaeijx494 http://www.openrdf.org/config/repository#repositoryID "fedID"
11:57:52.844 [main] DEBUG _:node1drquaeijx494 http://www.w3.org/2000/01/rdf-schema#label "Test Federation Title"
11:57:52.844 [main] DEBUG _:node1drquaeijx494 http://www.openrdf.org/config/repository#repositoryImpl _:node1drquaeijx495
11:57:52.844 [main] DEBUG _:node1drquaeijx495 http://www.openrdf.org/config/repository#repositoryType "openrdf:SailRepository"
11:57:52.844 [main] DEBUG _:node1drquaeijx495 http://www.openrdf.org/config/repository/sail#sailImpl _:node1drquaeijx496
11:57:52.844 [main] DEBUG _:node1drquaeijx496 http://www.openrdf.org/config/sail#sailType "openrdf:Federation"
11:57:52.844 [main] DEBUG _:node1drquaeijx496 http://www.openrdf.org/config/sail/federation#readOnly "true"^^<http://www.w3.org/2001/XMLSchema#boolean>
11:57:52.844 [main] DEBUG _:node1drquaeijx496 http://www.openrdf.org/config/sail/federation#distinct "false"^^<http://www.w3.org/2001/XMLSchema#boolean>
11:57:52.844 [main] DEBUG Adding member: sparql
11:57:52.844 [main] DEBUG _:node1drquaeijx496 http://www.openrdf.org/config/sail/federation#member _:node1drquaeijx497
11:57:52.845 [main] DEBUG _:node1drquaeijx497 http://www.openrdf.org/config/repository#repositoryType "openrdf:SPARQLRepository"
11:57:52.845 [main] DEBUG _:node1drquaeijx497 http://www.openrdf.org/config/repository/sparql#query-endpoint http://localhost:8080/openrdf-sesame/repositories/sparql
11:57:52.845 [main] DEBUG Added member sparql: 
11:57:52.845 [main] DEBUG Adding member: sparql2
11:57:52.845 [main] DEBUG _:node1drquaeijx496 http://www.openrdf.org/config/sail/federation#member _:node1drquaeijx500
11:57:52.845 [main] DEBUG _:node1drquaeijx500 http://www.openrdf.org/config/repository#repositoryType "openrdf:SPARQLRepository"
11:57:52.846 [main] DEBUG _:node1drquaeijx500 http://www.openrdf.org/config/repository/sparql#query-endpoint http://localhost:8080/openrdf-sesame/repositories/sparql
11:57:52.846 [main] DEBUG Added member sparql2: 
11:57:52.853 [main] DEBUG Initializing MemoryStore...
11:57:52.854 [main] DEBUG Initializing data file...
11:57:52.854 [main] DEBUG Data file initialized
11:57:52.854 [main] DEBUG MemoryStore initialized
11:57:52.855 [main] DEBUG syncing data to file...
11:57:52.855 [main] DEBUG Data synced to file
11:57:52.857 [main] DEBUG Initializing MemoryStore...
11:57:52.857 [main] DEBUG Initializing data file...
11:57:52.858 [main] DEBUG Data file initialized
11:57:52.858 [main] DEBUG MemoryStore initialized
11:57:52.859 [main] DEBUG syncing data to file...
11:57:52.859 [main] DEBUG Data synced to file
11:57:52.864 [main] DEBUG Federate called with federation ID = fedID, and member ID's = [http][sparql].
  Distinct set to false, and readonly set to true.

11:57:52.865 [main] DEBUG Federation repository root node: _:node1drquaeijx549
11:57:52.865 [main] DEBUG _:node1drquaeijx549 http://www.w3.org/1999/02/22-rdf-syntax-ns#type http://www.openrdf.org/config/repository#Repository
11:57:52.865 [main] DEBUG _:node1drquaeijx549 http://www.openrdf.org/config/repository#repositoryID "fedID"
11:57:52.865 [main] DEBUG _:node1drquaeijx549 http://www.w3.org/2000/01/rdf-schema#label "Test Federation Title"
11:57:52.865 [main] DEBUG _:node1drquaeijx549 http://www.openrdf.org/config/repository#repositoryImpl _:node1drquaeijx550
11:57:52.865 [main] DEBUG _:node1drquaeijx550 http://www.openrdf.org/config/repository#repositoryType "openrdf:SailRepository"
11:57:52.865 [main] DEBUG _:node1drquaeijx550 http://www.openrdf.org/config/repository/sail#sailImpl _:node1drquaeijx551
11:57:52.865 [main] DEBUG _:node1drquaeijx551 http://www.openrdf.org/config/sail#sailType "openrdf:Federation"
11:57:52.865 [main] DEBUG _:node1drquaeijx551 http://www.openrdf.org/config/sail/federation#readOnly "true"^^<http://www.w3.org/2001/XMLSchema#boolean>
11:57:52.865 [main] DEBUG _:node1drquaeijx551 http://www.openrdf.org/config/sail/federation#distinct "false"^^<http://www.w3.org/2001/XMLSchema#boolean>
11:57:52.865 [main] DEBUG Adding member: http
11:57:52.865 [main] DEBUG _:node1drquaeijx551 http://www.openrdf.org/config/sail/federation#member _:node1drquaeijx552
11:57:52.866 [main] DEBUG _:node1drquaeijx552 http://www.openrdf.org/config/repository#repositoryType "openrdf:HTTPRepository"
11:57:52.866 [main] DEBUG _:node1drquaeijx552 http://www.openrdf.org/config/repository/http#repositoryURL http://localhost:8080/openrdf-sesame/repositories/http
11:57:52.866 [main] DEBUG Added member http: 
11:57:52.866 [main] DEBUG Adding member: sparql
11:57:52.866 [main] DEBUG _:node1drquaeijx551 http://www.openrdf.org/config/sail/federation#member _:node1drquaeijx555
11:57:52.867 [main] DEBUG _:node1drquaeijx555 http://www.openrdf.org/config/repository#repositoryType "openrdf:SPARQLRepository"
11:57:52.867 [main] DEBUG _:node1drquaeijx555 http://www.openrdf.org/config/repository/sparql#query-endpoint http://localhost:8080/openrdf-sesame/repositories/sparql
11:57:52.867 [main] DEBUG Added member sparql: 
11:57:52.879 [main] DEBUG Initializing MemoryStore...
11:57:52.879 [main] DEBUG Initializing data file...
11:57:52.880 [main] DEBUG Data file initialized
11:57:52.880 [main] DEBUG MemoryStore initialized
11:57:52.881 [main] DEBUG syncing data to file...
11:57:52.881 [main] DEBUG Data synced to file
11:57:52.885 [main] DEBUG Initializing MemoryStore...
11:57:52.886 [main] DEBUG Initializing data file...
11:57:52.886 [main] DEBUG Data file initialized
11:57:52.886 [main] DEBUG MemoryStore initialized
11:57:52.887 [main] DEBUG syncing data to file...
11:57:52.888 [main] DEBUG Data synced to file
11:57:52.895 [main] DEBUG Federate called with federation ID = fedID, and member ID's = [alien][FreeLunch].
  Distinct set to false, and readonly set to true.

11:57:52.896 [main] ERROR FreeLunch does not exist.
[MockitoHint] FederateTest.testNonexistentMemberPrintsSpecificError (see javadoc for MockitoHint):
[MockitoHint] 1. Unused -> at org.eclipse.rdf4j.console.command.FederateTest.setUp(FederateTest.java:88)

11:57:52.902 [main] DEBUG Initializing MemoryStore...
11:57:52.903 [main] DEBUG Initializing data file...
11:57:52.903 [main] DEBUG Data file initialized
11:57:52.903 [main] DEBUG MemoryStore initialized
11:57:52.905 [main] DEBUG syncing data to file...
11:57:52.905 [main] DEBUG Data synced to file
11:57:52.908 [main] DEBUG Initializing MemoryStore...
11:57:52.909 [main] DEBUG Initializing data file...
11:57:52.909 [main] DEBUG Data file initialized
11:57:52.909 [main] DEBUG MemoryStore initialized
11:57:52.910 [main] DEBUG syncing data to file...
11:57:52.911 [main] DEBUG Data synced to file
11:57:52.916 [main] ERROR Duplicate repository id's specified.
[MockitoHint] FederateTest.testFedSameAsMemberPrintsError (see javadoc for MockitoHint):
[MockitoHint] 1. Unused -> at org.eclipse.rdf4j.console.command.FederateTest.setUp(FederateTest.java:87)
[MockitoHint] 2. Unused -> at org.eclipse.rdf4j.console.command.FederateTest.setUp(FederateTest.java:88)

11:57:52.922 [main] DEBUG Initializing MemoryStore...
11:57:52.922 [main] DEBUG Initializing data file...
11:57:52.923 [main] DEBUG Data file initialized
11:57:52.923 [main] DEBUG MemoryStore initialized
11:57:52.924 [main] DEBUG syncing data to file...
11:57:52.924 [main] DEBUG Data synced to file
11:57:52.927 [main] DEBUG Initializing MemoryStore...
11:57:52.928 [main] DEBUG Initializing data file...
11:57:52.928 [main] DEBUG Data file initialized
11:57:52.928 [main] DEBUG MemoryStore initialized
11:57:52.929 [main] DEBUG syncing data to file...
11:57:52.930 [main] DEBUG Data synced to file
[MockitoHint] FederateTest.testTwoArgumentsPrintsHelp (see javadoc for MockitoHint):
[MockitoHint] 1. Unused -> at org.eclipse.rdf4j.console.command.FederateTest.setUp(FederateTest.java:87)
[MockitoHint] 2. Unused -> at org.eclipse.rdf4j.console.command.FederateTest.setUp(FederateTest.java:88)

11:57:52.941 [main] DEBUG Initializing MemoryStore...
11:57:52.942 [main] DEBUG Initializing data file...
11:57:52.942 [main] DEBUG Data file initialized
11:57:52.942 [main] DEBUG MemoryStore initialized
11:57:52.943 [main] DEBUG syncing data to file...
11:57:52.944 [main] DEBUG Data synced to file
11:57:52.946 [main] DEBUG Initializing MemoryStore...
11:57:52.947 [main] DEBUG Initializing data file...
11:57:52.947 [main] DEBUG Data file initialized
11:57:52.947 [main] DEBUG MemoryStore initialized
11:57:52.948 [main] DEBUG syncing data to file...
11:57:52.949 [main] DEBUG Data synced to file
11:57:52.954 [main] DEBUG Federate called with federation ID = fedID, and member ID's = [alien][scary].
  Distinct set to false, and readonly set to true.

11:57:52.955 [main] DEBUG Federation repository root node: _:node1drquaeijx692
11:57:52.955 [main] DEBUG _:node1drquaeijx692 http://www.w3.org/1999/02/22-rdf-syntax-ns#type http://www.openrdf.org/config/repository#Repository
11:57:52.955 [main] DEBUG _:node1drquaeijx692 http://www.openrdf.org/config/repository#repositoryID "fedID"
11:57:52.955 [main] DEBUG _:node1drquaeijx692 http://www.w3.org/2000/01/rdf-schema#label "Test Federation Title"
11:57:52.955 [main] DEBUG _:node1drquaeijx692 http://www.openrdf.org/config/repository#repositoryImpl _:node1drquaeijx693
11:57:52.955 [main] DEBUG _:node1drquaeijx693 http://www.openrdf.org/config/repository#repositoryType "openrdf:SailRepository"
11:57:52.955 [main] DEBUG _:node1drquaeijx693 http://www.openrdf.org/config/repository/sail#sailImpl _:node1drquaeijx694
11:57:52.955 [main] DEBUG _:node1drquaeijx694 http://www.openrdf.org/config/sail#sailType "openrdf:Federation"
11:57:52.955 [main] DEBUG _:node1drquaeijx694 http://www.openrdf.org/config/sail/federation#readOnly "true"^^<http://www.w3.org/2001/XMLSchema#boolean>
11:57:52.955 [main] DEBUG _:node1drquaeijx694 http://www.openrdf.org/config/sail/federation#distinct "false"^^<http://www.w3.org/2001/XMLSchema#boolean>
11:57:52.956 [main] DEBUG Adding member: alien
11:57:52.956 [main] DEBUG _:node1drquaeijx694 http://www.openrdf.org/config/sail/federation#member _:node1drquaeijx695
11:57:52.956 [main] DEBUG _:node1drquaeijx695 http://www.openrdf.org/config/repository#repositoryType "openrdf:ProxyRepository"
11:57:52.956 [main] DEBUG _:node1drquaeijx695 http://www.openrdf.org/config/repository/proxy#proxiedID "alien"
11:57:52.956 [main] DEBUG Added member alien: 
11:57:52.956 [main] DEBUG Adding member: scary
11:57:52.956 [main] DEBUG _:node1drquaeijx694 http://www.openrdf.org/config/sail/federation#member _:node1drquaeijx698
11:57:52.956 [main] DEBUG _:node1drquaeijx698 http://www.openrdf.org/config/repository#repositoryType "openrdf:ProxyRepository"
11:57:52.957 [main] DEBUG _:node1drquaeijx698 http://www.openrdf.org/config/repository/proxy#proxiedID "scary"
11:57:52.957 [main] DEBUG Added member scary: 
11:57:52.971 [main] DEBUG Initializing MemoryStore...
11:57:52.972 [main] DEBUG Initializing data file...
11:57:52.972 [main] DEBUG Data file initialized
11:57:52.972 [main] DEBUG MemoryStore initialized
11:57:52.974 [main] DEBUG syncing data to file...
11:57:52.974 [main] DEBUG Data synced to file
11:57:52.976 [main] DEBUG Initializing MemoryStore...
11:57:52.976 [main] DEBUG Initializing data file...
11:57:52.976 [main] DEBUG Data file initialized
11:57:52.976 [main] DEBUG MemoryStore initialized
11:57:52.977 [main] DEBUG syncing data to file...
11:57:52.978 [main] DEBUG Data synced to file
[MockitoHint] FederateTest.testOneArgumentPrintsHelp (see javadoc for MockitoHint):
[MockitoHint] 1. Unused -> at org.eclipse.rdf4j.console.command.FederateTest.setUp(FederateTest.java:87)
[MockitoHint] 2. Unused -> at org.eclipse.rdf4j.console.command.FederateTest.setUp(FederateTest.java:88)

11:57:52.985 [main] DEBUG Initializing MemoryStore...
11:57:52.986 [main] DEBUG Initializing data file...
11:57:52.986 [main] DEBUG Data file initialized
11:57:52.986 [main] DEBUG MemoryStore initialized
11:57:52.987 [main] DEBUG syncing data to file...
11:57:52.987 [main] DEBUG Data synced to file
11:57:52.989 [main] DEBUG Initializing MemoryStore...
11:57:52.989 [main] DEBUG Initializing data file...
11:57:52.989 [main] DEBUG Data file initialized
11:57:52.989 [main] DEBUG MemoryStore initialized
11:57:52.990 [main] DEBUG syncing data to file...
11:57:52.990 [main] DEBUG Data synced to file
11:57:52.994 [main] DEBUG Federate called with federation ID = fedID, and member ID's = [http][http2].
  Distinct set to false, and readonly set to true.

11:57:52.995 [main] DEBUG Federation repository root node: _:node1drquaeijx784
11:57:52.995 [main] DEBUG _:node1drquaeijx784 http://www.w3.org/1999/02/22-rdf-syntax-ns#type http://www.openrdf.org/config/repository#Repository
11:57:52.995 [main] DEBUG _:node1drquaeijx784 http://www.openrdf.org/config/repository#repositoryID "fedID"
11:57:52.995 [main] DEBUG _:node1drquaeijx784 http://www.w3.org/2000/01/rdf-schema#label "Test Federation Title"
11:57:52.995 [main] DEBUG _:node1drquaeijx784 http://www.openrdf.org/config/repository#repositoryImpl _:node1drquaeijx785
11:57:52.995 [main] DEBUG _:node1drquaeijx785 http://www.openrdf.org/config/repository#repositoryType "openrdf:SailRepository"
11:57:52.995 [main] DEBUG _:node1drquaeijx785 http://www.openrdf.org/config/repository/sail#sailImpl _:node1drquaeijx786
11:57:52.995 [main] DEBUG _:node1drquaeijx786 http://www.openrdf.org/config/sail#sailType "openrdf:Federation"
11:57:52.995 [main] DEBUG _:node1drquaeijx786 http://www.openrdf.org/config/sail/federation#readOnly "true"^^<http://www.w3.org/2001/XMLSchema#boolean>
11:57:52.995 [main] DEBUG _:node1drquaeijx786 http://www.openrdf.org/config/sail/federation#distinct "false"^^<http://www.w3.org/2001/XMLSchema#boolean>
11:57:52.995 [main] DEBUG Adding member: http
11:57:52.995 [main] DEBUG _:node1drquaeijx786 http://www.openrdf.org/config/sail/federation#member _:node1drquaeijx787
11:57:52.995 [main] DEBUG _:node1drquaeijx787 http://www.openrdf.org/config/repository#repositoryType "openrdf:HTTPRepository"
11:57:52.996 [main] DEBUG _:node1drquaeijx787 http://www.openrdf.org/config/repository/http#repositoryURL http://localhost:8080/openrdf-sesame/repositories/http
11:57:52.996 [main] DEBUG Added member http: 
11:57:52.996 [main] DEBUG Adding member: http2
11:57:52.996 [main] DEBUG _:node1drquaeijx786 http://www.openrdf.org/config/sail/federation#member _:node1drquaeijx790
11:57:52.996 [main] DEBUG _:node1drquaeijx790 http://www.openrdf.org/config/repository#repositoryType "openrdf:HTTPRepository"
11:57:52.996 [main] DEBUG _:node1drquaeijx790 http://www.openrdf.org/config/repository/http#repositoryURL http://localhost:8080/openrdf-sesame/repositories/http
11:57:52.996 [main] DEBUG Added member http2: 
[INFO] Tests run: 15, Failures: 0, Errors: 0, Skipped: 0, Time elapsed: 0.454 s - in org.eclipse.rdf4j.console.command.FederateTest
[INFO] Running org.eclipse.rdf4j.console.command.SparqlTest
[MockitoHint] SparqlTest.testInputFile (see javadoc for MockitoHint):
[MockitoHint] 1. Unused -> at org.eclipse.rdf4j.console.command.SparqlTest.setUp(SparqlTest.java:49)

11:57:53.027 [main] ERROR No suitable result writer found
[MockitoHint] SparqlTest.testSelectError (see javadoc for MockitoHint):
[MockitoHint] 1. Unused -> at org.eclipse.rdf4j.console.command.SparqlTest.setUp(SparqlTest.java:49)

[MockitoHint] SparqlTest.testSelectMissingBindings (see javadoc for MockitoHint):
[MockitoHint] 1. Unused -> at org.eclipse.rdf4j.console.command.SparqlTest.setUp(SparqlTest.java:49)

[MockitoHint] SparqlTest.testInputFileWorkdir (see javadoc for MockitoHint):
[MockitoHint] 1. Unused -> at org.eclipse.rdf4j.console.command.SparqlTest.setUp(SparqlTest.java:49)

[INFO] Tests run: 9, Failures: 0, Errors: 0, Skipped: 0, Time elapsed: 0.095 s - in org.eclipse.rdf4j.console.command.SparqlTest
[INFO] Running org.eclipse.rdf4j.console.UtilTest
 one, two
 three
 four
 five, six
 seven
 eight
[INFO] Tests run: 4, Failures: 0, Errors: 0, Skipped: 0, Time elapsed: 0 s - in org.eclipse.rdf4j.console.UtilTest
[INFO] Running org.eclipse.rdf4j.console.ConsoleIOTest
[INFO] Tests run: 3, Failures: 0, Errors: 0, Skipped: 0, Time elapsed: 0.025 s - in org.eclipse.rdf4j.console.ConsoleIOTest
[INFO] 
[INFO] Results:
[INFO] 
[INFO] Tests run: 64, Failures: 0, Errors: 0, Skipped: 0
[INFO] 
[JENKINS] Recording test results
[INFO] 
[INFO] --- animal-sniffer-maven-plugin:1.16:check (default) @ rdf4j-console ---
[INFO] Checking unresolved references to org.codehaus.mojo.signature:java18:1.0
[INFO] 
[INFO] --- maven-jar-plugin:2.3.1:jar (default-jar) @ rdf4j-console ---
[INFO] Building jar: /home/hudson/genie.rdf4j/.jenkins/jobs/rdf4j-pr-verify/workspace/tools/console/target/rdf4j-console-3.1.0-SNAPSHOT.jar