SuccessConsole Output

Started calculate disk usage of build
Finished Calculation of disk usage of build in 0 seconds
Started calculate disk usage of workspace
Finished Calculation of disk usage of workspace in 0 seconds
[INFO] 
[INFO] ------------------< org.eclipse.rdf4j:rdf4j-console >-------------------
[INFO] Building RDF4J: Console 3.1.0-SNAPSHOT                           [70/85]
[INFO] --------------------------------[ jar ]---------------------------------
[INFO] 
[INFO] --- buildnumber-maven-plugin:1.4:create (default) @ rdf4j-console ---
[INFO] ShortRevision tag detected. The value is '7'.
[INFO] Executing: /bin/sh -c cd '/home/hudson/genie.rdf4j/.jenkins/jobs/rdf4j-pr-verify/workspace/tools/console' && 'git' 'rev-parse' '--verify' '--short=7' 'HEAD'
[INFO] Working directory: /home/hudson/genie.rdf4j/.jenkins/jobs/rdf4j-pr-verify/workspace/tools/console
[INFO] Storing buildNumber: 43d242b at timestamp: 1576075645366
[WARNING] Cannot get the branch information from the git repository: 
Detecting the current branch failed: fatal: ref HEAD is not a symbolic ref

[INFO] ShortRevision tag detected. The value is '7'.
[INFO] Executing: /bin/sh -c cd '/home/hudson/genie.rdf4j/.jenkins/jobs/rdf4j-pr-verify/workspace/tools/console' && 'git' 'rev-parse' '--verify' '--short=7' 'HEAD'
[INFO] Working directory: /home/hudson/genie.rdf4j/.jenkins/jobs/rdf4j-pr-verify/workspace/tools/console
[INFO] Storing buildScmBranch: UNKNOWN
[INFO] 
[INFO] --- maven-enforcer-plugin:1.4.1:enforce (enforce-bytecode-version) @ rdf4j-console ---
[INFO] Adding ignore: META-INF/**/module-info
[INFO] 
[INFO] --- formatter-maven-plugin:2.8.1:validate (default) @ rdf4j-console ---
[INFO] Using 'UTF-8' encoding to format source files.
[INFO] Number of files to be formatted: 61
[INFO] Html formatting is skipped
[INFO] Successfully formatted:          0 file(s)
[INFO] Fail to format:                  0 file(s)
[INFO] Skipped:                         61 file(s)
[INFO] Read only skipped:               0 file(s)
[INFO] Approximate time taken:          0s
[INFO] 
[INFO] --- maven-resources-plugin:3.0.2:resources (default-resources) @ rdf4j-console ---
[INFO] Using 'UTF-8' encoding to copy filtered resources.
[INFO] skip non existing resourceDirectory /home/hudson/genie.rdf4j/.jenkins/jobs/rdf4j-pr-verify/workspace/tools/console/src/main/resources
[INFO] 
[INFO] --- maven-compiler-plugin:3.7.0:compile (default-compile) @ rdf4j-console ---
[INFO] Changes detected - recompiling the module!
[INFO] Compiling 42 source files to /home/hudson/genie.rdf4j/.jenkins/jobs/rdf4j-pr-verify/workspace/tools/console/target/classes
[INFO] 
[INFO] --- maven-resources-plugin:3.0.2:testResources (default-testResources) @ rdf4j-console ---
[INFO] Using 'UTF-8' encoding to copy filtered resources.
[INFO] Copying 29 resources
[INFO] 
[INFO] --- maven-compiler-plugin:3.7.0:testCompile (default-testCompile) @ rdf4j-console ---
[INFO] Changes detected - recompiling the module!
[INFO] Compiling 18 source files to /home/hudson/genie.rdf4j/.jenkins/jobs/rdf4j-pr-verify/workspace/tools/console/target/test-classes
[INFO] 
[INFO] --- maven-surefire-plugin:2.22.2:test (default-test) @ rdf4j-console ---
[INFO] 
[INFO] -------------------------------------------------------
[INFO]  T E S T S
[INFO] -------------------------------------------------------
[INFO] Running org.eclipse.rdf4j.console.setting.PrefixesTest
[INFO] Tests run: 3, Failures: 0, Errors: 0, Skipped: 0, Time elapsed: 0.584 s - in org.eclipse.rdf4j.console.setting.PrefixesTest
[INFO] Running org.eclipse.rdf4j.console.setting.LogLevelTest
09:47:30.063 [main] ERROR unknown logging level: chatty
[INFO] Tests run: 4, Failures: 0, Errors: 0, Skipped: 0, Time elapsed: 0.009 s - in org.eclipse.rdf4j.console.setting.LogLevelTest
[INFO] Running org.eclipse.rdf4j.console.setting.QueryPrefixTest
[INFO] Tests run: 1, Failures: 0, Errors: 0, Skipped: 0, Time elapsed: 0 s - in org.eclipse.rdf4j.console.setting.QueryPrefixTest
[INFO] Running org.eclipse.rdf4j.console.setting.ShowPrefixTest
[INFO] Tests run: 1, Failures: 0, Errors: 0, Skipped: 0, Time elapsed: 0 s - in org.eclipse.rdf4j.console.setting.ShowPrefixTest
[INFO] Running org.eclipse.rdf4j.console.setting.ConsoleWidthTest
[INFO] Tests run: 1, Failures: 0, Errors: 0, Skipped: 0, Time elapsed: 0 s - in org.eclipse.rdf4j.console.setting.ConsoleWidthTest
[INFO] Running org.eclipse.rdf4j.console.command.SetParametersTest
09:47:30.097 [main] ERROR Unknown parameter: unknown
[INFO] Tests run: 1, Failures: 0, Errors: 0, Skipped: 0, Time elapsed: 0.024 s - in org.eclipse.rdf4j.console.command.SetParametersTest
[INFO] Running org.eclipse.rdf4j.console.command.LoadTest
[MockitoHint] LoadTest.testLoad (see javadoc for MockitoHint):
[MockitoHint] 1. Unused -> at org.eclipse.rdf4j.console.command.LoadTest.setUp(LoadTest.java:49)

[MockitoHint] LoadTest.testLoadWorkDir (see javadoc for MockitoHint):
[MockitoHint] 1. Unused -> at org.eclipse.rdf4j.console.command.LoadTest.setUp(LoadTest.java:49)

[INFO] Tests run: 2, Failures: 0, Errors: 0, Skipped: 0, Time elapsed: 0.193 s - in org.eclipse.rdf4j.console.command.LoadTest
[INFO] Running org.eclipse.rdf4j.console.command.ConvertTest
09:47:30.555 [main] ERROR No RDF writer for /tmp/genie.rdf4j/junit7183719117472787431/alien.qyx
[MockitoHint] ConvertTest.testConvertInvalidFormat (see javadoc for MockitoHint):
[MockitoHint] 1. Unused -> at org.eclipse.rdf4j.console.command.ConvertTest.setup(ConvertTest.java:39)

09:47:30.566 [main] ERROR Failed to convert data
org.eclipse.rdf4j.rio.RDFParseException: Expected '<' or '_', found: e [line 1, column 101]
	at org.eclipse.rdf4j.rio.ntriples.NTriplesParser.parseSubject(NTriplesParser.java:313)
	at org.eclipse.rdf4j.rio.ntriples.NTriplesParser.parseTriple(NTriplesParser.java:252)
	at org.eclipse.rdf4j.rio.ntriples.NTriplesParser.parse(NTriplesParser.java:160)
	at org.eclipse.rdf4j.rio.ntriples.NTriplesParser.parse(NTriplesParser.java:109)
	at org.eclipse.rdf4j.console.command.Convert.convert(Convert.java:139)
	at org.eclipse.rdf4j.console.command.Convert.execute(Convert.java:74)
	at org.eclipse.rdf4j.console.command.ConvertTest.testConvertParseError(ConvertTest.java:92)
	at sun.reflect.NativeMethodAccessorImpl.invoke0(Native Method)
	at sun.reflect.NativeMethodAccessorImpl.invoke(NativeMethodAccessorImpl.java:62)
	at sun.reflect.DelegatingMethodAccessorImpl.invoke(DelegatingMethodAccessorImpl.java:43)
	at java.lang.reflect.Method.invoke(Method.java:498)
	at org.junit.runners.model.FrameworkMethod$1.runReflectiveCall(FrameworkMethod.java:50)
	at org.junit.internal.runners.model.ReflectiveCallable.run(ReflectiveCallable.java:12)
	at org.junit.runners.model.FrameworkMethod.invokeExplosively(FrameworkMethod.java:47)
	at org.junit.internal.runners.statements.InvokeMethod.evaluate(InvokeMethod.java:17)
	at org.junit.internal.runners.statements.RunBefores.evaluate(RunBefores.java:26)
	at org.junit.internal.runners.statements.RunAfters.evaluate(RunAfters.java:27)
	at org.mockito.internal.junit.JUnitRule$1.evaluateSafely(JUnitRule.java:52)
	at org.mockito.internal.junit.JUnitRule$1.evaluate(JUnitRule.java:43)
	at org.junit.rules.ExternalResource$1.evaluate(ExternalResource.java:48)
	at org.junit.rules.RunRules.evaluate(RunRules.java:20)
	at org.junit.runners.ParentRunner.runLeaf(ParentRunner.java:325)
	at org.junit.runners.BlockJUnit4ClassRunner.runChild(BlockJUnit4ClassRunner.java:78)
	at org.junit.runners.BlockJUnit4ClassRunner.runChild(BlockJUnit4ClassRunner.java:57)
	at org.junit.runners.ParentRunner$3.run(ParentRunner.java:290)
	at org.junit.runners.ParentRunner$1.schedule(ParentRunner.java:71)
	at org.junit.runners.ParentRunner.runChildren(ParentRunner.java:288)
	at org.junit.runners.ParentRunner.access$000(ParentRunner.java:58)
	at org.junit.runners.ParentRunner$2.evaluate(ParentRunner.java:268)
	at org.junit.runners.ParentRunner.run(ParentRunner.java:363)
	at org.apache.maven.surefire.junit4.JUnit4Provider.execute(JUnit4Provider.java:365)
	at org.apache.maven.surefire.junit4.JUnit4Provider.executeWithRerun(JUnit4Provider.java:273)
	at org.apache.maven.surefire.junit4.JUnit4Provider.executeTestSet(JUnit4Provider.java:238)
	at org.apache.maven.surefire.junit4.JUnit4Provider.invoke(JUnit4Provider.java:159)
	at org.apache.maven.surefire.booter.ForkedBooter.invokeProviderInSameClassLoader(ForkedBooter.java:384)
	at org.apache.maven.surefire.booter.ForkedBooter.runSuitesInProcess(ForkedBooter.java:345)
	at org.apache.maven.surefire.booter.ForkedBooter.execute(ForkedBooter.java:126)
	at org.apache.maven.surefire.booter.ForkedBooter.main(ForkedBooter.java:418)
[INFO] Tests run: 4, Failures: 0, Errors: 0, Skipped: 0, Time elapsed: 0.268 s - in org.eclipse.rdf4j.console.command.ConvertTest
[INFO] Running org.eclipse.rdf4j.console.command.ExportTest
[MockitoHint] ExportTest.testExportWorkDir (see javadoc for MockitoHint):
[MockitoHint] 1. Unused -> at org.eclipse.rdf4j.console.command.ExportTest.setUp(ExportTest.java:46)

[MockitoHint] ExportTest.testExportAll (see javadoc for MockitoHint):
[MockitoHint] 1. Unused -> at org.eclipse.rdf4j.console.command.ExportTest.setUp(ExportTest.java:46)

[MockitoHint] ExportTest.testExportContexts (see javadoc for MockitoHint):
[MockitoHint] 1. Unused -> at org.eclipse.rdf4j.console.command.ExportTest.setUp(ExportTest.java:46)

[INFO] Tests run: 3, Failures: 0, Errors: 0, Skipped: 0, Time elapsed: 0.065 s - in org.eclipse.rdf4j.console.command.ExportTest
[INFO] Running org.eclipse.rdf4j.console.command.VerifyTest
09:47:30.961 [main] ERROR Unexpected RDFParseException
org.eclipse.rdf4j.rio.RDFParseException: 'missing type' was not recognised, and could not be verified, with datatype http://example.rdf4j.org/type/wrong [line 1]
	at org.eclipse.rdf4j.rio.helpers.RDFParserHelper.reportError(RDFParserHelper.java:265)
	at org.eclipse.rdf4j.rio.helpers.RDFParserHelper.createLiteral(RDFParserHelper.java:180)
	at org.eclipse.rdf4j.rio.helpers.AbstractRDFParser.createLiteral(AbstractRDFParser.java:530)
	at org.eclipse.rdf4j.rio.turtle.TurtleParser.parseQuotedLiteral(TurtleParser.java:665)
	at org.eclipse.rdf4j.rio.turtle.TurtleParser.parseValue(TurtleParser.java:584)
	at org.eclipse.rdf4j.rio.turtle.TurtleParser.parseObject(TurtleParser.java:461)
	at org.eclipse.rdf4j.rio.turtle.TurtleParser.parseObjectList(TurtleParser.java:389)
	at org.eclipse.rdf4j.rio.turtle.TurtleParser.parsePredicateObjectList(TurtleParser.java:362)
	at org.eclipse.rdf4j.rio.turtle.TurtleParser.parseTriples(TurtleParser.java:349)
	at org.eclipse.rdf4j.rio.turtle.TurtleParser.parseStatement(TurtleParser.java:216)
	at org.eclipse.rdf4j.rio.turtle.TurtleParser.parse(TurtleParser.java:178)
	at org.eclipse.rdf4j.rio.turtle.TurtleParser.parse(TurtleParser.java:130)
	at org.eclipse.rdf4j.console.command.Verify.verify(Verify.java:145)
	at org.eclipse.rdf4j.console.command.Verify.execute(Verify.java:97)
	at org.eclipse.rdf4j.console.command.VerifyTest.testVerifyMissingType(VerifyTest.java:97)
	at sun.reflect.NativeMethodAccessorImpl.invoke0(Native Method)
	at sun.reflect.NativeMethodAccessorImpl.invoke(NativeMethodAccessorImpl.java:62)
	at sun.reflect.DelegatingMethodAccessorImpl.invoke(DelegatingMethodAccessorImpl.java:43)
	at java.lang.reflect.Method.invoke(Method.java:498)
	at org.junit.runners.model.FrameworkMethod$1.runReflectiveCall(FrameworkMethod.java:50)
	at org.junit.internal.runners.model.ReflectiveCallable.run(ReflectiveCallable.java:12)
	at org.junit.runners.model.FrameworkMethod.invokeExplosively(FrameworkMethod.java:47)
	at org.junit.internal.runners.statements.InvokeMethod.evaluate(InvokeMethod.java:17)
	at org.junit.internal.runners.statements.RunBefores.evaluate(RunBefores.java:26)
	at org.junit.internal.runners.statements.RunAfters.evaluate(RunAfters.java:27)
	at org.mockito.internal.junit.JUnitRule$1.evaluateSafely(JUnitRule.java:52)
	at org.mockito.internal.junit.JUnitRule$1.evaluate(JUnitRule.java:43)
	at org.junit.rules.ExternalResource$1.evaluate(ExternalResource.java:48)
	at org.junit.rules.RunRules.evaluate(RunRules.java:20)
	at org.junit.runners.ParentRunner.runLeaf(ParentRunner.java:325)
	at org.junit.runners.BlockJUnit4ClassRunner.runChild(BlockJUnit4ClassRunner.java:78)
	at org.junit.runners.BlockJUnit4ClassRunner.runChild(BlockJUnit4ClassRunner.java:57)
	at org.junit.runners.ParentRunner$3.run(ParentRunner.java:290)
	at org.junit.runners.ParentRunner$1.schedule(ParentRunner.java:71)
	at org.junit.runners.ParentRunner.runChildren(ParentRunner.java:288)
	at org.junit.runners.ParentRunner.access$000(ParentRunner.java:58)
	at org.junit.runners.ParentRunner$2.evaluate(ParentRunner.java:268)
	at org.junit.runners.ParentRunner.run(ParentRunner.java:363)
	at org.apache.maven.surefire.junit4.JUnit4Provider.execute(JUnit4Provider.java:365)
	at org.apache.maven.surefire.junit4.JUnit4Provider.executeWithRerun(JUnit4Provider.java:273)
	at org.apache.maven.surefire.junit4.JUnit4Provider.executeTestSet(JUnit4Provider.java:238)
	at org.apache.maven.surefire.junit4.JUnit4Provider.invoke(JUnit4Provider.java:159)
	at org.apache.maven.surefire.booter.ForkedBooter.invokeProviderInSameClassLoader(ForkedBooter.java:384)
	at org.apache.maven.surefire.booter.ForkedBooter.runSuitesInProcess(ForkedBooter.java:345)
	at org.apache.maven.surefire.booter.ForkedBooter.execute(ForkedBooter.java:126)
	at org.apache.maven.surefire.booter.ForkedBooter.main(ForkedBooter.java:418)
09:47:31.019 [main] ERROR SHACL validation failed, writing report to /tmp/genie.rdf4j/junit1723804952159807682/junit4098865168026360436.tmp
09:47:31.037 [main] ERROR Unexpected RDFParseException
org.eclipse.rdf4j.rio.RDFParseException: Unexpected end of file
	at org.eclipse.rdf4j.rio.turtle.TurtleParser.throwEOFException(TurtleParser.java:1317)
	at org.eclipse.rdf4j.rio.turtle.TurtleParser.parseValue(TurtleParser.java:589)
	at org.eclipse.rdf4j.rio.turtle.TurtleParser.parsePredicate(TurtleParser.java:434)
	at org.eclipse.rdf4j.rio.turtle.TurtleParser.parsePredicateObjectList(TurtleParser.java:358)
	at org.eclipse.rdf4j.rio.turtle.TurtleParser.parseTriples(TurtleParser.java:349)
	at org.eclipse.rdf4j.rio.turtle.TurtleParser.parseStatement(TurtleParser.java:216)
	at org.eclipse.rdf4j.rio.turtle.TurtleParser.parse(TurtleParser.java:178)
	at org.eclipse.rdf4j.rio.turtle.TurtleParser.parse(TurtleParser.java:130)
	at org.eclipse.rdf4j.console.command.Verify.verify(Verify.java:145)
	at org.eclipse.rdf4j.console.command.Verify.execute(Verify.java:97)
	at org.eclipse.rdf4j.console.command.VerifyTest.testVerifyBrokenFile(VerifyTest.java:91)
	at sun.reflect.NativeMethodAccessorImpl.invoke0(Native Method)
	at sun.reflect.NativeMethodAccessorImpl.invoke(NativeMethodAccessorImpl.java:62)
	at sun.reflect.DelegatingMethodAccessorImpl.invoke(DelegatingMethodAccessorImpl.java:43)
	at java.lang.reflect.Method.invoke(Method.java:498)
	at org.junit.runners.model.FrameworkMethod$1.runReflectiveCall(FrameworkMethod.java:50)
	at org.junit.internal.runners.model.ReflectiveCallable.run(ReflectiveCallable.java:12)
	at org.junit.runners.model.FrameworkMethod.invokeExplosively(FrameworkMethod.java:47)
	at org.junit.internal.runners.statements.InvokeMethod.evaluate(InvokeMethod.java:17)
	at org.junit.internal.runners.statements.RunBefores.evaluate(RunBefores.java:26)
	at org.junit.internal.runners.statements.RunAfters.evaluate(RunAfters.java:27)
	at org.mockito.internal.junit.JUnitRule$1.evaluateSafely(JUnitRule.java:52)
	at org.mockito.internal.junit.JUnitRule$1.evaluate(JUnitRule.java:43)
	at org.junit.rules.ExternalResource$1.evaluate(ExternalResource.java:48)
	at org.junit.rules.RunRules.evaluate(RunRules.java:20)
	at org.junit.runners.ParentRunner.runLeaf(ParentRunner.java:325)
	at org.junit.runners.BlockJUnit4ClassRunner.runChild(BlockJUnit4ClassRunner.java:78)
	at org.junit.runners.BlockJUnit4ClassRunner.runChild(BlockJUnit4ClassRunner.java:57)
	at org.junit.runners.ParentRunner$3.run(ParentRunner.java:290)
	at org.junit.runners.ParentRunner$1.schedule(ParentRunner.java:71)
	at org.junit.runners.ParentRunner.runChildren(ParentRunner.java:288)
	at org.junit.runners.ParentRunner.access$000(ParentRunner.java:58)
	at org.junit.runners.ParentRunner$2.evaluate(ParentRunner.java:268)
	at org.junit.runners.ParentRunner.run(ParentRunner.java:363)
	at org.apache.maven.surefire.junit4.JUnit4Provider.execute(JUnit4Provider.java:365)
	at org.apache.maven.surefire.junit4.JUnit4Provider.executeWithRerun(JUnit4Provider.java:273)
	at org.apache.maven.surefire.junit4.JUnit4Provider.executeTestSet(JUnit4Provider.java:238)
	at org.apache.maven.surefire.junit4.JUnit4Provider.invoke(JUnit4Provider.java:159)
	at org.apache.maven.surefire.booter.ForkedBooter.invokeProviderInSameClassLoader(ForkedBooter.java:384)
	at org.apache.maven.surefire.booter.ForkedBooter.runSuitesInProcess(ForkedBooter.java:345)
	at org.apache.maven.surefire.booter.ForkedBooter.execute(ForkedBooter.java:126)
	at org.apache.maven.surefire.booter.ForkedBooter.main(ForkedBooter.java:418)
09:47:31.050 [main] ERROR Unexpected RDFParseException
org.eclipse.rdf4j.rio.RDFParseException: Expected a letter, found '1' [line 1]
	at org.eclipse.rdf4j.rio.helpers.RDFParserHelper.reportError(RDFParserHelper.java:265)
	at org.eclipse.rdf4j.rio.helpers.AbstractRDFParser.reportError(AbstractRDFParser.java:628)
	at org.eclipse.rdf4j.rio.turtle.TurtleParser.reportError(TurtleParser.java:1297)
	at org.eclipse.rdf4j.rio.turtle.TurtleParser.parseQuotedLiteral(TurtleParser.java:619)
	at org.eclipse.rdf4j.rio.turtle.TurtleParser.parseValue(TurtleParser.java:584)
	at org.eclipse.rdf4j.rio.turtle.TurtleParser.parseObject(TurtleParser.java:461)
	at org.eclipse.rdf4j.rio.turtle.TurtleParser.parseObjectList(TurtleParser.java:389)
	at org.eclipse.rdf4j.rio.turtle.TurtleParser.parsePredicateObjectList(TurtleParser.java:362)
	at org.eclipse.rdf4j.rio.turtle.TurtleParser.parseTriples(TurtleParser.java:349)
	at org.eclipse.rdf4j.rio.turtle.TurtleParser.parseStatement(TurtleParser.java:216)
	at org.eclipse.rdf4j.rio.turtle.TurtleParser.parse(TurtleParser.java:178)
	at org.eclipse.rdf4j.rio.turtle.TurtleParser.parse(TurtleParser.java:130)
	at org.eclipse.rdf4j.console.command.Verify.verify(Verify.java:145)
	at org.eclipse.rdf4j.console.command.Verify.execute(Verify.java:97)
	at org.eclipse.rdf4j.console.command.VerifyTest.testVerifyWrongLang(VerifyTest.java:109)
	at sun.reflect.NativeMethodAccessorImpl.invoke0(Native Method)
	at sun.reflect.NativeMethodAccessorImpl.invoke(NativeMethodAccessorImpl.java:62)
	at sun.reflect.DelegatingMethodAccessorImpl.invoke(DelegatingMethodAccessorImpl.java:43)
	at java.lang.reflect.Method.invoke(Method.java:498)
	at org.junit.runners.model.FrameworkMethod$1.runReflectiveCall(FrameworkMethod.java:50)
	at org.junit.internal.runners.model.ReflectiveCallable.run(ReflectiveCallable.java:12)
	at org.junit.runners.model.FrameworkMethod.invokeExplosively(FrameworkMethod.java:47)
	at org.junit.internal.runners.statements.InvokeMethod.evaluate(InvokeMethod.java:17)
	at org.junit.internal.runners.statements.RunBefores.evaluate(RunBefores.java:26)
	at org.junit.internal.runners.statements.RunAfters.evaluate(RunAfters.java:27)
	at org.mockito.internal.junit.JUnitRule$1.evaluateSafely(JUnitRule.java:52)
	at org.mockito.internal.junit.JUnitRule$1.evaluate(JUnitRule.java:43)
	at org.junit.rules.ExternalResource$1.evaluate(ExternalResource.java:48)
	at org.junit.rules.RunRules.evaluate(RunRules.java:20)
	at org.junit.runners.ParentRunner.runLeaf(ParentRunner.java:325)
	at org.junit.runners.BlockJUnit4ClassRunner.runChild(BlockJUnit4ClassRunner.java:78)
	at org.junit.runners.BlockJUnit4ClassRunner.runChild(BlockJUnit4ClassRunner.java:57)
	at org.junit.runners.ParentRunner$3.run(ParentRunner.java:290)
	at org.junit.runners.ParentRunner$1.schedule(ParentRunner.java:71)
	at org.junit.runners.ParentRunner.runChildren(ParentRunner.java:288)
	at org.junit.runners.ParentRunner.access$000(ParentRunner.java:58)
	at org.junit.runners.ParentRunner$2.evaluate(ParentRunner.java:268)
	at org.junit.runners.ParentRunner.run(ParentRunner.java:363)
	at org.apache.maven.surefire.junit4.JUnit4Provider.execute(JUnit4Provider.java:365)
	at org.apache.maven.surefire.junit4.JUnit4Provider.executeWithRerun(JUnit4Provider.java:273)
	at org.apache.maven.surefire.junit4.JUnit4Provider.executeTestSet(JUnit4Provider.java:238)
	at org.apache.maven.surefire.junit4.JUnit4Provider.invoke(JUnit4Provider.java:159)
	at org.apache.maven.surefire.booter.ForkedBooter.invokeProviderInSameClassLoader(ForkedBooter.java:384)
	at org.apache.maven.surefire.booter.ForkedBooter.runSuitesInProcess(ForkedBooter.java:345)
	at org.apache.maven.surefire.booter.ForkedBooter.execute(ForkedBooter.java:126)
	at org.apache.maven.surefire.booter.ForkedBooter.main(ForkedBooter.java:418)
09:47:31.059 [main] ERROR No parser available for this RDF format
org.eclipse.rdf4j.rio.UnsupportedRDFormatException: Did not recognise RDF format string file:/home/hudson/genie.rdf4j/.jenkins/jobs/rdf4j-pr-verify/workspace/tools/console/does-not-exist.docx
	at org.eclipse.rdf4j.rio.Rio.lambda$unsupportedFormat$1(Rio.java:577)
	at java.util.Optional.orElseThrow(Optional.java:290)
	at org.eclipse.rdf4j.console.command.Verify.verify(Verify.java:124)
	at org.eclipse.rdf4j.console.command.Verify.execute(Verify.java:97)
	at org.eclipse.rdf4j.console.command.VerifyTest.testVerifyWrongFormat(VerifyTest.java:69)
	at sun.reflect.NativeMethodAccessorImpl.invoke0(Native Method)
	at sun.reflect.NativeMethodAccessorImpl.invoke(NativeMethodAccessorImpl.java:62)
	at sun.reflect.DelegatingMethodAccessorImpl.invoke(DelegatingMethodAccessorImpl.java:43)
	at java.lang.reflect.Method.invoke(Method.java:498)
	at org.junit.runners.model.FrameworkMethod$1.runReflectiveCall(FrameworkMethod.java:50)
	at org.junit.internal.runners.model.ReflectiveCallable.run(ReflectiveCallable.java:12)
	at org.junit.runners.model.FrameworkMethod.invokeExplosively(FrameworkMethod.java:47)
	at org.junit.internal.runners.statements.InvokeMethod.evaluate(InvokeMethod.java:17)
	at org.junit.internal.runners.statements.RunBefores.evaluate(RunBefores.java:26)
	at org.junit.internal.runners.statements.RunAfters.evaluate(RunAfters.java:27)
	at org.mockito.internal.junit.JUnitRule$1.evaluateSafely(JUnitRule.java:52)
	at org.mockito.internal.junit.JUnitRule$1.evaluate(JUnitRule.java:43)
	at org.junit.rules.ExternalResource$1.evaluate(ExternalResource.java:48)
	at org.junit.rules.RunRules.evaluate(RunRules.java:20)
	at org.junit.runners.ParentRunner.runLeaf(ParentRunner.java:325)
	at org.junit.runners.BlockJUnit4ClassRunner.runChild(BlockJUnit4ClassRunner.java:78)
	at org.junit.runners.BlockJUnit4ClassRunner.runChild(BlockJUnit4ClassRunner.java:57)
	at org.junit.runners.ParentRunner$3.run(ParentRunner.java:290)
	at org.junit.runners.ParentRunner$1.schedule(ParentRunner.java:71)
	at org.junit.runners.ParentRunner.runChildren(ParentRunner.java:288)
	at org.junit.runners.ParentRunner.access$000(ParentRunner.java:58)
	at org.junit.runners.ParentRunner$2.evaluate(ParentRunner.java:268)
	at org.junit.runners.ParentRunner.run(ParentRunner.java:363)
	at org.apache.maven.surefire.junit4.JUnit4Provider.execute(JUnit4Provider.java:365)
	at org.apache.maven.surefire.junit4.JUnit4Provider.executeWithRerun(JUnit4Provider.java:273)
	at org.apache.maven.surefire.junit4.JUnit4Provider.executeTestSet(JUnit4Provider.java:238)
	at org.apache.maven.surefire.junit4.JUnit4Provider.invoke(JUnit4Provider.java:159)
	at org.apache.maven.surefire.booter.ForkedBooter.invokeProviderInSameClassLoader(ForkedBooter.java:384)
	at org.apache.maven.surefire.booter.ForkedBooter.runSuitesInProcess(ForkedBooter.java:345)
	at org.apache.maven.surefire.booter.ForkedBooter.execute(ForkedBooter.java:126)
	at org.apache.maven.surefire.booter.ForkedBooter.main(ForkedBooter.java:418)
09:47:31.069 [main] ERROR Unexpected RDFParseException
org.eclipse.rdf4j.rio.RDFParseException: IRI included an unencoded space: '32' [line 1]
	at org.eclipse.rdf4j.rio.helpers.RDFParserHelper.reportError(RDFParserHelper.java:265)
	at org.eclipse.rdf4j.rio.helpers.AbstractRDFParser.reportError(AbstractRDFParser.java:628)
	at org.eclipse.rdf4j.rio.turtle.TurtleParser.reportError(TurtleParser.java:1297)
	at org.eclipse.rdf4j.rio.turtle.TurtleParser.parseURI(TurtleParser.java:902)
	at org.eclipse.rdf4j.rio.turtle.TurtleParser.parseValue(TurtleParser.java:575)
	at org.eclipse.rdf4j.rio.turtle.TurtleParser.parseSubject(TurtleParser.java:406)
	at org.eclipse.rdf4j.rio.turtle.TurtleParser.parseTriples(TurtleParser.java:347)
	at org.eclipse.rdf4j.rio.turtle.TurtleParser.parseStatement(TurtleParser.java:216)
	at org.eclipse.rdf4j.rio.turtle.TurtleParser.parse(TurtleParser.java:178)
	at org.eclipse.rdf4j.rio.turtle.TurtleParser.parse(TurtleParser.java:130)
	at org.eclipse.rdf4j.console.command.Verify.verify(Verify.java:145)
	at org.eclipse.rdf4j.console.command.Verify.execute(Verify.java:97)
	at org.eclipse.rdf4j.console.command.VerifyTest.testVerifySpaceIRI(VerifyTest.java:103)
	at sun.reflect.NativeMethodAccessorImpl.invoke0(Native Method)
	at sun.reflect.NativeMethodAccessorImpl.invoke(NativeMethodAccessorImpl.java:62)
	at sun.reflect.DelegatingMethodAccessorImpl.invoke(DelegatingMethodAccessorImpl.java:43)
	at java.lang.reflect.Method.invoke(Method.java:498)
	at org.junit.runners.model.FrameworkMethod$1.runReflectiveCall(FrameworkMethod.java:50)
	at org.junit.internal.runners.model.ReflectiveCallable.run(ReflectiveCallable.java:12)
	at org.junit.runners.model.FrameworkMethod.invokeExplosively(FrameworkMethod.java:47)
	at org.junit.internal.runners.statements.InvokeMethod.evaluate(InvokeMethod.java:17)
	at org.junit.internal.runners.statements.RunBefores.evaluate(RunBefores.java:26)
	at org.junit.internal.runners.statements.RunAfters.evaluate(RunAfters.java:27)
	at org.mockito.internal.junit.JUnitRule$1.evaluateSafely(JUnitRule.java:52)
	at org.mockito.internal.junit.JUnitRule$1.evaluate(JUnitRule.java:43)
	at org.junit.rules.ExternalResource$1.evaluate(ExternalResource.java:48)
	at org.junit.rules.RunRules.evaluate(RunRules.java:20)
	at org.junit.runners.ParentRunner.runLeaf(ParentRunner.java:325)
	at org.junit.runners.BlockJUnit4ClassRunner.runChild(BlockJUnit4ClassRunner.java:78)
	at org.junit.runners.BlockJUnit4ClassRunner.runChild(BlockJUnit4ClassRunner.java:57)
	at org.junit.runners.ParentRunner$3.run(ParentRunner.java:290)
	at org.junit.runners.ParentRunner$1.schedule(ParentRunner.java:71)
	at org.junit.runners.ParentRunner.runChildren(ParentRunner.java:288)
	at org.junit.runners.ParentRunner.access$000(ParentRunner.java:58)
	at org.junit.runners.ParentRunner$2.evaluate(ParentRunner.java:268)
	at org.junit.runners.ParentRunner.run(ParentRunner.java:363)
	at org.apache.maven.surefire.junit4.JUnit4Provider.execute(JUnit4Provider.java:365)
	at org.apache.maven.surefire.junit4.JUnit4Provider.executeWithRerun(JUnit4Provider.java:273)
	at org.apache.maven.surefire.junit4.JUnit4Provider.executeTestSet(JUnit4Provider.java:238)
	at org.apache.maven.surefire.junit4.JUnit4Provider.invoke(JUnit4Provider.java:159)
	at org.apache.maven.surefire.booter.ForkedBooter.invokeProviderInSameClassLoader(ForkedBooter.java:384)
	at org.apache.maven.surefire.booter.ForkedBooter.runSuitesInProcess(ForkedBooter.java:345)
	at org.apache.maven.surefire.booter.ForkedBooter.execute(ForkedBooter.java:126)
	at org.apache.maven.surefire.booter.ForkedBooter.main(ForkedBooter.java:418)
[INFO] Tests run: 10, Failures: 0, Errors: 0, Skipped: 0, Time elapsed: 0.461 s - in org.eclipse.rdf4j.console.command.VerifyTest
[INFO] Running org.eclipse.rdf4j.console.command.DropTest
[MockitoHint] DropTest.testUserAbortedUnsafeDropBeforeWarning (see javadoc for MockitoHint):
[MockitoHint] 1. Unused -> at org.eclipse.rdf4j.console.command.DropTest.setUp(DropTest.java:50)

[INFO] Tests run: 3, Failures: 0, Errors: 0, Skipped: 0, Time elapsed: 0.115 s - in org.eclipse.rdf4j.console.command.DropTest
[INFO] Running org.eclipse.rdf4j.console.command.FederateTest
09:47:31.236 [main] DEBUG Initializing MemoryStore...
09:47:31.237 [main] DEBUG Initializing data file...
09:47:31.237 [main] DEBUG Data file initialized
09:47:31.237 [main] DEBUG MemoryStore initialized
09:47:31.239 [main] DEBUG syncing data to file...
09:47:31.239 [main] DEBUG Data synced to file
09:47:31.242 [main] DEBUG Initializing MemoryStore...
09:47:31.243 [main] DEBUG Initializing data file...
09:47:31.244 [main] DEBUG Data file initialized
09:47:31.244 [main] DEBUG MemoryStore initialized
09:47:31.245 [main] DEBUG syncing data to file...
09:47:31.246 [main] DEBUG Data synced to file
09:47:31.258 [main] DEBUG Federate called with federation ID = fedID, and member ID's = [sparql][alien][http].
  Distinct set to false, and readonly set to true.

09:47:31.261 [main] DEBUG Federation repository root node: _:node1drqmrofcx216
09:47:31.262 [main] DEBUG _:node1drqmrofcx216 http://www.w3.org/1999/02/22-rdf-syntax-ns#type http://www.openrdf.org/config/repository#Repository
09:47:31.262 [main] DEBUG _:node1drqmrofcx216 http://www.openrdf.org/config/repository#repositoryID "fedID"
09:47:31.262 [main] DEBUG _:node1drqmrofcx216 http://www.w3.org/2000/01/rdf-schema#label "Test Federation Title"
09:47:31.262 [main] DEBUG _:node1drqmrofcx216 http://www.openrdf.org/config/repository#repositoryImpl _:node1drqmrofcx217
09:47:31.262 [main] DEBUG _:node1drqmrofcx217 http://www.openrdf.org/config/repository#repositoryType "openrdf:SailRepository"
09:47:31.262 [main] DEBUG _:node1drqmrofcx217 http://www.openrdf.org/config/repository/sail#sailImpl _:node1drqmrofcx218
09:47:31.262 [main] DEBUG _:node1drqmrofcx218 http://www.openrdf.org/config/sail#sailType "openrdf:Federation"
09:47:31.263 [main] DEBUG _:node1drqmrofcx218 http://www.openrdf.org/config/sail/federation#readOnly "true"^^<http://www.w3.org/2001/XMLSchema#boolean>
09:47:31.263 [main] DEBUG _:node1drqmrofcx218 http://www.openrdf.org/config/sail/federation#distinct "false"^^<http://www.w3.org/2001/XMLSchema#boolean>
09:47:31.263 [main] DEBUG Adding member: sparql
09:47:31.263 [main] DEBUG _:node1drqmrofcx218 http://www.openrdf.org/config/sail/federation#member _:node1drqmrofcx219
09:47:31.263 [main] DEBUG _:node1drqmrofcx219 http://www.openrdf.org/config/repository#repositoryType "openrdf:SPARQLRepository"
09:47:31.264 [main] DEBUG _:node1drqmrofcx219 http://www.openrdf.org/config/repository/sparql#query-endpoint http://localhost:8080/openrdf-sesame/repositories/sparql
09:47:31.264 [main] DEBUG Added member sparql: 
09:47:31.264 [main] DEBUG Adding member: alien
09:47:31.264 [main] DEBUG _:node1drqmrofcx218 http://www.openrdf.org/config/sail/federation#member _:node1drqmrofcx222
09:47:31.264 [main] DEBUG _:node1drqmrofcx222 http://www.openrdf.org/config/repository#repositoryType "openrdf:ProxyRepository"
09:47:31.264 [main] DEBUG _:node1drqmrofcx222 http://www.openrdf.org/config/repository/proxy#proxiedID "alien"
09:47:31.265 [main] DEBUG Added member alien: 
09:47:31.265 [main] DEBUG Adding member: http
09:47:31.265 [main] DEBUG _:node1drqmrofcx218 http://www.openrdf.org/config/sail/federation#member _:node1drqmrofcx225
09:47:31.265 [main] DEBUG _:node1drqmrofcx225 http://www.openrdf.org/config/repository#repositoryType "openrdf:HTTPRepository"
09:47:31.266 [main] DEBUG _:node1drqmrofcx225 http://www.openrdf.org/config/repository/http#repositoryURL http://localhost:8080/openrdf-sesame/repositories/http
09:47:31.266 [main] DEBUG Added member http: 
09:47:31.290 [main] DEBUG Initializing MemoryStore...
09:47:31.291 [main] DEBUG Initializing data file...
09:47:31.291 [main] DEBUG Data file initialized
09:47:31.291 [main] DEBUG MemoryStore initialized
09:47:31.292 [main] DEBUG syncing data to file...
09:47:31.293 [main] DEBUG Data synced to file
09:47:31.296 [main] DEBUG Initializing MemoryStore...
09:47:31.297 [main] DEBUG Initializing data file...
09:47:31.298 [main] DEBUG Data file initialized
09:47:31.298 [main] DEBUG MemoryStore initialized
09:47:31.300 [main] DEBUG syncing data to file...
09:47:31.300 [main] DEBUG Data synced to file
09:47:31.309 [main] ERROR Duplicate repository id's specified.
[MockitoHint] FederateTest.testDuplicateMembersPrintsError (see javadoc for MockitoHint):
[MockitoHint] 1. Unused -> at org.eclipse.rdf4j.console.command.FederateTest.setUp(FederateTest.java:87)
[MockitoHint] 2. Unused -> at org.eclipse.rdf4j.console.command.FederateTest.setUp(FederateTest.java:88)

09:47:31.316 [main] DEBUG Initializing MemoryStore...
09:47:31.317 [main] DEBUG Initializing data file...
09:47:31.318 [main] DEBUG Data file initialized
09:47:31.318 [main] DEBUG MemoryStore initialized
09:47:31.319 [main] DEBUG syncing data to file...
09:47:31.320 [main] DEBUG Data synced to file
09:47:31.323 [main] DEBUG Initializing MemoryStore...
09:47:31.323 [main] DEBUG Initializing data file...
09:47:31.323 [main] DEBUG Data file initialized
09:47:31.323 [main] DEBUG MemoryStore initialized
09:47:31.325 [main] DEBUG syncing data to file...
09:47:31.325 [main] DEBUG Data synced to file
09:47:31.332 [main] DEBUG Federate called with federation ID = alien, and member ID's = [fedID][scary].
  Distinct set to false, and readonly set to true.

09:47:31.333 [main] ERROR alien already exists.
[MockitoHint] FederateTest.testFedAlreadyExistsPrintsSpecificError (see javadoc for MockitoHint):
[MockitoHint] 1. Unused -> at org.eclipse.rdf4j.console.command.FederateTest.setUp(FederateTest.java:88)

09:47:31.339 [main] DEBUG Initializing MemoryStore...
09:47:31.340 [main] DEBUG Initializing data file...
09:47:31.341 [main] DEBUG Data file initialized
09:47:31.341 [main] DEBUG MemoryStore initialized
09:47:31.342 [main] DEBUG syncing data to file...
09:47:31.342 [main] DEBUG Data synced to file
09:47:31.345 [main] DEBUG Initializing MemoryStore...
09:47:31.345 [main] DEBUG Initializing data file...
09:47:31.346 [main] DEBUG Data file initialized
09:47:31.346 [main] DEBUG MemoryStore initialized
09:47:31.348 [main] DEBUG syncing data to file...
09:47:31.349 [main] DEBUG Data synced to file
09:47:31.359 [main] DEBUG Federate called with federation ID = fedID, and member ID's = [alien][scary].
  Distinct set to true, and readonly set to false.

09:47:31.361 [main] DEBUG Federation repository root node: _:node1drqmrofcx338
09:47:31.361 [main] DEBUG _:node1drqmrofcx338 http://www.w3.org/1999/02/22-rdf-syntax-ns#type http://www.openrdf.org/config/repository#Repository
09:47:31.361 [main] DEBUG _:node1drqmrofcx338 http://www.openrdf.org/config/repository#repositoryID "fedID"
09:47:31.361 [main] DEBUG _:node1drqmrofcx338 http://www.w3.org/2000/01/rdf-schema#label "Test Federation Title"
09:47:31.361 [main] DEBUG _:node1drqmrofcx338 http://www.openrdf.org/config/repository#repositoryImpl _:node1drqmrofcx339
09:47:31.361 [main] DEBUG _:node1drqmrofcx339 http://www.openrdf.org/config/repository#repositoryType "openrdf:SailRepository"
09:47:31.361 [main] DEBUG _:node1drqmrofcx339 http://www.openrdf.org/config/repository/sail#sailImpl _:node1drqmrofcx340
09:47:31.361 [main] DEBUG _:node1drqmrofcx340 http://www.openrdf.org/config/sail#sailType "openrdf:Federation"
09:47:31.361 [main] DEBUG _:node1drqmrofcx340 http://www.openrdf.org/config/sail/federation#readOnly "false"^^<http://www.w3.org/2001/XMLSchema#boolean>
09:47:31.361 [main] DEBUG _:node1drqmrofcx340 http://www.openrdf.org/config/sail/federation#distinct "true"^^<http://www.w3.org/2001/XMLSchema#boolean>
09:47:31.361 [main] DEBUG Adding member: alien
09:47:31.361 [main] DEBUG _:node1drqmrofcx340 http://www.openrdf.org/config/sail/federation#member _:node1drqmrofcx341
09:47:31.362 [main] DEBUG _:node1drqmrofcx341 http://www.openrdf.org/config/repository#repositoryType "openrdf:ProxyRepository"
09:47:31.362 [main] DEBUG _:node1drqmrofcx341 http://www.openrdf.org/config/repository/proxy#proxiedID "alien"
09:47:31.362 [main] DEBUG Added member alien: 
09:47:31.362 [main] DEBUG Adding member: scary
09:47:31.362 [main] DEBUG _:node1drqmrofcx340 http://www.openrdf.org/config/sail/federation#member _:node1drqmrofcx344
09:47:31.363 [main] DEBUG _:node1drqmrofcx344 http://www.openrdf.org/config/repository#repositoryType "openrdf:ProxyRepository"
09:47:31.363 [main] DEBUG _:node1drqmrofcx344 http://www.openrdf.org/config/repository/proxy#proxiedID "scary"
09:47:31.363 [main] DEBUG Added member scary: 
09:47:31.386 [main] DEBUG Initializing MemoryStore...
09:47:31.386 [main] DEBUG Initializing data file...
09:47:31.387 [main] DEBUG Data file initialized
09:47:31.387 [main] DEBUG MemoryStore initialized
09:47:31.389 [main] DEBUG syncing data to file...
09:47:31.389 [main] DEBUG Data synced to file
09:47:31.393 [main] DEBUG Initializing MemoryStore...
09:47:31.394 [main] DEBUG Initializing data file...
09:47:31.394 [main] DEBUG Data file initialized
09:47:31.394 [main] DEBUG MemoryStore initialized
09:47:31.396 [main] DEBUG syncing data to file...
09:47:31.397 [main] DEBUG Data synced to file
09:47:31.404 [main] DEBUG Federate called with federation ID = fedID, and member ID's = [sparql][sparql2].
  Distinct set to false, and readonly set to false.

09:47:31.406 [main] ERROR sparql is read-only.
09:47:31.407 [main] ERROR sparql2 is read-only.
[MockitoHint] FederateTest.testSparqlAndNotReadOnlyPrintsError (see javadoc for MockitoHint):
[MockitoHint] 1. Unused -> at org.eclipse.rdf4j.console.command.FederateTest.setUp(FederateTest.java:88)

09:47:31.416 [main] DEBUG Initializing MemoryStore...
09:47:31.417 [main] DEBUG Initializing data file...
09:47:31.418 [main] DEBUG Data file initialized
09:47:31.418 [main] DEBUG MemoryStore initialized
09:47:31.420 [main] DEBUG syncing data to file...
09:47:31.421 [main] DEBUG Data synced to file
09:47:31.424 [main] DEBUG Initializing MemoryStore...
09:47:31.425 [main] DEBUG Initializing data file...
09:47:31.425 [main] DEBUG Data file initialized
09:47:31.425 [main] DEBUG MemoryStore initialized
09:47:31.427 [main] DEBUG syncing data to file...
09:47:31.427 [main] DEBUG Data synced to file
[MockitoHint] FederateTest.testNoArgumentsPrintsHelp (see javadoc for MockitoHint):
[MockitoHint] 1. Unused -> at org.eclipse.rdf4j.console.command.FederateTest.setUp(FederateTest.java:87)
[MockitoHint] 2. Unused -> at org.eclipse.rdf4j.console.command.FederateTest.setUp(FederateTest.java:88)

09:47:31.446 [main] DEBUG Initializing MemoryStore...
09:47:31.447 [main] DEBUG Initializing data file...
09:47:31.447 [main] DEBUG Data file initialized
09:47:31.447 [main] DEBUG MemoryStore initialized
09:47:31.449 [main] DEBUG syncing data to file...
09:47:31.450 [main] DEBUG Data synced to file
09:47:31.452 [main] DEBUG Initializing MemoryStore...
09:47:31.453 [main] DEBUG Initializing data file...
09:47:31.453 [main] DEBUG Data file initialized
09:47:31.453 [main] DEBUG MemoryStore initialized
09:47:31.454 [main] DEBUG syncing data to file...
09:47:31.455 [main] DEBUG Data synced to file
09:47:31.461 [main] DEBUG Federate called with federation ID = type=memory, and member ID's = [fedID][alien][scary].
  Distinct set to false, and readonly set to true.

09:47:31.461 [main] ERROR fedID does not exist.
[MockitoHint] FederateTest.testInvalidArgumentPrintsError (see javadoc for MockitoHint):
[MockitoHint] 1. Unused -> at org.eclipse.rdf4j.console.command.FederateTest.setUp(FederateTest.java:88)

09:47:31.469 [main] DEBUG Initializing MemoryStore...
09:47:31.470 [main] DEBUG Initializing data file...
09:47:31.470 [main] DEBUG Data file initialized
09:47:31.470 [main] DEBUG MemoryStore initialized
09:47:31.472 [main] DEBUG syncing data to file...
09:47:31.472 [main] DEBUG Data synced to file
09:47:31.475 [main] DEBUG Initializing MemoryStore...
09:47:31.476 [main] DEBUG Initializing data file...
09:47:31.476 [main] DEBUG Data file initialized
09:47:31.476 [main] DEBUG MemoryStore initialized
09:47:31.477 [main] DEBUG syncing data to file...
09:47:31.478 [main] DEBUG Data synced to file
09:47:31.484 [main] DEBUG Federate called with federation ID = fedID, and member ID's = [sparql][sparql2].
  Distinct set to false, and readonly set to true.

09:47:31.485 [main] DEBUG Federation repository root node: _:node1drqmrofcx494
09:47:31.485 [main] DEBUG _:node1drqmrofcx494 http://www.w3.org/1999/02/22-rdf-syntax-ns#type http://www.openrdf.org/config/repository#Repository
09:47:31.485 [main] DEBUG _:node1drqmrofcx494 http://www.openrdf.org/config/repository#repositoryID "fedID"
09:47:31.485 [main] DEBUG _:node1drqmrofcx494 http://www.w3.org/2000/01/rdf-schema#label "Test Federation Title"
09:47:31.486 [main] DEBUG _:node1drqmrofcx494 http://www.openrdf.org/config/repository#repositoryImpl _:node1drqmrofcx495
09:47:31.486 [main] DEBUG _:node1drqmrofcx495 http://www.openrdf.org/config/repository#repositoryType "openrdf:SailRepository"
09:47:31.486 [main] DEBUG _:node1drqmrofcx495 http://www.openrdf.org/config/repository/sail#sailImpl _:node1drqmrofcx496
09:47:31.486 [main] DEBUG _:node1drqmrofcx496 http://www.openrdf.org/config/sail#sailType "openrdf:Federation"
09:47:31.486 [main] DEBUG _:node1drqmrofcx496 http://www.openrdf.org/config/sail/federation#readOnly "true"^^<http://www.w3.org/2001/XMLSchema#boolean>
09:47:31.486 [main] DEBUG _:node1drqmrofcx496 http://www.openrdf.org/config/sail/federation#distinct "false"^^<http://www.w3.org/2001/XMLSchema#boolean>
09:47:31.486 [main] DEBUG Adding member: sparql
09:47:31.486 [main] DEBUG _:node1drqmrofcx496 http://www.openrdf.org/config/sail/federation#member _:node1drqmrofcx497
09:47:31.486 [main] DEBUG _:node1drqmrofcx497 http://www.openrdf.org/config/repository#repositoryType "openrdf:SPARQLRepository"
09:47:31.487 [main] DEBUG _:node1drqmrofcx497 http://www.openrdf.org/config/repository/sparql#query-endpoint http://localhost:8080/openrdf-sesame/repositories/sparql
09:47:31.487 [main] DEBUG Added member sparql: 
09:47:31.487 [main] DEBUG Adding member: sparql2
09:47:31.487 [main] DEBUG _:node1drqmrofcx496 http://www.openrdf.org/config/sail/federation#member _:node1drqmrofcx500
09:47:31.487 [main] DEBUG _:node1drqmrofcx500 http://www.openrdf.org/config/repository#repositoryType "openrdf:SPARQLRepository"
09:47:31.487 [main] DEBUG _:node1drqmrofcx500 http://www.openrdf.org/config/repository/sparql#query-endpoint http://localhost:8080/openrdf-sesame/repositories/sparql
09:47:31.487 [main] DEBUG Added member sparql2: 
09:47:31.498 [main] DEBUG Initializing MemoryStore...
09:47:31.498 [main] DEBUG Initializing data file...
09:47:31.499 [main] DEBUG Data file initialized
09:47:31.499 [main] DEBUG MemoryStore initialized
09:47:31.500 [main] DEBUG syncing data to file...
09:47:31.500 [main] DEBUG Data synced to file
09:47:31.503 [main] DEBUG Initializing MemoryStore...
09:47:31.505 [main] DEBUG Initializing data file...
09:47:31.505 [main] DEBUG Data file initialized
09:47:31.505 [main] DEBUG MemoryStore initialized
09:47:31.506 [main] DEBUG syncing data to file...
09:47:31.507 [main] DEBUG Data synced to file
09:47:31.513 [main] DEBUG Federate called with federation ID = fedID, and member ID's = [http][sparql].
  Distinct set to false, and readonly set to true.

09:47:31.514 [main] DEBUG Federation repository root node: _:node1drqmrofcx549
09:47:31.514 [main] DEBUG _:node1drqmrofcx549 http://www.w3.org/1999/02/22-rdf-syntax-ns#type http://www.openrdf.org/config/repository#Repository
09:47:31.514 [main] DEBUG _:node1drqmrofcx549 http://www.openrdf.org/config/repository#repositoryID "fedID"
09:47:31.514 [main] DEBUG _:node1drqmrofcx549 http://www.w3.org/2000/01/rdf-schema#label "Test Federation Title"
09:47:31.515 [main] DEBUG _:node1drqmrofcx549 http://www.openrdf.org/config/repository#repositoryImpl _:node1drqmrofcx550
09:47:31.515 [main] DEBUG _:node1drqmrofcx550 http://www.openrdf.org/config/repository#repositoryType "openrdf:SailRepository"
09:47:31.515 [main] DEBUG _:node1drqmrofcx550 http://www.openrdf.org/config/repository/sail#sailImpl _:node1drqmrofcx551
09:47:31.515 [main] DEBUG _:node1drqmrofcx551 http://www.openrdf.org/config/sail#sailType "openrdf:Federation"
09:47:31.515 [main] DEBUG _:node1drqmrofcx551 http://www.openrdf.org/config/sail/federation#readOnly "true"^^<http://www.w3.org/2001/XMLSchema#boolean>
09:47:31.515 [main] DEBUG _:node1drqmrofcx551 http://www.openrdf.org/config/sail/federation#distinct "false"^^<http://www.w3.org/2001/XMLSchema#boolean>
09:47:31.515 [main] DEBUG Adding member: http
09:47:31.515 [main] DEBUG _:node1drqmrofcx551 http://www.openrdf.org/config/sail/federation#member _:node1drqmrofcx552
09:47:31.515 [main] DEBUG _:node1drqmrofcx552 http://www.openrdf.org/config/repository#repositoryType "openrdf:HTTPRepository"
09:47:31.516 [main] DEBUG _:node1drqmrofcx552 http://www.openrdf.org/config/repository/http#repositoryURL http://localhost:8080/openrdf-sesame/repositories/http
09:47:31.516 [main] DEBUG Added member http: 
09:47:31.516 [main] DEBUG Adding member: sparql
09:47:31.516 [main] DEBUG _:node1drqmrofcx551 http://www.openrdf.org/config/sail/federation#member _:node1drqmrofcx555
09:47:31.516 [main] DEBUG _:node1drqmrofcx555 http://www.openrdf.org/config/repository#repositoryType "openrdf:SPARQLRepository"
09:47:31.517 [main] DEBUG _:node1drqmrofcx555 http://www.openrdf.org/config/repository/sparql#query-endpoint http://localhost:8080/openrdf-sesame/repositories/sparql
09:47:31.517 [main] DEBUG Added member sparql: 
09:47:31.528 [main] DEBUG Initializing MemoryStore...
09:47:31.528 [main] DEBUG Initializing data file...
09:47:31.529 [main] DEBUG Data file initialized
09:47:31.529 [main] DEBUG MemoryStore initialized
09:47:31.530 [main] DEBUG syncing data to file...
09:47:31.531 [main] DEBUG Data synced to file
09:47:31.534 [main] DEBUG Initializing MemoryStore...
09:47:31.535 [main] DEBUG Initializing data file...
09:47:31.535 [main] DEBUG Data file initialized
09:47:31.535 [main] DEBUG MemoryStore initialized
09:47:31.537 [main] DEBUG syncing data to file...
09:47:31.539 [main] DEBUG Data synced to file
09:47:31.548 [main] DEBUG Federate called with federation ID = fedID, and member ID's = [alien][FreeLunch].
  Distinct set to false, and readonly set to true.

09:47:31.549 [main] ERROR FreeLunch does not exist.
[MockitoHint] FederateTest.testNonexistentMemberPrintsSpecificError (see javadoc for MockitoHint):
[MockitoHint] 1. Unused -> at org.eclipse.rdf4j.console.command.FederateTest.setUp(FederateTest.java:88)

09:47:31.555 [main] DEBUG Initializing MemoryStore...
09:47:31.556 [main] DEBUG Initializing data file...
09:47:31.556 [main] DEBUG Data file initialized
09:47:31.556 [main] DEBUG MemoryStore initialized
09:47:31.557 [main] DEBUG syncing data to file...
09:47:31.558 [main] DEBUG Data synced to file
09:47:31.560 [main] DEBUG Initializing MemoryStore...
09:47:31.561 [main] DEBUG Initializing data file...
09:47:31.562 [main] DEBUG Data file initialized
09:47:31.562 [main] DEBUG MemoryStore initialized
09:47:31.563 [main] DEBUG syncing data to file...
09:47:31.564 [main] DEBUG Data synced to file
09:47:31.570 [main] ERROR Duplicate repository id's specified.
[MockitoHint] FederateTest.testFedSameAsMemberPrintsError (see javadoc for MockitoHint):
[MockitoHint] 1. Unused -> at org.eclipse.rdf4j.console.command.FederateTest.setUp(FederateTest.java:87)
[MockitoHint] 2. Unused -> at org.eclipse.rdf4j.console.command.FederateTest.setUp(FederateTest.java:88)

09:47:31.576 [main] DEBUG Initializing MemoryStore...
09:47:31.577 [main] DEBUG Initializing data file...
09:47:31.577 [main] DEBUG Data file initialized
09:47:31.577 [main] DEBUG MemoryStore initialized
09:47:31.578 [main] DEBUG syncing data to file...
09:47:31.579 [main] DEBUG Data synced to file
09:47:31.581 [main] DEBUG Initializing MemoryStore...
09:47:31.582 [main] DEBUG Initializing data file...
09:47:31.583 [main] DEBUG Data file initialized
09:47:31.583 [main] DEBUG MemoryStore initialized
09:47:31.584 [main] DEBUG syncing data to file...
09:47:31.585 [main] DEBUG Data synced to file
[MockitoHint] FederateTest.testTwoArgumentsPrintsHelp (see javadoc for MockitoHint):
[MockitoHint] 1. Unused -> at org.eclipse.rdf4j.console.command.FederateTest.setUp(FederateTest.java:87)
[MockitoHint] 2. Unused -> at org.eclipse.rdf4j.console.command.FederateTest.setUp(FederateTest.java:88)

09:47:31.596 [main] DEBUG Initializing MemoryStore...
09:47:31.597 [main] DEBUG Initializing data file...
09:47:31.597 [main] DEBUG Data file initialized
09:47:31.597 [main] DEBUG MemoryStore initialized
09:47:31.598 [main] DEBUG syncing data to file...
09:47:31.599 [main] DEBUG Data synced to file
09:47:31.601 [main] DEBUG Initializing MemoryStore...
09:47:31.602 [main] DEBUG Initializing data file...
09:47:31.603 [main] DEBUG Data file initialized
09:47:31.603 [main] DEBUG MemoryStore initialized
09:47:31.604 [main] DEBUG syncing data to file...
09:47:31.605 [main] DEBUG Data synced to file
09:47:31.610 [main] DEBUG Federate called with federation ID = fedID, and member ID's = [alien][scary].
  Distinct set to false, and readonly set to true.

09:47:31.611 [main] DEBUG Federation repository root node: _:node1drqmrofcx692
09:47:31.611 [main] DEBUG _:node1drqmrofcx692 http://www.w3.org/1999/02/22-rdf-syntax-ns#type http://www.openrdf.org/config/repository#Repository
09:47:31.611 [main] DEBUG _:node1drqmrofcx692 http://www.openrdf.org/config/repository#repositoryID "fedID"
09:47:31.611 [main] DEBUG _:node1drqmrofcx692 http://www.w3.org/2000/01/rdf-schema#label "Test Federation Title"
09:47:31.611 [main] DEBUG _:node1drqmrofcx692 http://www.openrdf.org/config/repository#repositoryImpl _:node1drqmrofcx693
09:47:31.611 [main] DEBUG _:node1drqmrofcx693 http://www.openrdf.org/config/repository#repositoryType "openrdf:SailRepository"
09:47:31.611 [main] DEBUG _:node1drqmrofcx693 http://www.openrdf.org/config/repository/sail#sailImpl _:node1drqmrofcx694
09:47:31.611 [main] DEBUG _:node1drqmrofcx694 http://www.openrdf.org/config/sail#sailType "openrdf:Federation"
09:47:31.611 [main] DEBUG _:node1drqmrofcx694 http://www.openrdf.org/config/sail/federation#readOnly "true"^^<http://www.w3.org/2001/XMLSchema#boolean>
09:47:31.611 [main] DEBUG _:node1drqmrofcx694 http://www.openrdf.org/config/sail/federation#distinct "false"^^<http://www.w3.org/2001/XMLSchema#boolean>
09:47:31.612 [main] DEBUG Adding member: alien
09:47:31.612 [main] DEBUG _:node1drqmrofcx694 http://www.openrdf.org/config/sail/federation#member _:node1drqmrofcx695
09:47:31.612 [main] DEBUG _:node1drqmrofcx695 http://www.openrdf.org/config/repository#repositoryType "openrdf:ProxyRepository"
09:47:31.612 [main] DEBUG _:node1drqmrofcx695 http://www.openrdf.org/config/repository/proxy#proxiedID "alien"
09:47:31.612 [main] DEBUG Added member alien: 
09:47:31.612 [main] DEBUG Adding member: scary
09:47:31.612 [main] DEBUG _:node1drqmrofcx694 http://www.openrdf.org/config/sail/federation#member _:node1drqmrofcx698
09:47:31.613 [main] DEBUG _:node1drqmrofcx698 http://www.openrdf.org/config/repository#repositoryType "openrdf:ProxyRepository"
09:47:31.613 [main] DEBUG _:node1drqmrofcx698 http://www.openrdf.org/config/repository/proxy#proxiedID "scary"
09:47:31.613 [main] DEBUG Added member scary: 
09:47:31.626 [main] DEBUG Initializing MemoryStore...
09:47:31.627 [main] DEBUG Initializing data file...
09:47:31.628 [main] DEBUG Data file initialized
09:47:31.628 [main] DEBUG MemoryStore initialized
09:47:31.629 [main] DEBUG syncing data to file...
09:47:31.629 [main] DEBUG Data synced to file
09:47:31.632 [main] DEBUG Initializing MemoryStore...
09:47:31.632 [main] DEBUG Initializing data file...
09:47:31.633 [main] DEBUG Data file initialized
09:47:31.633 [main] DEBUG MemoryStore initialized
09:47:31.634 [main] DEBUG syncing data to file...
09:47:31.634 [main] DEBUG Data synced to file
[MockitoHint] FederateTest.testOneArgumentPrintsHelp (see javadoc for MockitoHint):
[MockitoHint] 1. Unused -> at org.eclipse.rdf4j.console.command.FederateTest.setUp(FederateTest.java:87)
[MockitoHint] 2. Unused -> at org.eclipse.rdf4j.console.command.FederateTest.setUp(FederateTest.java:88)

09:47:31.646 [main] DEBUG Initializing MemoryStore...
09:47:31.647 [main] DEBUG Initializing data file...
09:47:31.648 [main] DEBUG Data file initialized
09:47:31.648 [main] DEBUG MemoryStore initialized
09:47:31.649 [main] DEBUG syncing data to file...
09:47:31.649 [main] DEBUG Data synced to file
09:47:31.651 [main] DEBUG Initializing MemoryStore...
09:47:31.652 [main] DEBUG Initializing data file...
09:47:31.652 [main] DEBUG Data file initialized
09:47:31.652 [main] DEBUG MemoryStore initialized
09:47:31.653 [main] DEBUG syncing data to file...
09:47:31.653 [main] DEBUG Data synced to file
09:47:31.659 [main] DEBUG Federate called with federation ID = fedID, and member ID's = [http][http2].
  Distinct set to false, and readonly set to true.

09:47:31.660 [main] DEBUG Federation repository root node: _:node1drqmrofcx784
09:47:31.660 [main] DEBUG _:node1drqmrofcx784 http://www.w3.org/1999/02/22-rdf-syntax-ns#type http://www.openrdf.org/config/repository#Repository
09:47:31.660 [main] DEBUG _:node1drqmrofcx784 http://www.openrdf.org/config/repository#repositoryID "fedID"
09:47:31.660 [main] DEBUG _:node1drqmrofcx784 http://www.w3.org/2000/01/rdf-schema#label "Test Federation Title"
09:47:31.660 [main] DEBUG _:node1drqmrofcx784 http://www.openrdf.org/config/repository#repositoryImpl _:node1drqmrofcx785
09:47:31.660 [main] DEBUG _:node1drqmrofcx785 http://www.openrdf.org/config/repository#repositoryType "openrdf:SailRepository"
09:47:31.660 [main] DEBUG _:node1drqmrofcx785 http://www.openrdf.org/config/repository/sail#sailImpl _:node1drqmrofcx786
09:47:31.660 [main] DEBUG _:node1drqmrofcx786 http://www.openrdf.org/config/sail#sailType "openrdf:Federation"
09:47:31.660 [main] DEBUG _:node1drqmrofcx786 http://www.openrdf.org/config/sail/federation#readOnly "true"^^<http://www.w3.org/2001/XMLSchema#boolean>
09:47:31.660 [main] DEBUG _:node1drqmrofcx786 http://www.openrdf.org/config/sail/federation#distinct "false"^^<http://www.w3.org/2001/XMLSchema#boolean>
09:47:31.660 [main] DEBUG Adding member: http
09:47:31.660 [main] DEBUG _:node1drqmrofcx786 http://www.openrdf.org/config/sail/federation#member _:node1drqmrofcx787
09:47:31.660 [main] DEBUG _:node1drqmrofcx787 http://www.openrdf.org/config/repository#repositoryType "openrdf:HTTPRepository"
09:47:31.661 [main] DEBUG _:node1drqmrofcx787 http://www.openrdf.org/config/repository/http#repositoryURL http://localhost:8080/openrdf-sesame/repositories/http
09:47:31.661 [main] DEBUG Added member http: 
09:47:31.661 [main] DEBUG Adding member: http2
09:47:31.661 [main] DEBUG _:node1drqmrofcx786 http://www.openrdf.org/config/sail/federation#member _:node1drqmrofcx790
09:47:31.661 [main] DEBUG _:node1drqmrofcx790 http://www.openrdf.org/config/repository#repositoryType "openrdf:HTTPRepository"
09:47:31.662 [main] DEBUG _:node1drqmrofcx790 http://www.openrdf.org/config/repository/http#repositoryURL http://localhost:8080/openrdf-sesame/repositories/http
09:47:31.662 [main] DEBUG Added member http2: 
[INFO] Tests run: 15, Failures: 0, Errors: 0, Skipped: 0, Time elapsed: 0.442 s - in org.eclipse.rdf4j.console.command.FederateTest
[INFO] Running org.eclipse.rdf4j.console.command.SparqlTest
[MockitoHint] SparqlTest.testInputFile (see javadoc for MockitoHint):
[MockitoHint] 1. Unused -> at org.eclipse.rdf4j.console.command.SparqlTest.setUp(SparqlTest.java:49)

09:47:31.700 [main] ERROR No suitable result writer found
[MockitoHint] SparqlTest.testSelectError (see javadoc for MockitoHint):
[MockitoHint] 1. Unused -> at org.eclipse.rdf4j.console.command.SparqlTest.setUp(SparqlTest.java:49)

[MockitoHint] SparqlTest.testSelectMissingBindings (see javadoc for MockitoHint):
[MockitoHint] 1. Unused -> at org.eclipse.rdf4j.console.command.SparqlTest.setUp(SparqlTest.java:49)

[MockitoHint] SparqlTest.testInputFileWorkdir (see javadoc for MockitoHint):
[MockitoHint] 1. Unused -> at org.eclipse.rdf4j.console.command.SparqlTest.setUp(SparqlTest.java:49)

[INFO] Tests run: 9, Failures: 0, Errors: 0, Skipped: 0, Time elapsed: 0.126 s - in org.eclipse.rdf4j.console.command.SparqlTest
[INFO] Running org.eclipse.rdf4j.console.UtilTest
 one, two
 three
 four
 five, six
 seven
 eight
[INFO] Tests run: 4, Failures: 0, Errors: 0, Skipped: 0, Time elapsed: 0 s - in org.eclipse.rdf4j.console.UtilTest
[INFO] Running org.eclipse.rdf4j.console.ConsoleIOTest
[INFO] Tests run: 3, Failures: 0, Errors: 0, Skipped: 0, Time elapsed: 0.034 s - in org.eclipse.rdf4j.console.ConsoleIOTest
[INFO] 
[INFO] Results:
[INFO] 
[INFO] Tests run: 64, Failures: 0, Errors: 0, Skipped: 0
[INFO] 
[JENKINS] Recording test results
[INFO] 
[INFO] --- animal-sniffer-maven-plugin:1.16:check (default) @ rdf4j-console ---
[INFO] Checking unresolved references to org.codehaus.mojo.signature:java18:1.0
[INFO] 
[INFO] --- maven-jar-plugin:2.3.1:jar (default-jar) @ rdf4j-console ---
[INFO] Building jar: /home/hudson/genie.rdf4j/.jenkins/jobs/rdf4j-pr-verify/workspace/tools/console/target/rdf4j-console-3.1.0-SNAPSHOT.jar