SuccessConsole Output

Started calculate disk usage of build
Finished Calculation of disk usage of build in 0 seconds
Started calculate disk usage of workspace
Finished Calculation of disk usage of workspace in 0 seconds
[INFO] 
[INFO] ------------------< org.eclipse.rdf4j:rdf4j-console >-------------------
[INFO] Building RDF4J: Console 3.1.0-SNAPSHOT                           [70/85]
[INFO] --------------------------------[ jar ]---------------------------------
[INFO] 
[INFO] --- buildnumber-maven-plugin:1.4:create (default) @ rdf4j-console ---
[INFO] ShortRevision tag detected. The value is '7'.
[INFO] Executing: /bin/sh -c cd '/home/hudson/genie.rdf4j/.jenkins/jobs/rdf4j-pr-verify/workspace/tools/console' && 'git' 'rev-parse' '--verify' '--short=7' 'HEAD'
[INFO] Working directory: /home/hudson/genie.rdf4j/.jenkins/jobs/rdf4j-pr-verify/workspace/tools/console
[INFO] Storing buildNumber: 43d242b at timestamp: 1576072275856
[WARNING] Cannot get the branch information from the git repository: 
Detecting the current branch failed: fatal: ref HEAD is not a symbolic ref

[INFO] ShortRevision tag detected. The value is '7'.
[INFO] Executing: /bin/sh -c cd '/home/hudson/genie.rdf4j/.jenkins/jobs/rdf4j-pr-verify/workspace/tools/console' && 'git' 'rev-parse' '--verify' '--short=7' 'HEAD'
[INFO] Working directory: /home/hudson/genie.rdf4j/.jenkins/jobs/rdf4j-pr-verify/workspace/tools/console
[INFO] Storing buildScmBranch: UNKNOWN
[INFO] 
[INFO] --- maven-enforcer-plugin:1.4.1:enforce (enforce-bytecode-version) @ rdf4j-console ---
[INFO] Adding ignore: META-INF/**/module-info
[INFO] 
[INFO] --- formatter-maven-plugin:2.8.1:validate (default) @ rdf4j-console ---
[INFO] Using 'UTF-8' encoding to format source files.
[INFO] Number of files to be formatted: 61
[INFO] Html formatting is skipped
[INFO] Successfully formatted:          0 file(s)
[INFO] Fail to format:                  0 file(s)
[INFO] Skipped:                         61 file(s)
[INFO] Read only skipped:               0 file(s)
[INFO] Approximate time taken:          0s
[INFO] 
[INFO] --- maven-resources-plugin:3.0.2:resources (default-resources) @ rdf4j-console ---
[INFO] Using 'UTF-8' encoding to copy filtered resources.
[INFO] skip non existing resourceDirectory /home/hudson/genie.rdf4j/.jenkins/jobs/rdf4j-pr-verify/workspace/tools/console/src/main/resources
[INFO] 
[INFO] --- maven-compiler-plugin:3.7.0:compile (default-compile) @ rdf4j-console ---
[INFO] Changes detected - recompiling the module!
[INFO] Compiling 42 source files to /home/hudson/genie.rdf4j/.jenkins/jobs/rdf4j-pr-verify/workspace/tools/console/target/classes
[INFO] 
[INFO] --- maven-resources-plugin:3.0.2:testResources (default-testResources) @ rdf4j-console ---
[INFO] Using 'UTF-8' encoding to copy filtered resources.
[INFO] Copying 29 resources
[INFO] 
[INFO] --- maven-compiler-plugin:3.7.0:testCompile (default-testCompile) @ rdf4j-console ---
[INFO] Changes detected - recompiling the module!
[INFO] Compiling 18 source files to /home/hudson/genie.rdf4j/.jenkins/jobs/rdf4j-pr-verify/workspace/tools/console/target/test-classes
[INFO] 
[INFO] --- maven-surefire-plugin:2.22.2:test (default-test) @ rdf4j-console ---
[INFO] 
[INFO] -------------------------------------------------------
[INFO]  T E S T S
[INFO] -------------------------------------------------------
[INFO] Running org.eclipse.rdf4j.console.setting.PrefixesTest
[INFO] Tests run: 3, Failures: 0, Errors: 0, Skipped: 0, Time elapsed: 0.637 s - in org.eclipse.rdf4j.console.setting.PrefixesTest
[INFO] Running org.eclipse.rdf4j.console.setting.LogLevelTest
08:51:20.664 [main] ERROR unknown logging level: chatty
[INFO] Tests run: 4, Failures: 0, Errors: 0, Skipped: 0, Time elapsed: 0.011 s - in org.eclipse.rdf4j.console.setting.LogLevelTest
[INFO] Running org.eclipse.rdf4j.console.setting.QueryPrefixTest
[INFO] Tests run: 1, Failures: 0, Errors: 0, Skipped: 0, Time elapsed: 0 s - in org.eclipse.rdf4j.console.setting.QueryPrefixTest
[INFO] Running org.eclipse.rdf4j.console.setting.ShowPrefixTest
[INFO] Tests run: 1, Failures: 0, Errors: 0, Skipped: 0, Time elapsed: 0 s - in org.eclipse.rdf4j.console.setting.ShowPrefixTest
[INFO] Running org.eclipse.rdf4j.console.setting.ConsoleWidthTest
[INFO] Tests run: 1, Failures: 0, Errors: 0, Skipped: 0, Time elapsed: 0 s - in org.eclipse.rdf4j.console.setting.ConsoleWidthTest
[INFO] Running org.eclipse.rdf4j.console.command.SetParametersTest
08:51:20.698 [main] ERROR Unknown parameter: unknown
[INFO] Tests run: 1, Failures: 0, Errors: 0, Skipped: 0, Time elapsed: 0.022 s - in org.eclipse.rdf4j.console.command.SetParametersTest
[INFO] Running org.eclipse.rdf4j.console.command.LoadTest
[MockitoHint] LoadTest.testLoad (see javadoc for MockitoHint):
[MockitoHint] 1. Unused -> at org.eclipse.rdf4j.console.command.LoadTest.setUp(LoadTest.java:49)

[MockitoHint] LoadTest.testLoadWorkDir (see javadoc for MockitoHint):
[MockitoHint] 1. Unused -> at org.eclipse.rdf4j.console.command.LoadTest.setUp(LoadTest.java:49)

[INFO] Tests run: 2, Failures: 0, Errors: 0, Skipped: 0, Time elapsed: 2.399 s - in org.eclipse.rdf4j.console.command.LoadTest
[INFO] Running org.eclipse.rdf4j.console.command.ConvertTest
08:51:23.417 [main] ERROR No RDF writer for /tmp/genie.rdf4j/junit5198337401627204127/alien.qyx
[MockitoHint] ConvertTest.testConvertInvalidFormat (see javadoc for MockitoHint):
[MockitoHint] 1. Unused -> at org.eclipse.rdf4j.console.command.ConvertTest.setup(ConvertTest.java:39)

08:51:23.427 [main] ERROR Failed to convert data
org.eclipse.rdf4j.rio.RDFParseException: Expected '<' or '_', found: e [line 1, column 101]
	at org.eclipse.rdf4j.rio.ntriples.NTriplesParser.parseSubject(NTriplesParser.java:313)
	at org.eclipse.rdf4j.rio.ntriples.NTriplesParser.parseTriple(NTriplesParser.java:252)
	at org.eclipse.rdf4j.rio.ntriples.NTriplesParser.parse(NTriplesParser.java:160)
	at org.eclipse.rdf4j.rio.ntriples.NTriplesParser.parse(NTriplesParser.java:109)
	at org.eclipse.rdf4j.console.command.Convert.convert(Convert.java:139)
	at org.eclipse.rdf4j.console.command.Convert.execute(Convert.java:74)
	at org.eclipse.rdf4j.console.command.ConvertTest.testConvertParseError(ConvertTest.java:92)
	at sun.reflect.NativeMethodAccessorImpl.invoke0(Native Method)
	at sun.reflect.NativeMethodAccessorImpl.invoke(NativeMethodAccessorImpl.java:62)
	at sun.reflect.DelegatingMethodAccessorImpl.invoke(DelegatingMethodAccessorImpl.java:43)
	at java.lang.reflect.Method.invoke(Method.java:498)
	at org.junit.runners.model.FrameworkMethod$1.runReflectiveCall(FrameworkMethod.java:50)
	at org.junit.internal.runners.model.ReflectiveCallable.run(ReflectiveCallable.java:12)
	at org.junit.runners.model.FrameworkMethod.invokeExplosively(FrameworkMethod.java:47)
	at org.junit.internal.runners.statements.InvokeMethod.evaluate(InvokeMethod.java:17)
	at org.junit.internal.runners.statements.RunBefores.evaluate(RunBefores.java:26)
	at org.junit.internal.runners.statements.RunAfters.evaluate(RunAfters.java:27)
	at org.mockito.internal.junit.JUnitRule$1.evaluateSafely(JUnitRule.java:52)
	at org.mockito.internal.junit.JUnitRule$1.evaluate(JUnitRule.java:43)
	at org.junit.rules.ExternalResource$1.evaluate(ExternalResource.java:48)
	at org.junit.rules.RunRules.evaluate(RunRules.java:20)
	at org.junit.runners.ParentRunner.runLeaf(ParentRunner.java:325)
	at org.junit.runners.BlockJUnit4ClassRunner.runChild(BlockJUnit4ClassRunner.java:78)
	at org.junit.runners.BlockJUnit4ClassRunner.runChild(BlockJUnit4ClassRunner.java:57)
	at org.junit.runners.ParentRunner$3.run(ParentRunner.java:290)
	at org.junit.runners.ParentRunner$1.schedule(ParentRunner.java:71)
	at org.junit.runners.ParentRunner.runChildren(ParentRunner.java:288)
	at org.junit.runners.ParentRunner.access$000(ParentRunner.java:58)
	at org.junit.runners.ParentRunner$2.evaluate(ParentRunner.java:268)
	at org.junit.runners.ParentRunner.run(ParentRunner.java:363)
	at org.apache.maven.surefire.junit4.JUnit4Provider.execute(JUnit4Provider.java:365)
	at org.apache.maven.surefire.junit4.JUnit4Provider.executeWithRerun(JUnit4Provider.java:273)
	at org.apache.maven.surefire.junit4.JUnit4Provider.executeTestSet(JUnit4Provider.java:238)
	at org.apache.maven.surefire.junit4.JUnit4Provider.invoke(JUnit4Provider.java:159)
	at org.apache.maven.surefire.booter.ForkedBooter.invokeProviderInSameClassLoader(ForkedBooter.java:384)
	at org.apache.maven.surefire.booter.ForkedBooter.runSuitesInProcess(ForkedBooter.java:345)
	at org.apache.maven.surefire.booter.ForkedBooter.execute(ForkedBooter.java:126)
	at org.apache.maven.surefire.booter.ForkedBooter.main(ForkedBooter.java:418)
[INFO] Tests run: 4, Failures: 0, Errors: 0, Skipped: 0, Time elapsed: 0.32 s - in org.eclipse.rdf4j.console.command.ConvertTest
[INFO] Running org.eclipse.rdf4j.console.command.ExportTest
[MockitoHint] ExportTest.testExportWorkDir (see javadoc for MockitoHint):
[MockitoHint] 1. Unused -> at org.eclipse.rdf4j.console.command.ExportTest.setUp(ExportTest.java:46)

[MockitoHint] ExportTest.testExportAll (see javadoc for MockitoHint):
[MockitoHint] 1. Unused -> at org.eclipse.rdf4j.console.command.ExportTest.setUp(ExportTest.java:46)

[MockitoHint] ExportTest.testExportContexts (see javadoc for MockitoHint):
[MockitoHint] 1. Unused -> at org.eclipse.rdf4j.console.command.ExportTest.setUp(ExportTest.java:46)

[INFO] Tests run: 3, Failures: 0, Errors: 0, Skipped: 0, Time elapsed: 0.088 s - in org.eclipse.rdf4j.console.command.ExportTest
[INFO] Running org.eclipse.rdf4j.console.command.VerifyTest
08:51:24.021 [main] ERROR Unexpected RDFParseException
org.eclipse.rdf4j.rio.RDFParseException: 'missing type' was not recognised, and could not be verified, with datatype http://example.rdf4j.org/type/wrong [line 1]
	at org.eclipse.rdf4j.rio.helpers.RDFParserHelper.reportError(RDFParserHelper.java:265)
	at org.eclipse.rdf4j.rio.helpers.RDFParserHelper.createLiteral(RDFParserHelper.java:180)
	at org.eclipse.rdf4j.rio.helpers.AbstractRDFParser.createLiteral(AbstractRDFParser.java:530)
	at org.eclipse.rdf4j.rio.turtle.TurtleParser.parseQuotedLiteral(TurtleParser.java:665)
	at org.eclipse.rdf4j.rio.turtle.TurtleParser.parseValue(TurtleParser.java:584)
	at org.eclipse.rdf4j.rio.turtle.TurtleParser.parseObject(TurtleParser.java:461)
	at org.eclipse.rdf4j.rio.turtle.TurtleParser.parseObjectList(TurtleParser.java:389)
	at org.eclipse.rdf4j.rio.turtle.TurtleParser.parsePredicateObjectList(TurtleParser.java:362)
	at org.eclipse.rdf4j.rio.turtle.TurtleParser.parseTriples(TurtleParser.java:349)
	at org.eclipse.rdf4j.rio.turtle.TurtleParser.parseStatement(TurtleParser.java:216)
	at org.eclipse.rdf4j.rio.turtle.TurtleParser.parse(TurtleParser.java:178)
	at org.eclipse.rdf4j.rio.turtle.TurtleParser.parse(TurtleParser.java:130)
	at org.eclipse.rdf4j.console.command.Verify.verify(Verify.java:145)
	at org.eclipse.rdf4j.console.command.Verify.execute(Verify.java:97)
	at org.eclipse.rdf4j.console.command.VerifyTest.testVerifyMissingType(VerifyTest.java:97)
	at sun.reflect.NativeMethodAccessorImpl.invoke0(Native Method)
	at sun.reflect.NativeMethodAccessorImpl.invoke(NativeMethodAccessorImpl.java:62)
	at sun.reflect.DelegatingMethodAccessorImpl.invoke(DelegatingMethodAccessorImpl.java:43)
	at java.lang.reflect.Method.invoke(Method.java:498)
	at org.junit.runners.model.FrameworkMethod$1.runReflectiveCall(FrameworkMethod.java:50)
	at org.junit.internal.runners.model.ReflectiveCallable.run(ReflectiveCallable.java:12)
	at org.junit.runners.model.FrameworkMethod.invokeExplosively(FrameworkMethod.java:47)
	at org.junit.internal.runners.statements.InvokeMethod.evaluate(InvokeMethod.java:17)
	at org.junit.internal.runners.statements.RunBefores.evaluate(RunBefores.java:26)
	at org.junit.internal.runners.statements.RunAfters.evaluate(RunAfters.java:27)
	at org.mockito.internal.junit.JUnitRule$1.evaluateSafely(JUnitRule.java:52)
	at org.mockito.internal.junit.JUnitRule$1.evaluate(JUnitRule.java:43)
	at org.junit.rules.ExternalResource$1.evaluate(ExternalResource.java:48)
	at org.junit.rules.RunRules.evaluate(RunRules.java:20)
	at org.junit.runners.ParentRunner.runLeaf(ParentRunner.java:325)
	at org.junit.runners.BlockJUnit4ClassRunner.runChild(BlockJUnit4ClassRunner.java:78)
	at org.junit.runners.BlockJUnit4ClassRunner.runChild(BlockJUnit4ClassRunner.java:57)
	at org.junit.runners.ParentRunner$3.run(ParentRunner.java:290)
	at org.junit.runners.ParentRunner$1.schedule(ParentRunner.java:71)
	at org.junit.runners.ParentRunner.runChildren(ParentRunner.java:288)
	at org.junit.runners.ParentRunner.access$000(ParentRunner.java:58)
	at org.junit.runners.ParentRunner$2.evaluate(ParentRunner.java:268)
	at org.junit.runners.ParentRunner.run(ParentRunner.java:363)
	at org.apache.maven.surefire.junit4.JUnit4Provider.execute(JUnit4Provider.java:365)
	at org.apache.maven.surefire.junit4.JUnit4Provider.executeWithRerun(JUnit4Provider.java:273)
	at org.apache.maven.surefire.junit4.JUnit4Provider.executeTestSet(JUnit4Provider.java:238)
	at org.apache.maven.surefire.junit4.JUnit4Provider.invoke(JUnit4Provider.java:159)
	at org.apache.maven.surefire.booter.ForkedBooter.invokeProviderInSameClassLoader(ForkedBooter.java:384)
	at org.apache.maven.surefire.booter.ForkedBooter.runSuitesInProcess(ForkedBooter.java:345)
	at org.apache.maven.surefire.booter.ForkedBooter.execute(ForkedBooter.java:126)
	at org.apache.maven.surefire.booter.ForkedBooter.main(ForkedBooter.java:418)
08:51:24.099 [main] ERROR SHACL validation failed, writing report to /tmp/genie.rdf4j/junit1180087107326039441/junit6490605765479865637.tmp
08:51:24.135 [main] ERROR Unexpected RDFParseException
org.eclipse.rdf4j.rio.RDFParseException: Unexpected end of file
	at org.eclipse.rdf4j.rio.turtle.TurtleParser.throwEOFException(TurtleParser.java:1317)
	at org.eclipse.rdf4j.rio.turtle.TurtleParser.parseValue(TurtleParser.java:589)
	at org.eclipse.rdf4j.rio.turtle.TurtleParser.parsePredicate(TurtleParser.java:434)
	at org.eclipse.rdf4j.rio.turtle.TurtleParser.parsePredicateObjectList(TurtleParser.java:358)
	at org.eclipse.rdf4j.rio.turtle.TurtleParser.parseTriples(TurtleParser.java:349)
	at org.eclipse.rdf4j.rio.turtle.TurtleParser.parseStatement(TurtleParser.java:216)
	at org.eclipse.rdf4j.rio.turtle.TurtleParser.parse(TurtleParser.java:178)
	at org.eclipse.rdf4j.rio.turtle.TurtleParser.parse(TurtleParser.java:130)
	at org.eclipse.rdf4j.console.command.Verify.verify(Verify.java:145)
	at org.eclipse.rdf4j.console.command.Verify.execute(Verify.java:97)
	at org.eclipse.rdf4j.console.command.VerifyTest.testVerifyBrokenFile(VerifyTest.java:91)
	at sun.reflect.NativeMethodAccessorImpl.invoke0(Native Method)
	at sun.reflect.NativeMethodAccessorImpl.invoke(NativeMethodAccessorImpl.java:62)
	at sun.reflect.DelegatingMethodAccessorImpl.invoke(DelegatingMethodAccessorImpl.java:43)
	at java.lang.reflect.Method.invoke(Method.java:498)
	at org.junit.runners.model.FrameworkMethod$1.runReflectiveCall(FrameworkMethod.java:50)
	at org.junit.internal.runners.model.ReflectiveCallable.run(ReflectiveCallable.java:12)
	at org.junit.runners.model.FrameworkMethod.invokeExplosively(FrameworkMethod.java:47)
	at org.junit.internal.runners.statements.InvokeMethod.evaluate(InvokeMethod.java:17)
	at org.junit.internal.runners.statements.RunBefores.evaluate(RunBefores.java:26)
	at org.junit.internal.runners.statements.RunAfters.evaluate(RunAfters.java:27)
	at org.mockito.internal.junit.JUnitRule$1.evaluateSafely(JUnitRule.java:52)
	at org.mockito.internal.junit.JUnitRule$1.evaluate(JUnitRule.java:43)
	at org.junit.rules.ExternalResource$1.evaluate(ExternalResource.java:48)
	at org.junit.rules.RunRules.evaluate(RunRules.java:20)
	at org.junit.runners.ParentRunner.runLeaf(ParentRunner.java:325)
	at org.junit.runners.BlockJUnit4ClassRunner.runChild(BlockJUnit4ClassRunner.java:78)
	at org.junit.runners.BlockJUnit4ClassRunner.runChild(BlockJUnit4ClassRunner.java:57)
	at org.junit.runners.ParentRunner$3.run(ParentRunner.java:290)
	at org.junit.runners.ParentRunner$1.schedule(ParentRunner.java:71)
	at org.junit.runners.ParentRunner.runChildren(ParentRunner.java:288)
	at org.junit.runners.ParentRunner.access$000(ParentRunner.java:58)
	at org.junit.runners.ParentRunner$2.evaluate(ParentRunner.java:268)
	at org.junit.runners.ParentRunner.run(ParentRunner.java:363)
	at org.apache.maven.surefire.junit4.JUnit4Provider.execute(JUnit4Provider.java:365)
	at org.apache.maven.surefire.junit4.JUnit4Provider.executeWithRerun(JUnit4Provider.java:273)
	at org.apache.maven.surefire.junit4.JUnit4Provider.executeTestSet(JUnit4Provider.java:238)
	at org.apache.maven.surefire.junit4.JUnit4Provider.invoke(JUnit4Provider.java:159)
	at org.apache.maven.surefire.booter.ForkedBooter.invokeProviderInSameClassLoader(ForkedBooter.java:384)
	at org.apache.maven.surefire.booter.ForkedBooter.runSuitesInProcess(ForkedBooter.java:345)
	at org.apache.maven.surefire.booter.ForkedBooter.execute(ForkedBooter.java:126)
	at org.apache.maven.surefire.booter.ForkedBooter.main(ForkedBooter.java:418)
08:51:24.153 [main] ERROR Unexpected RDFParseException
org.eclipse.rdf4j.rio.RDFParseException: Expected a letter, found '1' [line 1]
	at org.eclipse.rdf4j.rio.helpers.RDFParserHelper.reportError(RDFParserHelper.java:265)
	at org.eclipse.rdf4j.rio.helpers.AbstractRDFParser.reportError(AbstractRDFParser.java:628)
	at org.eclipse.rdf4j.rio.turtle.TurtleParser.reportError(TurtleParser.java:1297)
	at org.eclipse.rdf4j.rio.turtle.TurtleParser.parseQuotedLiteral(TurtleParser.java:619)
	at org.eclipse.rdf4j.rio.turtle.TurtleParser.parseValue(TurtleParser.java:584)
	at org.eclipse.rdf4j.rio.turtle.TurtleParser.parseObject(TurtleParser.java:461)
	at org.eclipse.rdf4j.rio.turtle.TurtleParser.parseObjectList(TurtleParser.java:389)
	at org.eclipse.rdf4j.rio.turtle.TurtleParser.parsePredicateObjectList(TurtleParser.java:362)
	at org.eclipse.rdf4j.rio.turtle.TurtleParser.parseTriples(TurtleParser.java:349)
	at org.eclipse.rdf4j.rio.turtle.TurtleParser.parseStatement(TurtleParser.java:216)
	at org.eclipse.rdf4j.rio.turtle.TurtleParser.parse(TurtleParser.java:178)
	at org.eclipse.rdf4j.rio.turtle.TurtleParser.parse(TurtleParser.java:130)
	at org.eclipse.rdf4j.console.command.Verify.verify(Verify.java:145)
	at org.eclipse.rdf4j.console.command.Verify.execute(Verify.java:97)
	at org.eclipse.rdf4j.console.command.VerifyTest.testVerifyWrongLang(VerifyTest.java:109)
	at sun.reflect.NativeMethodAccessorImpl.invoke0(Native Method)
	at sun.reflect.NativeMethodAccessorImpl.invoke(NativeMethodAccessorImpl.java:62)
	at sun.reflect.DelegatingMethodAccessorImpl.invoke(DelegatingMethodAccessorImpl.java:43)
	at java.lang.reflect.Method.invoke(Method.java:498)
	at org.junit.runners.model.FrameworkMethod$1.runReflectiveCall(FrameworkMethod.java:50)
	at org.junit.internal.runners.model.ReflectiveCallable.run(ReflectiveCallable.java:12)
	at org.junit.runners.model.FrameworkMethod.invokeExplosively(FrameworkMethod.java:47)
	at org.junit.internal.runners.statements.InvokeMethod.evaluate(InvokeMethod.java:17)
	at org.junit.internal.runners.statements.RunBefores.evaluate(RunBefores.java:26)
	at org.junit.internal.runners.statements.RunAfters.evaluate(RunAfters.java:27)
	at org.mockito.internal.junit.JUnitRule$1.evaluateSafely(JUnitRule.java:52)
	at org.mockito.internal.junit.JUnitRule$1.evaluate(JUnitRule.java:43)
	at org.junit.rules.ExternalResource$1.evaluate(ExternalResource.java:48)
	at org.junit.rules.RunRules.evaluate(RunRules.java:20)
	at org.junit.runners.ParentRunner.runLeaf(ParentRunner.java:325)
	at org.junit.runners.BlockJUnit4ClassRunner.runChild(BlockJUnit4ClassRunner.java:78)
	at org.junit.runners.BlockJUnit4ClassRunner.runChild(BlockJUnit4ClassRunner.java:57)
	at org.junit.runners.ParentRunner$3.run(ParentRunner.java:290)
	at org.junit.runners.ParentRunner$1.schedule(ParentRunner.java:71)
	at org.junit.runners.ParentRunner.runChildren(ParentRunner.java:288)
	at org.junit.runners.ParentRunner.access$000(ParentRunner.java:58)
	at org.junit.runners.ParentRunner$2.evaluate(ParentRunner.java:268)
	at org.junit.runners.ParentRunner.run(ParentRunner.java:363)
	at org.apache.maven.surefire.junit4.JUnit4Provider.execute(JUnit4Provider.java:365)
	at org.apache.maven.surefire.junit4.JUnit4Provider.executeWithRerun(JUnit4Provider.java:273)
	at org.apache.maven.surefire.junit4.JUnit4Provider.executeTestSet(JUnit4Provider.java:238)
	at org.apache.maven.surefire.junit4.JUnit4Provider.invoke(JUnit4Provider.java:159)
	at org.apache.maven.surefire.booter.ForkedBooter.invokeProviderInSameClassLoader(ForkedBooter.java:384)
	at org.apache.maven.surefire.booter.ForkedBooter.runSuitesInProcess(ForkedBooter.java:345)
	at org.apache.maven.surefire.booter.ForkedBooter.execute(ForkedBooter.java:126)
	at org.apache.maven.surefire.booter.ForkedBooter.main(ForkedBooter.java:418)
08:51:24.171 [main] ERROR No parser available for this RDF format
org.eclipse.rdf4j.rio.UnsupportedRDFormatException: Did not recognise RDF format string file:/home/hudson/genie.rdf4j/.jenkins/jobs/rdf4j-pr-verify/workspace/tools/console/does-not-exist.docx
	at org.eclipse.rdf4j.rio.Rio.lambda$unsupportedFormat$1(Rio.java:577)
	at java.util.Optional.orElseThrow(Optional.java:290)
	at org.eclipse.rdf4j.console.command.Verify.verify(Verify.java:124)
	at org.eclipse.rdf4j.console.command.Verify.execute(Verify.java:97)
	at org.eclipse.rdf4j.console.command.VerifyTest.testVerifyWrongFormat(VerifyTest.java:69)
	at sun.reflect.NativeMethodAccessorImpl.invoke0(Native Method)
	at sun.reflect.NativeMethodAccessorImpl.invoke(NativeMethodAccessorImpl.java:62)
	at sun.reflect.DelegatingMethodAccessorImpl.invoke(DelegatingMethodAccessorImpl.java:43)
	at java.lang.reflect.Method.invoke(Method.java:498)
	at org.junit.runners.model.FrameworkMethod$1.runReflectiveCall(FrameworkMethod.java:50)
	at org.junit.internal.runners.model.ReflectiveCallable.run(ReflectiveCallable.java:12)
	at org.junit.runners.model.FrameworkMethod.invokeExplosively(FrameworkMethod.java:47)
	at org.junit.internal.runners.statements.InvokeMethod.evaluate(InvokeMethod.java:17)
	at org.junit.internal.runners.statements.RunBefores.evaluate(RunBefores.java:26)
	at org.junit.internal.runners.statements.RunAfters.evaluate(RunAfters.java:27)
	at org.mockito.internal.junit.JUnitRule$1.evaluateSafely(JUnitRule.java:52)
	at org.mockito.internal.junit.JUnitRule$1.evaluate(JUnitRule.java:43)
	at org.junit.rules.ExternalResource$1.evaluate(ExternalResource.java:48)
	at org.junit.rules.RunRules.evaluate(RunRules.java:20)
	at org.junit.runners.ParentRunner.runLeaf(ParentRunner.java:325)
	at org.junit.runners.BlockJUnit4ClassRunner.runChild(BlockJUnit4ClassRunner.java:78)
	at org.junit.runners.BlockJUnit4ClassRunner.runChild(BlockJUnit4ClassRunner.java:57)
	at org.junit.runners.ParentRunner$3.run(ParentRunner.java:290)
	at org.junit.runners.ParentRunner$1.schedule(ParentRunner.java:71)
	at org.junit.runners.ParentRunner.runChildren(ParentRunner.java:288)
	at org.junit.runners.ParentRunner.access$000(ParentRunner.java:58)
	at org.junit.runners.ParentRunner$2.evaluate(ParentRunner.java:268)
	at org.junit.runners.ParentRunner.run(ParentRunner.java:363)
	at org.apache.maven.surefire.junit4.JUnit4Provider.execute(JUnit4Provider.java:365)
	at org.apache.maven.surefire.junit4.JUnit4Provider.executeWithRerun(JUnit4Provider.java:273)
	at org.apache.maven.surefire.junit4.JUnit4Provider.executeTestSet(JUnit4Provider.java:238)
	at org.apache.maven.surefire.junit4.JUnit4Provider.invoke(JUnit4Provider.java:159)
	at org.apache.maven.surefire.booter.ForkedBooter.invokeProviderInSameClassLoader(ForkedBooter.java:384)
	at org.apache.maven.surefire.booter.ForkedBooter.runSuitesInProcess(ForkedBooter.java:345)
	at org.apache.maven.surefire.booter.ForkedBooter.execute(ForkedBooter.java:126)
	at org.apache.maven.surefire.booter.ForkedBooter.main(ForkedBooter.java:418)
08:51:24.253 [main] ERROR Unexpected RDFParseException
org.eclipse.rdf4j.rio.RDFParseException: IRI included an unencoded space: '32' [line 1]
	at org.eclipse.rdf4j.rio.helpers.RDFParserHelper.reportError(RDFParserHelper.java:265)
	at org.eclipse.rdf4j.rio.helpers.AbstractRDFParser.reportError(AbstractRDFParser.java:628)
	at org.eclipse.rdf4j.rio.turtle.TurtleParser.reportError(TurtleParser.java:1297)
	at org.eclipse.rdf4j.rio.turtle.TurtleParser.parseURI(TurtleParser.java:902)
	at org.eclipse.rdf4j.rio.turtle.TurtleParser.parseValue(TurtleParser.java:575)
	at org.eclipse.rdf4j.rio.turtle.TurtleParser.parseSubject(TurtleParser.java:406)
	at org.eclipse.rdf4j.rio.turtle.TurtleParser.parseTriples(TurtleParser.java:347)
	at org.eclipse.rdf4j.rio.turtle.TurtleParser.parseStatement(TurtleParser.java:216)
	at org.eclipse.rdf4j.rio.turtle.TurtleParser.parse(TurtleParser.java:178)
	at org.eclipse.rdf4j.rio.turtle.TurtleParser.parse(TurtleParser.java:130)
	at org.eclipse.rdf4j.console.command.Verify.verify(Verify.java:145)
	at org.eclipse.rdf4j.console.command.Verify.execute(Verify.java:97)
	at org.eclipse.rdf4j.console.command.VerifyTest.testVerifySpaceIRI(VerifyTest.java:103)
	at sun.reflect.NativeMethodAccessorImpl.invoke0(Native Method)
	at sun.reflect.NativeMethodAccessorImpl.invoke(NativeMethodAccessorImpl.java:62)
	at sun.reflect.DelegatingMethodAccessorImpl.invoke(DelegatingMethodAccessorImpl.java:43)
	at java.lang.reflect.Method.invoke(Method.java:498)
	at org.junit.runners.model.FrameworkMethod$1.runReflectiveCall(FrameworkMethod.java:50)
	at org.junit.internal.runners.model.ReflectiveCallable.run(ReflectiveCallable.java:12)
	at org.junit.runners.model.FrameworkMethod.invokeExplosively(FrameworkMethod.java:47)
	at org.junit.internal.runners.statements.InvokeMethod.evaluate(InvokeMethod.java:17)
	at org.junit.internal.runners.statements.RunBefores.evaluate(RunBefores.java:26)
	at org.junit.internal.runners.statements.RunAfters.evaluate(RunAfters.java:27)
	at org.mockito.internal.junit.JUnitRule$1.evaluateSafely(JUnitRule.java:52)
	at org.mockito.internal.junit.JUnitRule$1.evaluate(JUnitRule.java:43)
	at org.junit.rules.ExternalResource$1.evaluate(ExternalResource.java:48)
	at org.junit.rules.RunRules.evaluate(RunRules.java:20)
	at org.junit.runners.ParentRunner.runLeaf(ParentRunner.java:325)
	at org.junit.runners.BlockJUnit4ClassRunner.runChild(BlockJUnit4ClassRunner.java:78)
	at org.junit.runners.BlockJUnit4ClassRunner.runChild(BlockJUnit4ClassRunner.java:57)
	at org.junit.runners.ParentRunner$3.run(ParentRunner.java:290)
	at org.junit.runners.ParentRunner$1.schedule(ParentRunner.java:71)
	at org.junit.runners.ParentRunner.runChildren(ParentRunner.java:288)
	at org.junit.runners.ParentRunner.access$000(ParentRunner.java:58)
	at org.junit.runners.ParentRunner$2.evaluate(ParentRunner.java:268)
	at org.junit.runners.ParentRunner.run(ParentRunner.java:363)
	at org.apache.maven.surefire.junit4.JUnit4Provider.execute(JUnit4Provider.java:365)
	at org.apache.maven.surefire.junit4.JUnit4Provider.executeWithRerun(JUnit4Provider.java:273)
	at org.apache.maven.surefire.junit4.JUnit4Provider.executeTestSet(JUnit4Provider.java:238)
	at org.apache.maven.surefire.junit4.JUnit4Provider.invoke(JUnit4Provider.java:159)
	at org.apache.maven.surefire.booter.ForkedBooter.invokeProviderInSameClassLoader(ForkedBooter.java:384)
	at org.apache.maven.surefire.booter.ForkedBooter.runSuitesInProcess(ForkedBooter.java:345)
	at org.apache.maven.surefire.booter.ForkedBooter.execute(ForkedBooter.java:126)
	at org.apache.maven.surefire.booter.ForkedBooter.main(ForkedBooter.java:418)
[INFO] Tests run: 10, Failures: 0, Errors: 0, Skipped: 0, Time elapsed: 0.764 s - in org.eclipse.rdf4j.console.command.VerifyTest
[INFO] Running org.eclipse.rdf4j.console.command.DropTest
[MockitoHint] DropTest.testUserAbortedUnsafeDropBeforeWarning (see javadoc for MockitoHint):
[MockitoHint] 1. Unused -> at org.eclipse.rdf4j.console.command.DropTest.setUp(DropTest.java:50)

[INFO] Tests run: 3, Failures: 0, Errors: 0, Skipped: 0, Time elapsed: 0.208 s - in org.eclipse.rdf4j.console.command.DropTest
[INFO] Running org.eclipse.rdf4j.console.command.FederateTest
08:51:24.571 [main] DEBUG Initializing MemoryStore...
08:51:24.573 [main] DEBUG Initializing data file...
08:51:24.574 [main] DEBUG Data file initialized
08:51:24.574 [main] DEBUG MemoryStore initialized
08:51:24.577 [main] DEBUG syncing data to file...
08:51:24.578 [main] DEBUG Data synced to file
08:51:24.583 [main] DEBUG Initializing MemoryStore...
08:51:24.584 [main] DEBUG Initializing data file...
08:51:24.584 [main] DEBUG Data file initialized
08:51:24.584 [main] DEBUG MemoryStore initialized
08:51:24.586 [main] DEBUG syncing data to file...
08:51:24.587 [main] DEBUG Data synced to file
08:51:24.631 [main] DEBUG Federate called with federation ID = fedID, and member ID's = [sparql][alien][http].
  Distinct set to false, and readonly set to true.

08:51:24.637 [main] DEBUG Federation repository root node: _:node1drqjktvsx216
08:51:24.639 [main] DEBUG _:node1drqjktvsx216 http://www.w3.org/1999/02/22-rdf-syntax-ns#type http://www.openrdf.org/config/repository#Repository
08:51:24.640 [main] DEBUG _:node1drqjktvsx216 http://www.openrdf.org/config/repository#repositoryID "fedID"
08:51:24.640 [main] DEBUG _:node1drqjktvsx216 http://www.w3.org/2000/01/rdf-schema#label "Test Federation Title"
08:51:24.640 [main] DEBUG _:node1drqjktvsx216 http://www.openrdf.org/config/repository#repositoryImpl _:node1drqjktvsx217
08:51:24.640 [main] DEBUG _:node1drqjktvsx217 http://www.openrdf.org/config/repository#repositoryType "openrdf:SailRepository"
08:51:24.640 [main] DEBUG _:node1drqjktvsx217 http://www.openrdf.org/config/repository/sail#sailImpl _:node1drqjktvsx218
08:51:24.640 [main] DEBUG _:node1drqjktvsx218 http://www.openrdf.org/config/sail#sailType "openrdf:Federation"
08:51:24.642 [main] DEBUG _:node1drqjktvsx218 http://www.openrdf.org/config/sail/federation#readOnly "true"^^<http://www.w3.org/2001/XMLSchema#boolean>
08:51:24.642 [main] DEBUG _:node1drqjktvsx218 http://www.openrdf.org/config/sail/federation#distinct "false"^^<http://www.w3.org/2001/XMLSchema#boolean>
08:51:24.642 [main] DEBUG Adding member: sparql
08:51:24.642 [main] DEBUG _:node1drqjktvsx218 http://www.openrdf.org/config/sail/federation#member _:node1drqjktvsx219
08:51:24.643 [main] DEBUG _:node1drqjktvsx219 http://www.openrdf.org/config/repository#repositoryType "openrdf:SPARQLRepository"
08:51:24.645 [main] DEBUG _:node1drqjktvsx219 http://www.openrdf.org/config/repository/sparql#query-endpoint http://localhost:8080/openrdf-sesame/repositories/sparql
08:51:24.645 [main] DEBUG Added member sparql: 
08:51:24.645 [main] DEBUG Adding member: alien
08:51:24.645 [main] DEBUG _:node1drqjktvsx218 http://www.openrdf.org/config/sail/federation#member _:node1drqjktvsx222
08:51:24.646 [main] DEBUG _:node1drqjktvsx222 http://www.openrdf.org/config/repository#repositoryType "openrdf:ProxyRepository"
08:51:24.646 [main] DEBUG _:node1drqjktvsx222 http://www.openrdf.org/config/repository/proxy#proxiedID "alien"
08:51:24.646 [main] DEBUG Added member alien: 
08:51:24.646 [main] DEBUG Adding member: http
08:51:24.647 [main] DEBUG _:node1drqjktvsx218 http://www.openrdf.org/config/sail/federation#member _:node1drqjktvsx225
08:51:24.648 [main] DEBUG _:node1drqjktvsx225 http://www.openrdf.org/config/repository#repositoryType "openrdf:HTTPRepository"
08:51:24.649 [main] DEBUG _:node1drqjktvsx225 http://www.openrdf.org/config/repository/http#repositoryURL http://localhost:8080/openrdf-sesame/repositories/http
08:51:24.649 [main] DEBUG Added member http: 
08:51:24.703 [main] DEBUG Initializing MemoryStore...
08:51:24.705 [main] DEBUG Initializing data file...
08:51:24.706 [main] DEBUG Data file initialized
08:51:24.706 [main] DEBUG MemoryStore initialized
08:51:24.708 [main] DEBUG syncing data to file...
08:51:24.710 [main] DEBUG Data synced to file
08:51:24.714 [main] DEBUG Initializing MemoryStore...
08:51:24.715 [main] DEBUG Initializing data file...
08:51:24.715 [main] DEBUG Data file initialized
08:51:24.715 [main] DEBUG MemoryStore initialized
08:51:24.717 [main] DEBUG syncing data to file...
08:51:24.718 [main] DEBUG Data synced to file
08:51:24.728 [main] ERROR Duplicate repository id's specified.
[MockitoHint] FederateTest.testDuplicateMembersPrintsError (see javadoc for MockitoHint):
[MockitoHint] 1. Unused -> at org.eclipse.rdf4j.console.command.FederateTest.setUp(FederateTest.java:87)
[MockitoHint] 2. Unused -> at org.eclipse.rdf4j.console.command.FederateTest.setUp(FederateTest.java:88)

08:51:24.740 [main] DEBUG Initializing MemoryStore...
08:51:24.741 [main] DEBUG Initializing data file...
08:51:24.742 [main] DEBUG Data file initialized
08:51:24.743 [main] DEBUG MemoryStore initialized
08:51:24.745 [main] DEBUG syncing data to file...
08:51:24.747 [main] DEBUG Data synced to file
08:51:24.751 [main] DEBUG Initializing MemoryStore...
08:51:24.753 [main] DEBUG Initializing data file...
08:51:24.753 [main] DEBUG Data file initialized
08:51:24.753 [main] DEBUG MemoryStore initialized
08:51:24.755 [main] DEBUG syncing data to file...
08:51:24.757 [main] DEBUG Data synced to file
08:51:24.767 [main] DEBUG Federate called with federation ID = alien, and member ID's = [fedID][scary].
  Distinct set to false, and readonly set to true.

08:51:24.768 [main] ERROR alien already exists.
[MockitoHint] FederateTest.testFedAlreadyExistsPrintsSpecificError (see javadoc for MockitoHint):
[MockitoHint] 1. Unused -> at org.eclipse.rdf4j.console.command.FederateTest.setUp(FederateTest.java:88)

08:51:24.779 [main] DEBUG Initializing MemoryStore...
08:51:24.780 [main] DEBUG Initializing data file...
08:51:24.781 [main] DEBUG Data file initialized
08:51:24.781 [main] DEBUG MemoryStore initialized
08:51:24.783 [main] DEBUG syncing data to file...
08:51:24.784 [main] DEBUG Data synced to file
08:51:24.787 [main] DEBUG Initializing MemoryStore...
08:51:24.787 [main] DEBUG Initializing data file...
08:51:24.788 [main] DEBUG Data file initialized
08:51:24.788 [main] DEBUG MemoryStore initialized
08:51:24.789 [main] DEBUG syncing data to file...
08:51:24.790 [main] DEBUG Data synced to file
08:51:24.800 [main] DEBUG Federate called with federation ID = fedID, and member ID's = [alien][scary].
  Distinct set to true, and readonly set to false.

08:51:24.803 [main] DEBUG Federation repository root node: _:node1drqjktvsx338
08:51:24.803 [main] DEBUG _:node1drqjktvsx338 http://www.w3.org/1999/02/22-rdf-syntax-ns#type http://www.openrdf.org/config/repository#Repository
08:51:24.803 [main] DEBUG _:node1drqjktvsx338 http://www.openrdf.org/config/repository#repositoryID "fedID"
08:51:24.803 [main] DEBUG _:node1drqjktvsx338 http://www.w3.org/2000/01/rdf-schema#label "Test Federation Title"
08:51:24.803 [main] DEBUG _:node1drqjktvsx338 http://www.openrdf.org/config/repository#repositoryImpl _:node1drqjktvsx339
08:51:24.803 [main] DEBUG _:node1drqjktvsx339 http://www.openrdf.org/config/repository#repositoryType "openrdf:SailRepository"
08:51:24.803 [main] DEBUG _:node1drqjktvsx339 http://www.openrdf.org/config/repository/sail#sailImpl _:node1drqjktvsx340
08:51:24.803 [main] DEBUG _:node1drqjktvsx340 http://www.openrdf.org/config/sail#sailType "openrdf:Federation"
08:51:24.803 [main] DEBUG _:node1drqjktvsx340 http://www.openrdf.org/config/sail/federation#readOnly "false"^^<http://www.w3.org/2001/XMLSchema#boolean>
08:51:24.803 [main] DEBUG _:node1drqjktvsx340 http://www.openrdf.org/config/sail/federation#distinct "true"^^<http://www.w3.org/2001/XMLSchema#boolean>
08:51:24.803 [main] DEBUG Adding member: alien
08:51:24.803 [main] DEBUG _:node1drqjktvsx340 http://www.openrdf.org/config/sail/federation#member _:node1drqjktvsx341
08:51:24.804 [main] DEBUG _:node1drqjktvsx341 http://www.openrdf.org/config/repository#repositoryType "openrdf:ProxyRepository"
08:51:24.804 [main] DEBUG _:node1drqjktvsx341 http://www.openrdf.org/config/repository/proxy#proxiedID "alien"
08:51:24.804 [main] DEBUG Added member alien: 
08:51:24.805 [main] DEBUG Adding member: scary
08:51:24.805 [main] DEBUG _:node1drqjktvsx340 http://www.openrdf.org/config/sail/federation#member _:node1drqjktvsx344
08:51:24.805 [main] DEBUG _:node1drqjktvsx344 http://www.openrdf.org/config/repository#repositoryType "openrdf:ProxyRepository"
08:51:24.805 [main] DEBUG _:node1drqjktvsx344 http://www.openrdf.org/config/repository/proxy#proxiedID "scary"
08:51:24.806 [main] DEBUG Added member scary: 
08:51:24.834 [main] DEBUG Initializing MemoryStore...
08:51:24.835 [main] DEBUG Initializing data file...
08:51:24.835 [main] DEBUG Data file initialized
08:51:24.835 [main] DEBUG MemoryStore initialized
08:51:24.837 [main] DEBUG syncing data to file...
08:51:24.838 [main] DEBUG Data synced to file
08:51:24.841 [main] DEBUG Initializing MemoryStore...
08:51:24.843 [main] DEBUG Initializing data file...
08:51:24.843 [main] DEBUG Data file initialized
08:51:24.843 [main] DEBUG MemoryStore initialized
08:51:24.845 [main] DEBUG syncing data to file...
08:51:24.845 [main] DEBUG Data synced to file
08:51:24.854 [main] DEBUG Federate called with federation ID = fedID, and member ID's = [sparql][sparql2].
  Distinct set to false, and readonly set to false.

08:51:24.856 [main] ERROR sparql is read-only.
08:51:24.857 [main] ERROR sparql2 is read-only.
[MockitoHint] FederateTest.testSparqlAndNotReadOnlyPrintsError (see javadoc for MockitoHint):
[MockitoHint] 1. Unused -> at org.eclipse.rdf4j.console.command.FederateTest.setUp(FederateTest.java:88)

08:51:24.866 [main] DEBUG Initializing MemoryStore...
08:51:24.866 [main] DEBUG Initializing data file...
08:51:24.866 [main] DEBUG Data file initialized
08:51:24.866 [main] DEBUG MemoryStore initialized
08:51:24.869 [main] DEBUG syncing data to file...
08:51:24.869 [main] DEBUG Data synced to file
08:51:24.872 [main] DEBUG Initializing MemoryStore...
08:51:24.874 [main] DEBUG Initializing data file...
08:51:24.874 [main] DEBUG Data file initialized
08:51:24.874 [main] DEBUG MemoryStore initialized
08:51:24.876 [main] DEBUG syncing data to file...
08:51:24.876 [main] DEBUG Data synced to file
[MockitoHint] FederateTest.testNoArgumentsPrintsHelp (see javadoc for MockitoHint):
[MockitoHint] 1. Unused -> at org.eclipse.rdf4j.console.command.FederateTest.setUp(FederateTest.java:87)
[MockitoHint] 2. Unused -> at org.eclipse.rdf4j.console.command.FederateTest.setUp(FederateTest.java:88)

08:51:24.892 [main] DEBUG Initializing MemoryStore...
08:51:24.893 [main] DEBUG Initializing data file...
08:51:24.893 [main] DEBUG Data file initialized
08:51:24.893 [main] DEBUG MemoryStore initialized
08:51:24.895 [main] DEBUG syncing data to file...
08:51:24.895 [main] DEBUG Data synced to file
08:51:24.898 [main] DEBUG Initializing MemoryStore...
08:51:24.900 [main] DEBUG Initializing data file...
08:51:24.900 [main] DEBUG Data file initialized
08:51:24.900 [main] DEBUG MemoryStore initialized
08:51:24.902 [main] DEBUG syncing data to file...
08:51:24.902 [main] DEBUG Data synced to file
08:51:24.909 [main] DEBUG Federate called with federation ID = type=memory, and member ID's = [fedID][alien][scary].
  Distinct set to false, and readonly set to true.

08:51:24.910 [main] ERROR fedID does not exist.
[MockitoHint] FederateTest.testInvalidArgumentPrintsError (see javadoc for MockitoHint):
[MockitoHint] 1. Unused -> at org.eclipse.rdf4j.console.command.FederateTest.setUp(FederateTest.java:88)

08:51:24.930 [main] DEBUG Initializing MemoryStore...
08:51:24.932 [main] DEBUG Initializing data file...
08:51:24.932 [main] DEBUG Data file initialized
08:51:24.932 [main] DEBUG MemoryStore initialized
08:51:24.935 [main] DEBUG syncing data to file...
08:51:24.936 [main] DEBUG Data synced to file
08:51:24.941 [main] DEBUG Initializing MemoryStore...
08:51:24.943 [main] DEBUG Initializing data file...
08:51:24.943 [main] DEBUG Data file initialized
08:51:24.943 [main] DEBUG MemoryStore initialized
08:51:24.945 [main] DEBUG syncing data to file...
08:51:24.946 [main] DEBUG Data synced to file
08:51:24.955 [main] DEBUG Federate called with federation ID = fedID, and member ID's = [sparql][sparql2].
  Distinct set to false, and readonly set to true.

08:51:24.956 [main] DEBUG Federation repository root node: _:node1drqjktvsx494
08:51:24.956 [main] DEBUG _:node1drqjktvsx494 http://www.w3.org/1999/02/22-rdf-syntax-ns#type http://www.openrdf.org/config/repository#Repository
08:51:24.956 [main] DEBUG _:node1drqjktvsx494 http://www.openrdf.org/config/repository#repositoryID "fedID"
08:51:24.956 [main] DEBUG _:node1drqjktvsx494 http://www.w3.org/2000/01/rdf-schema#label "Test Federation Title"
08:51:24.956 [main] DEBUG _:node1drqjktvsx494 http://www.openrdf.org/config/repository#repositoryImpl _:node1drqjktvsx495
08:51:24.956 [main] DEBUG _:node1drqjktvsx495 http://www.openrdf.org/config/repository#repositoryType "openrdf:SailRepository"
08:51:24.956 [main] DEBUG _:node1drqjktvsx495 http://www.openrdf.org/config/repository/sail#sailImpl _:node1drqjktvsx496
08:51:24.956 [main] DEBUG _:node1drqjktvsx496 http://www.openrdf.org/config/sail#sailType "openrdf:Federation"
08:51:24.956 [main] DEBUG _:node1drqjktvsx496 http://www.openrdf.org/config/sail/federation#readOnly "true"^^<http://www.w3.org/2001/XMLSchema#boolean>
08:51:24.956 [main] DEBUG _:node1drqjktvsx496 http://www.openrdf.org/config/sail/federation#distinct "false"^^<http://www.w3.org/2001/XMLSchema#boolean>
08:51:24.956 [main] DEBUG Adding member: sparql
08:51:24.956 [main] DEBUG _:node1drqjktvsx496 http://www.openrdf.org/config/sail/federation#member _:node1drqjktvsx497
08:51:24.957 [main] DEBUG _:node1drqjktvsx497 http://www.openrdf.org/config/repository#repositoryType "openrdf:SPARQLRepository"
08:51:24.957 [main] DEBUG _:node1drqjktvsx497 http://www.openrdf.org/config/repository/sparql#query-endpoint http://localhost:8080/openrdf-sesame/repositories/sparql
08:51:24.957 [main] DEBUG Added member sparql: 
08:51:24.957 [main] DEBUG Adding member: sparql2
08:51:24.957 [main] DEBUG _:node1drqjktvsx496 http://www.openrdf.org/config/sail/federation#member _:node1drqjktvsx500
08:51:24.958 [main] DEBUG _:node1drqjktvsx500 http://www.openrdf.org/config/repository#repositoryType "openrdf:SPARQLRepository"
08:51:24.958 [main] DEBUG _:node1drqjktvsx500 http://www.openrdf.org/config/repository/sparql#query-endpoint http://localhost:8080/openrdf-sesame/repositories/sparql
08:51:24.958 [main] DEBUG Added member sparql2: 
08:51:24.972 [main] DEBUG Initializing MemoryStore...
08:51:24.973 [main] DEBUG Initializing data file...
08:51:24.973 [main] DEBUG Data file initialized
08:51:24.973 [main] DEBUG MemoryStore initialized
08:51:24.976 [main] DEBUG syncing data to file...
08:51:24.977 [main] DEBUG Data synced to file
08:51:24.980 [main] DEBUG Initializing MemoryStore...
08:51:24.981 [main] DEBUG Initializing data file...
08:51:24.982 [main] DEBUG Data file initialized
08:51:24.982 [main] DEBUG MemoryStore initialized
08:51:24.983 [main] DEBUG syncing data to file...
08:51:24.984 [main] DEBUG Data synced to file
08:51:24.991 [main] DEBUG Federate called with federation ID = fedID, and member ID's = [http][sparql].
  Distinct set to false, and readonly set to true.

08:51:24.993 [main] DEBUG Federation repository root node: _:node1drqjktvsx549
08:51:24.993 [main] DEBUG _:node1drqjktvsx549 http://www.w3.org/1999/02/22-rdf-syntax-ns#type http://www.openrdf.org/config/repository#Repository
08:51:24.993 [main] DEBUG _:node1drqjktvsx549 http://www.openrdf.org/config/repository#repositoryID "fedID"
08:51:24.993 [main] DEBUG _:node1drqjktvsx549 http://www.w3.org/2000/01/rdf-schema#label "Test Federation Title"
08:51:24.993 [main] DEBUG _:node1drqjktvsx549 http://www.openrdf.org/config/repository#repositoryImpl _:node1drqjktvsx550
08:51:24.993 [main] DEBUG _:node1drqjktvsx550 http://www.openrdf.org/config/repository#repositoryType "openrdf:SailRepository"
08:51:24.993 [main] DEBUG _:node1drqjktvsx550 http://www.openrdf.org/config/repository/sail#sailImpl _:node1drqjktvsx551
08:51:24.993 [main] DEBUG _:node1drqjktvsx551 http://www.openrdf.org/config/sail#sailType "openrdf:Federation"
08:51:24.993 [main] DEBUG _:node1drqjktvsx551 http://www.openrdf.org/config/sail/federation#readOnly "true"^^<http://www.w3.org/2001/XMLSchema#boolean>
08:51:24.993 [main] DEBUG _:node1drqjktvsx551 http://www.openrdf.org/config/sail/federation#distinct "false"^^<http://www.w3.org/2001/XMLSchema#boolean>
08:51:24.993 [main] DEBUG Adding member: http
08:51:24.993 [main] DEBUG _:node1drqjktvsx551 http://www.openrdf.org/config/sail/federation#member _:node1drqjktvsx552
08:51:24.994 [main] DEBUG _:node1drqjktvsx552 http://www.openrdf.org/config/repository#repositoryType "openrdf:HTTPRepository"
08:51:24.995 [main] DEBUG _:node1drqjktvsx552 http://www.openrdf.org/config/repository/http#repositoryURL http://localhost:8080/openrdf-sesame/repositories/http
08:51:24.995 [main] DEBUG Added member http: 
08:51:24.995 [main] DEBUG Adding member: sparql
08:51:24.995 [main] DEBUG _:node1drqjktvsx551 http://www.openrdf.org/config/sail/federation#member _:node1drqjktvsx555
08:51:24.995 [main] DEBUG _:node1drqjktvsx555 http://www.openrdf.org/config/repository#repositoryType "openrdf:SPARQLRepository"
08:51:24.996 [main] DEBUG _:node1drqjktvsx555 http://www.openrdf.org/config/repository/sparql#query-endpoint http://localhost:8080/openrdf-sesame/repositories/sparql
08:51:24.996 [main] DEBUG Added member sparql: 
08:51:25.008 [main] DEBUG Initializing MemoryStore...
08:51:25.010 [main] DEBUG Initializing data file...
08:51:25.010 [main] DEBUG Data file initialized
08:51:25.010 [main] DEBUG MemoryStore initialized
08:51:25.012 [main] DEBUG syncing data to file...
08:51:25.012 [main] DEBUG Data synced to file
08:51:25.015 [main] DEBUG Initializing MemoryStore...
08:51:25.016 [main] DEBUG Initializing data file...
08:51:25.016 [main] DEBUG Data file initialized
08:51:25.016 [main] DEBUG MemoryStore initialized
08:51:25.017 [main] DEBUG syncing data to file...
08:51:25.018 [main] DEBUG Data synced to file
08:51:25.025 [main] DEBUG Federate called with federation ID = fedID, and member ID's = [alien][FreeLunch].
  Distinct set to false, and readonly set to true.

08:51:25.026 [main] ERROR FreeLunch does not exist.
[MockitoHint] FederateTest.testNonexistentMemberPrintsSpecificError (see javadoc for MockitoHint):
[MockitoHint] 1. Unused -> at org.eclipse.rdf4j.console.command.FederateTest.setUp(FederateTest.java:88)

08:51:25.034 [main] DEBUG Initializing MemoryStore...
08:51:25.036 [main] DEBUG Initializing data file...
08:51:25.036 [main] DEBUG Data file initialized
08:51:25.036 [main] DEBUG MemoryStore initialized
08:51:25.038 [main] DEBUG syncing data to file...
08:51:25.038 [main] DEBUG Data synced to file
08:51:25.041 [main] DEBUG Initializing MemoryStore...
08:51:25.041 [main] DEBUG Initializing data file...
08:51:25.041 [main] DEBUG Data file initialized
08:51:25.041 [main] DEBUG MemoryStore initialized
08:51:25.042 [main] DEBUG syncing data to file...
08:51:25.043 [main] DEBUG Data synced to file
08:51:25.048 [main] ERROR Duplicate repository id's specified.
[MockitoHint] FederateTest.testFedSameAsMemberPrintsError (see javadoc for MockitoHint):
[MockitoHint] 1. Unused -> at org.eclipse.rdf4j.console.command.FederateTest.setUp(FederateTest.java:87)
[MockitoHint] 2. Unused -> at org.eclipse.rdf4j.console.command.FederateTest.setUp(FederateTest.java:88)

08:51:25.055 [main] DEBUG Initializing MemoryStore...
08:51:25.056 [main] DEBUG Initializing data file...
08:51:25.056 [main] DEBUG Data file initialized
08:51:25.057 [main] DEBUG MemoryStore initialized
08:51:25.058 [main] DEBUG syncing data to file...
08:51:25.058 [main] DEBUG Data synced to file
08:51:25.060 [main] DEBUG Initializing MemoryStore...
08:51:25.060 [main] DEBUG Initializing data file...
08:51:25.061 [main] DEBUG Data file initialized
08:51:25.061 [main] DEBUG MemoryStore initialized
08:51:25.062 [main] DEBUG syncing data to file...
08:51:25.062 [main] DEBUG Data synced to file
[MockitoHint] FederateTest.testTwoArgumentsPrintsHelp (see javadoc for MockitoHint):
[MockitoHint] 1. Unused -> at org.eclipse.rdf4j.console.command.FederateTest.setUp(FederateTest.java:87)
[MockitoHint] 2. Unused -> at org.eclipse.rdf4j.console.command.FederateTest.setUp(FederateTest.java:88)

08:51:25.073 [main] DEBUG Initializing MemoryStore...
08:51:25.075 [main] DEBUG Initializing data file...
08:51:25.075 [main] DEBUG Data file initialized
08:51:25.075 [main] DEBUG MemoryStore initialized
08:51:25.076 [main] DEBUG syncing data to file...
08:51:25.077 [main] DEBUG Data synced to file
08:51:25.079 [main] DEBUG Initializing MemoryStore...
08:51:25.079 [main] DEBUG Initializing data file...
08:51:25.079 [main] DEBUG Data file initialized
08:51:25.079 [main] DEBUG MemoryStore initialized
08:51:25.080 [main] DEBUG syncing data to file...
08:51:25.081 [main] DEBUG Data synced to file
08:51:25.086 [main] DEBUG Federate called with federation ID = fedID, and member ID's = [alien][scary].
  Distinct set to false, and readonly set to true.

08:51:25.087 [main] DEBUG Federation repository root node: _:node1drqjktvsx692
08:51:25.087 [main] DEBUG _:node1drqjktvsx692 http://www.w3.org/1999/02/22-rdf-syntax-ns#type http://www.openrdf.org/config/repository#Repository
08:51:25.087 [main] DEBUG _:node1drqjktvsx692 http://www.openrdf.org/config/repository#repositoryID "fedID"
08:51:25.087 [main] DEBUG _:node1drqjktvsx692 http://www.w3.org/2000/01/rdf-schema#label "Test Federation Title"
08:51:25.087 [main] DEBUG _:node1drqjktvsx692 http://www.openrdf.org/config/repository#repositoryImpl _:node1drqjktvsx693
08:51:25.087 [main] DEBUG _:node1drqjktvsx693 http://www.openrdf.org/config/repository#repositoryType "openrdf:SailRepository"
08:51:25.087 [main] DEBUG _:node1drqjktvsx693 http://www.openrdf.org/config/repository/sail#sailImpl _:node1drqjktvsx694
08:51:25.087 [main] DEBUG _:node1drqjktvsx694 http://www.openrdf.org/config/sail#sailType "openrdf:Federation"
08:51:25.087 [main] DEBUG _:node1drqjktvsx694 http://www.openrdf.org/config/sail/federation#readOnly "true"^^<http://www.w3.org/2001/XMLSchema#boolean>
08:51:25.087 [main] DEBUG _:node1drqjktvsx694 http://www.openrdf.org/config/sail/federation#distinct "false"^^<http://www.w3.org/2001/XMLSchema#boolean>
08:51:25.087 [main] DEBUG Adding member: alien
08:51:25.087 [main] DEBUG _:node1drqjktvsx694 http://www.openrdf.org/config/sail/federation#member _:node1drqjktvsx695
08:51:25.087 [main] DEBUG _:node1drqjktvsx695 http://www.openrdf.org/config/repository#repositoryType "openrdf:ProxyRepository"
08:51:25.087 [main] DEBUG _:node1drqjktvsx695 http://www.openrdf.org/config/repository/proxy#proxiedID "alien"
08:51:25.087 [main] DEBUG Added member alien: 
08:51:25.087 [main] DEBUG Adding member: scary
08:51:25.087 [main] DEBUG _:node1drqjktvsx694 http://www.openrdf.org/config/sail/federation#member _:node1drqjktvsx698
08:51:25.088 [main] DEBUG _:node1drqjktvsx698 http://www.openrdf.org/config/repository#repositoryType "openrdf:ProxyRepository"
08:51:25.088 [main] DEBUG _:node1drqjktvsx698 http://www.openrdf.org/config/repository/proxy#proxiedID "scary"
08:51:25.088 [main] DEBUG Added member scary: 
08:51:25.103 [main] DEBUG Initializing MemoryStore...
08:51:25.104 [main] DEBUG Initializing data file...
08:51:25.105 [main] DEBUG Data file initialized
08:51:25.105 [main] DEBUG MemoryStore initialized
08:51:25.106 [main] DEBUG syncing data to file...
08:51:25.107 [main] DEBUG Data synced to file
08:51:25.108 [main] DEBUG Initializing MemoryStore...
08:51:25.109 [main] DEBUG Initializing data file...
08:51:25.109 [main] DEBUG Data file initialized
08:51:25.109 [main] DEBUG MemoryStore initialized
08:51:25.111 [main] DEBUG syncing data to file...
08:51:25.111 [main] DEBUG Data synced to file
[MockitoHint] FederateTest.testOneArgumentPrintsHelp (see javadoc for MockitoHint):
[MockitoHint] 1. Unused -> at org.eclipse.rdf4j.console.command.FederateTest.setUp(FederateTest.java:87)
[MockitoHint] 2. Unused -> at org.eclipse.rdf4j.console.command.FederateTest.setUp(FederateTest.java:88)

08:51:25.123 [main] DEBUG Initializing MemoryStore...
08:51:25.124 [main] DEBUG Initializing data file...
08:51:25.125 [main] DEBUG Data file initialized
08:51:25.125 [main] DEBUG MemoryStore initialized
08:51:25.126 [main] DEBUG syncing data to file...
08:51:25.126 [main] DEBUG Data synced to file
08:51:25.128 [main] DEBUG Initializing MemoryStore...
08:51:25.129 [main] DEBUG Initializing data file...
08:51:25.129 [main] DEBUG Data file initialized
08:51:25.129 [main] DEBUG MemoryStore initialized
08:51:25.130 [main] DEBUG syncing data to file...
08:51:25.130 [main] DEBUG Data synced to file
08:51:25.136 [main] DEBUG Federate called with federation ID = fedID, and member ID's = [http][http2].
  Distinct set to false, and readonly set to true.

08:51:25.138 [main] DEBUG Federation repository root node: _:node1drqjktvsx784
08:51:25.138 [main] DEBUG _:node1drqjktvsx784 http://www.w3.org/1999/02/22-rdf-syntax-ns#type http://www.openrdf.org/config/repository#Repository
08:51:25.138 [main] DEBUG _:node1drqjktvsx784 http://www.openrdf.org/config/repository#repositoryID "fedID"
08:51:25.138 [main] DEBUG _:node1drqjktvsx784 http://www.w3.org/2000/01/rdf-schema#label "Test Federation Title"
08:51:25.138 [main] DEBUG _:node1drqjktvsx784 http://www.openrdf.org/config/repository#repositoryImpl _:node1drqjktvsx785
08:51:25.138 [main] DEBUG _:node1drqjktvsx785 http://www.openrdf.org/config/repository#repositoryType "openrdf:SailRepository"
08:51:25.138 [main] DEBUG _:node1drqjktvsx785 http://www.openrdf.org/config/repository/sail#sailImpl _:node1drqjktvsx786
08:51:25.138 [main] DEBUG _:node1drqjktvsx786 http://www.openrdf.org/config/sail#sailType "openrdf:Federation"
08:51:25.138 [main] DEBUG _:node1drqjktvsx786 http://www.openrdf.org/config/sail/federation#readOnly "true"^^<http://www.w3.org/2001/XMLSchema#boolean>
08:51:25.138 [main] DEBUG _:node1drqjktvsx786 http://www.openrdf.org/config/sail/federation#distinct "false"^^<http://www.w3.org/2001/XMLSchema#boolean>
08:51:25.138 [main] DEBUG Adding member: http
08:51:25.138 [main] DEBUG _:node1drqjktvsx786 http://www.openrdf.org/config/sail/federation#member _:node1drqjktvsx787
08:51:25.138 [main] DEBUG _:node1drqjktvsx787 http://www.openrdf.org/config/repository#repositoryType "openrdf:HTTPRepository"
08:51:25.139 [main] DEBUG _:node1drqjktvsx787 http://www.openrdf.org/config/repository/http#repositoryURL http://localhost:8080/openrdf-sesame/repositories/http
08:51:25.139 [main] DEBUG Added member http: 
08:51:25.139 [main] DEBUG Adding member: http2
08:51:25.139 [main] DEBUG _:node1drqjktvsx786 http://www.openrdf.org/config/sail/federation#member _:node1drqjktvsx790
08:51:25.139 [main] DEBUG _:node1drqjktvsx790 http://www.openrdf.org/config/repository#repositoryType "openrdf:HTTPRepository"
08:51:25.140 [main] DEBUG _:node1drqjktvsx790 http://www.openrdf.org/config/repository/http#repositoryURL http://localhost:8080/openrdf-sesame/repositories/http
08:51:25.140 [main] DEBUG Added member http2: 
[INFO] Tests run: 15, Failures: 0, Errors: 0, Skipped: 0, Time elapsed: 0.639 s - in org.eclipse.rdf4j.console.command.FederateTest
[INFO] Running org.eclipse.rdf4j.console.command.SparqlTest
[MockitoHint] SparqlTest.testInputFile (see javadoc for MockitoHint):
[MockitoHint] 1. Unused -> at org.eclipse.rdf4j.console.command.SparqlTest.setUp(SparqlTest.java:49)

08:51:25.192 [main] ERROR No suitable result writer found
[MockitoHint] SparqlTest.testSelectError (see javadoc for MockitoHint):
[MockitoHint] 1. Unused -> at org.eclipse.rdf4j.console.command.SparqlTest.setUp(SparqlTest.java:49)

[MockitoHint] SparqlTest.testSelectMissingBindings (see javadoc for MockitoHint):
[MockitoHint] 1. Unused -> at org.eclipse.rdf4j.console.command.SparqlTest.setUp(SparqlTest.java:49)

[MockitoHint] SparqlTest.testInputFileWorkdir (see javadoc for MockitoHint):
[MockitoHint] 1. Unused -> at org.eclipse.rdf4j.console.command.SparqlTest.setUp(SparqlTest.java:49)

[INFO] Tests run: 9, Failures: 0, Errors: 0, Skipped: 0, Time elapsed: 0.121 s - in org.eclipse.rdf4j.console.command.SparqlTest
[INFO] Running org.eclipse.rdf4j.console.UtilTest
 one, two
 three
 four
 five, six
 seven
 eight
[INFO] Tests run: 4, Failures: 0, Errors: 0, Skipped: 0, Time elapsed: 0 s - in org.eclipse.rdf4j.console.UtilTest
[INFO] Running org.eclipse.rdf4j.console.ConsoleIOTest
[INFO] Tests run: 3, Failures: 0, Errors: 0, Skipped: 0, Time elapsed: 0.032 s - in org.eclipse.rdf4j.console.ConsoleIOTest
[INFO] 
[INFO] Results:
[INFO] 
[INFO] Tests run: 64, Failures: 0, Errors: 0, Skipped: 0
[INFO] 
[JENKINS] Recording test results
[INFO] 
[INFO] --- animal-sniffer-maven-plugin:1.16:check (default) @ rdf4j-console ---
[INFO] Checking unresolved references to org.codehaus.mojo.signature:java18:1.0
[INFO] 
[INFO] --- maven-jar-plugin:2.3.1:jar (default-jar) @ rdf4j-console ---
[INFO] Building jar: /home/hudson/genie.rdf4j/.jenkins/jobs/rdf4j-pr-verify/workspace/tools/console/target/rdf4j-console-3.1.0-SNAPSHOT.jar