SuccessConsole Output

Started calculate disk usage of build
Finished Calculation of disk usage of build in 0 seconds
Started calculate disk usage of workspace
Finished Calculation of disk usage of workspace in 0 seconds
[INFO] 
[INFO] ------------------< org.eclipse.rdf4j:rdf4j-console >-------------------
[INFO] Building RDF4J: Console 3.1.0-SNAPSHOT                           [70/85]
[INFO] --------------------------------[ jar ]---------------------------------
[INFO] 
[INFO] --- buildnumber-maven-plugin:1.4:create (default) @ rdf4j-console ---
[INFO] ShortRevision tag detected. The value is '7'.
[INFO] Executing: /bin/sh -c cd '/home/hudson/genie.rdf4j/.jenkins/jobs/rdf4j-pr-verify/workspace/tools/console' && 'git' 'rev-parse' '--verify' '--short=7' 'HEAD'
[INFO] Working directory: /home/hudson/genie.rdf4j/.jenkins/jobs/rdf4j-pr-verify/workspace/tools/console
[INFO] Storing buildNumber: f8e8b09 at timestamp: 1576068378550
[WARNING] Cannot get the branch information from the git repository: 
Detecting the current branch failed: fatal: ref HEAD is not a symbolic ref

[INFO] ShortRevision tag detected. The value is '7'.
[INFO] Executing: /bin/sh -c cd '/home/hudson/genie.rdf4j/.jenkins/jobs/rdf4j-pr-verify/workspace/tools/console' && 'git' 'rev-parse' '--verify' '--short=7' 'HEAD'
[INFO] Working directory: /home/hudson/genie.rdf4j/.jenkins/jobs/rdf4j-pr-verify/workspace/tools/console
[INFO] Storing buildScmBranch: UNKNOWN
[INFO] 
[INFO] --- maven-enforcer-plugin:1.4.1:enforce (enforce-bytecode-version) @ rdf4j-console ---
[INFO] Adding ignore: META-INF/**/module-info
[INFO] 
[INFO] --- formatter-maven-plugin:2.8.1:validate (default) @ rdf4j-console ---
[INFO] Using 'UTF-8' encoding to format source files.
[INFO] Number of files to be formatted: 61
[INFO] Html formatting is skipped
[INFO] Successfully formatted:          0 file(s)
[INFO] Fail to format:                  0 file(s)
[INFO] Skipped:                         61 file(s)
[INFO] Read only skipped:               0 file(s)
[INFO] Approximate time taken:          0s
[INFO] 
[INFO] --- maven-resources-plugin:3.0.2:resources (default-resources) @ rdf4j-console ---
[INFO] Using 'UTF-8' encoding to copy filtered resources.
[INFO] skip non existing resourceDirectory /home/hudson/genie.rdf4j/.jenkins/jobs/rdf4j-pr-verify/workspace/tools/console/src/main/resources
[INFO] 
[INFO] --- maven-compiler-plugin:3.7.0:compile (default-compile) @ rdf4j-console ---
[INFO] Changes detected - recompiling the module!
[INFO] Compiling 42 source files to /home/hudson/genie.rdf4j/.jenkins/jobs/rdf4j-pr-verify/workspace/tools/console/target/classes
[INFO] 
[INFO] --- maven-resources-plugin:3.0.2:testResources (default-testResources) @ rdf4j-console ---
[INFO] Using 'UTF-8' encoding to copy filtered resources.
[INFO] Copying 29 resources
[INFO] 
[INFO] --- maven-compiler-plugin:3.7.0:testCompile (default-testCompile) @ rdf4j-console ---
[INFO] Changes detected - recompiling the module!
[INFO] Compiling 18 source files to /home/hudson/genie.rdf4j/.jenkins/jobs/rdf4j-pr-verify/workspace/tools/console/target/test-classes
[INFO] 
[INFO] --- maven-surefire-plugin:2.22.2:test (default-test) @ rdf4j-console ---
[INFO] 
[INFO] -------------------------------------------------------
[INFO]  T E S T S
[INFO] -------------------------------------------------------
[INFO] Running org.eclipse.rdf4j.console.setting.PrefixesTest
[INFO] Tests run: 3, Failures: 0, Errors: 0, Skipped: 0, Time elapsed: 0.648 s - in org.eclipse.rdf4j.console.setting.PrefixesTest
[INFO] Running org.eclipse.rdf4j.console.setting.LogLevelTest
07:46:25.960 [main] ERROR unknown logging level: chatty
[INFO] Tests run: 4, Failures: 0, Errors: 0, Skipped: 0, Time elapsed: 0.016 s - in org.eclipse.rdf4j.console.setting.LogLevelTest
[INFO] Running org.eclipse.rdf4j.console.setting.QueryPrefixTest
[INFO] Tests run: 1, Failures: 0, Errors: 0, Skipped: 0, Time elapsed: 0 s - in org.eclipse.rdf4j.console.setting.QueryPrefixTest
[INFO] Running org.eclipse.rdf4j.console.setting.ShowPrefixTest
[INFO] Tests run: 1, Failures: 0, Errors: 0, Skipped: 0, Time elapsed: 0 s - in org.eclipse.rdf4j.console.setting.ShowPrefixTest
[INFO] Running org.eclipse.rdf4j.console.setting.ConsoleWidthTest
[INFO] Tests run: 1, Failures: 0, Errors: 0, Skipped: 0, Time elapsed: 0 s - in org.eclipse.rdf4j.console.setting.ConsoleWidthTest
[INFO] Running org.eclipse.rdf4j.console.command.SetParametersTest
07:46:25.997 [main] ERROR Unknown parameter: unknown
[INFO] Tests run: 1, Failures: 0, Errors: 0, Skipped: 0, Time elapsed: 0.028 s - in org.eclipse.rdf4j.console.command.SetParametersTest
[INFO] Running org.eclipse.rdf4j.console.command.LoadTest
[MockitoHint] LoadTest.testLoad (see javadoc for MockitoHint):
[MockitoHint] 1. Unused -> at org.eclipse.rdf4j.console.command.LoadTest.setUp(LoadTest.java:49)

[MockitoHint] LoadTest.testLoadWorkDir (see javadoc for MockitoHint):
[MockitoHint] 1. Unused -> at org.eclipse.rdf4j.console.command.LoadTest.setUp(LoadTest.java:49)

[INFO] Tests run: 2, Failures: 0, Errors: 0, Skipped: 0, Time elapsed: 0.188 s - in org.eclipse.rdf4j.console.command.LoadTest
[INFO] Running org.eclipse.rdf4j.console.command.ConvertTest
07:46:26.425 [main] ERROR No RDF writer for /tmp/genie.rdf4j/junit894990233308132297/alien.qyx
[MockitoHint] ConvertTest.testConvertInvalidFormat (see javadoc for MockitoHint):
[MockitoHint] 1. Unused -> at org.eclipse.rdf4j.console.command.ConvertTest.setup(ConvertTest.java:39)

07:46:26.431 [main] ERROR Failed to convert data
org.eclipse.rdf4j.rio.RDFParseException: Expected '<' or '_', found: e [line 1, column 101]
	at org.eclipse.rdf4j.rio.ntriples.NTriplesParser.parseSubject(NTriplesParser.java:313)
	at org.eclipse.rdf4j.rio.ntriples.NTriplesParser.parseTriple(NTriplesParser.java:252)
	at org.eclipse.rdf4j.rio.ntriples.NTriplesParser.parse(NTriplesParser.java:160)
	at org.eclipse.rdf4j.rio.ntriples.NTriplesParser.parse(NTriplesParser.java:109)
	at org.eclipse.rdf4j.console.command.Convert.convert(Convert.java:139)
	at org.eclipse.rdf4j.console.command.Convert.execute(Convert.java:74)
	at org.eclipse.rdf4j.console.command.ConvertTest.testConvertParseError(ConvertTest.java:92)
	at sun.reflect.NativeMethodAccessorImpl.invoke0(Native Method)
	at sun.reflect.NativeMethodAccessorImpl.invoke(NativeMethodAccessorImpl.java:62)
	at sun.reflect.DelegatingMethodAccessorImpl.invoke(DelegatingMethodAccessorImpl.java:43)
	at java.lang.reflect.Method.invoke(Method.java:498)
	at org.junit.runners.model.FrameworkMethod$1.runReflectiveCall(FrameworkMethod.java:50)
	at org.junit.internal.runners.model.ReflectiveCallable.run(ReflectiveCallable.java:12)
	at org.junit.runners.model.FrameworkMethod.invokeExplosively(FrameworkMethod.java:47)
	at org.junit.internal.runners.statements.InvokeMethod.evaluate(InvokeMethod.java:17)
	at org.junit.internal.runners.statements.RunBefores.evaluate(RunBefores.java:26)
	at org.junit.internal.runners.statements.RunAfters.evaluate(RunAfters.java:27)
	at org.mockito.internal.junit.JUnitRule$1.evaluateSafely(JUnitRule.java:52)
	at org.mockito.internal.junit.JUnitRule$1.evaluate(JUnitRule.java:43)
	at org.junit.rules.ExternalResource$1.evaluate(ExternalResource.java:48)
	at org.junit.rules.RunRules.evaluate(RunRules.java:20)
	at org.junit.runners.ParentRunner.runLeaf(ParentRunner.java:325)
	at org.junit.runners.BlockJUnit4ClassRunner.runChild(BlockJUnit4ClassRunner.java:78)
	at org.junit.runners.BlockJUnit4ClassRunner.runChild(BlockJUnit4ClassRunner.java:57)
	at org.junit.runners.ParentRunner$3.run(ParentRunner.java:290)
	at org.junit.runners.ParentRunner$1.schedule(ParentRunner.java:71)
	at org.junit.runners.ParentRunner.runChildren(ParentRunner.java:288)
	at org.junit.runners.ParentRunner.access$000(ParentRunner.java:58)
	at org.junit.runners.ParentRunner$2.evaluate(ParentRunner.java:268)
	at org.junit.runners.ParentRunner.run(ParentRunner.java:363)
	at org.apache.maven.surefire.junit4.JUnit4Provider.execute(JUnit4Provider.java:365)
	at org.apache.maven.surefire.junit4.JUnit4Provider.executeWithRerun(JUnit4Provider.java:273)
	at org.apache.maven.surefire.junit4.JUnit4Provider.executeTestSet(JUnit4Provider.java:238)
	at org.apache.maven.surefire.junit4.JUnit4Provider.invoke(JUnit4Provider.java:159)
	at org.apache.maven.surefire.booter.ForkedBooter.invokeProviderInSameClassLoader(ForkedBooter.java:384)
	at org.apache.maven.surefire.booter.ForkedBooter.runSuitesInProcess(ForkedBooter.java:345)
	at org.apache.maven.surefire.booter.ForkedBooter.execute(ForkedBooter.java:126)
	at org.apache.maven.surefire.booter.ForkedBooter.main(ForkedBooter.java:418)
[INFO] Tests run: 4, Failures: 0, Errors: 0, Skipped: 0, Time elapsed: 0.238 s - in org.eclipse.rdf4j.console.command.ConvertTest
[INFO] Running org.eclipse.rdf4j.console.command.ExportTest
[MockitoHint] ExportTest.testExportWorkDir (see javadoc for MockitoHint):
[MockitoHint] 1. Unused -> at org.eclipse.rdf4j.console.command.ExportTest.setUp(ExportTest.java:46)

[MockitoHint] ExportTest.testExportAll (see javadoc for MockitoHint):
[MockitoHint] 1. Unused -> at org.eclipse.rdf4j.console.command.ExportTest.setUp(ExportTest.java:46)

[MockitoHint] ExportTest.testExportContexts (see javadoc for MockitoHint):
[MockitoHint] 1. Unused -> at org.eclipse.rdf4j.console.command.ExportTest.setUp(ExportTest.java:46)

[INFO] Tests run: 3, Failures: 0, Errors: 0, Skipped: 0, Time elapsed: 0.05 s - in org.eclipse.rdf4j.console.command.ExportTest
[INFO] Running org.eclipse.rdf4j.console.command.VerifyTest
07:46:26.826 [main] ERROR Unexpected RDFParseException
org.eclipse.rdf4j.rio.RDFParseException: 'missing type' was not recognised, and could not be verified, with datatype http://example.rdf4j.org/type/wrong [line 1]
	at org.eclipse.rdf4j.rio.helpers.RDFParserHelper.reportError(RDFParserHelper.java:265)
	at org.eclipse.rdf4j.rio.helpers.RDFParserHelper.createLiteral(RDFParserHelper.java:180)
	at org.eclipse.rdf4j.rio.helpers.AbstractRDFParser.createLiteral(AbstractRDFParser.java:530)
	at org.eclipse.rdf4j.rio.turtle.TurtleParser.parseQuotedLiteral(TurtleParser.java:665)
	at org.eclipse.rdf4j.rio.turtle.TurtleParser.parseValue(TurtleParser.java:584)
	at org.eclipse.rdf4j.rio.turtle.TurtleParser.parseObject(TurtleParser.java:461)
	at org.eclipse.rdf4j.rio.turtle.TurtleParser.parseObjectList(TurtleParser.java:389)
	at org.eclipse.rdf4j.rio.turtle.TurtleParser.parsePredicateObjectList(TurtleParser.java:362)
	at org.eclipse.rdf4j.rio.turtle.TurtleParser.parseTriples(TurtleParser.java:349)
	at org.eclipse.rdf4j.rio.turtle.TurtleParser.parseStatement(TurtleParser.java:216)
	at org.eclipse.rdf4j.rio.turtle.TurtleParser.parse(TurtleParser.java:178)
	at org.eclipse.rdf4j.rio.turtle.TurtleParser.parse(TurtleParser.java:130)
	at org.eclipse.rdf4j.console.command.Verify.verify(Verify.java:145)
	at org.eclipse.rdf4j.console.command.Verify.execute(Verify.java:97)
	at org.eclipse.rdf4j.console.command.VerifyTest.testVerifyMissingType(VerifyTest.java:97)
	at sun.reflect.NativeMethodAccessorImpl.invoke0(Native Method)
	at sun.reflect.NativeMethodAccessorImpl.invoke(NativeMethodAccessorImpl.java:62)
	at sun.reflect.DelegatingMethodAccessorImpl.invoke(DelegatingMethodAccessorImpl.java:43)
	at java.lang.reflect.Method.invoke(Method.java:498)
	at org.junit.runners.model.FrameworkMethod$1.runReflectiveCall(FrameworkMethod.java:50)
	at org.junit.internal.runners.model.ReflectiveCallable.run(ReflectiveCallable.java:12)
	at org.junit.runners.model.FrameworkMethod.invokeExplosively(FrameworkMethod.java:47)
	at org.junit.internal.runners.statements.InvokeMethod.evaluate(InvokeMethod.java:17)
	at org.junit.internal.runners.statements.RunBefores.evaluate(RunBefores.java:26)
	at org.junit.internal.runners.statements.RunAfters.evaluate(RunAfters.java:27)
	at org.mockito.internal.junit.JUnitRule$1.evaluateSafely(JUnitRule.java:52)
	at org.mockito.internal.junit.JUnitRule$1.evaluate(JUnitRule.java:43)
	at org.junit.rules.ExternalResource$1.evaluate(ExternalResource.java:48)
	at org.junit.rules.RunRules.evaluate(RunRules.java:20)
	at org.junit.runners.ParentRunner.runLeaf(ParentRunner.java:325)
	at org.junit.runners.BlockJUnit4ClassRunner.runChild(BlockJUnit4ClassRunner.java:78)
	at org.junit.runners.BlockJUnit4ClassRunner.runChild(BlockJUnit4ClassRunner.java:57)
	at org.junit.runners.ParentRunner$3.run(ParentRunner.java:290)
	at org.junit.runners.ParentRunner$1.schedule(ParentRunner.java:71)
	at org.junit.runners.ParentRunner.runChildren(ParentRunner.java:288)
	at org.junit.runners.ParentRunner.access$000(ParentRunner.java:58)
	at org.junit.runners.ParentRunner$2.evaluate(ParentRunner.java:268)
	at org.junit.runners.ParentRunner.run(ParentRunner.java:363)
	at org.apache.maven.surefire.junit4.JUnit4Provider.execute(JUnit4Provider.java:365)
	at org.apache.maven.surefire.junit4.JUnit4Provider.executeWithRerun(JUnit4Provider.java:273)
	at org.apache.maven.surefire.junit4.JUnit4Provider.executeTestSet(JUnit4Provider.java:238)
	at org.apache.maven.surefire.junit4.JUnit4Provider.invoke(JUnit4Provider.java:159)
	at org.apache.maven.surefire.booter.ForkedBooter.invokeProviderInSameClassLoader(ForkedBooter.java:384)
	at org.apache.maven.surefire.booter.ForkedBooter.runSuitesInProcess(ForkedBooter.java:345)
	at org.apache.maven.surefire.booter.ForkedBooter.execute(ForkedBooter.java:126)
	at org.apache.maven.surefire.booter.ForkedBooter.main(ForkedBooter.java:418)
07:46:26.874 [main] ERROR SHACL validation failed, writing report to /tmp/genie.rdf4j/junit8185699654561085171/junit7852900914663175444.tmp
07:46:26.890 [main] ERROR Unexpected RDFParseException
org.eclipse.rdf4j.rio.RDFParseException: Unexpected end of file
	at org.eclipse.rdf4j.rio.turtle.TurtleParser.throwEOFException(TurtleParser.java:1317)
	at org.eclipse.rdf4j.rio.turtle.TurtleParser.parseValue(TurtleParser.java:589)
	at org.eclipse.rdf4j.rio.turtle.TurtleParser.parsePredicate(TurtleParser.java:434)
	at org.eclipse.rdf4j.rio.turtle.TurtleParser.parsePredicateObjectList(TurtleParser.java:358)
	at org.eclipse.rdf4j.rio.turtle.TurtleParser.parseTriples(TurtleParser.java:349)
	at org.eclipse.rdf4j.rio.turtle.TurtleParser.parseStatement(TurtleParser.java:216)
	at org.eclipse.rdf4j.rio.turtle.TurtleParser.parse(TurtleParser.java:178)
	at org.eclipse.rdf4j.rio.turtle.TurtleParser.parse(TurtleParser.java:130)
	at org.eclipse.rdf4j.console.command.Verify.verify(Verify.java:145)
	at org.eclipse.rdf4j.console.command.Verify.execute(Verify.java:97)
	at org.eclipse.rdf4j.console.command.VerifyTest.testVerifyBrokenFile(VerifyTest.java:91)
	at sun.reflect.NativeMethodAccessorImpl.invoke0(Native Method)
	at sun.reflect.NativeMethodAccessorImpl.invoke(NativeMethodAccessorImpl.java:62)
	at sun.reflect.DelegatingMethodAccessorImpl.invoke(DelegatingMethodAccessorImpl.java:43)
	at java.lang.reflect.Method.invoke(Method.java:498)
	at org.junit.runners.model.FrameworkMethod$1.runReflectiveCall(FrameworkMethod.java:50)
	at org.junit.internal.runners.model.ReflectiveCallable.run(ReflectiveCallable.java:12)
	at org.junit.runners.model.FrameworkMethod.invokeExplosively(FrameworkMethod.java:47)
	at org.junit.internal.runners.statements.InvokeMethod.evaluate(InvokeMethod.java:17)
	at org.junit.internal.runners.statements.RunBefores.evaluate(RunBefores.java:26)
	at org.junit.internal.runners.statements.RunAfters.evaluate(RunAfters.java:27)
	at org.mockito.internal.junit.JUnitRule$1.evaluateSafely(JUnitRule.java:52)
	at org.mockito.internal.junit.JUnitRule$1.evaluate(JUnitRule.java:43)
	at org.junit.rules.ExternalResource$1.evaluate(ExternalResource.java:48)
	at org.junit.rules.RunRules.evaluate(RunRules.java:20)
	at org.junit.runners.ParentRunner.runLeaf(ParentRunner.java:325)
	at org.junit.runners.BlockJUnit4ClassRunner.runChild(BlockJUnit4ClassRunner.java:78)
	at org.junit.runners.BlockJUnit4ClassRunner.runChild(BlockJUnit4ClassRunner.java:57)
	at org.junit.runners.ParentRunner$3.run(ParentRunner.java:290)
	at org.junit.runners.ParentRunner$1.schedule(ParentRunner.java:71)
	at org.junit.runners.ParentRunner.runChildren(ParentRunner.java:288)
	at org.junit.runners.ParentRunner.access$000(ParentRunner.java:58)
	at org.junit.runners.ParentRunner$2.evaluate(ParentRunner.java:268)
	at org.junit.runners.ParentRunner.run(ParentRunner.java:363)
	at org.apache.maven.surefire.junit4.JUnit4Provider.execute(JUnit4Provider.java:365)
	at org.apache.maven.surefire.junit4.JUnit4Provider.executeWithRerun(JUnit4Provider.java:273)
	at org.apache.maven.surefire.junit4.JUnit4Provider.executeTestSet(JUnit4Provider.java:238)
	at org.apache.maven.surefire.junit4.JUnit4Provider.invoke(JUnit4Provider.java:159)
	at org.apache.maven.surefire.booter.ForkedBooter.invokeProviderInSameClassLoader(ForkedBooter.java:384)
	at org.apache.maven.surefire.booter.ForkedBooter.runSuitesInProcess(ForkedBooter.java:345)
	at org.apache.maven.surefire.booter.ForkedBooter.execute(ForkedBooter.java:126)
	at org.apache.maven.surefire.booter.ForkedBooter.main(ForkedBooter.java:418)
07:46:26.902 [main] ERROR Unexpected RDFParseException
org.eclipse.rdf4j.rio.RDFParseException: Expected a letter, found '1' [line 1]
	at org.eclipse.rdf4j.rio.helpers.RDFParserHelper.reportError(RDFParserHelper.java:265)
	at org.eclipse.rdf4j.rio.helpers.AbstractRDFParser.reportError(AbstractRDFParser.java:628)
	at org.eclipse.rdf4j.rio.turtle.TurtleParser.reportError(TurtleParser.java:1297)
	at org.eclipse.rdf4j.rio.turtle.TurtleParser.parseQuotedLiteral(TurtleParser.java:619)
	at org.eclipse.rdf4j.rio.turtle.TurtleParser.parseValue(TurtleParser.java:584)
	at org.eclipse.rdf4j.rio.turtle.TurtleParser.parseObject(TurtleParser.java:461)
	at org.eclipse.rdf4j.rio.turtle.TurtleParser.parseObjectList(TurtleParser.java:389)
	at org.eclipse.rdf4j.rio.turtle.TurtleParser.parsePredicateObjectList(TurtleParser.java:362)
	at org.eclipse.rdf4j.rio.turtle.TurtleParser.parseTriples(TurtleParser.java:349)
	at org.eclipse.rdf4j.rio.turtle.TurtleParser.parseStatement(TurtleParser.java:216)
	at org.eclipse.rdf4j.rio.turtle.TurtleParser.parse(TurtleParser.java:178)
	at org.eclipse.rdf4j.rio.turtle.TurtleParser.parse(TurtleParser.java:130)
	at org.eclipse.rdf4j.console.command.Verify.verify(Verify.java:145)
	at org.eclipse.rdf4j.console.command.Verify.execute(Verify.java:97)
	at org.eclipse.rdf4j.console.command.VerifyTest.testVerifyWrongLang(VerifyTest.java:109)
	at sun.reflect.NativeMethodAccessorImpl.invoke0(Native Method)
	at sun.reflect.NativeMethodAccessorImpl.invoke(NativeMethodAccessorImpl.java:62)
	at sun.reflect.DelegatingMethodAccessorImpl.invoke(DelegatingMethodAccessorImpl.java:43)
	at java.lang.reflect.Method.invoke(Method.java:498)
	at org.junit.runners.model.FrameworkMethod$1.runReflectiveCall(FrameworkMethod.java:50)
	at org.junit.internal.runners.model.ReflectiveCallable.run(ReflectiveCallable.java:12)
	at org.junit.runners.model.FrameworkMethod.invokeExplosively(FrameworkMethod.java:47)
	at org.junit.internal.runners.statements.InvokeMethod.evaluate(InvokeMethod.java:17)
	at org.junit.internal.runners.statements.RunBefores.evaluate(RunBefores.java:26)
	at org.junit.internal.runners.statements.RunAfters.evaluate(RunAfters.java:27)
	at org.mockito.internal.junit.JUnitRule$1.evaluateSafely(JUnitRule.java:52)
	at org.mockito.internal.junit.JUnitRule$1.evaluate(JUnitRule.java:43)
	at org.junit.rules.ExternalResource$1.evaluate(ExternalResource.java:48)
	at org.junit.rules.RunRules.evaluate(RunRules.java:20)
	at org.junit.runners.ParentRunner.runLeaf(ParentRunner.java:325)
	at org.junit.runners.BlockJUnit4ClassRunner.runChild(BlockJUnit4ClassRunner.java:78)
	at org.junit.runners.BlockJUnit4ClassRunner.runChild(BlockJUnit4ClassRunner.java:57)
	at org.junit.runners.ParentRunner$3.run(ParentRunner.java:290)
	at org.junit.runners.ParentRunner$1.schedule(ParentRunner.java:71)
	at org.junit.runners.ParentRunner.runChildren(ParentRunner.java:288)
	at org.junit.runners.ParentRunner.access$000(ParentRunner.java:58)
	at org.junit.runners.ParentRunner$2.evaluate(ParentRunner.java:268)
	at org.junit.runners.ParentRunner.run(ParentRunner.java:363)
	at org.apache.maven.surefire.junit4.JUnit4Provider.execute(JUnit4Provider.java:365)
	at org.apache.maven.surefire.junit4.JUnit4Provider.executeWithRerun(JUnit4Provider.java:273)
	at org.apache.maven.surefire.junit4.JUnit4Provider.executeTestSet(JUnit4Provider.java:238)
	at org.apache.maven.surefire.junit4.JUnit4Provider.invoke(JUnit4Provider.java:159)
	at org.apache.maven.surefire.booter.ForkedBooter.invokeProviderInSameClassLoader(ForkedBooter.java:384)
	at org.apache.maven.surefire.booter.ForkedBooter.runSuitesInProcess(ForkedBooter.java:345)
	at org.apache.maven.surefire.booter.ForkedBooter.execute(ForkedBooter.java:126)
	at org.apache.maven.surefire.booter.ForkedBooter.main(ForkedBooter.java:418)
07:46:26.913 [main] ERROR No parser available for this RDF format
org.eclipse.rdf4j.rio.UnsupportedRDFormatException: Did not recognise RDF format string file:/home/hudson/genie.rdf4j/.jenkins/jobs/rdf4j-pr-verify/workspace/tools/console/does-not-exist.docx
	at org.eclipse.rdf4j.rio.Rio.lambda$unsupportedFormat$1(Rio.java:577)
	at java.util.Optional.orElseThrow(Optional.java:290)
	at org.eclipse.rdf4j.console.command.Verify.verify(Verify.java:124)
	at org.eclipse.rdf4j.console.command.Verify.execute(Verify.java:97)
	at org.eclipse.rdf4j.console.command.VerifyTest.testVerifyWrongFormat(VerifyTest.java:69)
	at sun.reflect.NativeMethodAccessorImpl.invoke0(Native Method)
	at sun.reflect.NativeMethodAccessorImpl.invoke(NativeMethodAccessorImpl.java:62)
	at sun.reflect.DelegatingMethodAccessorImpl.invoke(DelegatingMethodAccessorImpl.java:43)
	at java.lang.reflect.Method.invoke(Method.java:498)
	at org.junit.runners.model.FrameworkMethod$1.runReflectiveCall(FrameworkMethod.java:50)
	at org.junit.internal.runners.model.ReflectiveCallable.run(ReflectiveCallable.java:12)
	at org.junit.runners.model.FrameworkMethod.invokeExplosively(FrameworkMethod.java:47)
	at org.junit.internal.runners.statements.InvokeMethod.evaluate(InvokeMethod.java:17)
	at org.junit.internal.runners.statements.RunBefores.evaluate(RunBefores.java:26)
	at org.junit.internal.runners.statements.RunAfters.evaluate(RunAfters.java:27)
	at org.mockito.internal.junit.JUnitRule$1.evaluateSafely(JUnitRule.java:52)
	at org.mockito.internal.junit.JUnitRule$1.evaluate(JUnitRule.java:43)
	at org.junit.rules.ExternalResource$1.evaluate(ExternalResource.java:48)
	at org.junit.rules.RunRules.evaluate(RunRules.java:20)
	at org.junit.runners.ParentRunner.runLeaf(ParentRunner.java:325)
	at org.junit.runners.BlockJUnit4ClassRunner.runChild(BlockJUnit4ClassRunner.java:78)
	at org.junit.runners.BlockJUnit4ClassRunner.runChild(BlockJUnit4ClassRunner.java:57)
	at org.junit.runners.ParentRunner$3.run(ParentRunner.java:290)
	at org.junit.runners.ParentRunner$1.schedule(ParentRunner.java:71)
	at org.junit.runners.ParentRunner.runChildren(ParentRunner.java:288)
	at org.junit.runners.ParentRunner.access$000(ParentRunner.java:58)
	at org.junit.runners.ParentRunner$2.evaluate(ParentRunner.java:268)
	at org.junit.runners.ParentRunner.run(ParentRunner.java:363)
	at org.apache.maven.surefire.junit4.JUnit4Provider.execute(JUnit4Provider.java:365)
	at org.apache.maven.surefire.junit4.JUnit4Provider.executeWithRerun(JUnit4Provider.java:273)
	at org.apache.maven.surefire.junit4.JUnit4Provider.executeTestSet(JUnit4Provider.java:238)
	at org.apache.maven.surefire.junit4.JUnit4Provider.invoke(JUnit4Provider.java:159)
	at org.apache.maven.surefire.booter.ForkedBooter.invokeProviderInSameClassLoader(ForkedBooter.java:384)
	at org.apache.maven.surefire.booter.ForkedBooter.runSuitesInProcess(ForkedBooter.java:345)
	at org.apache.maven.surefire.booter.ForkedBooter.execute(ForkedBooter.java:126)
	at org.apache.maven.surefire.booter.ForkedBooter.main(ForkedBooter.java:418)
07:46:26.925 [main] ERROR Unexpected RDFParseException
org.eclipse.rdf4j.rio.RDFParseException: IRI included an unencoded space: '32' [line 1]
	at org.eclipse.rdf4j.rio.helpers.RDFParserHelper.reportError(RDFParserHelper.java:265)
	at org.eclipse.rdf4j.rio.helpers.AbstractRDFParser.reportError(AbstractRDFParser.java:628)
	at org.eclipse.rdf4j.rio.turtle.TurtleParser.reportError(TurtleParser.java:1297)
	at org.eclipse.rdf4j.rio.turtle.TurtleParser.parseURI(TurtleParser.java:902)
	at org.eclipse.rdf4j.rio.turtle.TurtleParser.parseValue(TurtleParser.java:575)
	at org.eclipse.rdf4j.rio.turtle.TurtleParser.parseSubject(TurtleParser.java:406)
	at org.eclipse.rdf4j.rio.turtle.TurtleParser.parseTriples(TurtleParser.java:347)
	at org.eclipse.rdf4j.rio.turtle.TurtleParser.parseStatement(TurtleParser.java:216)
	at org.eclipse.rdf4j.rio.turtle.TurtleParser.parse(TurtleParser.java:178)
	at org.eclipse.rdf4j.rio.turtle.TurtleParser.parse(TurtleParser.java:130)
	at org.eclipse.rdf4j.console.command.Verify.verify(Verify.java:145)
	at org.eclipse.rdf4j.console.command.Verify.execute(Verify.java:97)
	at org.eclipse.rdf4j.console.command.VerifyTest.testVerifySpaceIRI(VerifyTest.java:103)
	at sun.reflect.NativeMethodAccessorImpl.invoke0(Native Method)
	at sun.reflect.NativeMethodAccessorImpl.invoke(NativeMethodAccessorImpl.java:62)
	at sun.reflect.DelegatingMethodAccessorImpl.invoke(DelegatingMethodAccessorImpl.java:43)
	at java.lang.reflect.Method.invoke(Method.java:498)
	at org.junit.runners.model.FrameworkMethod$1.runReflectiveCall(FrameworkMethod.java:50)
	at org.junit.internal.runners.model.ReflectiveCallable.run(ReflectiveCallable.java:12)
	at org.junit.runners.model.FrameworkMethod.invokeExplosively(FrameworkMethod.java:47)
	at org.junit.internal.runners.statements.InvokeMethod.evaluate(InvokeMethod.java:17)
	at org.junit.internal.runners.statements.RunBefores.evaluate(RunBefores.java:26)
	at org.junit.internal.runners.statements.RunAfters.evaluate(RunAfters.java:27)
	at org.mockito.internal.junit.JUnitRule$1.evaluateSafely(JUnitRule.java:52)
	at org.mockito.internal.junit.JUnitRule$1.evaluate(JUnitRule.java:43)
	at org.junit.rules.ExternalResource$1.evaluate(ExternalResource.java:48)
	at org.junit.rules.RunRules.evaluate(RunRules.java:20)
	at org.junit.runners.ParentRunner.runLeaf(ParentRunner.java:325)
	at org.junit.runners.BlockJUnit4ClassRunner.runChild(BlockJUnit4ClassRunner.java:78)
	at org.junit.runners.BlockJUnit4ClassRunner.runChild(BlockJUnit4ClassRunner.java:57)
	at org.junit.runners.ParentRunner$3.run(ParentRunner.java:290)
	at org.junit.runners.ParentRunner$1.schedule(ParentRunner.java:71)
	at org.junit.runners.ParentRunner.runChildren(ParentRunner.java:288)
	at org.junit.runners.ParentRunner.access$000(ParentRunner.java:58)
	at org.junit.runners.ParentRunner$2.evaluate(ParentRunner.java:268)
	at org.junit.runners.ParentRunner.run(ParentRunner.java:363)
	at org.apache.maven.surefire.junit4.JUnit4Provider.execute(JUnit4Provider.java:365)
	at org.apache.maven.surefire.junit4.JUnit4Provider.executeWithRerun(JUnit4Provider.java:273)
	at org.apache.maven.surefire.junit4.JUnit4Provider.executeTestSet(JUnit4Provider.java:238)
	at org.apache.maven.surefire.junit4.JUnit4Provider.invoke(JUnit4Provider.java:159)
	at org.apache.maven.surefire.booter.ForkedBooter.invokeProviderInSameClassLoader(ForkedBooter.java:384)
	at org.apache.maven.surefire.booter.ForkedBooter.runSuitesInProcess(ForkedBooter.java:345)
	at org.apache.maven.surefire.booter.ForkedBooter.execute(ForkedBooter.java:126)
	at org.apache.maven.surefire.booter.ForkedBooter.main(ForkedBooter.java:418)
[INFO] Tests run: 10, Failures: 0, Errors: 0, Skipped: 0, Time elapsed: 0.478 s - in org.eclipse.rdf4j.console.command.VerifyTest
[INFO] Running org.eclipse.rdf4j.console.command.DropTest
[MockitoHint] DropTest.testUserAbortedUnsafeDropBeforeWarning (see javadoc for MockitoHint):
[MockitoHint] 1. Unused -> at org.eclipse.rdf4j.console.command.DropTest.setUp(DropTest.java:50)

[INFO] Tests run: 3, Failures: 0, Errors: 0, Skipped: 0, Time elapsed: 0.12 s - in org.eclipse.rdf4j.console.command.DropTest
[INFO] Running org.eclipse.rdf4j.console.command.FederateTest
07:46:27.110 [main] DEBUG Initializing MemoryStore...
07:46:27.111 [main] DEBUG Initializing data file...
07:46:27.111 [main] DEBUG Data file initialized
07:46:27.111 [main] DEBUG MemoryStore initialized
07:46:27.114 [main] DEBUG syncing data to file...
07:46:27.115 [main] DEBUG Data synced to file
07:46:27.120 [main] DEBUG Initializing MemoryStore...
07:46:27.121 [main] DEBUG Initializing data file...
07:46:27.121 [main] DEBUG Data file initialized
07:46:27.121 [main] DEBUG MemoryStore initialized
07:46:27.124 [main] DEBUG syncing data to file...
07:46:27.125 [main] DEBUG Data synced to file
07:46:27.147 [main] DEBUG Federate called with federation ID = fedID, and member ID's = [sparql][alien][http].
  Distinct set to false, and readonly set to true.

07:46:27.153 [main] DEBUG Federation repository root node: _:node1drqfu2iax216
07:46:27.155 [main] DEBUG _:node1drqfu2iax216 http://www.w3.org/1999/02/22-rdf-syntax-ns#type http://www.openrdf.org/config/repository#Repository
07:46:27.155 [main] DEBUG _:node1drqfu2iax216 http://www.openrdf.org/config/repository#repositoryID "fedID"
07:46:27.155 [main] DEBUG _:node1drqfu2iax216 http://www.w3.org/2000/01/rdf-schema#label "Test Federation Title"
07:46:27.156 [main] DEBUG _:node1drqfu2iax216 http://www.openrdf.org/config/repository#repositoryImpl _:node1drqfu2iax217
07:46:27.156 [main] DEBUG _:node1drqfu2iax217 http://www.openrdf.org/config/repository#repositoryType "openrdf:SailRepository"
07:46:27.156 [main] DEBUG _:node1drqfu2iax217 http://www.openrdf.org/config/repository/sail#sailImpl _:node1drqfu2iax218
07:46:27.156 [main] DEBUG _:node1drqfu2iax218 http://www.openrdf.org/config/sail#sailType "openrdf:Federation"
07:46:27.157 [main] DEBUG _:node1drqfu2iax218 http://www.openrdf.org/config/sail/federation#readOnly "true"^^<http://www.w3.org/2001/XMLSchema#boolean>
07:46:27.157 [main] DEBUG _:node1drqfu2iax218 http://www.openrdf.org/config/sail/federation#distinct "false"^^<http://www.w3.org/2001/XMLSchema#boolean>
07:46:27.157 [main] DEBUG Adding member: sparql
07:46:27.157 [main] DEBUG _:node1drqfu2iax218 http://www.openrdf.org/config/sail/federation#member _:node1drqfu2iax219
07:46:27.159 [main] DEBUG _:node1drqfu2iax219 http://www.openrdf.org/config/repository#repositoryType "openrdf:SPARQLRepository"
07:46:27.160 [main] DEBUG _:node1drqfu2iax219 http://www.openrdf.org/config/repository/sparql#query-endpoint http://localhost:8080/openrdf-sesame/repositories/sparql
07:46:27.160 [main] DEBUG Added member sparql: 
07:46:27.160 [main] DEBUG Adding member: alien
07:46:27.160 [main] DEBUG _:node1drqfu2iax218 http://www.openrdf.org/config/sail/federation#member _:node1drqfu2iax222
07:46:27.161 [main] DEBUG _:node1drqfu2iax222 http://www.openrdf.org/config/repository#repositoryType "openrdf:ProxyRepository"
07:46:27.161 [main] DEBUG _:node1drqfu2iax222 http://www.openrdf.org/config/repository/proxy#proxiedID "alien"
07:46:27.161 [main] DEBUG Added member alien: 
07:46:27.161 [main] DEBUG Adding member: http
07:46:27.161 [main] DEBUG _:node1drqfu2iax218 http://www.openrdf.org/config/sail/federation#member _:node1drqfu2iax225
07:46:27.162 [main] DEBUG _:node1drqfu2iax225 http://www.openrdf.org/config/repository#repositoryType "openrdf:HTTPRepository"
07:46:27.163 [main] DEBUG _:node1drqfu2iax225 http://www.openrdf.org/config/repository/http#repositoryURL http://localhost:8080/openrdf-sesame/repositories/http
07:46:27.163 [main] DEBUG Added member http: 
07:46:27.201 [main] DEBUG Initializing MemoryStore...
07:46:27.202 [main] DEBUG Initializing data file...
07:46:27.203 [main] DEBUG Data file initialized
07:46:27.203 [main] DEBUG MemoryStore initialized
07:46:27.204 [main] DEBUG syncing data to file...
07:46:27.205 [main] DEBUG Data synced to file
07:46:27.210 [main] DEBUG Initializing MemoryStore...
07:46:27.211 [main] DEBUG Initializing data file...
07:46:27.211 [main] DEBUG Data file initialized
07:46:27.211 [main] DEBUG MemoryStore initialized
07:46:27.212 [main] DEBUG syncing data to file...
07:46:27.213 [main] DEBUG Data synced to file
07:46:27.221 [main] ERROR Duplicate repository id's specified.
[MockitoHint] FederateTest.testDuplicateMembersPrintsError (see javadoc for MockitoHint):
[MockitoHint] 1. Unused -> at org.eclipse.rdf4j.console.command.FederateTest.setUp(FederateTest.java:87)
[MockitoHint] 2. Unused -> at org.eclipse.rdf4j.console.command.FederateTest.setUp(FederateTest.java:88)

07:46:27.230 [main] DEBUG Initializing MemoryStore...
07:46:27.231 [main] DEBUG Initializing data file...
07:46:27.231 [main] DEBUG Data file initialized
07:46:27.231 [main] DEBUG MemoryStore initialized
07:46:27.234 [main] DEBUG syncing data to file...
07:46:27.235 [main] DEBUG Data synced to file
07:46:27.239 [main] DEBUG Initializing MemoryStore...
07:46:27.240 [main] DEBUG Initializing data file...
07:46:27.240 [main] DEBUG Data file initialized
07:46:27.240 [main] DEBUG MemoryStore initialized
07:46:27.242 [main] DEBUG syncing data to file...
07:46:27.242 [main] DEBUG Data synced to file
07:46:27.252 [main] DEBUG Federate called with federation ID = alien, and member ID's = [fedID][scary].
  Distinct set to false, and readonly set to true.

07:46:27.254 [main] ERROR alien already exists.
[MockitoHint] FederateTest.testFedAlreadyExistsPrintsSpecificError (see javadoc for MockitoHint):
[MockitoHint] 1. Unused -> at org.eclipse.rdf4j.console.command.FederateTest.setUp(FederateTest.java:88)

07:46:27.261 [main] DEBUG Initializing MemoryStore...
07:46:27.262 [main] DEBUG Initializing data file...
07:46:27.262 [main] DEBUG Data file initialized
07:46:27.262 [main] DEBUG MemoryStore initialized
07:46:27.263 [main] DEBUG syncing data to file...
07:46:27.264 [main] DEBUG Data synced to file
07:46:27.266 [main] DEBUG Initializing MemoryStore...
07:46:27.267 [main] DEBUG Initializing data file...
07:46:27.267 [main] DEBUG Data file initialized
07:46:27.267 [main] DEBUG MemoryStore initialized
07:46:27.268 [main] DEBUG syncing data to file...
07:46:27.269 [main] DEBUG Data synced to file
07:46:27.276 [main] DEBUG Federate called with federation ID = fedID, and member ID's = [alien][scary].
  Distinct set to true, and readonly set to false.

07:46:27.277 [main] DEBUG Federation repository root node: _:node1drqfu2iax338
07:46:27.277 [main] DEBUG _:node1drqfu2iax338 http://www.w3.org/1999/02/22-rdf-syntax-ns#type http://www.openrdf.org/config/repository#Repository
07:46:27.277 [main] DEBUG _:node1drqfu2iax338 http://www.openrdf.org/config/repository#repositoryID "fedID"
07:46:27.277 [main] DEBUG _:node1drqfu2iax338 http://www.w3.org/2000/01/rdf-schema#label "Test Federation Title"
07:46:27.277 [main] DEBUG _:node1drqfu2iax338 http://www.openrdf.org/config/repository#repositoryImpl _:node1drqfu2iax339
07:46:27.277 [main] DEBUG _:node1drqfu2iax339 http://www.openrdf.org/config/repository#repositoryType "openrdf:SailRepository"
07:46:27.277 [main] DEBUG _:node1drqfu2iax339 http://www.openrdf.org/config/repository/sail#sailImpl _:node1drqfu2iax340
07:46:27.277 [main] DEBUG _:node1drqfu2iax340 http://www.openrdf.org/config/sail#sailType "openrdf:Federation"
07:46:27.277 [main] DEBUG _:node1drqfu2iax340 http://www.openrdf.org/config/sail/federation#readOnly "false"^^<http://www.w3.org/2001/XMLSchema#boolean>
07:46:27.277 [main] DEBUG _:node1drqfu2iax340 http://www.openrdf.org/config/sail/federation#distinct "true"^^<http://www.w3.org/2001/XMLSchema#boolean>
07:46:27.277 [main] DEBUG Adding member: alien
07:46:27.277 [main] DEBUG _:node1drqfu2iax340 http://www.openrdf.org/config/sail/federation#member _:node1drqfu2iax341
07:46:27.278 [main] DEBUG _:node1drqfu2iax341 http://www.openrdf.org/config/repository#repositoryType "openrdf:ProxyRepository"
07:46:27.278 [main] DEBUG _:node1drqfu2iax341 http://www.openrdf.org/config/repository/proxy#proxiedID "alien"
07:46:27.278 [main] DEBUG Added member alien: 
07:46:27.278 [main] DEBUG Adding member: scary
07:46:27.278 [main] DEBUG _:node1drqfu2iax340 http://www.openrdf.org/config/sail/federation#member _:node1drqfu2iax344
07:46:27.279 [main] DEBUG _:node1drqfu2iax344 http://www.openrdf.org/config/repository#repositoryType "openrdf:ProxyRepository"
07:46:27.279 [main] DEBUG _:node1drqfu2iax344 http://www.openrdf.org/config/repository/proxy#proxiedID "scary"
07:46:27.279 [main] DEBUG Added member scary: 
07:46:27.305 [main] DEBUG Initializing MemoryStore...
07:46:27.305 [main] DEBUG Initializing data file...
07:46:27.306 [main] DEBUG Data file initialized
07:46:27.306 [main] DEBUG MemoryStore initialized
07:46:27.307 [main] DEBUG syncing data to file...
07:46:27.308 [main] DEBUG Data synced to file
07:46:27.310 [main] DEBUG Initializing MemoryStore...
07:46:27.311 [main] DEBUG Initializing data file...
07:46:27.311 [main] DEBUG Data file initialized
07:46:27.311 [main] DEBUG MemoryStore initialized
07:46:27.312 [main] DEBUG syncing data to file...
07:46:27.313 [main] DEBUG Data synced to file
07:46:27.322 [main] DEBUG Federate called with federation ID = fedID, and member ID's = [sparql][sparql2].
  Distinct set to false, and readonly set to false.

07:46:27.325 [main] ERROR sparql is read-only.
07:46:27.326 [main] ERROR sparql2 is read-only.
[MockitoHint] FederateTest.testSparqlAndNotReadOnlyPrintsError (see javadoc for MockitoHint):
[MockitoHint] 1. Unused -> at org.eclipse.rdf4j.console.command.FederateTest.setUp(FederateTest.java:88)

07:46:27.335 [main] DEBUG Initializing MemoryStore...
07:46:27.336 [main] DEBUG Initializing data file...
07:46:27.336 [main] DEBUG Data file initialized
07:46:27.336 [main] DEBUG MemoryStore initialized
07:46:27.337 [main] DEBUG syncing data to file...
07:46:27.338 [main] DEBUG Data synced to file
07:46:27.341 [main] DEBUG Initializing MemoryStore...
07:46:27.342 [main] DEBUG Initializing data file...
07:46:27.342 [main] DEBUG Data file initialized
07:46:27.342 [main] DEBUG MemoryStore initialized
07:46:27.344 [main] DEBUG syncing data to file...
07:46:27.345 [main] DEBUG Data synced to file
[MockitoHint] FederateTest.testNoArgumentsPrintsHelp (see javadoc for MockitoHint):
[MockitoHint] 1. Unused -> at org.eclipse.rdf4j.console.command.FederateTest.setUp(FederateTest.java:87)
[MockitoHint] 2. Unused -> at org.eclipse.rdf4j.console.command.FederateTest.setUp(FederateTest.java:88)

07:46:27.360 [main] DEBUG Initializing MemoryStore...
07:46:27.361 [main] DEBUG Initializing data file...
07:46:27.361 [main] DEBUG Data file initialized
07:46:27.361 [main] DEBUG MemoryStore initialized
07:46:27.362 [main] DEBUG syncing data to file...
07:46:27.363 [main] DEBUG Data synced to file
07:46:27.366 [main] DEBUG Initializing MemoryStore...
07:46:27.366 [main] DEBUG Initializing data file...
07:46:27.366 [main] DEBUG Data file initialized
07:46:27.366 [main] DEBUG MemoryStore initialized
07:46:27.368 [main] DEBUG syncing data to file...
07:46:27.368 [main] DEBUG Data synced to file
07:46:27.375 [main] DEBUG Federate called with federation ID = type=memory, and member ID's = [fedID][alien][scary].
  Distinct set to false, and readonly set to true.

07:46:27.375 [main] ERROR fedID does not exist.
[MockitoHint] FederateTest.testInvalidArgumentPrintsError (see javadoc for MockitoHint):
[MockitoHint] 1. Unused -> at org.eclipse.rdf4j.console.command.FederateTest.setUp(FederateTest.java:88)

07:46:27.385 [main] DEBUG Initializing MemoryStore...
07:46:27.386 [main] DEBUG Initializing data file...
07:46:27.386 [main] DEBUG Data file initialized
07:46:27.386 [main] DEBUG MemoryStore initialized
07:46:27.387 [main] DEBUG syncing data to file...
07:46:27.388 [main] DEBUG Data synced to file
07:46:27.392 [main] DEBUG Initializing MemoryStore...
07:46:27.393 [main] DEBUG Initializing data file...
07:46:27.393 [main] DEBUG Data file initialized
07:46:27.393 [main] DEBUG MemoryStore initialized
07:46:27.395 [main] DEBUG syncing data to file...
07:46:27.395 [main] DEBUG Data synced to file
07:46:27.403 [main] DEBUG Federate called with federation ID = fedID, and member ID's = [sparql][sparql2].
  Distinct set to false, and readonly set to true.

07:46:27.404 [main] DEBUG Federation repository root node: _:node1drqfu2iax494
07:46:27.404 [main] DEBUG _:node1drqfu2iax494 http://www.w3.org/1999/02/22-rdf-syntax-ns#type http://www.openrdf.org/config/repository#Repository
07:46:27.404 [main] DEBUG _:node1drqfu2iax494 http://www.openrdf.org/config/repository#repositoryID "fedID"
07:46:27.404 [main] DEBUG _:node1drqfu2iax494 http://www.w3.org/2000/01/rdf-schema#label "Test Federation Title"
07:46:27.404 [main] DEBUG _:node1drqfu2iax494 http://www.openrdf.org/config/repository#repositoryImpl _:node1drqfu2iax495
07:46:27.405 [main] DEBUG _:node1drqfu2iax495 http://www.openrdf.org/config/repository#repositoryType "openrdf:SailRepository"
07:46:27.405 [main] DEBUG _:node1drqfu2iax495 http://www.openrdf.org/config/repository/sail#sailImpl _:node1drqfu2iax496
07:46:27.405 [main] DEBUG _:node1drqfu2iax496 http://www.openrdf.org/config/sail#sailType "openrdf:Federation"
07:46:27.405 [main] DEBUG _:node1drqfu2iax496 http://www.openrdf.org/config/sail/federation#readOnly "true"^^<http://www.w3.org/2001/XMLSchema#boolean>
07:46:27.405 [main] DEBUG _:node1drqfu2iax496 http://www.openrdf.org/config/sail/federation#distinct "false"^^<http://www.w3.org/2001/XMLSchema#boolean>
07:46:27.405 [main] DEBUG Adding member: sparql
07:46:27.405 [main] DEBUG _:node1drqfu2iax496 http://www.openrdf.org/config/sail/federation#member _:node1drqfu2iax497
07:46:27.405 [main] DEBUG _:node1drqfu2iax497 http://www.openrdf.org/config/repository#repositoryType "openrdf:SPARQLRepository"
07:46:27.405 [main] DEBUG _:node1drqfu2iax497 http://www.openrdf.org/config/repository/sparql#query-endpoint http://localhost:8080/openrdf-sesame/repositories/sparql
07:46:27.405 [main] DEBUG Added member sparql: 
07:46:27.405 [main] DEBUG Adding member: sparql2
07:46:27.405 [main] DEBUG _:node1drqfu2iax496 http://www.openrdf.org/config/sail/federation#member _:node1drqfu2iax500
07:46:27.406 [main] DEBUG _:node1drqfu2iax500 http://www.openrdf.org/config/repository#repositoryType "openrdf:SPARQLRepository"
07:46:27.406 [main] DEBUG _:node1drqfu2iax500 http://www.openrdf.org/config/repository/sparql#query-endpoint http://localhost:8080/openrdf-sesame/repositories/sparql
07:46:27.406 [main] DEBUG Added member sparql2: 
07:46:27.415 [main] DEBUG Initializing MemoryStore...
07:46:27.416 [main] DEBUG Initializing data file...
07:46:27.416 [main] DEBUG Data file initialized
07:46:27.416 [main] DEBUG MemoryStore initialized
07:46:27.418 [main] DEBUG syncing data to file...
07:46:27.418 [main] DEBUG Data synced to file
07:46:27.420 [main] DEBUG Initializing MemoryStore...
07:46:27.421 [main] DEBUG Initializing data file...
07:46:27.421 [main] DEBUG Data file initialized
07:46:27.421 [main] DEBUG MemoryStore initialized
07:46:27.422 [main] DEBUG syncing data to file...
07:46:27.422 [main] DEBUG Data synced to file
07:46:27.427 [main] DEBUG Federate called with federation ID = fedID, and member ID's = [http][sparql].
  Distinct set to false, and readonly set to true.

07:46:27.428 [main] DEBUG Federation repository root node: _:node1drqfu2iax549
07:46:27.428 [main] DEBUG _:node1drqfu2iax549 http://www.w3.org/1999/02/22-rdf-syntax-ns#type http://www.openrdf.org/config/repository#Repository
07:46:27.428 [main] DEBUG _:node1drqfu2iax549 http://www.openrdf.org/config/repository#repositoryID "fedID"
07:46:27.428 [main] DEBUG _:node1drqfu2iax549 http://www.w3.org/2000/01/rdf-schema#label "Test Federation Title"
07:46:27.428 [main] DEBUG _:node1drqfu2iax549 http://www.openrdf.org/config/repository#repositoryImpl _:node1drqfu2iax550
07:46:27.428 [main] DEBUG _:node1drqfu2iax550 http://www.openrdf.org/config/repository#repositoryType "openrdf:SailRepository"
07:46:27.428 [main] DEBUG _:node1drqfu2iax550 http://www.openrdf.org/config/repository/sail#sailImpl _:node1drqfu2iax551
07:46:27.428 [main] DEBUG _:node1drqfu2iax551 http://www.openrdf.org/config/sail#sailType "openrdf:Federation"
07:46:27.428 [main] DEBUG _:node1drqfu2iax551 http://www.openrdf.org/config/sail/federation#readOnly "true"^^<http://www.w3.org/2001/XMLSchema#boolean>
07:46:27.428 [main] DEBUG _:node1drqfu2iax551 http://www.openrdf.org/config/sail/federation#distinct "false"^^<http://www.w3.org/2001/XMLSchema#boolean>
07:46:27.428 [main] DEBUG Adding member: http
07:46:27.428 [main] DEBUG _:node1drqfu2iax551 http://www.openrdf.org/config/sail/federation#member _:node1drqfu2iax552
07:46:27.429 [main] DEBUG _:node1drqfu2iax552 http://www.openrdf.org/config/repository#repositoryType "openrdf:HTTPRepository"
07:46:27.429 [main] DEBUG _:node1drqfu2iax552 http://www.openrdf.org/config/repository/http#repositoryURL http://localhost:8080/openrdf-sesame/repositories/http
07:46:27.429 [main] DEBUG Added member http: 
07:46:27.429 [main] DEBUG Adding member: sparql
07:46:27.429 [main] DEBUG _:node1drqfu2iax551 http://www.openrdf.org/config/sail/federation#member _:node1drqfu2iax555
07:46:27.429 [main] DEBUG _:node1drqfu2iax555 http://www.openrdf.org/config/repository#repositoryType "openrdf:SPARQLRepository"
07:46:27.430 [main] DEBUG _:node1drqfu2iax555 http://www.openrdf.org/config/repository/sparql#query-endpoint http://localhost:8080/openrdf-sesame/repositories/sparql
07:46:27.430 [main] DEBUG Added member sparql: 
07:46:27.440 [main] DEBUG Initializing MemoryStore...
07:46:27.441 [main] DEBUG Initializing data file...
07:46:27.441 [main] DEBUG Data file initialized
07:46:27.441 [main] DEBUG MemoryStore initialized
07:46:27.443 [main] DEBUG syncing data to file...
07:46:27.443 [main] DEBUG Data synced to file
07:46:27.445 [main] DEBUG Initializing MemoryStore...
07:46:27.446 [main] DEBUG Initializing data file...
07:46:27.446 [main] DEBUG Data file initialized
07:46:27.446 [main] DEBUG MemoryStore initialized
07:46:27.447 [main] DEBUG syncing data to file...
07:46:27.447 [main] DEBUG Data synced to file
07:46:27.452 [main] DEBUG Federate called with federation ID = fedID, and member ID's = [alien][FreeLunch].
  Distinct set to false, and readonly set to true.

07:46:27.453 [main] ERROR FreeLunch does not exist.
[MockitoHint] FederateTest.testNonexistentMemberPrintsSpecificError (see javadoc for MockitoHint):
[MockitoHint] 1. Unused -> at org.eclipse.rdf4j.console.command.FederateTest.setUp(FederateTest.java:88)

07:46:27.459 [main] DEBUG Initializing MemoryStore...
07:46:27.459 [main] DEBUG Initializing data file...
07:46:27.459 [main] DEBUG Data file initialized
07:46:27.459 [main] DEBUG MemoryStore initialized
07:46:27.461 [main] DEBUG syncing data to file...
07:46:27.461 [main] DEBUG Data synced to file
07:46:27.463 [main] DEBUG Initializing MemoryStore...
07:46:27.464 [main] DEBUG Initializing data file...
07:46:27.464 [main] DEBUG Data file initialized
07:46:27.464 [main] DEBUG MemoryStore initialized
07:46:27.465 [main] DEBUG syncing data to file...
07:46:27.465 [main] DEBUG Data synced to file
07:46:27.470 [main] ERROR Duplicate repository id's specified.
[MockitoHint] FederateTest.testFedSameAsMemberPrintsError (see javadoc for MockitoHint):
[MockitoHint] 1. Unused -> at org.eclipse.rdf4j.console.command.FederateTest.setUp(FederateTest.java:87)
[MockitoHint] 2. Unused -> at org.eclipse.rdf4j.console.command.FederateTest.setUp(FederateTest.java:88)

07:46:27.475 [main] DEBUG Initializing MemoryStore...
07:46:27.476 [main] DEBUG Initializing data file...
07:46:27.476 [main] DEBUG Data file initialized
07:46:27.476 [main] DEBUG MemoryStore initialized
07:46:27.477 [main] DEBUG syncing data to file...
07:46:27.477 [main] DEBUG Data synced to file
07:46:27.479 [main] DEBUG Initializing MemoryStore...
07:46:27.480 [main] DEBUG Initializing data file...
07:46:27.480 [main] DEBUG Data file initialized
07:46:27.480 [main] DEBUG MemoryStore initialized
07:46:27.481 [main] DEBUG syncing data to file...
07:46:27.481 [main] DEBUG Data synced to file
[MockitoHint] FederateTest.testTwoArgumentsPrintsHelp (see javadoc for MockitoHint):
[MockitoHint] 1. Unused -> at org.eclipse.rdf4j.console.command.FederateTest.setUp(FederateTest.java:87)
[MockitoHint] 2. Unused -> at org.eclipse.rdf4j.console.command.FederateTest.setUp(FederateTest.java:88)

07:46:27.493 [main] DEBUG Initializing MemoryStore...
07:46:27.494 [main] DEBUG Initializing data file...
07:46:27.495 [main] DEBUG Data file initialized
07:46:27.495 [main] DEBUG MemoryStore initialized
07:46:27.496 [main] DEBUG syncing data to file...
07:46:27.496 [main] DEBUG Data synced to file
07:46:27.498 [main] DEBUG Initializing MemoryStore...
07:46:27.499 [main] DEBUG Initializing data file...
07:46:27.499 [main] DEBUG Data file initialized
07:46:27.499 [main] DEBUG MemoryStore initialized
07:46:27.500 [main] DEBUG syncing data to file...
07:46:27.500 [main] DEBUG Data synced to file
07:46:27.505 [main] DEBUG Federate called with federation ID = fedID, and member ID's = [alien][scary].
  Distinct set to false, and readonly set to true.

07:46:27.506 [main] DEBUG Federation repository root node: _:node1drqfu2iax692
07:46:27.506 [main] DEBUG _:node1drqfu2iax692 http://www.w3.org/1999/02/22-rdf-syntax-ns#type http://www.openrdf.org/config/repository#Repository
07:46:27.506 [main] DEBUG _:node1drqfu2iax692 http://www.openrdf.org/config/repository#repositoryID "fedID"
07:46:27.506 [main] DEBUG _:node1drqfu2iax692 http://www.w3.org/2000/01/rdf-schema#label "Test Federation Title"
07:46:27.506 [main] DEBUG _:node1drqfu2iax692 http://www.openrdf.org/config/repository#repositoryImpl _:node1drqfu2iax693
07:46:27.506 [main] DEBUG _:node1drqfu2iax693 http://www.openrdf.org/config/repository#repositoryType "openrdf:SailRepository"
07:46:27.506 [main] DEBUG _:node1drqfu2iax693 http://www.openrdf.org/config/repository/sail#sailImpl _:node1drqfu2iax694
07:46:27.506 [main] DEBUG _:node1drqfu2iax694 http://www.openrdf.org/config/sail#sailType "openrdf:Federation"
07:46:27.506 [main] DEBUG _:node1drqfu2iax694 http://www.openrdf.org/config/sail/federation#readOnly "true"^^<http://www.w3.org/2001/XMLSchema#boolean>
07:46:27.506 [main] DEBUG _:node1drqfu2iax694 http://www.openrdf.org/config/sail/federation#distinct "false"^^<http://www.w3.org/2001/XMLSchema#boolean>
07:46:27.506 [main] DEBUG Adding member: alien
07:46:27.506 [main] DEBUG _:node1drqfu2iax694 http://www.openrdf.org/config/sail/federation#member _:node1drqfu2iax695
07:46:27.506 [main] DEBUG _:node1drqfu2iax695 http://www.openrdf.org/config/repository#repositoryType "openrdf:ProxyRepository"
07:46:27.506 [main] DEBUG _:node1drqfu2iax695 http://www.openrdf.org/config/repository/proxy#proxiedID "alien"
07:46:27.507 [main] DEBUG Added member alien: 
07:46:27.507 [main] DEBUG Adding member: scary
07:46:27.507 [main] DEBUG _:node1drqfu2iax694 http://www.openrdf.org/config/sail/federation#member _:node1drqfu2iax698
07:46:27.507 [main] DEBUG _:node1drqfu2iax698 http://www.openrdf.org/config/repository#repositoryType "openrdf:ProxyRepository"
07:46:27.507 [main] DEBUG _:node1drqfu2iax698 http://www.openrdf.org/config/repository/proxy#proxiedID "scary"
07:46:27.507 [main] DEBUG Added member scary: 
07:46:27.519 [main] DEBUG Initializing MemoryStore...
07:46:27.520 [main] DEBUG Initializing data file...
07:46:27.520 [main] DEBUG Data file initialized
07:46:27.520 [main] DEBUG MemoryStore initialized
07:46:27.521 [main] DEBUG syncing data to file...
07:46:27.522 [main] DEBUG Data synced to file
07:46:27.524 [main] DEBUG Initializing MemoryStore...
07:46:27.525 [main] DEBUG Initializing data file...
07:46:27.525 [main] DEBUG Data file initialized
07:46:27.525 [main] DEBUG MemoryStore initialized
07:46:27.526 [main] DEBUG syncing data to file...
07:46:27.526 [main] DEBUG Data synced to file
[MockitoHint] FederateTest.testOneArgumentPrintsHelp (see javadoc for MockitoHint):
[MockitoHint] 1. Unused -> at org.eclipse.rdf4j.console.command.FederateTest.setUp(FederateTest.java:87)
[MockitoHint] 2. Unused -> at org.eclipse.rdf4j.console.command.FederateTest.setUp(FederateTest.java:88)

07:46:27.536 [main] DEBUG Initializing MemoryStore...
07:46:27.537 [main] DEBUG Initializing data file...
07:46:27.537 [main] DEBUG Data file initialized
07:46:27.537 [main] DEBUG MemoryStore initialized
07:46:27.539 [main] DEBUG syncing data to file...
07:46:27.539 [main] DEBUG Data synced to file
07:46:27.541 [main] DEBUG Initializing MemoryStore...
07:46:27.542 [main] DEBUG Initializing data file...
07:46:27.542 [main] DEBUG Data file initialized
07:46:27.542 [main] DEBUG MemoryStore initialized
07:46:27.543 [main] DEBUG syncing data to file...
07:46:27.543 [main] DEBUG Data synced to file
07:46:27.547 [main] DEBUG Federate called with federation ID = fedID, and member ID's = [http][http2].
  Distinct set to false, and readonly set to true.

07:46:27.548 [main] DEBUG Federation repository root node: _:node1drqfu2iax784
07:46:27.548 [main] DEBUG _:node1drqfu2iax784 http://www.w3.org/1999/02/22-rdf-syntax-ns#type http://www.openrdf.org/config/repository#Repository
07:46:27.548 [main] DEBUG _:node1drqfu2iax784 http://www.openrdf.org/config/repository#repositoryID "fedID"
07:46:27.548 [main] DEBUG _:node1drqfu2iax784 http://www.w3.org/2000/01/rdf-schema#label "Test Federation Title"
07:46:27.548 [main] DEBUG _:node1drqfu2iax784 http://www.openrdf.org/config/repository#repositoryImpl _:node1drqfu2iax785
07:46:27.548 [main] DEBUG _:node1drqfu2iax785 http://www.openrdf.org/config/repository#repositoryType "openrdf:SailRepository"
07:46:27.548 [main] DEBUG _:node1drqfu2iax785 http://www.openrdf.org/config/repository/sail#sailImpl _:node1drqfu2iax786
07:46:27.548 [main] DEBUG _:node1drqfu2iax786 http://www.openrdf.org/config/sail#sailType "openrdf:Federation"
07:46:27.548 [main] DEBUG _:node1drqfu2iax786 http://www.openrdf.org/config/sail/federation#readOnly "true"^^<http://www.w3.org/2001/XMLSchema#boolean>
07:46:27.548 [main] DEBUG _:node1drqfu2iax786 http://www.openrdf.org/config/sail/federation#distinct "false"^^<http://www.w3.org/2001/XMLSchema#boolean>
07:46:27.548 [main] DEBUG Adding member: http
07:46:27.548 [main] DEBUG _:node1drqfu2iax786 http://www.openrdf.org/config/sail/federation#member _:node1drqfu2iax787
07:46:27.549 [main] DEBUG _:node1drqfu2iax787 http://www.openrdf.org/config/repository#repositoryType "openrdf:HTTPRepository"
07:46:27.549 [main] DEBUG _:node1drqfu2iax787 http://www.openrdf.org/config/repository/http#repositoryURL http://localhost:8080/openrdf-sesame/repositories/http
07:46:27.549 [main] DEBUG Added member http: 
07:46:27.549 [main] DEBUG Adding member: http2
07:46:27.549 [main] DEBUG _:node1drqfu2iax786 http://www.openrdf.org/config/sail/federation#member _:node1drqfu2iax790
07:46:27.549 [main] DEBUG _:node1drqfu2iax790 http://www.openrdf.org/config/repository#repositoryType "openrdf:HTTPRepository"
07:46:27.550 [main] DEBUG _:node1drqfu2iax790 http://www.openrdf.org/config/repository/http#repositoryURL http://localhost:8080/openrdf-sesame/repositories/http
07:46:27.550 [main] DEBUG Added member http2: 
[INFO] Tests run: 15, Failures: 0, Errors: 0, Skipped: 0, Time elapsed: 0.462 s - in org.eclipse.rdf4j.console.command.FederateTest
[INFO] Running org.eclipse.rdf4j.console.command.SparqlTest
[MockitoHint] SparqlTest.testInputFile (see javadoc for MockitoHint):
[MockitoHint] 1. Unused -> at org.eclipse.rdf4j.console.command.SparqlTest.setUp(SparqlTest.java:49)

07:46:27.586 [main] ERROR No suitable result writer found
[MockitoHint] SparqlTest.testSelectError (see javadoc for MockitoHint):
[MockitoHint] 1. Unused -> at org.eclipse.rdf4j.console.command.SparqlTest.setUp(SparqlTest.java:49)

[MockitoHint] SparqlTest.testSelectMissingBindings (see javadoc for MockitoHint):
[MockitoHint] 1. Unused -> at org.eclipse.rdf4j.console.command.SparqlTest.setUp(SparqlTest.java:49)

[MockitoHint] SparqlTest.testInputFileWorkdir (see javadoc for MockitoHint):
[MockitoHint] 1. Unused -> at org.eclipse.rdf4j.console.command.SparqlTest.setUp(SparqlTest.java:49)

[INFO] Tests run: 9, Failures: 0, Errors: 0, Skipped: 0, Time elapsed: 0.099 s - in org.eclipse.rdf4j.console.command.SparqlTest
[INFO] Running org.eclipse.rdf4j.console.UtilTest
 one, two
 three
 four
 five, six
 seven
 eight
[INFO] Tests run: 4, Failures: 0, Errors: 0, Skipped: 0, Time elapsed: 0 s - in org.eclipse.rdf4j.console.UtilTest
[INFO] Running org.eclipse.rdf4j.console.ConsoleIOTest
[INFO] Tests run: 3, Failures: 0, Errors: 0, Skipped: 0, Time elapsed: 0 s - in org.eclipse.rdf4j.console.ConsoleIOTest
[INFO] 
[INFO] Results:
[INFO] 
[INFO] Tests run: 64, Failures: 0, Errors: 0, Skipped: 0
[INFO] 
[JENKINS] Recording test results
[INFO] 
[INFO] --- animal-sniffer-maven-plugin:1.16:check (default) @ rdf4j-console ---
[INFO] Checking unresolved references to org.codehaus.mojo.signature:java18:1.0
[INFO] 
[INFO] --- maven-jar-plugin:2.3.1:jar (default-jar) @ rdf4j-console ---
[INFO] Building jar: /home/hudson/genie.rdf4j/.jenkins/jobs/rdf4j-pr-verify/workspace/tools/console/target/rdf4j-console-3.1.0-SNAPSHOT.jar