SuccessConsole Output

Started calculate disk usage of build
Finished Calculation of disk usage of build in 0 seconds
Started calculate disk usage of workspace
Finished Calculation of disk usage of workspace in 0 seconds
[INFO] 
[INFO] ------------------< org.eclipse.rdf4j:rdf4j-console >-------------------
[INFO] Building RDF4J: Console 3.1.0-SNAPSHOT                           [70/85]
[INFO] --------------------------------[ jar ]---------------------------------
[INFO] 
[INFO] --- buildnumber-maven-plugin:1.4:create (default) @ rdf4j-console ---
[INFO] ShortRevision tag detected. The value is '7'.
[INFO] Executing: /bin/sh -c cd '/home/hudson/genie.rdf4j/.jenkins/jobs/rdf4j-pr-verify/workspace/tools/console' && 'git' 'rev-parse' '--verify' '--short=7' 'HEAD'
[INFO] Working directory: /home/hudson/genie.rdf4j/.jenkins/jobs/rdf4j-pr-verify/workspace/tools/console
[INFO] Storing buildNumber: adc8da5 at timestamp: 1575921552329
[WARNING] Cannot get the branch information from the git repository: 
Detecting the current branch failed: fatal: ref HEAD is not a symbolic ref

[INFO] ShortRevision tag detected. The value is '7'.
[INFO] Executing: /bin/sh -c cd '/home/hudson/genie.rdf4j/.jenkins/jobs/rdf4j-pr-verify/workspace/tools/console' && 'git' 'rev-parse' '--verify' '--short=7' 'HEAD'
[INFO] Working directory: /home/hudson/genie.rdf4j/.jenkins/jobs/rdf4j-pr-verify/workspace/tools/console
[INFO] Storing buildScmBranch: UNKNOWN
[INFO] 
[INFO] --- maven-enforcer-plugin:1.4.1:enforce (enforce-bytecode-version) @ rdf4j-console ---
[INFO] Adding ignore: META-INF/**/module-info
[INFO] 
[INFO] --- formatter-maven-plugin:2.8.1:validate (default) @ rdf4j-console ---
[INFO] Using 'UTF-8' encoding to format source files.
[INFO] Number of files to be formatted: 61
[INFO] Html formatting is skipped
[INFO] Successfully formatted:          0 file(s)
[INFO] Fail to format:                  0 file(s)
[INFO] Skipped:                         61 file(s)
[INFO] Read only skipped:               0 file(s)
[INFO] Approximate time taken:          0s
[INFO] 
[INFO] --- maven-resources-plugin:3.0.2:resources (default-resources) @ rdf4j-console ---
[INFO] Using 'UTF-8' encoding to copy filtered resources.
[INFO] skip non existing resourceDirectory /home/hudson/genie.rdf4j/.jenkins/jobs/rdf4j-pr-verify/workspace/tools/console/src/main/resources
[INFO] 
[INFO] --- maven-compiler-plugin:3.7.0:compile (default-compile) @ rdf4j-console ---
[INFO] Changes detected - recompiling the module!
[INFO] Compiling 42 source files to /home/hudson/genie.rdf4j/.jenkins/jobs/rdf4j-pr-verify/workspace/tools/console/target/classes
[INFO] 
[INFO] --- maven-resources-plugin:3.0.2:testResources (default-testResources) @ rdf4j-console ---
[INFO] Using 'UTF-8' encoding to copy filtered resources.
[INFO] Copying 29 resources
[INFO] 
[INFO] --- maven-compiler-plugin:3.7.0:testCompile (default-testCompile) @ rdf4j-console ---
[INFO] Changes detected - recompiling the module!
[INFO] Compiling 18 source files to /home/hudson/genie.rdf4j/.jenkins/jobs/rdf4j-pr-verify/workspace/tools/console/target/test-classes
[INFO] 
[INFO] --- maven-surefire-plugin:2.22.2:test (default-test) @ rdf4j-console ---
[INFO] 
[INFO] -------------------------------------------------------
[INFO]  T E S T S
[INFO] -------------------------------------------------------
[INFO] Running org.eclipse.rdf4j.console.setting.PrefixesTest
[INFO] Tests run: 3, Failures: 0, Errors: 0, Skipped: 0, Time elapsed: 0.709 s - in org.eclipse.rdf4j.console.setting.PrefixesTest
[INFO] Running org.eclipse.rdf4j.console.setting.LogLevelTest
14:59:17.162 [main] ERROR unknown logging level: chatty
[INFO] Tests run: 4, Failures: 0, Errors: 0, Skipped: 0, Time elapsed: 0.015 s - in org.eclipse.rdf4j.console.setting.LogLevelTest
[INFO] Running org.eclipse.rdf4j.console.setting.QueryPrefixTest
[INFO] Tests run: 1, Failures: 0, Errors: 0, Skipped: 0, Time elapsed: 0 s - in org.eclipse.rdf4j.console.setting.QueryPrefixTest
[INFO] Running org.eclipse.rdf4j.console.setting.ShowPrefixTest
[INFO] Tests run: 1, Failures: 0, Errors: 0, Skipped: 0, Time elapsed: 0 s - in org.eclipse.rdf4j.console.setting.ShowPrefixTest
[INFO] Running org.eclipse.rdf4j.console.setting.ConsoleWidthTest
[INFO] Tests run: 1, Failures: 0, Errors: 0, Skipped: 0, Time elapsed: 0 s - in org.eclipse.rdf4j.console.setting.ConsoleWidthTest
[INFO] Running org.eclipse.rdf4j.console.command.SetParametersTest
14:59:17.195 [main] ERROR Unknown parameter: unknown
[INFO] Tests run: 1, Failures: 0, Errors: 0, Skipped: 0, Time elapsed: 0.025 s - in org.eclipse.rdf4j.console.command.SetParametersTest
[INFO] Running org.eclipse.rdf4j.console.command.LoadTest
[MockitoHint] LoadTest.testLoad (see javadoc for MockitoHint):
[MockitoHint] 1. Unused -> at org.eclipse.rdf4j.console.command.LoadTest.setUp(LoadTest.java:49)

[MockitoHint] LoadTest.testLoadWorkDir (see javadoc for MockitoHint):
[MockitoHint] 1. Unused -> at org.eclipse.rdf4j.console.command.LoadTest.setUp(LoadTest.java:49)

[INFO] Tests run: 2, Failures: 0, Errors: 0, Skipped: 0, Time elapsed: 0.189 s - in org.eclipse.rdf4j.console.command.LoadTest
[INFO] Running org.eclipse.rdf4j.console.command.ConvertTest
14:59:17.641 [main] ERROR No RDF writer for /tmp/genie.rdf4j/junit5435232393591265682/alien.qyx
[MockitoHint] ConvertTest.testConvertInvalidFormat (see javadoc for MockitoHint):
[MockitoHint] 1. Unused -> at org.eclipse.rdf4j.console.command.ConvertTest.setup(ConvertTest.java:39)

14:59:17.649 [main] ERROR Failed to convert data
org.eclipse.rdf4j.rio.RDFParseException: Expected '<' or '_', found: e [line 1, column 101]
	at org.eclipse.rdf4j.rio.ntriples.NTriplesParser.parseSubject(NTriplesParser.java:313)
	at org.eclipse.rdf4j.rio.ntriples.NTriplesParser.parseTriple(NTriplesParser.java:252)
	at org.eclipse.rdf4j.rio.ntriples.NTriplesParser.parse(NTriplesParser.java:160)
	at org.eclipse.rdf4j.rio.ntriples.NTriplesParser.parse(NTriplesParser.java:109)
	at org.eclipse.rdf4j.console.command.Convert.convert(Convert.java:139)
	at org.eclipse.rdf4j.console.command.Convert.execute(Convert.java:74)
	at org.eclipse.rdf4j.console.command.ConvertTest.testConvertParseError(ConvertTest.java:92)
	at sun.reflect.NativeMethodAccessorImpl.invoke0(Native Method)
	at sun.reflect.NativeMethodAccessorImpl.invoke(NativeMethodAccessorImpl.java:62)
	at sun.reflect.DelegatingMethodAccessorImpl.invoke(DelegatingMethodAccessorImpl.java:43)
	at java.lang.reflect.Method.invoke(Method.java:498)
	at org.junit.runners.model.FrameworkMethod$1.runReflectiveCall(FrameworkMethod.java:50)
	at org.junit.internal.runners.model.ReflectiveCallable.run(ReflectiveCallable.java:12)
	at org.junit.runners.model.FrameworkMethod.invokeExplosively(FrameworkMethod.java:47)
	at org.junit.internal.runners.statements.InvokeMethod.evaluate(InvokeMethod.java:17)
	at org.junit.internal.runners.statements.RunBefores.evaluate(RunBefores.java:26)
	at org.junit.internal.runners.statements.RunAfters.evaluate(RunAfters.java:27)
	at org.mockito.internal.junit.JUnitRule$1.evaluateSafely(JUnitRule.java:52)
	at org.mockito.internal.junit.JUnitRule$1.evaluate(JUnitRule.java:43)
	at org.junit.rules.ExternalResource$1.evaluate(ExternalResource.java:48)
	at org.junit.rules.RunRules.evaluate(RunRules.java:20)
	at org.junit.runners.ParentRunner.runLeaf(ParentRunner.java:325)
	at org.junit.runners.BlockJUnit4ClassRunner.runChild(BlockJUnit4ClassRunner.java:78)
	at org.junit.runners.BlockJUnit4ClassRunner.runChild(BlockJUnit4ClassRunner.java:57)
	at org.junit.runners.ParentRunner$3.run(ParentRunner.java:290)
	at org.junit.runners.ParentRunner$1.schedule(ParentRunner.java:71)
	at org.junit.runners.ParentRunner.runChildren(ParentRunner.java:288)
	at org.junit.runners.ParentRunner.access$000(ParentRunner.java:58)
	at org.junit.runners.ParentRunner$2.evaluate(ParentRunner.java:268)
	at org.junit.runners.ParentRunner.run(ParentRunner.java:363)
	at org.apache.maven.surefire.junit4.JUnit4Provider.execute(JUnit4Provider.java:365)
	at org.apache.maven.surefire.junit4.JUnit4Provider.executeWithRerun(JUnit4Provider.java:273)
	at org.apache.maven.surefire.junit4.JUnit4Provider.executeTestSet(JUnit4Provider.java:238)
	at org.apache.maven.surefire.junit4.JUnit4Provider.invoke(JUnit4Provider.java:159)
	at org.apache.maven.surefire.booter.ForkedBooter.invokeProviderInSameClassLoader(ForkedBooter.java:384)
	at org.apache.maven.surefire.booter.ForkedBooter.runSuitesInProcess(ForkedBooter.java:345)
	at org.apache.maven.surefire.booter.ForkedBooter.execute(ForkedBooter.java:126)
	at org.apache.maven.surefire.booter.ForkedBooter.main(ForkedBooter.java:418)
[INFO] Tests run: 4, Failures: 0, Errors: 0, Skipped: 0, Time elapsed: 0.258 s - in org.eclipse.rdf4j.console.command.ConvertTest
[INFO] Running org.eclipse.rdf4j.console.command.ExportTest
[MockitoHint] ExportTest.testExportWorkDir (see javadoc for MockitoHint):
[MockitoHint] 1. Unused -> at org.eclipse.rdf4j.console.command.ExportTest.setUp(ExportTest.java:46)

[MockitoHint] ExportTest.testExportAll (see javadoc for MockitoHint):
[MockitoHint] 1. Unused -> at org.eclipse.rdf4j.console.command.ExportTest.setUp(ExportTest.java:46)

[MockitoHint] ExportTest.testExportContexts (see javadoc for MockitoHint):
[MockitoHint] 1. Unused -> at org.eclipse.rdf4j.console.command.ExportTest.setUp(ExportTest.java:46)

[INFO] Tests run: 3, Failures: 0, Errors: 0, Skipped: 0, Time elapsed: 0.062 s - in org.eclipse.rdf4j.console.command.ExportTest
[INFO] Running org.eclipse.rdf4j.console.command.VerifyTest
14:59:18.039 [main] ERROR Unexpected RDFParseException
org.eclipse.rdf4j.rio.RDFParseException: 'missing type' was not recognised, and could not be verified, with datatype http://example.rdf4j.org/type/wrong [line 1]
	at org.eclipse.rdf4j.rio.helpers.RDFParserHelper.reportError(RDFParserHelper.java:265)
	at org.eclipse.rdf4j.rio.helpers.RDFParserHelper.createLiteral(RDFParserHelper.java:180)
	at org.eclipse.rdf4j.rio.helpers.AbstractRDFParser.createLiteral(AbstractRDFParser.java:530)
	at org.eclipse.rdf4j.rio.turtle.TurtleParser.parseQuotedLiteral(TurtleParser.java:665)
	at org.eclipse.rdf4j.rio.turtle.TurtleParser.parseValue(TurtleParser.java:584)
	at org.eclipse.rdf4j.rio.turtle.TurtleParser.parseObject(TurtleParser.java:461)
	at org.eclipse.rdf4j.rio.turtle.TurtleParser.parseObjectList(TurtleParser.java:389)
	at org.eclipse.rdf4j.rio.turtle.TurtleParser.parsePredicateObjectList(TurtleParser.java:362)
	at org.eclipse.rdf4j.rio.turtle.TurtleParser.parseTriples(TurtleParser.java:349)
	at org.eclipse.rdf4j.rio.turtle.TurtleParser.parseStatement(TurtleParser.java:216)
	at org.eclipse.rdf4j.rio.turtle.TurtleParser.parse(TurtleParser.java:178)
	at org.eclipse.rdf4j.rio.turtle.TurtleParser.parse(TurtleParser.java:130)
	at org.eclipse.rdf4j.console.command.Verify.verify(Verify.java:145)
	at org.eclipse.rdf4j.console.command.Verify.execute(Verify.java:97)
	at org.eclipse.rdf4j.console.command.VerifyTest.testVerifyMissingType(VerifyTest.java:97)
	at sun.reflect.NativeMethodAccessorImpl.invoke0(Native Method)
	at sun.reflect.NativeMethodAccessorImpl.invoke(NativeMethodAccessorImpl.java:62)
	at sun.reflect.DelegatingMethodAccessorImpl.invoke(DelegatingMethodAccessorImpl.java:43)
	at java.lang.reflect.Method.invoke(Method.java:498)
	at org.junit.runners.model.FrameworkMethod$1.runReflectiveCall(FrameworkMethod.java:50)
	at org.junit.internal.runners.model.ReflectiveCallable.run(ReflectiveCallable.java:12)
	at org.junit.runners.model.FrameworkMethod.invokeExplosively(FrameworkMethod.java:47)
	at org.junit.internal.runners.statements.InvokeMethod.evaluate(InvokeMethod.java:17)
	at org.junit.internal.runners.statements.RunBefores.evaluate(RunBefores.java:26)
	at org.junit.internal.runners.statements.RunAfters.evaluate(RunAfters.java:27)
	at org.mockito.internal.junit.JUnitRule$1.evaluateSafely(JUnitRule.java:52)
	at org.mockito.internal.junit.JUnitRule$1.evaluate(JUnitRule.java:43)
	at org.junit.rules.ExternalResource$1.evaluate(ExternalResource.java:48)
	at org.junit.rules.RunRules.evaluate(RunRules.java:20)
	at org.junit.runners.ParentRunner.runLeaf(ParentRunner.java:325)
	at org.junit.runners.BlockJUnit4ClassRunner.runChild(BlockJUnit4ClassRunner.java:78)
	at org.junit.runners.BlockJUnit4ClassRunner.runChild(BlockJUnit4ClassRunner.java:57)
	at org.junit.runners.ParentRunner$3.run(ParentRunner.java:290)
	at org.junit.runners.ParentRunner$1.schedule(ParentRunner.java:71)
	at org.junit.runners.ParentRunner.runChildren(ParentRunner.java:288)
	at org.junit.runners.ParentRunner.access$000(ParentRunner.java:58)
	at org.junit.runners.ParentRunner$2.evaluate(ParentRunner.java:268)
	at org.junit.runners.ParentRunner.run(ParentRunner.java:363)
	at org.apache.maven.surefire.junit4.JUnit4Provider.execute(JUnit4Provider.java:365)
	at org.apache.maven.surefire.junit4.JUnit4Provider.executeWithRerun(JUnit4Provider.java:273)
	at org.apache.maven.surefire.junit4.JUnit4Provider.executeTestSet(JUnit4Provider.java:238)
	at org.apache.maven.surefire.junit4.JUnit4Provider.invoke(JUnit4Provider.java:159)
	at org.apache.maven.surefire.booter.ForkedBooter.invokeProviderInSameClassLoader(ForkedBooter.java:384)
	at org.apache.maven.surefire.booter.ForkedBooter.runSuitesInProcess(ForkedBooter.java:345)
	at org.apache.maven.surefire.booter.ForkedBooter.execute(ForkedBooter.java:126)
	at org.apache.maven.surefire.booter.ForkedBooter.main(ForkedBooter.java:418)
14:59:18.099 [main] ERROR SHACL validation failed, writing report to /tmp/genie.rdf4j/junit5077224743816422686/junit4012176004787498201.tmp
14:59:18.118 [main] ERROR Unexpected RDFParseException
org.eclipse.rdf4j.rio.RDFParseException: Unexpected end of file
	at org.eclipse.rdf4j.rio.turtle.TurtleParser.throwEOFException(TurtleParser.java:1317)
	at org.eclipse.rdf4j.rio.turtle.TurtleParser.parseValue(TurtleParser.java:589)
	at org.eclipse.rdf4j.rio.turtle.TurtleParser.parsePredicate(TurtleParser.java:434)
	at org.eclipse.rdf4j.rio.turtle.TurtleParser.parsePredicateObjectList(TurtleParser.java:358)
	at org.eclipse.rdf4j.rio.turtle.TurtleParser.parseTriples(TurtleParser.java:349)
	at org.eclipse.rdf4j.rio.turtle.TurtleParser.parseStatement(TurtleParser.java:216)
	at org.eclipse.rdf4j.rio.turtle.TurtleParser.parse(TurtleParser.java:178)
	at org.eclipse.rdf4j.rio.turtle.TurtleParser.parse(TurtleParser.java:130)
	at org.eclipse.rdf4j.console.command.Verify.verify(Verify.java:145)
	at org.eclipse.rdf4j.console.command.Verify.execute(Verify.java:97)
	at org.eclipse.rdf4j.console.command.VerifyTest.testVerifyBrokenFile(VerifyTest.java:91)
	at sun.reflect.NativeMethodAccessorImpl.invoke0(Native Method)
	at sun.reflect.NativeMethodAccessorImpl.invoke(NativeMethodAccessorImpl.java:62)
	at sun.reflect.DelegatingMethodAccessorImpl.invoke(DelegatingMethodAccessorImpl.java:43)
	at java.lang.reflect.Method.invoke(Method.java:498)
	at org.junit.runners.model.FrameworkMethod$1.runReflectiveCall(FrameworkMethod.java:50)
	at org.junit.internal.runners.model.ReflectiveCallable.run(ReflectiveCallable.java:12)
	at org.junit.runners.model.FrameworkMethod.invokeExplosively(FrameworkMethod.java:47)
	at org.junit.internal.runners.statements.InvokeMethod.evaluate(InvokeMethod.java:17)
	at org.junit.internal.runners.statements.RunBefores.evaluate(RunBefores.java:26)
	at org.junit.internal.runners.statements.RunAfters.evaluate(RunAfters.java:27)
	at org.mockito.internal.junit.JUnitRule$1.evaluateSafely(JUnitRule.java:52)
	at org.mockito.internal.junit.JUnitRule$1.evaluate(JUnitRule.java:43)
	at org.junit.rules.ExternalResource$1.evaluate(ExternalResource.java:48)
	at org.junit.rules.RunRules.evaluate(RunRules.java:20)
	at org.junit.runners.ParentRunner.runLeaf(ParentRunner.java:325)
	at org.junit.runners.BlockJUnit4ClassRunner.runChild(BlockJUnit4ClassRunner.java:78)
	at org.junit.runners.BlockJUnit4ClassRunner.runChild(BlockJUnit4ClassRunner.java:57)
	at org.junit.runners.ParentRunner$3.run(ParentRunner.java:290)
	at org.junit.runners.ParentRunner$1.schedule(ParentRunner.java:71)
	at org.junit.runners.ParentRunner.runChildren(ParentRunner.java:288)
	at org.junit.runners.ParentRunner.access$000(ParentRunner.java:58)
	at org.junit.runners.ParentRunner$2.evaluate(ParentRunner.java:268)
	at org.junit.runners.ParentRunner.run(ParentRunner.java:363)
	at org.apache.maven.surefire.junit4.JUnit4Provider.execute(JUnit4Provider.java:365)
	at org.apache.maven.surefire.junit4.JUnit4Provider.executeWithRerun(JUnit4Provider.java:273)
	at org.apache.maven.surefire.junit4.JUnit4Provider.executeTestSet(JUnit4Provider.java:238)
	at org.apache.maven.surefire.junit4.JUnit4Provider.invoke(JUnit4Provider.java:159)
	at org.apache.maven.surefire.booter.ForkedBooter.invokeProviderInSameClassLoader(ForkedBooter.java:384)
	at org.apache.maven.surefire.booter.ForkedBooter.runSuitesInProcess(ForkedBooter.java:345)
	at org.apache.maven.surefire.booter.ForkedBooter.execute(ForkedBooter.java:126)
	at org.apache.maven.surefire.booter.ForkedBooter.main(ForkedBooter.java:418)
14:59:18.132 [main] ERROR Unexpected RDFParseException
org.eclipse.rdf4j.rio.RDFParseException: Expected a letter, found '1' [line 1]
	at org.eclipse.rdf4j.rio.helpers.RDFParserHelper.reportError(RDFParserHelper.java:265)
	at org.eclipse.rdf4j.rio.helpers.AbstractRDFParser.reportError(AbstractRDFParser.java:628)
	at org.eclipse.rdf4j.rio.turtle.TurtleParser.reportError(TurtleParser.java:1297)
	at org.eclipse.rdf4j.rio.turtle.TurtleParser.parseQuotedLiteral(TurtleParser.java:619)
	at org.eclipse.rdf4j.rio.turtle.TurtleParser.parseValue(TurtleParser.java:584)
	at org.eclipse.rdf4j.rio.turtle.TurtleParser.parseObject(TurtleParser.java:461)
	at org.eclipse.rdf4j.rio.turtle.TurtleParser.parseObjectList(TurtleParser.java:389)
	at org.eclipse.rdf4j.rio.turtle.TurtleParser.parsePredicateObjectList(TurtleParser.java:362)
	at org.eclipse.rdf4j.rio.turtle.TurtleParser.parseTriples(TurtleParser.java:349)
	at org.eclipse.rdf4j.rio.turtle.TurtleParser.parseStatement(TurtleParser.java:216)
	at org.eclipse.rdf4j.rio.turtle.TurtleParser.parse(TurtleParser.java:178)
	at org.eclipse.rdf4j.rio.turtle.TurtleParser.parse(TurtleParser.java:130)
	at org.eclipse.rdf4j.console.command.Verify.verify(Verify.java:145)
	at org.eclipse.rdf4j.console.command.Verify.execute(Verify.java:97)
	at org.eclipse.rdf4j.console.command.VerifyTest.testVerifyWrongLang(VerifyTest.java:109)
	at sun.reflect.NativeMethodAccessorImpl.invoke0(Native Method)
	at sun.reflect.NativeMethodAccessorImpl.invoke(NativeMethodAccessorImpl.java:62)
	at sun.reflect.DelegatingMethodAccessorImpl.invoke(DelegatingMethodAccessorImpl.java:43)
	at java.lang.reflect.Method.invoke(Method.java:498)
	at org.junit.runners.model.FrameworkMethod$1.runReflectiveCall(FrameworkMethod.java:50)
	at org.junit.internal.runners.model.ReflectiveCallable.run(ReflectiveCallable.java:12)
	at org.junit.runners.model.FrameworkMethod.invokeExplosively(FrameworkMethod.java:47)
	at org.junit.internal.runners.statements.InvokeMethod.evaluate(InvokeMethod.java:17)
	at org.junit.internal.runners.statements.RunBefores.evaluate(RunBefores.java:26)
	at org.junit.internal.runners.statements.RunAfters.evaluate(RunAfters.java:27)
	at org.mockito.internal.junit.JUnitRule$1.evaluateSafely(JUnitRule.java:52)
	at org.mockito.internal.junit.JUnitRule$1.evaluate(JUnitRule.java:43)
	at org.junit.rules.ExternalResource$1.evaluate(ExternalResource.java:48)
	at org.junit.rules.RunRules.evaluate(RunRules.java:20)
	at org.junit.runners.ParentRunner.runLeaf(ParentRunner.java:325)
	at org.junit.runners.BlockJUnit4ClassRunner.runChild(BlockJUnit4ClassRunner.java:78)
	at org.junit.runners.BlockJUnit4ClassRunner.runChild(BlockJUnit4ClassRunner.java:57)
	at org.junit.runners.ParentRunner$3.run(ParentRunner.java:290)
	at org.junit.runners.ParentRunner$1.schedule(ParentRunner.java:71)
	at org.junit.runners.ParentRunner.runChildren(ParentRunner.java:288)
	at org.junit.runners.ParentRunner.access$000(ParentRunner.java:58)
	at org.junit.runners.ParentRunner$2.evaluate(ParentRunner.java:268)
	at org.junit.runners.ParentRunner.run(ParentRunner.java:363)
	at org.apache.maven.surefire.junit4.JUnit4Provider.execute(JUnit4Provider.java:365)
	at org.apache.maven.surefire.junit4.JUnit4Provider.executeWithRerun(JUnit4Provider.java:273)
	at org.apache.maven.surefire.junit4.JUnit4Provider.executeTestSet(JUnit4Provider.java:238)
	at org.apache.maven.surefire.junit4.JUnit4Provider.invoke(JUnit4Provider.java:159)
	at org.apache.maven.surefire.booter.ForkedBooter.invokeProviderInSameClassLoader(ForkedBooter.java:384)
	at org.apache.maven.surefire.booter.ForkedBooter.runSuitesInProcess(ForkedBooter.java:345)
	at org.apache.maven.surefire.booter.ForkedBooter.execute(ForkedBooter.java:126)
	at org.apache.maven.surefire.booter.ForkedBooter.main(ForkedBooter.java:418)
14:59:18.144 [main] ERROR No parser available for this RDF format
org.eclipse.rdf4j.rio.UnsupportedRDFormatException: Did not recognise RDF format string file:/home/hudson/genie.rdf4j/.jenkins/jobs/rdf4j-pr-verify/workspace/tools/console/does-not-exist.docx
	at org.eclipse.rdf4j.rio.Rio.lambda$unsupportedFormat$1(Rio.java:577)
	at java.util.Optional.orElseThrow(Optional.java:290)
	at org.eclipse.rdf4j.console.command.Verify.verify(Verify.java:124)
	at org.eclipse.rdf4j.console.command.Verify.execute(Verify.java:97)
	at org.eclipse.rdf4j.console.command.VerifyTest.testVerifyWrongFormat(VerifyTest.java:69)
	at sun.reflect.NativeMethodAccessorImpl.invoke0(Native Method)
	at sun.reflect.NativeMethodAccessorImpl.invoke(NativeMethodAccessorImpl.java:62)
	at sun.reflect.DelegatingMethodAccessorImpl.invoke(DelegatingMethodAccessorImpl.java:43)
	at java.lang.reflect.Method.invoke(Method.java:498)
	at org.junit.runners.model.FrameworkMethod$1.runReflectiveCall(FrameworkMethod.java:50)
	at org.junit.internal.runners.model.ReflectiveCallable.run(ReflectiveCallable.java:12)
	at org.junit.runners.model.FrameworkMethod.invokeExplosively(FrameworkMethod.java:47)
	at org.junit.internal.runners.statements.InvokeMethod.evaluate(InvokeMethod.java:17)
	at org.junit.internal.runners.statements.RunBefores.evaluate(RunBefores.java:26)
	at org.junit.internal.runners.statements.RunAfters.evaluate(RunAfters.java:27)
	at org.mockito.internal.junit.JUnitRule$1.evaluateSafely(JUnitRule.java:52)
	at org.mockito.internal.junit.JUnitRule$1.evaluate(JUnitRule.java:43)
	at org.junit.rules.ExternalResource$1.evaluate(ExternalResource.java:48)
	at org.junit.rules.RunRules.evaluate(RunRules.java:20)
	at org.junit.runners.ParentRunner.runLeaf(ParentRunner.java:325)
	at org.junit.runners.BlockJUnit4ClassRunner.runChild(BlockJUnit4ClassRunner.java:78)
	at org.junit.runners.BlockJUnit4ClassRunner.runChild(BlockJUnit4ClassRunner.java:57)
	at org.junit.runners.ParentRunner$3.run(ParentRunner.java:290)
	at org.junit.runners.ParentRunner$1.schedule(ParentRunner.java:71)
	at org.junit.runners.ParentRunner.runChildren(ParentRunner.java:288)
	at org.junit.runners.ParentRunner.access$000(ParentRunner.java:58)
	at org.junit.runners.ParentRunner$2.evaluate(ParentRunner.java:268)
	at org.junit.runners.ParentRunner.run(ParentRunner.java:363)
	at org.apache.maven.surefire.junit4.JUnit4Provider.execute(JUnit4Provider.java:365)
	at org.apache.maven.surefire.junit4.JUnit4Provider.executeWithRerun(JUnit4Provider.java:273)
	at org.apache.maven.surefire.junit4.JUnit4Provider.executeTestSet(JUnit4Provider.java:238)
	at org.apache.maven.surefire.junit4.JUnit4Provider.invoke(JUnit4Provider.java:159)
	at org.apache.maven.surefire.booter.ForkedBooter.invokeProviderInSameClassLoader(ForkedBooter.java:384)
	at org.apache.maven.surefire.booter.ForkedBooter.runSuitesInProcess(ForkedBooter.java:345)
	at org.apache.maven.surefire.booter.ForkedBooter.execute(ForkedBooter.java:126)
	at org.apache.maven.surefire.booter.ForkedBooter.main(ForkedBooter.java:418)
14:59:18.154 [main] ERROR Unexpected RDFParseException
org.eclipse.rdf4j.rio.RDFParseException: IRI included an unencoded space: '32' [line 1]
	at org.eclipse.rdf4j.rio.helpers.RDFParserHelper.reportError(RDFParserHelper.java:265)
	at org.eclipse.rdf4j.rio.helpers.AbstractRDFParser.reportError(AbstractRDFParser.java:628)
	at org.eclipse.rdf4j.rio.turtle.TurtleParser.reportError(TurtleParser.java:1297)
	at org.eclipse.rdf4j.rio.turtle.TurtleParser.parseURI(TurtleParser.java:902)
	at org.eclipse.rdf4j.rio.turtle.TurtleParser.parseValue(TurtleParser.java:575)
	at org.eclipse.rdf4j.rio.turtle.TurtleParser.parseSubject(TurtleParser.java:406)
	at org.eclipse.rdf4j.rio.turtle.TurtleParser.parseTriples(TurtleParser.java:347)
	at org.eclipse.rdf4j.rio.turtle.TurtleParser.parseStatement(TurtleParser.java:216)
	at org.eclipse.rdf4j.rio.turtle.TurtleParser.parse(TurtleParser.java:178)
	at org.eclipse.rdf4j.rio.turtle.TurtleParser.parse(TurtleParser.java:130)
	at org.eclipse.rdf4j.console.command.Verify.verify(Verify.java:145)
	at org.eclipse.rdf4j.console.command.Verify.execute(Verify.java:97)
	at org.eclipse.rdf4j.console.command.VerifyTest.testVerifySpaceIRI(VerifyTest.java:103)
	at sun.reflect.NativeMethodAccessorImpl.invoke0(Native Method)
	at sun.reflect.NativeMethodAccessorImpl.invoke(NativeMethodAccessorImpl.java:62)
	at sun.reflect.DelegatingMethodAccessorImpl.invoke(DelegatingMethodAccessorImpl.java:43)
	at java.lang.reflect.Method.invoke(Method.java:498)
	at org.junit.runners.model.FrameworkMethod$1.runReflectiveCall(FrameworkMethod.java:50)
	at org.junit.internal.runners.model.ReflectiveCallable.run(ReflectiveCallable.java:12)
	at org.junit.runners.model.FrameworkMethod.invokeExplosively(FrameworkMethod.java:47)
	at org.junit.internal.runners.statements.InvokeMethod.evaluate(InvokeMethod.java:17)
	at org.junit.internal.runners.statements.RunBefores.evaluate(RunBefores.java:26)
	at org.junit.internal.runners.statements.RunAfters.evaluate(RunAfters.java:27)
	at org.mockito.internal.junit.JUnitRule$1.evaluateSafely(JUnitRule.java:52)
	at org.mockito.internal.junit.JUnitRule$1.evaluate(JUnitRule.java:43)
	at org.junit.rules.ExternalResource$1.evaluate(ExternalResource.java:48)
	at org.junit.rules.RunRules.evaluate(RunRules.java:20)
	at org.junit.runners.ParentRunner.runLeaf(ParentRunner.java:325)
	at org.junit.runners.BlockJUnit4ClassRunner.runChild(BlockJUnit4ClassRunner.java:78)
	at org.junit.runners.BlockJUnit4ClassRunner.runChild(BlockJUnit4ClassRunner.java:57)
	at org.junit.runners.ParentRunner$3.run(ParentRunner.java:290)
	at org.junit.runners.ParentRunner$1.schedule(ParentRunner.java:71)
	at org.junit.runners.ParentRunner.runChildren(ParentRunner.java:288)
	at org.junit.runners.ParentRunner.access$000(ParentRunner.java:58)
	at org.junit.runners.ParentRunner$2.evaluate(ParentRunner.java:268)
	at org.junit.runners.ParentRunner.run(ParentRunner.java:363)
	at org.apache.maven.surefire.junit4.JUnit4Provider.execute(JUnit4Provider.java:365)
	at org.apache.maven.surefire.junit4.JUnit4Provider.executeWithRerun(JUnit4Provider.java:273)
	at org.apache.maven.surefire.junit4.JUnit4Provider.executeTestSet(JUnit4Provider.java:238)
	at org.apache.maven.surefire.junit4.JUnit4Provider.invoke(JUnit4Provider.java:159)
	at org.apache.maven.surefire.booter.ForkedBooter.invokeProviderInSameClassLoader(ForkedBooter.java:384)
	at org.apache.maven.surefire.booter.ForkedBooter.runSuitesInProcess(ForkedBooter.java:345)
	at org.apache.maven.surefire.booter.ForkedBooter.execute(ForkedBooter.java:126)
	at org.apache.maven.surefire.booter.ForkedBooter.main(ForkedBooter.java:418)
[INFO] Tests run: 10, Failures: 0, Errors: 0, Skipped: 0, Time elapsed: 0.46 s - in org.eclipse.rdf4j.console.command.VerifyTest
[INFO] Running org.eclipse.rdf4j.console.command.DropTest
[MockitoHint] DropTest.testUserAbortedUnsafeDropBeforeWarning (see javadoc for MockitoHint):
[MockitoHint] 1. Unused -> at org.eclipse.rdf4j.console.command.DropTest.setUp(DropTest.java:50)

[INFO] Tests run: 3, Failures: 0, Errors: 0, Skipped: 0, Time elapsed: 0.101 s - in org.eclipse.rdf4j.console.command.DropTest
[INFO] Running org.eclipse.rdf4j.console.command.FederateTest
14:59:18.301 [main] DEBUG Initializing MemoryStore...
14:59:18.303 [main] DEBUG Initializing data file...
14:59:18.303 [main] DEBUG Data file initialized
14:59:18.303 [main] DEBUG MemoryStore initialized
14:59:18.305 [main] DEBUG syncing data to file...
14:59:18.306 [main] DEBUG Data synced to file
14:59:18.310 [main] DEBUG Initializing MemoryStore...
14:59:18.310 [main] DEBUG Initializing data file...
14:59:18.310 [main] DEBUG Data file initialized
14:59:18.311 [main] DEBUG MemoryStore initialized
14:59:18.312 [main] DEBUG syncing data to file...
14:59:18.313 [main] DEBUG Data synced to file
14:59:18.330 [main] DEBUG Federate called with federation ID = fedID, and member ID's = [sparql][alien][http].
  Distinct set to false, and readonly set to true.

14:59:18.334 [main] DEBUG Federation repository root node: _:node1drm3t708x216
14:59:18.336 [main] DEBUG _:node1drm3t708x216 http://www.w3.org/1999/02/22-rdf-syntax-ns#type http://www.openrdf.org/config/repository#Repository
14:59:18.336 [main] DEBUG _:node1drm3t708x216 http://www.openrdf.org/config/repository#repositoryID "fedID"
14:59:18.336 [main] DEBUG _:node1drm3t708x216 http://www.w3.org/2000/01/rdf-schema#label "Test Federation Title"
14:59:18.336 [main] DEBUG _:node1drm3t708x216 http://www.openrdf.org/config/repository#repositoryImpl _:node1drm3t708x217
14:59:18.336 [main] DEBUG _:node1drm3t708x217 http://www.openrdf.org/config/repository#repositoryType "openrdf:SailRepository"
14:59:18.336 [main] DEBUG _:node1drm3t708x217 http://www.openrdf.org/config/repository/sail#sailImpl _:node1drm3t708x218
14:59:18.336 [main] DEBUG _:node1drm3t708x218 http://www.openrdf.org/config/sail#sailType "openrdf:Federation"
14:59:18.337 [main] DEBUG _:node1drm3t708x218 http://www.openrdf.org/config/sail/federation#readOnly "true"^^<http://www.w3.org/2001/XMLSchema#boolean>
14:59:18.337 [main] DEBUG _:node1drm3t708x218 http://www.openrdf.org/config/sail/federation#distinct "false"^^<http://www.w3.org/2001/XMLSchema#boolean>
14:59:18.337 [main] DEBUG Adding member: sparql
14:59:18.338 [main] DEBUG _:node1drm3t708x218 http://www.openrdf.org/config/sail/federation#member _:node1drm3t708x219
14:59:18.339 [main] DEBUG _:node1drm3t708x219 http://www.openrdf.org/config/repository#repositoryType "openrdf:SPARQLRepository"
14:59:18.339 [main] DEBUG _:node1drm3t708x219 http://www.openrdf.org/config/repository/sparql#query-endpoint http://localhost:8080/openrdf-sesame/repositories/sparql
14:59:18.339 [main] DEBUG Added member sparql: 
14:59:18.339 [main] DEBUG Adding member: alien
14:59:18.339 [main] DEBUG _:node1drm3t708x218 http://www.openrdf.org/config/sail/federation#member _:node1drm3t708x222
14:59:18.340 [main] DEBUG _:node1drm3t708x222 http://www.openrdf.org/config/repository#repositoryType "openrdf:ProxyRepository"
14:59:18.340 [main] DEBUG _:node1drm3t708x222 http://www.openrdf.org/config/repository/proxy#proxiedID "alien"
14:59:18.340 [main] DEBUG Added member alien: 
14:59:18.341 [main] DEBUG Adding member: http
14:59:18.341 [main] DEBUG _:node1drm3t708x218 http://www.openrdf.org/config/sail/federation#member _:node1drm3t708x225
14:59:18.341 [main] DEBUG _:node1drm3t708x225 http://www.openrdf.org/config/repository#repositoryType "openrdf:HTTPRepository"
14:59:18.342 [main] DEBUG _:node1drm3t708x225 http://www.openrdf.org/config/repository/http#repositoryURL http://localhost:8080/openrdf-sesame/repositories/http
14:59:18.342 [main] DEBUG Added member http: 
14:59:18.375 [main] DEBUG Initializing MemoryStore...
14:59:18.375 [main] DEBUG Initializing data file...
14:59:18.376 [main] DEBUG Data file initialized
14:59:18.376 [main] DEBUG MemoryStore initialized
14:59:18.378 [main] DEBUG syncing data to file...
14:59:18.379 [main] DEBUG Data synced to file
14:59:18.383 [main] DEBUG Initializing MemoryStore...
14:59:18.384 [main] DEBUG Initializing data file...
14:59:18.384 [main] DEBUG Data file initialized
14:59:18.384 [main] DEBUG MemoryStore initialized
14:59:18.386 [main] DEBUG syncing data to file...
14:59:18.387 [main] DEBUG Data synced to file
14:59:18.394 [main] ERROR Duplicate repository id's specified.
[MockitoHint] FederateTest.testDuplicateMembersPrintsError (see javadoc for MockitoHint):
[MockitoHint] 1. Unused -> at org.eclipse.rdf4j.console.command.FederateTest.setUp(FederateTest.java:87)
[MockitoHint] 2. Unused -> at org.eclipse.rdf4j.console.command.FederateTest.setUp(FederateTest.java:88)

14:59:18.400 [main] DEBUG Initializing MemoryStore...
14:59:18.400 [main] DEBUG Initializing data file...
14:59:18.400 [main] DEBUG Data file initialized
14:59:18.400 [main] DEBUG MemoryStore initialized
14:59:18.402 [main] DEBUG syncing data to file...
14:59:18.403 [main] DEBUG Data synced to file
14:59:18.406 [main] DEBUG Initializing MemoryStore...
14:59:18.406 [main] DEBUG Initializing data file...
14:59:18.406 [main] DEBUG Data file initialized
14:59:18.406 [main] DEBUG MemoryStore initialized
14:59:18.408 [main] DEBUG syncing data to file...
14:59:18.408 [main] DEBUG Data synced to file
14:59:18.415 [main] DEBUG Federate called with federation ID = alien, and member ID's = [fedID][scary].
  Distinct set to false, and readonly set to true.

14:59:18.416 [main] ERROR alien already exists.
[MockitoHint] FederateTest.testFedAlreadyExistsPrintsSpecificError (see javadoc for MockitoHint):
[MockitoHint] 1. Unused -> at org.eclipse.rdf4j.console.command.FederateTest.setUp(FederateTest.java:88)

14:59:18.422 [main] DEBUG Initializing MemoryStore...
14:59:18.422 [main] DEBUG Initializing data file...
14:59:18.422 [main] DEBUG Data file initialized
14:59:18.422 [main] DEBUG MemoryStore initialized
14:59:18.424 [main] DEBUG syncing data to file...
14:59:18.425 [main] DEBUG Data synced to file
14:59:18.427 [main] DEBUG Initializing MemoryStore...
14:59:18.428 [main] DEBUG Initializing data file...
14:59:18.428 [main] DEBUG Data file initialized
14:59:18.428 [main] DEBUG MemoryStore initialized
14:59:18.429 [main] DEBUG syncing data to file...
14:59:18.429 [main] DEBUG Data synced to file
14:59:18.435 [main] DEBUG Federate called with federation ID = fedID, and member ID's = [alien][scary].
  Distinct set to true, and readonly set to false.

14:59:18.437 [main] DEBUG Federation repository root node: _:node1drm3t708x338
14:59:18.437 [main] DEBUG _:node1drm3t708x338 http://www.w3.org/1999/02/22-rdf-syntax-ns#type http://www.openrdf.org/config/repository#Repository
14:59:18.437 [main] DEBUG _:node1drm3t708x338 http://www.openrdf.org/config/repository#repositoryID "fedID"
14:59:18.437 [main] DEBUG _:node1drm3t708x338 http://www.w3.org/2000/01/rdf-schema#label "Test Federation Title"
14:59:18.437 [main] DEBUG _:node1drm3t708x338 http://www.openrdf.org/config/repository#repositoryImpl _:node1drm3t708x339
14:59:18.437 [main] DEBUG _:node1drm3t708x339 http://www.openrdf.org/config/repository#repositoryType "openrdf:SailRepository"
14:59:18.437 [main] DEBUG _:node1drm3t708x339 http://www.openrdf.org/config/repository/sail#sailImpl _:node1drm3t708x340
14:59:18.437 [main] DEBUG _:node1drm3t708x340 http://www.openrdf.org/config/sail#sailType "openrdf:Federation"
14:59:18.437 [main] DEBUG _:node1drm3t708x340 http://www.openrdf.org/config/sail/federation#readOnly "false"^^<http://www.w3.org/2001/XMLSchema#boolean>
14:59:18.437 [main] DEBUG _:node1drm3t708x340 http://www.openrdf.org/config/sail/federation#distinct "true"^^<http://www.w3.org/2001/XMLSchema#boolean>
14:59:18.437 [main] DEBUG Adding member: alien
14:59:18.437 [main] DEBUG _:node1drm3t708x340 http://www.openrdf.org/config/sail/federation#member _:node1drm3t708x341
14:59:18.438 [main] DEBUG _:node1drm3t708x341 http://www.openrdf.org/config/repository#repositoryType "openrdf:ProxyRepository"
14:59:18.438 [main] DEBUG _:node1drm3t708x341 http://www.openrdf.org/config/repository/proxy#proxiedID "alien"
14:59:18.438 [main] DEBUG Added member alien: 
14:59:18.438 [main] DEBUG Adding member: scary
14:59:18.438 [main] DEBUG _:node1drm3t708x340 http://www.openrdf.org/config/sail/federation#member _:node1drm3t708x344
14:59:18.438 [main] DEBUG _:node1drm3t708x344 http://www.openrdf.org/config/repository#repositoryType "openrdf:ProxyRepository"
14:59:18.438 [main] DEBUG _:node1drm3t708x344 http://www.openrdf.org/config/repository/proxy#proxiedID "scary"
14:59:18.438 [main] DEBUG Added member scary: 
14:59:18.457 [main] DEBUG Initializing MemoryStore...
14:59:18.457 [main] DEBUG Initializing data file...
14:59:18.458 [main] DEBUG Data file initialized
14:59:18.458 [main] DEBUG MemoryStore initialized
14:59:18.459 [main] DEBUG syncing data to file...
14:59:18.460 [main] DEBUG Data synced to file
14:59:18.462 [main] DEBUG Initializing MemoryStore...
14:59:18.463 [main] DEBUG Initializing data file...
14:59:18.463 [main] DEBUG Data file initialized
14:59:18.463 [main] DEBUG MemoryStore initialized
14:59:18.464 [main] DEBUG syncing data to file...
14:59:18.465 [main] DEBUG Data synced to file
14:59:18.472 [main] DEBUG Federate called with federation ID = fedID, and member ID's = [sparql][sparql2].
  Distinct set to false, and readonly set to false.

14:59:18.474 [main] ERROR sparql is read-only.
14:59:18.476 [main] ERROR sparql2 is read-only.
[MockitoHint] FederateTest.testSparqlAndNotReadOnlyPrintsError (see javadoc for MockitoHint):
[MockitoHint] 1. Unused -> at org.eclipse.rdf4j.console.command.FederateTest.setUp(FederateTest.java:88)

14:59:18.481 [main] DEBUG Initializing MemoryStore...
14:59:18.481 [main] DEBUG Initializing data file...
14:59:18.482 [main] DEBUG Data file initialized
14:59:18.482 [main] DEBUG MemoryStore initialized
14:59:18.484 [main] DEBUG syncing data to file...
14:59:18.485 [main] DEBUG Data synced to file
14:59:18.488 [main] DEBUG Initializing MemoryStore...
14:59:18.489 [main] DEBUG Initializing data file...
14:59:18.489 [main] DEBUG Data file initialized
14:59:18.489 [main] DEBUG MemoryStore initialized
14:59:18.491 [main] DEBUG syncing data to file...
14:59:18.492 [main] DEBUG Data synced to file
[MockitoHint] FederateTest.testNoArgumentsPrintsHelp (see javadoc for MockitoHint):
[MockitoHint] 1. Unused -> at org.eclipse.rdf4j.console.command.FederateTest.setUp(FederateTest.java:87)
[MockitoHint] 2. Unused -> at org.eclipse.rdf4j.console.command.FederateTest.setUp(FederateTest.java:88)

14:59:18.502 [main] DEBUG Initializing MemoryStore...
14:59:18.502 [main] DEBUG Initializing data file...
14:59:18.502 [main] DEBUG Data file initialized
14:59:18.502 [main] DEBUG MemoryStore initialized
14:59:18.504 [main] DEBUG syncing data to file...
14:59:18.504 [main] DEBUG Data synced to file
14:59:18.507 [main] DEBUG Initializing MemoryStore...
14:59:18.507 [main] DEBUG Initializing data file...
14:59:18.507 [main] DEBUG Data file initialized
14:59:18.507 [main] DEBUG MemoryStore initialized
14:59:18.508 [main] DEBUG syncing data to file...
14:59:18.509 [main] DEBUG Data synced to file
14:59:18.514 [main] DEBUG Federate called with federation ID = type=memory, and member ID's = [fedID][alien][scary].
  Distinct set to false, and readonly set to true.

14:59:18.514 [main] ERROR fedID does not exist.
[MockitoHint] FederateTest.testInvalidArgumentPrintsError (see javadoc for MockitoHint):
[MockitoHint] 1. Unused -> at org.eclipse.rdf4j.console.command.FederateTest.setUp(FederateTest.java:88)

14:59:18.520 [main] DEBUG Initializing MemoryStore...
14:59:18.520 [main] DEBUG Initializing data file...
14:59:18.521 [main] DEBUG Data file initialized
14:59:18.521 [main] DEBUG MemoryStore initialized
14:59:18.522 [main] DEBUG syncing data to file...
14:59:18.523 [main] DEBUG Data synced to file
14:59:18.524 [main] DEBUG Initializing MemoryStore...
14:59:18.525 [main] DEBUG Initializing data file...
14:59:18.525 [main] DEBUG Data file initialized
14:59:18.525 [main] DEBUG MemoryStore initialized
14:59:18.526 [main] DEBUG syncing data to file...
14:59:18.526 [main] DEBUG Data synced to file
14:59:18.531 [main] DEBUG Federate called with federation ID = fedID, and member ID's = [sparql][sparql2].
  Distinct set to false, and readonly set to true.

14:59:18.532 [main] DEBUG Federation repository root node: _:node1drm3t708x494
14:59:18.532 [main] DEBUG _:node1drm3t708x494 http://www.w3.org/1999/02/22-rdf-syntax-ns#type http://www.openrdf.org/config/repository#Repository
14:59:18.532 [main] DEBUG _:node1drm3t708x494 http://www.openrdf.org/config/repository#repositoryID "fedID"
14:59:18.532 [main] DEBUG _:node1drm3t708x494 http://www.w3.org/2000/01/rdf-schema#label "Test Federation Title"
14:59:18.532 [main] DEBUG _:node1drm3t708x494 http://www.openrdf.org/config/repository#repositoryImpl _:node1drm3t708x495
14:59:18.532 [main] DEBUG _:node1drm3t708x495 http://www.openrdf.org/config/repository#repositoryType "openrdf:SailRepository"
14:59:18.532 [main] DEBUG _:node1drm3t708x495 http://www.openrdf.org/config/repository/sail#sailImpl _:node1drm3t708x496
14:59:18.532 [main] DEBUG _:node1drm3t708x496 http://www.openrdf.org/config/sail#sailType "openrdf:Federation"
14:59:18.532 [main] DEBUG _:node1drm3t708x496 http://www.openrdf.org/config/sail/federation#readOnly "true"^^<http://www.w3.org/2001/XMLSchema#boolean>
14:59:18.532 [main] DEBUG _:node1drm3t708x496 http://www.openrdf.org/config/sail/federation#distinct "false"^^<http://www.w3.org/2001/XMLSchema#boolean>
14:59:18.532 [main] DEBUG Adding member: sparql
14:59:18.532 [main] DEBUG _:node1drm3t708x496 http://www.openrdf.org/config/sail/federation#member _:node1drm3t708x497
14:59:18.532 [main] DEBUG _:node1drm3t708x497 http://www.openrdf.org/config/repository#repositoryType "openrdf:SPARQLRepository"
14:59:18.533 [main] DEBUG _:node1drm3t708x497 http://www.openrdf.org/config/repository/sparql#query-endpoint http://localhost:8080/openrdf-sesame/repositories/sparql
14:59:18.533 [main] DEBUG Added member sparql: 
14:59:18.533 [main] DEBUG Adding member: sparql2
14:59:18.533 [main] DEBUG _:node1drm3t708x496 http://www.openrdf.org/config/sail/federation#member _:node1drm3t708x500
14:59:18.533 [main] DEBUG _:node1drm3t708x500 http://www.openrdf.org/config/repository#repositoryType "openrdf:SPARQLRepository"
14:59:18.533 [main] DEBUG _:node1drm3t708x500 http://www.openrdf.org/config/repository/sparql#query-endpoint http://localhost:8080/openrdf-sesame/repositories/sparql
14:59:18.533 [main] DEBUG Added member sparql2: 
14:59:18.541 [main] DEBUG Initializing MemoryStore...
14:59:18.541 [main] DEBUG Initializing data file...
14:59:18.542 [main] DEBUG Data file initialized
14:59:18.542 [main] DEBUG MemoryStore initialized
14:59:18.544 [main] DEBUG syncing data to file...
14:59:18.545 [main] DEBUG Data synced to file
14:59:18.547 [main] DEBUG Initializing MemoryStore...
14:59:18.547 [main] DEBUG Initializing data file...
14:59:18.548 [main] DEBUG Data file initialized
14:59:18.548 [main] DEBUG MemoryStore initialized
14:59:18.549 [main] DEBUG syncing data to file...
14:59:18.549 [main] DEBUG Data synced to file
14:59:18.555 [main] DEBUG Federate called with federation ID = fedID, and member ID's = [http][sparql].
  Distinct set to false, and readonly set to true.

14:59:18.556 [main] DEBUG Federation repository root node: _:node1drm3t708x549
14:59:18.556 [main] DEBUG _:node1drm3t708x549 http://www.w3.org/1999/02/22-rdf-syntax-ns#type http://www.openrdf.org/config/repository#Repository
14:59:18.556 [main] DEBUG _:node1drm3t708x549 http://www.openrdf.org/config/repository#repositoryID "fedID"
14:59:18.556 [main] DEBUG _:node1drm3t708x549 http://www.w3.org/2000/01/rdf-schema#label "Test Federation Title"
14:59:18.556 [main] DEBUG _:node1drm3t708x549 http://www.openrdf.org/config/repository#repositoryImpl _:node1drm3t708x550
14:59:18.556 [main] DEBUG _:node1drm3t708x550 http://www.openrdf.org/config/repository#repositoryType "openrdf:SailRepository"
14:59:18.556 [main] DEBUG _:node1drm3t708x550 http://www.openrdf.org/config/repository/sail#sailImpl _:node1drm3t708x551
14:59:18.556 [main] DEBUG _:node1drm3t708x551 http://www.openrdf.org/config/sail#sailType "openrdf:Federation"
14:59:18.556 [main] DEBUG _:node1drm3t708x551 http://www.openrdf.org/config/sail/federation#readOnly "true"^^<http://www.w3.org/2001/XMLSchema#boolean>
14:59:18.556 [main] DEBUG _:node1drm3t708x551 http://www.openrdf.org/config/sail/federation#distinct "false"^^<http://www.w3.org/2001/XMLSchema#boolean>
14:59:18.556 [main] DEBUG Adding member: http
14:59:18.556 [main] DEBUG _:node1drm3t708x551 http://www.openrdf.org/config/sail/federation#member _:node1drm3t708x552
14:59:18.557 [main] DEBUG _:node1drm3t708x552 http://www.openrdf.org/config/repository#repositoryType "openrdf:HTTPRepository"
14:59:18.558 [main] DEBUG _:node1drm3t708x552 http://www.openrdf.org/config/repository/http#repositoryURL http://localhost:8080/openrdf-sesame/repositories/http
14:59:18.558 [main] DEBUG Added member http: 
14:59:18.558 [main] DEBUG Adding member: sparql
14:59:18.558 [main] DEBUG _:node1drm3t708x551 http://www.openrdf.org/config/sail/federation#member _:node1drm3t708x555
14:59:18.559 [main] DEBUG _:node1drm3t708x555 http://www.openrdf.org/config/repository#repositoryType "openrdf:SPARQLRepository"
14:59:18.559 [main] DEBUG _:node1drm3t708x555 http://www.openrdf.org/config/repository/sparql#query-endpoint http://localhost:8080/openrdf-sesame/repositories/sparql
14:59:18.559 [main] DEBUG Added member sparql: 
14:59:18.571 [main] DEBUG Initializing MemoryStore...
14:59:18.571 [main] DEBUG Initializing data file...
14:59:18.572 [main] DEBUG Data file initialized
14:59:18.572 [main] DEBUG MemoryStore initialized
14:59:18.573 [main] DEBUG syncing data to file...
14:59:18.574 [main] DEBUG Data synced to file
14:59:18.576 [main] DEBUG Initializing MemoryStore...
14:59:18.577 [main] DEBUG Initializing data file...
14:59:18.577 [main] DEBUG Data file initialized
14:59:18.577 [main] DEBUG MemoryStore initialized
14:59:18.578 [main] DEBUG syncing data to file...
14:59:18.579 [main] DEBUG Data synced to file
14:59:18.585 [main] DEBUG Federate called with federation ID = fedID, and member ID's = [alien][FreeLunch].
  Distinct set to false, and readonly set to true.

14:59:18.585 [main] ERROR FreeLunch does not exist.
[MockitoHint] FederateTest.testNonexistentMemberPrintsSpecificError (see javadoc for MockitoHint):
[MockitoHint] 1. Unused -> at org.eclipse.rdf4j.console.command.FederateTest.setUp(FederateTest.java:88)

14:59:18.591 [main] DEBUG Initializing MemoryStore...
14:59:18.591 [main] DEBUG Initializing data file...
14:59:18.591 [main] DEBUG Data file initialized
14:59:18.591 [main] DEBUG MemoryStore initialized
14:59:18.593 [main] DEBUG syncing data to file...
14:59:18.593 [main] DEBUG Data synced to file
14:59:18.596 [main] DEBUG Initializing MemoryStore...
14:59:18.596 [main] DEBUG Initializing data file...
14:59:18.596 [main] DEBUG Data file initialized
14:59:18.596 [main] DEBUG MemoryStore initialized
14:59:18.597 [main] DEBUG syncing data to file...
14:59:18.598 [main] DEBUG Data synced to file
14:59:18.603 [main] ERROR Duplicate repository id's specified.
[MockitoHint] FederateTest.testFedSameAsMemberPrintsError (see javadoc for MockitoHint):
[MockitoHint] 1. Unused -> at org.eclipse.rdf4j.console.command.FederateTest.setUp(FederateTest.java:87)
[MockitoHint] 2. Unused -> at org.eclipse.rdf4j.console.command.FederateTest.setUp(FederateTest.java:88)

14:59:18.607 [main] DEBUG Initializing MemoryStore...
14:59:18.607 [main] DEBUG Initializing data file...
14:59:18.608 [main] DEBUG Data file initialized
14:59:18.608 [main] DEBUG MemoryStore initialized
14:59:18.609 [main] DEBUG syncing data to file...
14:59:18.609 [main] DEBUG Data synced to file
14:59:18.611 [main] DEBUG Initializing MemoryStore...
14:59:18.611 [main] DEBUG Initializing data file...
14:59:18.612 [main] DEBUG Data file initialized
14:59:18.612 [main] DEBUG MemoryStore initialized
14:59:18.613 [main] DEBUG syncing data to file...
14:59:18.613 [main] DEBUG Data synced to file
[MockitoHint] FederateTest.testTwoArgumentsPrintsHelp (see javadoc for MockitoHint):
[MockitoHint] 1. Unused -> at org.eclipse.rdf4j.console.command.FederateTest.setUp(FederateTest.java:87)
[MockitoHint] 2. Unused -> at org.eclipse.rdf4j.console.command.FederateTest.setUp(FederateTest.java:88)

14:59:18.622 [main] DEBUG Initializing MemoryStore...
14:59:18.622 [main] DEBUG Initializing data file...
14:59:18.622 [main] DEBUG Data file initialized
14:59:18.622 [main] DEBUG MemoryStore initialized
14:59:18.623 [main] DEBUG syncing data to file...
14:59:18.624 [main] DEBUG Data synced to file
14:59:18.626 [main] DEBUG Initializing MemoryStore...
14:59:18.626 [main] DEBUG Initializing data file...
14:59:18.627 [main] DEBUG Data file initialized
14:59:18.627 [main] DEBUG MemoryStore initialized
14:59:18.628 [main] DEBUG syncing data to file...
14:59:18.628 [main] DEBUG Data synced to file
14:59:18.633 [main] DEBUG Federate called with federation ID = fedID, and member ID's = [alien][scary].
  Distinct set to false, and readonly set to true.

14:59:18.634 [main] DEBUG Federation repository root node: _:node1drm3t708x692
14:59:18.634 [main] DEBUG _:node1drm3t708x692 http://www.w3.org/1999/02/22-rdf-syntax-ns#type http://www.openrdf.org/config/repository#Repository
14:59:18.634 [main] DEBUG _:node1drm3t708x692 http://www.openrdf.org/config/repository#repositoryID "fedID"
14:59:18.635 [main] DEBUG _:node1drm3t708x692 http://www.w3.org/2000/01/rdf-schema#label "Test Federation Title"
14:59:18.635 [main] DEBUG _:node1drm3t708x692 http://www.openrdf.org/config/repository#repositoryImpl _:node1drm3t708x693
14:59:18.635 [main] DEBUG _:node1drm3t708x693 http://www.openrdf.org/config/repository#repositoryType "openrdf:SailRepository"
14:59:18.635 [main] DEBUG _:node1drm3t708x693 http://www.openrdf.org/config/repository/sail#sailImpl _:node1drm3t708x694
14:59:18.635 [main] DEBUG _:node1drm3t708x694 http://www.openrdf.org/config/sail#sailType "openrdf:Federation"
14:59:18.635 [main] DEBUG _:node1drm3t708x694 http://www.openrdf.org/config/sail/federation#readOnly "true"^^<http://www.w3.org/2001/XMLSchema#boolean>
14:59:18.635 [main] DEBUG _:node1drm3t708x694 http://www.openrdf.org/config/sail/federation#distinct "false"^^<http://www.w3.org/2001/XMLSchema#boolean>
14:59:18.635 [main] DEBUG Adding member: alien
14:59:18.635 [main] DEBUG _:node1drm3t708x694 http://www.openrdf.org/config/sail/federation#member _:node1drm3t708x695
14:59:18.635 [main] DEBUG _:node1drm3t708x695 http://www.openrdf.org/config/repository#repositoryType "openrdf:ProxyRepository"
14:59:18.635 [main] DEBUG _:node1drm3t708x695 http://www.openrdf.org/config/repository/proxy#proxiedID "alien"
14:59:18.635 [main] DEBUG Added member alien: 
14:59:18.636 [main] DEBUG Adding member: scary
14:59:18.636 [main] DEBUG _:node1drm3t708x694 http://www.openrdf.org/config/sail/federation#member _:node1drm3t708x698
14:59:18.636 [main] DEBUG _:node1drm3t708x698 http://www.openrdf.org/config/repository#repositoryType "openrdf:ProxyRepository"
14:59:18.636 [main] DEBUG _:node1drm3t708x698 http://www.openrdf.org/config/repository/proxy#proxiedID "scary"
14:59:18.636 [main] DEBUG Added member scary: 
14:59:18.648 [main] DEBUG Initializing MemoryStore...
14:59:18.649 [main] DEBUG Initializing data file...
14:59:18.649 [main] DEBUG Data file initialized
14:59:18.649 [main] DEBUG MemoryStore initialized
14:59:18.651 [main] DEBUG syncing data to file...
14:59:18.651 [main] DEBUG Data synced to file
14:59:18.653 [main] DEBUG Initializing MemoryStore...
14:59:18.654 [main] DEBUG Initializing data file...
14:59:18.654 [main] DEBUG Data file initialized
14:59:18.654 [main] DEBUG MemoryStore initialized
14:59:18.655 [main] DEBUG syncing data to file...
14:59:18.656 [main] DEBUG Data synced to file
[MockitoHint] FederateTest.testOneArgumentPrintsHelp (see javadoc for MockitoHint):
[MockitoHint] 1. Unused -> at org.eclipse.rdf4j.console.command.FederateTest.setUp(FederateTest.java:87)
[MockitoHint] 2. Unused -> at org.eclipse.rdf4j.console.command.FederateTest.setUp(FederateTest.java:88)

14:59:18.668 [main] DEBUG Initializing MemoryStore...
14:59:18.668 [main] DEBUG Initializing data file...
14:59:18.669 [main] DEBUG Data file initialized
14:59:18.669 [main] DEBUG MemoryStore initialized
14:59:18.670 [main] DEBUG syncing data to file...
14:59:18.671 [main] DEBUG Data synced to file
14:59:18.673 [main] DEBUG Initializing MemoryStore...
14:59:18.673 [main] DEBUG Initializing data file...
14:59:18.674 [main] DEBUG Data file initialized
14:59:18.674 [main] DEBUG MemoryStore initialized
14:59:18.675 [main] DEBUG syncing data to file...
14:59:18.675 [main] DEBUG Data synced to file
14:59:18.683 [main] DEBUG Federate called with federation ID = fedID, and member ID's = [http][http2].
  Distinct set to false, and readonly set to true.

14:59:18.685 [main] DEBUG Federation repository root node: _:node1drm3t708x784
14:59:18.685 [main] DEBUG _:node1drm3t708x784 http://www.w3.org/1999/02/22-rdf-syntax-ns#type http://www.openrdf.org/config/repository#Repository
14:59:18.685 [main] DEBUG _:node1drm3t708x784 http://www.openrdf.org/config/repository#repositoryID "fedID"
14:59:18.685 [main] DEBUG _:node1drm3t708x784 http://www.w3.org/2000/01/rdf-schema#label "Test Federation Title"
14:59:18.685 [main] DEBUG _:node1drm3t708x784 http://www.openrdf.org/config/repository#repositoryImpl _:node1drm3t708x785
14:59:18.685 [main] DEBUG _:node1drm3t708x785 http://www.openrdf.org/config/repository#repositoryType "openrdf:SailRepository"
14:59:18.685 [main] DEBUG _:node1drm3t708x785 http://www.openrdf.org/config/repository/sail#sailImpl _:node1drm3t708x786
14:59:18.685 [main] DEBUG _:node1drm3t708x786 http://www.openrdf.org/config/sail#sailType "openrdf:Federation"
14:59:18.685 [main] DEBUG _:node1drm3t708x786 http://www.openrdf.org/config/sail/federation#readOnly "true"^^<http://www.w3.org/2001/XMLSchema#boolean>
14:59:18.686 [main] DEBUG _:node1drm3t708x786 http://www.openrdf.org/config/sail/federation#distinct "false"^^<http://www.w3.org/2001/XMLSchema#boolean>
14:59:18.686 [main] DEBUG Adding member: http
14:59:18.686 [main] DEBUG _:node1drm3t708x786 http://www.openrdf.org/config/sail/federation#member _:node1drm3t708x787
14:59:18.686 [main] DEBUG _:node1drm3t708x787 http://www.openrdf.org/config/repository#repositoryType "openrdf:HTTPRepository"
14:59:18.687 [main] DEBUG _:node1drm3t708x787 http://www.openrdf.org/config/repository/http#repositoryURL http://localhost:8080/openrdf-sesame/repositories/http
14:59:18.687 [main] DEBUG Added member http: 
14:59:18.687 [main] DEBUG Adding member: http2
14:59:18.687 [main] DEBUG _:node1drm3t708x786 http://www.openrdf.org/config/sail/federation#member _:node1drm3t708x790
14:59:18.687 [main] DEBUG _:node1drm3t708x790 http://www.openrdf.org/config/repository#repositoryType "openrdf:HTTPRepository"
14:59:18.688 [main] DEBUG _:node1drm3t708x790 http://www.openrdf.org/config/repository/http#repositoryURL http://localhost:8080/openrdf-sesame/repositories/http
14:59:18.688 [main] DEBUG Added member http2: 
[INFO] Tests run: 15, Failures: 0, Errors: 0, Skipped: 0, Time elapsed: 0.406 s - in org.eclipse.rdf4j.console.command.FederateTest
[INFO] Running org.eclipse.rdf4j.console.command.SparqlTest
[MockitoHint] SparqlTest.testInputFile (see javadoc for MockitoHint):
[MockitoHint] 1. Unused -> at org.eclipse.rdf4j.console.command.SparqlTest.setUp(SparqlTest.java:49)

14:59:18.734 [main] ERROR No suitable result writer found
[MockitoHint] SparqlTest.testSelectError (see javadoc for MockitoHint):
[MockitoHint] 1. Unused -> at org.eclipse.rdf4j.console.command.SparqlTest.setUp(SparqlTest.java:49)

[MockitoHint] SparqlTest.testSelectMissingBindings (see javadoc for MockitoHint):
[MockitoHint] 1. Unused -> at org.eclipse.rdf4j.console.command.SparqlTest.setUp(SparqlTest.java:49)

[MockitoHint] SparqlTest.testInputFileWorkdir (see javadoc for MockitoHint):
[MockitoHint] 1. Unused -> at org.eclipse.rdf4j.console.command.SparqlTest.setUp(SparqlTest.java:49)

[INFO] Tests run: 9, Failures: 0, Errors: 0, Skipped: 0, Time elapsed: 0.119 s - in org.eclipse.rdf4j.console.command.SparqlTest
[INFO] Running org.eclipse.rdf4j.console.UtilTest
 one, two
 three
 four
 five, six
 seven
 eight
[INFO] Tests run: 4, Failures: 0, Errors: 0, Skipped: 0, Time elapsed: 0.002 s - in org.eclipse.rdf4j.console.UtilTest
[INFO] Running org.eclipse.rdf4j.console.ConsoleIOTest
[INFO] Tests run: 3, Failures: 0, Errors: 0, Skipped: 0, Time elapsed: 0.044 s - in org.eclipse.rdf4j.console.ConsoleIOTest
[INFO] 
[INFO] Results:
[INFO] 
[INFO] Tests run: 64, Failures: 0, Errors: 0, Skipped: 0
[INFO] 
[JENKINS] Recording test results
[INFO] 
[INFO] --- animal-sniffer-maven-plugin:1.16:check (default) @ rdf4j-console ---
[INFO] Checking unresolved references to org.codehaus.mojo.signature:java18:1.0
[INFO] 
[INFO] --- maven-jar-plugin:2.3.1:jar (default-jar) @ rdf4j-console ---
[INFO] Building jar: /home/hudson/genie.rdf4j/.jenkins/jobs/rdf4j-pr-verify/workspace/tools/console/target/rdf4j-console-3.1.0-SNAPSHOT.jar