SuccessConsole Output

Started calculate disk usage of build
Finished Calculation of disk usage of build in 0 seconds
Started calculate disk usage of workspace
Finished Calculation of disk usage of workspace in 0 seconds
[INFO] 
[INFO] ------------------< org.eclipse.rdf4j:rdf4j-console >-------------------
[INFO] Building RDF4J: Console 3.1.0-SNAPSHOT                           [18/31]
[INFO] --------------------------------[ jar ]---------------------------------
[INFO] 
[INFO] --- buildnumber-maven-plugin:1.4:create (default) @ rdf4j-console ---
[INFO] ShortRevision tag detected. The value is '7'.
[INFO] Executing: /bin/sh -c cd '/home/hudson/genie.rdf4j/.jenkins/jobs/rdf4j-pr-verify/workspace/tools/console' && 'git' 'rev-parse' '--verify' '--short=7' 'HEAD'
[INFO] Working directory: /home/hudson/genie.rdf4j/.jenkins/jobs/rdf4j-pr-verify/workspace/tools/console
[INFO] Storing buildNumber: 93811e6 at timestamp: 1575909768447
[WARNING] Cannot get the branch information from the git repository: 
Detecting the current branch failed: fatal: ref HEAD is not a symbolic ref

[INFO] ShortRevision tag detected. The value is '7'.
[INFO] Executing: /bin/sh -c cd '/home/hudson/genie.rdf4j/.jenkins/jobs/rdf4j-pr-verify/workspace/tools/console' && 'git' 'rev-parse' '--verify' '--short=7' 'HEAD'
[INFO] Working directory: /home/hudson/genie.rdf4j/.jenkins/jobs/rdf4j-pr-verify/workspace/tools/console
[INFO] Storing buildScmBranch: UNKNOWN
[INFO] 
[INFO] --- maven-enforcer-plugin:1.4.1:enforce (enforce-bytecode-version) @ rdf4j-console ---
[INFO] Adding ignore: META-INF/**/module-info
[INFO] 
[INFO] --- formatter-maven-plugin:2.8.1:validate (default) @ rdf4j-console ---
[INFO] Using 'UTF-8' encoding to format source files.
[INFO] Number of files to be formatted: 61
[INFO] Html formatting is skipped
[INFO] Successfully formatted:          0 file(s)
[INFO] Fail to format:                  0 file(s)
[INFO] Skipped:                         61 file(s)
[INFO] Read only skipped:               0 file(s)
[INFO] Approximate time taken:          0s
[INFO] 
[INFO] --- maven-resources-plugin:3.0.2:resources (default-resources) @ rdf4j-console ---
[INFO] Using 'UTF-8' encoding to copy filtered resources.
[INFO] skip non existing resourceDirectory /home/hudson/genie.rdf4j/.jenkins/jobs/rdf4j-pr-verify/workspace/tools/console/src/main/resources
[INFO] 
[INFO] --- maven-compiler-plugin:3.7.0:compile (default-compile) @ rdf4j-console ---
[INFO] Changes detected - recompiling the module!
[INFO] Compiling 42 source files to /home/hudson/genie.rdf4j/.jenkins/jobs/rdf4j-pr-verify/workspace/tools/console/target/classes
[INFO] 
[INFO] --- maven-resources-plugin:3.0.2:testResources (default-testResources) @ rdf4j-console ---
[INFO] Using 'UTF-8' encoding to copy filtered resources.
[INFO] Copying 29 resources
[INFO] 
[INFO] --- maven-compiler-plugin:3.7.0:testCompile (default-testCompile) @ rdf4j-console ---
[INFO] Changes detected - recompiling the module!
[INFO] Compiling 18 source files to /home/hudson/genie.rdf4j/.jenkins/jobs/rdf4j-pr-verify/workspace/tools/console/target/test-classes
[INFO] 
[INFO] --- maven-surefire-plugin:2.22.2:test (default-test) @ rdf4j-console ---
[INFO] 
[INFO] -------------------------------------------------------
[INFO]  T E S T S
[INFO] -------------------------------------------------------
[INFO] Running org.eclipse.rdf4j.console.setting.PrefixesTest
[INFO] Tests run: 3, Failures: 0, Errors: 0, Skipped: 0, Time elapsed: 0.712 s - in org.eclipse.rdf4j.console.setting.PrefixesTest
[INFO] Running org.eclipse.rdf4j.console.setting.LogLevelTest
11:42:54.022 [main] ERROR unknown logging level: chatty
[INFO] Tests run: 4, Failures: 0, Errors: 0, Skipped: 0, Time elapsed: 0.018 s - in org.eclipse.rdf4j.console.setting.LogLevelTest
[INFO] Running org.eclipse.rdf4j.console.setting.QueryPrefixTest
[INFO] Tests run: 1, Failures: 0, Errors: 0, Skipped: 0, Time elapsed: 0 s - in org.eclipse.rdf4j.console.setting.QueryPrefixTest
[INFO] Running org.eclipse.rdf4j.console.setting.ShowPrefixTest
[INFO] Tests run: 1, Failures: 0, Errors: 0, Skipped: 0, Time elapsed: 0 s - in org.eclipse.rdf4j.console.setting.ShowPrefixTest
[INFO] Running org.eclipse.rdf4j.console.setting.ConsoleWidthTest
[INFO] Tests run: 1, Failures: 0, Errors: 0, Skipped: 0, Time elapsed: 0 s - in org.eclipse.rdf4j.console.setting.ConsoleWidthTest
[INFO] Running org.eclipse.rdf4j.console.command.SetParametersTest
11:42:54.074 [main] ERROR Unknown parameter: unknown
[INFO] Tests run: 1, Failures: 0, Errors: 0, Skipped: 0, Time elapsed: 0.031 s - in org.eclipse.rdf4j.console.command.SetParametersTest
[INFO] Running org.eclipse.rdf4j.console.command.LoadTest
[MockitoHint] LoadTest.testLoad (see javadoc for MockitoHint):
[MockitoHint] 1. Unused -> at org.eclipse.rdf4j.console.command.LoadTest.setUp(LoadTest.java:49)

[MockitoHint] LoadTest.testLoadWorkDir (see javadoc for MockitoHint):
[MockitoHint] 1. Unused -> at org.eclipse.rdf4j.console.command.LoadTest.setUp(LoadTest.java:49)

[INFO] Tests run: 2, Failures: 0, Errors: 0, Skipped: 0, Time elapsed: 0.249 s - in org.eclipse.rdf4j.console.command.LoadTest
[INFO] Running org.eclipse.rdf4j.console.command.ConvertTest
11:42:54.600 [main] ERROR No RDF writer for /tmp/genie.rdf4j/junit5212230841159112536/alien.qyx
[MockitoHint] ConvertTest.testConvertInvalidFormat (see javadoc for MockitoHint):
[MockitoHint] 1. Unused -> at org.eclipse.rdf4j.console.command.ConvertTest.setup(ConvertTest.java:39)

11:42:54.606 [main] ERROR Failed to convert data
org.eclipse.rdf4j.rio.RDFParseException: Expected '<' or '_', found: e [line 1, column 101]
	at org.eclipse.rdf4j.rio.ntriples.NTriplesParser.parseSubject(NTriplesParser.java:313)
	at org.eclipse.rdf4j.rio.ntriples.NTriplesParser.parseTriple(NTriplesParser.java:252)
	at org.eclipse.rdf4j.rio.ntriples.NTriplesParser.parse(NTriplesParser.java:160)
	at org.eclipse.rdf4j.rio.ntriples.NTriplesParser.parse(NTriplesParser.java:109)
	at org.eclipse.rdf4j.console.command.Convert.convert(Convert.java:139)
	at org.eclipse.rdf4j.console.command.Convert.execute(Convert.java:74)
	at org.eclipse.rdf4j.console.command.ConvertTest.testConvertParseError(ConvertTest.java:92)
	at sun.reflect.NativeMethodAccessorImpl.invoke0(Native Method)
	at sun.reflect.NativeMethodAccessorImpl.invoke(NativeMethodAccessorImpl.java:62)
	at sun.reflect.DelegatingMethodAccessorImpl.invoke(DelegatingMethodAccessorImpl.java:43)
	at java.lang.reflect.Method.invoke(Method.java:498)
	at org.junit.runners.model.FrameworkMethod$1.runReflectiveCall(FrameworkMethod.java:50)
	at org.junit.internal.runners.model.ReflectiveCallable.run(ReflectiveCallable.java:12)
	at org.junit.runners.model.FrameworkMethod.invokeExplosively(FrameworkMethod.java:47)
	at org.junit.internal.runners.statements.InvokeMethod.evaluate(InvokeMethod.java:17)
	at org.junit.internal.runners.statements.RunBefores.evaluate(RunBefores.java:26)
	at org.junit.internal.runners.statements.RunAfters.evaluate(RunAfters.java:27)
	at org.mockito.internal.junit.JUnitRule$1.evaluateSafely(JUnitRule.java:52)
	at org.mockito.internal.junit.JUnitRule$1.evaluate(JUnitRule.java:43)
	at org.junit.rules.ExternalResource$1.evaluate(ExternalResource.java:48)
	at org.junit.rules.RunRules.evaluate(RunRules.java:20)
	at org.junit.runners.ParentRunner.runLeaf(ParentRunner.java:325)
	at org.junit.runners.BlockJUnit4ClassRunner.runChild(BlockJUnit4ClassRunner.java:78)
	at org.junit.runners.BlockJUnit4ClassRunner.runChild(BlockJUnit4ClassRunner.java:57)
	at org.junit.runners.ParentRunner$3.run(ParentRunner.java:290)
	at org.junit.runners.ParentRunner$1.schedule(ParentRunner.java:71)
	at org.junit.runners.ParentRunner.runChildren(ParentRunner.java:288)
	at org.junit.runners.ParentRunner.access$000(ParentRunner.java:58)
	at org.junit.runners.ParentRunner$2.evaluate(ParentRunner.java:268)
	at org.junit.runners.ParentRunner.run(ParentRunner.java:363)
	at org.apache.maven.surefire.junit4.JUnit4Provider.execute(JUnit4Provider.java:365)
	at org.apache.maven.surefire.junit4.JUnit4Provider.executeWithRerun(JUnit4Provider.java:273)
	at org.apache.maven.surefire.junit4.JUnit4Provider.executeTestSet(JUnit4Provider.java:238)
	at org.apache.maven.surefire.junit4.JUnit4Provider.invoke(JUnit4Provider.java:159)
	at org.apache.maven.surefire.booter.ForkedBooter.invokeProviderInSameClassLoader(ForkedBooter.java:384)
	at org.apache.maven.surefire.booter.ForkedBooter.runSuitesInProcess(ForkedBooter.java:345)
	at org.apache.maven.surefire.booter.ForkedBooter.execute(ForkedBooter.java:126)
	at org.apache.maven.surefire.booter.ForkedBooter.main(ForkedBooter.java:418)
[INFO] Tests run: 4, Failures: 0, Errors: 0, Skipped: 0, Time elapsed: 0.267 s - in org.eclipse.rdf4j.console.command.ConvertTest
[INFO] Running org.eclipse.rdf4j.console.command.ExportTest
[MockitoHint] ExportTest.testExportWorkDir (see javadoc for MockitoHint):
[MockitoHint] 1. Unused -> at org.eclipse.rdf4j.console.command.ExportTest.setUp(ExportTest.java:46)

[MockitoHint] ExportTest.testExportAll (see javadoc for MockitoHint):
[MockitoHint] 1. Unused -> at org.eclipse.rdf4j.console.command.ExportTest.setUp(ExportTest.java:46)

[MockitoHint] ExportTest.testExportContexts (see javadoc for MockitoHint):
[MockitoHint] 1. Unused -> at org.eclipse.rdf4j.console.command.ExportTest.setUp(ExportTest.java:46)

[INFO] Tests run: 3, Failures: 0, Errors: 0, Skipped: 0, Time elapsed: 0.048 s - in org.eclipse.rdf4j.console.command.ExportTest
[INFO] Running org.eclipse.rdf4j.console.command.VerifyTest
11:42:55.041 [main] ERROR Unexpected RDFParseException
org.eclipse.rdf4j.rio.RDFParseException: 'missing type' was not recognised, and could not be verified, with datatype http://example.rdf4j.org/type/wrong [line 1]
	at org.eclipse.rdf4j.rio.helpers.RDFParserHelper.reportError(RDFParserHelper.java:265)
	at org.eclipse.rdf4j.rio.helpers.RDFParserHelper.createLiteral(RDFParserHelper.java:180)
	at org.eclipse.rdf4j.rio.helpers.AbstractRDFParser.createLiteral(AbstractRDFParser.java:530)
	at org.eclipse.rdf4j.rio.turtle.TurtleParser.parseQuotedLiteral(TurtleParser.java:665)
	at org.eclipse.rdf4j.rio.turtle.TurtleParser.parseValue(TurtleParser.java:584)
	at org.eclipse.rdf4j.rio.turtle.TurtleParser.parseObject(TurtleParser.java:461)
	at org.eclipse.rdf4j.rio.turtle.TurtleParser.parseObjectList(TurtleParser.java:389)
	at org.eclipse.rdf4j.rio.turtle.TurtleParser.parsePredicateObjectList(TurtleParser.java:362)
	at org.eclipse.rdf4j.rio.turtle.TurtleParser.parseTriples(TurtleParser.java:349)
	at org.eclipse.rdf4j.rio.turtle.TurtleParser.parseStatement(TurtleParser.java:216)
	at org.eclipse.rdf4j.rio.turtle.TurtleParser.parse(TurtleParser.java:178)
	at org.eclipse.rdf4j.rio.turtle.TurtleParser.parse(TurtleParser.java:130)
	at org.eclipse.rdf4j.console.command.Verify.verify(Verify.java:145)
	at org.eclipse.rdf4j.console.command.Verify.execute(Verify.java:97)
	at org.eclipse.rdf4j.console.command.VerifyTest.testVerifyMissingType(VerifyTest.java:97)
	at sun.reflect.NativeMethodAccessorImpl.invoke0(Native Method)
	at sun.reflect.NativeMethodAccessorImpl.invoke(NativeMethodAccessorImpl.java:62)
	at sun.reflect.DelegatingMethodAccessorImpl.invoke(DelegatingMethodAccessorImpl.java:43)
	at java.lang.reflect.Method.invoke(Method.java:498)
	at org.junit.runners.model.FrameworkMethod$1.runReflectiveCall(FrameworkMethod.java:50)
	at org.junit.internal.runners.model.ReflectiveCallable.run(ReflectiveCallable.java:12)
	at org.junit.runners.model.FrameworkMethod.invokeExplosively(FrameworkMethod.java:47)
	at org.junit.internal.runners.statements.InvokeMethod.evaluate(InvokeMethod.java:17)
	at org.junit.internal.runners.statements.RunBefores.evaluate(RunBefores.java:26)
	at org.junit.internal.runners.statements.RunAfters.evaluate(RunAfters.java:27)
	at org.mockito.internal.junit.JUnitRule$1.evaluateSafely(JUnitRule.java:52)
	at org.mockito.internal.junit.JUnitRule$1.evaluate(JUnitRule.java:43)
	at org.junit.rules.ExternalResource$1.evaluate(ExternalResource.java:48)
	at org.junit.rules.RunRules.evaluate(RunRules.java:20)
	at org.junit.runners.ParentRunner.runLeaf(ParentRunner.java:325)
	at org.junit.runners.BlockJUnit4ClassRunner.runChild(BlockJUnit4ClassRunner.java:78)
	at org.junit.runners.BlockJUnit4ClassRunner.runChild(BlockJUnit4ClassRunner.java:57)
	at org.junit.runners.ParentRunner$3.run(ParentRunner.java:290)
	at org.junit.runners.ParentRunner$1.schedule(ParentRunner.java:71)
	at org.junit.runners.ParentRunner.runChildren(ParentRunner.java:288)
	at org.junit.runners.ParentRunner.access$000(ParentRunner.java:58)
	at org.junit.runners.ParentRunner$2.evaluate(ParentRunner.java:268)
	at org.junit.runners.ParentRunner.run(ParentRunner.java:363)
	at org.apache.maven.surefire.junit4.JUnit4Provider.execute(JUnit4Provider.java:365)
	at org.apache.maven.surefire.junit4.JUnit4Provider.executeWithRerun(JUnit4Provider.java:273)
	at org.apache.maven.surefire.junit4.JUnit4Provider.executeTestSet(JUnit4Provider.java:238)
	at org.apache.maven.surefire.junit4.JUnit4Provider.invoke(JUnit4Provider.java:159)
	at org.apache.maven.surefire.booter.ForkedBooter.invokeProviderInSameClassLoader(ForkedBooter.java:384)
	at org.apache.maven.surefire.booter.ForkedBooter.runSuitesInProcess(ForkedBooter.java:345)
	at org.apache.maven.surefire.booter.ForkedBooter.execute(ForkedBooter.java:126)
	at org.apache.maven.surefire.booter.ForkedBooter.main(ForkedBooter.java:418)
11:42:55.090 [main] ERROR SHACL validation failed, writing report to /tmp/genie.rdf4j/junit6204957978198904457/junit4036632178894759443.tmp
11:42:55.109 [main] ERROR Unexpected RDFParseException
org.eclipse.rdf4j.rio.RDFParseException: Unexpected end of file
	at org.eclipse.rdf4j.rio.turtle.TurtleParser.throwEOFException(TurtleParser.java:1317)
	at org.eclipse.rdf4j.rio.turtle.TurtleParser.parseValue(TurtleParser.java:589)
	at org.eclipse.rdf4j.rio.turtle.TurtleParser.parsePredicate(TurtleParser.java:434)
	at org.eclipse.rdf4j.rio.turtle.TurtleParser.parsePredicateObjectList(TurtleParser.java:358)
	at org.eclipse.rdf4j.rio.turtle.TurtleParser.parseTriples(TurtleParser.java:349)
	at org.eclipse.rdf4j.rio.turtle.TurtleParser.parseStatement(TurtleParser.java:216)
	at org.eclipse.rdf4j.rio.turtle.TurtleParser.parse(TurtleParser.java:178)
	at org.eclipse.rdf4j.rio.turtle.TurtleParser.parse(TurtleParser.java:130)
	at org.eclipse.rdf4j.console.command.Verify.verify(Verify.java:145)
	at org.eclipse.rdf4j.console.command.Verify.execute(Verify.java:97)
	at org.eclipse.rdf4j.console.command.VerifyTest.testVerifyBrokenFile(VerifyTest.java:91)
	at sun.reflect.NativeMethodAccessorImpl.invoke0(Native Method)
	at sun.reflect.NativeMethodAccessorImpl.invoke(NativeMethodAccessorImpl.java:62)
	at sun.reflect.DelegatingMethodAccessorImpl.invoke(DelegatingMethodAccessorImpl.java:43)
	at java.lang.reflect.Method.invoke(Method.java:498)
	at org.junit.runners.model.FrameworkMethod$1.runReflectiveCall(FrameworkMethod.java:50)
	at org.junit.internal.runners.model.ReflectiveCallable.run(ReflectiveCallable.java:12)
	at org.junit.runners.model.FrameworkMethod.invokeExplosively(FrameworkMethod.java:47)
	at org.junit.internal.runners.statements.InvokeMethod.evaluate(InvokeMethod.java:17)
	at org.junit.internal.runners.statements.RunBefores.evaluate(RunBefores.java:26)
	at org.junit.internal.runners.statements.RunAfters.evaluate(RunAfters.java:27)
	at org.mockito.internal.junit.JUnitRule$1.evaluateSafely(JUnitRule.java:52)
	at org.mockito.internal.junit.JUnitRule$1.evaluate(JUnitRule.java:43)
	at org.junit.rules.ExternalResource$1.evaluate(ExternalResource.java:48)
	at org.junit.rules.RunRules.evaluate(RunRules.java:20)
	at org.junit.runners.ParentRunner.runLeaf(ParentRunner.java:325)
	at org.junit.runners.BlockJUnit4ClassRunner.runChild(BlockJUnit4ClassRunner.java:78)
	at org.junit.runners.BlockJUnit4ClassRunner.runChild(BlockJUnit4ClassRunner.java:57)
	at org.junit.runners.ParentRunner$3.run(ParentRunner.java:290)
	at org.junit.runners.ParentRunner$1.schedule(ParentRunner.java:71)
	at org.junit.runners.ParentRunner.runChildren(ParentRunner.java:288)
	at org.junit.runners.ParentRunner.access$000(ParentRunner.java:58)
	at org.junit.runners.ParentRunner$2.evaluate(ParentRunner.java:268)
	at org.junit.runners.ParentRunner.run(ParentRunner.java:363)
	at org.apache.maven.surefire.junit4.JUnit4Provider.execute(JUnit4Provider.java:365)
	at org.apache.maven.surefire.junit4.JUnit4Provider.executeWithRerun(JUnit4Provider.java:273)
	at org.apache.maven.surefire.junit4.JUnit4Provider.executeTestSet(JUnit4Provider.java:238)
	at org.apache.maven.surefire.junit4.JUnit4Provider.invoke(JUnit4Provider.java:159)
	at org.apache.maven.surefire.booter.ForkedBooter.invokeProviderInSameClassLoader(ForkedBooter.java:384)
	at org.apache.maven.surefire.booter.ForkedBooter.runSuitesInProcess(ForkedBooter.java:345)
	at org.apache.maven.surefire.booter.ForkedBooter.execute(ForkedBooter.java:126)
	at org.apache.maven.surefire.booter.ForkedBooter.main(ForkedBooter.java:418)
11:42:55.127 [main] ERROR Unexpected RDFParseException
org.eclipse.rdf4j.rio.RDFParseException: Expected a letter, found '1' [line 1]
	at org.eclipse.rdf4j.rio.helpers.RDFParserHelper.reportError(RDFParserHelper.java:265)
	at org.eclipse.rdf4j.rio.helpers.AbstractRDFParser.reportError(AbstractRDFParser.java:628)
	at org.eclipse.rdf4j.rio.turtle.TurtleParser.reportError(TurtleParser.java:1297)
	at org.eclipse.rdf4j.rio.turtle.TurtleParser.parseQuotedLiteral(TurtleParser.java:619)
	at org.eclipse.rdf4j.rio.turtle.TurtleParser.parseValue(TurtleParser.java:584)
	at org.eclipse.rdf4j.rio.turtle.TurtleParser.parseObject(TurtleParser.java:461)
	at org.eclipse.rdf4j.rio.turtle.TurtleParser.parseObjectList(TurtleParser.java:389)
	at org.eclipse.rdf4j.rio.turtle.TurtleParser.parsePredicateObjectList(TurtleParser.java:362)
	at org.eclipse.rdf4j.rio.turtle.TurtleParser.parseTriples(TurtleParser.java:349)
	at org.eclipse.rdf4j.rio.turtle.TurtleParser.parseStatement(TurtleParser.java:216)
	at org.eclipse.rdf4j.rio.turtle.TurtleParser.parse(TurtleParser.java:178)
	at org.eclipse.rdf4j.rio.turtle.TurtleParser.parse(TurtleParser.java:130)
	at org.eclipse.rdf4j.console.command.Verify.verify(Verify.java:145)
	at org.eclipse.rdf4j.console.command.Verify.execute(Verify.java:97)
	at org.eclipse.rdf4j.console.command.VerifyTest.testVerifyWrongLang(VerifyTest.java:109)
	at sun.reflect.NativeMethodAccessorImpl.invoke0(Native Method)
	at sun.reflect.NativeMethodAccessorImpl.invoke(NativeMethodAccessorImpl.java:62)
	at sun.reflect.DelegatingMethodAccessorImpl.invoke(DelegatingMethodAccessorImpl.java:43)
	at java.lang.reflect.Method.invoke(Method.java:498)
	at org.junit.runners.model.FrameworkMethod$1.runReflectiveCall(FrameworkMethod.java:50)
	at org.junit.internal.runners.model.ReflectiveCallable.run(ReflectiveCallable.java:12)
	at org.junit.runners.model.FrameworkMethod.invokeExplosively(FrameworkMethod.java:47)
	at org.junit.internal.runners.statements.InvokeMethod.evaluate(InvokeMethod.java:17)
	at org.junit.internal.runners.statements.RunBefores.evaluate(RunBefores.java:26)
	at org.junit.internal.runners.statements.RunAfters.evaluate(RunAfters.java:27)
	at org.mockito.internal.junit.JUnitRule$1.evaluateSafely(JUnitRule.java:52)
	at org.mockito.internal.junit.JUnitRule$1.evaluate(JUnitRule.java:43)
	at org.junit.rules.ExternalResource$1.evaluate(ExternalResource.java:48)
	at org.junit.rules.RunRules.evaluate(RunRules.java:20)
	at org.junit.runners.ParentRunner.runLeaf(ParentRunner.java:325)
	at org.junit.runners.BlockJUnit4ClassRunner.runChild(BlockJUnit4ClassRunner.java:78)
	at org.junit.runners.BlockJUnit4ClassRunner.runChild(BlockJUnit4ClassRunner.java:57)
	at org.junit.runners.ParentRunner$3.run(ParentRunner.java:290)
	at org.junit.runners.ParentRunner$1.schedule(ParentRunner.java:71)
	at org.junit.runners.ParentRunner.runChildren(ParentRunner.java:288)
	at org.junit.runners.ParentRunner.access$000(ParentRunner.java:58)
	at org.junit.runners.ParentRunner$2.evaluate(ParentRunner.java:268)
	at org.junit.runners.ParentRunner.run(ParentRunner.java:363)
	at org.apache.maven.surefire.junit4.JUnit4Provider.execute(JUnit4Provider.java:365)
	at org.apache.maven.surefire.junit4.JUnit4Provider.executeWithRerun(JUnit4Provider.java:273)
	at org.apache.maven.surefire.junit4.JUnit4Provider.executeTestSet(JUnit4Provider.java:238)
	at org.apache.maven.surefire.junit4.JUnit4Provider.invoke(JUnit4Provider.java:159)
	at org.apache.maven.surefire.booter.ForkedBooter.invokeProviderInSameClassLoader(ForkedBooter.java:384)
	at org.apache.maven.surefire.booter.ForkedBooter.runSuitesInProcess(ForkedBooter.java:345)
	at org.apache.maven.surefire.booter.ForkedBooter.execute(ForkedBooter.java:126)
	at org.apache.maven.surefire.booter.ForkedBooter.main(ForkedBooter.java:418)
11:42:55.138 [main] ERROR No parser available for this RDF format
org.eclipse.rdf4j.rio.UnsupportedRDFormatException: Did not recognise RDF format string file:/home/hudson/genie.rdf4j/.jenkins/jobs/rdf4j-pr-verify/workspace/tools/console/does-not-exist.docx
	at org.eclipse.rdf4j.rio.Rio.lambda$unsupportedFormat$1(Rio.java:577)
	at java.util.Optional.orElseThrow(Optional.java:290)
	at org.eclipse.rdf4j.console.command.Verify.verify(Verify.java:124)
	at org.eclipse.rdf4j.console.command.Verify.execute(Verify.java:97)
	at org.eclipse.rdf4j.console.command.VerifyTest.testVerifyWrongFormat(VerifyTest.java:69)
	at sun.reflect.NativeMethodAccessorImpl.invoke0(Native Method)
	at sun.reflect.NativeMethodAccessorImpl.invoke(NativeMethodAccessorImpl.java:62)
	at sun.reflect.DelegatingMethodAccessorImpl.invoke(DelegatingMethodAccessorImpl.java:43)
	at java.lang.reflect.Method.invoke(Method.java:498)
	at org.junit.runners.model.FrameworkMethod$1.runReflectiveCall(FrameworkMethod.java:50)
	at org.junit.internal.runners.model.ReflectiveCallable.run(ReflectiveCallable.java:12)
	at org.junit.runners.model.FrameworkMethod.invokeExplosively(FrameworkMethod.java:47)
	at org.junit.internal.runners.statements.InvokeMethod.evaluate(InvokeMethod.java:17)
	at org.junit.internal.runners.statements.RunBefores.evaluate(RunBefores.java:26)
	at org.junit.internal.runners.statements.RunAfters.evaluate(RunAfters.java:27)
	at org.mockito.internal.junit.JUnitRule$1.evaluateSafely(JUnitRule.java:52)
	at org.mockito.internal.junit.JUnitRule$1.evaluate(JUnitRule.java:43)
	at org.junit.rules.ExternalResource$1.evaluate(ExternalResource.java:48)
	at org.junit.rules.RunRules.evaluate(RunRules.java:20)
	at org.junit.runners.ParentRunner.runLeaf(ParentRunner.java:325)
	at org.junit.runners.BlockJUnit4ClassRunner.runChild(BlockJUnit4ClassRunner.java:78)
	at org.junit.runners.BlockJUnit4ClassRunner.runChild(BlockJUnit4ClassRunner.java:57)
	at org.junit.runners.ParentRunner$3.run(ParentRunner.java:290)
	at org.junit.runners.ParentRunner$1.schedule(ParentRunner.java:71)
	at org.junit.runners.ParentRunner.runChildren(ParentRunner.java:288)
	at org.junit.runners.ParentRunner.access$000(ParentRunner.java:58)
	at org.junit.runners.ParentRunner$2.evaluate(ParentRunner.java:268)
	at org.junit.runners.ParentRunner.run(ParentRunner.java:363)
	at org.apache.maven.surefire.junit4.JUnit4Provider.execute(JUnit4Provider.java:365)
	at org.apache.maven.surefire.junit4.JUnit4Provider.executeWithRerun(JUnit4Provider.java:273)
	at org.apache.maven.surefire.junit4.JUnit4Provider.executeTestSet(JUnit4Provider.java:238)
	at org.apache.maven.surefire.junit4.JUnit4Provider.invoke(JUnit4Provider.java:159)
	at org.apache.maven.surefire.booter.ForkedBooter.invokeProviderInSameClassLoader(ForkedBooter.java:384)
	at org.apache.maven.surefire.booter.ForkedBooter.runSuitesInProcess(ForkedBooter.java:345)
	at org.apache.maven.surefire.booter.ForkedBooter.execute(ForkedBooter.java:126)
	at org.apache.maven.surefire.booter.ForkedBooter.main(ForkedBooter.java:418)
11:42:55.149 [main] ERROR Unexpected RDFParseException
org.eclipse.rdf4j.rio.RDFParseException: IRI included an unencoded space: '32' [line 1]
	at org.eclipse.rdf4j.rio.helpers.RDFParserHelper.reportError(RDFParserHelper.java:265)
	at org.eclipse.rdf4j.rio.helpers.AbstractRDFParser.reportError(AbstractRDFParser.java:628)
	at org.eclipse.rdf4j.rio.turtle.TurtleParser.reportError(TurtleParser.java:1297)
	at org.eclipse.rdf4j.rio.turtle.TurtleParser.parseURI(TurtleParser.java:902)
	at org.eclipse.rdf4j.rio.turtle.TurtleParser.parseValue(TurtleParser.java:575)
	at org.eclipse.rdf4j.rio.turtle.TurtleParser.parseSubject(TurtleParser.java:406)
	at org.eclipse.rdf4j.rio.turtle.TurtleParser.parseTriples(TurtleParser.java:347)
	at org.eclipse.rdf4j.rio.turtle.TurtleParser.parseStatement(TurtleParser.java:216)
	at org.eclipse.rdf4j.rio.turtle.TurtleParser.parse(TurtleParser.java:178)
	at org.eclipse.rdf4j.rio.turtle.TurtleParser.parse(TurtleParser.java:130)
	at org.eclipse.rdf4j.console.command.Verify.verify(Verify.java:145)
	at org.eclipse.rdf4j.console.command.Verify.execute(Verify.java:97)
	at org.eclipse.rdf4j.console.command.VerifyTest.testVerifySpaceIRI(VerifyTest.java:103)
	at sun.reflect.NativeMethodAccessorImpl.invoke0(Native Method)
	at sun.reflect.NativeMethodAccessorImpl.invoke(NativeMethodAccessorImpl.java:62)
	at sun.reflect.DelegatingMethodAccessorImpl.invoke(DelegatingMethodAccessorImpl.java:43)
	at java.lang.reflect.Method.invoke(Method.java:498)
	at org.junit.runners.model.FrameworkMethod$1.runReflectiveCall(FrameworkMethod.java:50)
	at org.junit.internal.runners.model.ReflectiveCallable.run(ReflectiveCallable.java:12)
	at org.junit.runners.model.FrameworkMethod.invokeExplosively(FrameworkMethod.java:47)
	at org.junit.internal.runners.statements.InvokeMethod.evaluate(InvokeMethod.java:17)
	at org.junit.internal.runners.statements.RunBefores.evaluate(RunBefores.java:26)
	at org.junit.internal.runners.statements.RunAfters.evaluate(RunAfters.java:27)
	at org.mockito.internal.junit.JUnitRule$1.evaluateSafely(JUnitRule.java:52)
	at org.mockito.internal.junit.JUnitRule$1.evaluate(JUnitRule.java:43)
	at org.junit.rules.ExternalResource$1.evaluate(ExternalResource.java:48)
	at org.junit.rules.RunRules.evaluate(RunRules.java:20)
	at org.junit.runners.ParentRunner.runLeaf(ParentRunner.java:325)
	at org.junit.runners.BlockJUnit4ClassRunner.runChild(BlockJUnit4ClassRunner.java:78)
	at org.junit.runners.BlockJUnit4ClassRunner.runChild(BlockJUnit4ClassRunner.java:57)
	at org.junit.runners.ParentRunner$3.run(ParentRunner.java:290)
	at org.junit.runners.ParentRunner$1.schedule(ParentRunner.java:71)
	at org.junit.runners.ParentRunner.runChildren(ParentRunner.java:288)
	at org.junit.runners.ParentRunner.access$000(ParentRunner.java:58)
	at org.junit.runners.ParentRunner$2.evaluate(ParentRunner.java:268)
	at org.junit.runners.ParentRunner.run(ParentRunner.java:363)
	at org.apache.maven.surefire.junit4.JUnit4Provider.execute(JUnit4Provider.java:365)
	at org.apache.maven.surefire.junit4.JUnit4Provider.executeWithRerun(JUnit4Provider.java:273)
	at org.apache.maven.surefire.junit4.JUnit4Provider.executeTestSet(JUnit4Provider.java:238)
	at org.apache.maven.surefire.junit4.JUnit4Provider.invoke(JUnit4Provider.java:159)
	at org.apache.maven.surefire.booter.ForkedBooter.invokeProviderInSameClassLoader(ForkedBooter.java:384)
	at org.apache.maven.surefire.booter.ForkedBooter.runSuitesInProcess(ForkedBooter.java:345)
	at org.apache.maven.surefire.booter.ForkedBooter.execute(ForkedBooter.java:126)
	at org.apache.maven.surefire.booter.ForkedBooter.main(ForkedBooter.java:418)
[INFO] Tests run: 10, Failures: 0, Errors: 0, Skipped: 0, Time elapsed: 0.518 s - in org.eclipse.rdf4j.console.command.VerifyTest
[INFO] Running org.eclipse.rdf4j.console.command.DropTest
[MockitoHint] DropTest.testUserAbortedUnsafeDropBeforeWarning (see javadoc for MockitoHint):
[MockitoHint] 1. Unused -> at org.eclipse.rdf4j.console.command.DropTest.setUp(DropTest.java:50)

[INFO] Tests run: 3, Failures: 0, Errors: 0, Skipped: 0, Time elapsed: 0.12 s - in org.eclipse.rdf4j.console.command.DropTest
[INFO] Running org.eclipse.rdf4j.console.command.FederateTest
11:42:55.345 [main] DEBUG Initializing MemoryStore...
11:42:55.346 [main] DEBUG Initializing data file...
11:42:55.346 [main] DEBUG Data file initialized
11:42:55.346 [main] DEBUG MemoryStore initialized
11:42:55.349 [main] DEBUG syncing data to file...
11:42:55.350 [main] DEBUG Data synced to file
11:42:55.355 [main] DEBUG Initializing MemoryStore...
11:42:55.356 [main] DEBUG Initializing data file...
11:42:55.356 [main] DEBUG Data file initialized
11:42:55.356 [main] DEBUG MemoryStore initialized
11:42:55.359 [main] DEBUG syncing data to file...
11:42:55.360 [main] DEBUG Data synced to file
11:42:55.382 [main] DEBUG Federate called with federation ID = fedID, and member ID's = [sparql][alien][http].
  Distinct set to false, and readonly set to true.

11:42:55.385 [main] DEBUG Federation repository root node: _:node1drlolk0tx216
11:42:55.386 [main] DEBUG _:node1drlolk0tx216 http://www.w3.org/1999/02/22-rdf-syntax-ns#type http://www.openrdf.org/config/repository#Repository
11:42:55.387 [main] DEBUG _:node1drlolk0tx216 http://www.openrdf.org/config/repository#repositoryID "fedID"
11:42:55.387 [main] DEBUG _:node1drlolk0tx216 http://www.w3.org/2000/01/rdf-schema#label "Test Federation Title"
11:42:55.387 [main] DEBUG _:node1drlolk0tx216 http://www.openrdf.org/config/repository#repositoryImpl _:node1drlolk0tx217
11:42:55.387 [main] DEBUG _:node1drlolk0tx217 http://www.openrdf.org/config/repository#repositoryType "openrdf:SailRepository"
11:42:55.387 [main] DEBUG _:node1drlolk0tx217 http://www.openrdf.org/config/repository/sail#sailImpl _:node1drlolk0tx218
11:42:55.387 [main] DEBUG _:node1drlolk0tx218 http://www.openrdf.org/config/sail#sailType "openrdf:Federation"
11:42:55.387 [main] DEBUG _:node1drlolk0tx218 http://www.openrdf.org/config/sail/federation#readOnly "true"^^<http://www.w3.org/2001/XMLSchema#boolean>
11:42:55.388 [main] DEBUG _:node1drlolk0tx218 http://www.openrdf.org/config/sail/federation#distinct "false"^^<http://www.w3.org/2001/XMLSchema#boolean>
11:42:55.388 [main] DEBUG Adding member: sparql
11:42:55.388 [main] DEBUG _:node1drlolk0tx218 http://www.openrdf.org/config/sail/federation#member _:node1drlolk0tx219
11:42:55.388 [main] DEBUG _:node1drlolk0tx219 http://www.openrdf.org/config/repository#repositoryType "openrdf:SPARQLRepository"
11:42:55.389 [main] DEBUG _:node1drlolk0tx219 http://www.openrdf.org/config/repository/sparql#query-endpoint http://localhost:8080/openrdf-sesame/repositories/sparql
11:42:55.389 [main] DEBUG Added member sparql: 
11:42:55.389 [main] DEBUG Adding member: alien
11:42:55.389 [main] DEBUG _:node1drlolk0tx218 http://www.openrdf.org/config/sail/federation#member _:node1drlolk0tx222
11:42:55.390 [main] DEBUG _:node1drlolk0tx222 http://www.openrdf.org/config/repository#repositoryType "openrdf:ProxyRepository"
11:42:55.390 [main] DEBUG _:node1drlolk0tx222 http://www.openrdf.org/config/repository/proxy#proxiedID "alien"
11:42:55.390 [main] DEBUG Added member alien: 
11:42:55.390 [main] DEBUG Adding member: http
11:42:55.390 [main] DEBUG _:node1drlolk0tx218 http://www.openrdf.org/config/sail/federation#member _:node1drlolk0tx225
11:42:55.391 [main] DEBUG _:node1drlolk0tx225 http://www.openrdf.org/config/repository#repositoryType "openrdf:HTTPRepository"
11:42:55.392 [main] DEBUG _:node1drlolk0tx225 http://www.openrdf.org/config/repository/http#repositoryURL http://localhost:8080/openrdf-sesame/repositories/http
11:42:55.392 [main] DEBUG Added member http: 
11:42:55.421 [main] DEBUG Initializing MemoryStore...
11:42:55.421 [main] DEBUG Initializing data file...
11:42:55.422 [main] DEBUG Data file initialized
11:42:55.422 [main] DEBUG MemoryStore initialized
11:42:55.424 [main] DEBUG syncing data to file...
11:42:55.425 [main] DEBUG Data synced to file
11:42:55.428 [main] DEBUG Initializing MemoryStore...
11:42:55.429 [main] DEBUG Initializing data file...
11:42:55.429 [main] DEBUG Data file initialized
11:42:55.429 [main] DEBUG MemoryStore initialized
11:42:55.431 [main] DEBUG syncing data to file...
11:42:55.431 [main] DEBUG Data synced to file
11:42:55.442 [main] ERROR Duplicate repository id's specified.
[MockitoHint] FederateTest.testDuplicateMembersPrintsError (see javadoc for MockitoHint):
[MockitoHint] 1. Unused -> at org.eclipse.rdf4j.console.command.FederateTest.setUp(FederateTest.java:87)
[MockitoHint] 2. Unused -> at org.eclipse.rdf4j.console.command.FederateTest.setUp(FederateTest.java:88)

11:42:55.451 [main] DEBUG Initializing MemoryStore...
11:42:55.451 [main] DEBUG Initializing data file...
11:42:55.452 [main] DEBUG Data file initialized
11:42:55.452 [main] DEBUG MemoryStore initialized
11:42:55.453 [main] DEBUG syncing data to file...
11:42:55.454 [main] DEBUG Data synced to file
11:42:55.457 [main] DEBUG Initializing MemoryStore...
11:42:55.458 [main] DEBUG Initializing data file...
11:42:55.458 [main] DEBUG Data file initialized
11:42:55.458 [main] DEBUG MemoryStore initialized
11:42:55.460 [main] DEBUG syncing data to file...
11:42:55.460 [main] DEBUG Data synced to file
11:42:55.468 [main] DEBUG Federate called with federation ID = alien, and member ID's = [fedID][scary].
  Distinct set to false, and readonly set to true.

11:42:55.469 [main] ERROR alien already exists.
[MockitoHint] FederateTest.testFedAlreadyExistsPrintsSpecificError (see javadoc for MockitoHint):
[MockitoHint] 1. Unused -> at org.eclipse.rdf4j.console.command.FederateTest.setUp(FederateTest.java:88)

11:42:55.474 [main] DEBUG Initializing MemoryStore...
11:42:55.475 [main] DEBUG Initializing data file...
11:42:55.475 [main] DEBUG Data file initialized
11:42:55.475 [main] DEBUG MemoryStore initialized
11:42:55.477 [main] DEBUG syncing data to file...
11:42:55.478 [main] DEBUG Data synced to file
11:42:55.480 [main] DEBUG Initializing MemoryStore...
11:42:55.481 [main] DEBUG Initializing data file...
11:42:55.481 [main] DEBUG Data file initialized
11:42:55.481 [main] DEBUG MemoryStore initialized
11:42:55.483 [main] DEBUG syncing data to file...
11:42:55.483 [main] DEBUG Data synced to file
11:42:55.493 [main] DEBUG Federate called with federation ID = fedID, and member ID's = [alien][scary].
  Distinct set to true, and readonly set to false.

11:42:55.495 [main] DEBUG Federation repository root node: _:node1drlolk0tx338
11:42:55.495 [main] DEBUG _:node1drlolk0tx338 http://www.w3.org/1999/02/22-rdf-syntax-ns#type http://www.openrdf.org/config/repository#Repository
11:42:55.495 [main] DEBUG _:node1drlolk0tx338 http://www.openrdf.org/config/repository#repositoryID "fedID"
11:42:55.495 [main] DEBUG _:node1drlolk0tx338 http://www.w3.org/2000/01/rdf-schema#label "Test Federation Title"
11:42:55.495 [main] DEBUG _:node1drlolk0tx338 http://www.openrdf.org/config/repository#repositoryImpl _:node1drlolk0tx339
11:42:55.495 [main] DEBUG _:node1drlolk0tx339 http://www.openrdf.org/config/repository#repositoryType "openrdf:SailRepository"
11:42:55.495 [main] DEBUG _:node1drlolk0tx339 http://www.openrdf.org/config/repository/sail#sailImpl _:node1drlolk0tx340
11:42:55.495 [main] DEBUG _:node1drlolk0tx340 http://www.openrdf.org/config/sail#sailType "openrdf:Federation"
11:42:55.495 [main] DEBUG _:node1drlolk0tx340 http://www.openrdf.org/config/sail/federation#readOnly "false"^^<http://www.w3.org/2001/XMLSchema#boolean>
11:42:55.495 [main] DEBUG _:node1drlolk0tx340 http://www.openrdf.org/config/sail/federation#distinct "true"^^<http://www.w3.org/2001/XMLSchema#boolean>
11:42:55.495 [main] DEBUG Adding member: alien
11:42:55.495 [main] DEBUG _:node1drlolk0tx340 http://www.openrdf.org/config/sail/federation#member _:node1drlolk0tx341
11:42:55.496 [main] DEBUG _:node1drlolk0tx341 http://www.openrdf.org/config/repository#repositoryType "openrdf:ProxyRepository"
11:42:55.496 [main] DEBUG _:node1drlolk0tx341 http://www.openrdf.org/config/repository/proxy#proxiedID "alien"
11:42:55.496 [main] DEBUG Added member alien: 
11:42:55.496 [main] DEBUG Adding member: scary
11:42:55.496 [main] DEBUG _:node1drlolk0tx340 http://www.openrdf.org/config/sail/federation#member _:node1drlolk0tx344
11:42:55.497 [main] DEBUG _:node1drlolk0tx344 http://www.openrdf.org/config/repository#repositoryType "openrdf:ProxyRepository"
11:42:55.497 [main] DEBUG _:node1drlolk0tx344 http://www.openrdf.org/config/repository/proxy#proxiedID "scary"
11:42:55.497 [main] DEBUG Added member scary: 
11:42:55.522 [main] DEBUG Initializing MemoryStore...
11:42:55.523 [main] DEBUG Initializing data file...
11:42:55.523 [main] DEBUG Data file initialized
11:42:55.523 [main] DEBUG MemoryStore initialized
11:42:55.525 [main] DEBUG syncing data to file...
11:42:55.526 [main] DEBUG Data synced to file
11:42:55.530 [main] DEBUG Initializing MemoryStore...
11:42:55.531 [main] DEBUG Initializing data file...
11:42:55.531 [main] DEBUG Data file initialized
11:42:55.531 [main] DEBUG MemoryStore initialized
11:42:55.534 [main] DEBUG syncing data to file...
11:42:55.534 [main] DEBUG Data synced to file
11:42:55.542 [main] DEBUG Federate called with federation ID = fedID, and member ID's = [sparql][sparql2].
  Distinct set to false, and readonly set to false.

11:42:55.544 [main] ERROR sparql is read-only.
11:42:55.545 [main] ERROR sparql2 is read-only.
[MockitoHint] FederateTest.testSparqlAndNotReadOnlyPrintsError (see javadoc for MockitoHint):
[MockitoHint] 1. Unused -> at org.eclipse.rdf4j.console.command.FederateTest.setUp(FederateTest.java:88)

11:42:55.553 [main] DEBUG Initializing MemoryStore...
11:42:55.554 [main] DEBUG Initializing data file...
11:42:55.555 [main] DEBUG Data file initialized
11:42:55.555 [main] DEBUG MemoryStore initialized
11:42:55.557 [main] DEBUG syncing data to file...
11:42:55.558 [main] DEBUG Data synced to file
11:42:55.561 [main] DEBUG Initializing MemoryStore...
11:42:55.562 [main] DEBUG Initializing data file...
11:42:55.562 [main] DEBUG Data file initialized
11:42:55.562 [main] DEBUG MemoryStore initialized
11:42:55.564 [main] DEBUG syncing data to file...
11:42:55.564 [main] DEBUG Data synced to file
[MockitoHint] FederateTest.testNoArgumentsPrintsHelp (see javadoc for MockitoHint):
[MockitoHint] 1. Unused -> at org.eclipse.rdf4j.console.command.FederateTest.setUp(FederateTest.java:87)
[MockitoHint] 2. Unused -> at org.eclipse.rdf4j.console.command.FederateTest.setUp(FederateTest.java:88)

11:42:55.578 [main] DEBUG Initializing MemoryStore...
11:42:55.578 [main] DEBUG Initializing data file...
11:42:55.578 [main] DEBUG Data file initialized
11:42:55.578 [main] DEBUG MemoryStore initialized
11:42:55.580 [main] DEBUG syncing data to file...
11:42:55.580 [main] DEBUG Data synced to file
11:42:55.583 [main] DEBUG Initializing MemoryStore...
11:42:55.583 [main] DEBUG Initializing data file...
11:42:55.584 [main] DEBUG Data file initialized
11:42:55.584 [main] DEBUG MemoryStore initialized
11:42:55.585 [main] DEBUG syncing data to file...
11:42:55.585 [main] DEBUG Data synced to file
11:42:55.592 [main] DEBUG Federate called with federation ID = type=memory, and member ID's = [fedID][alien][scary].
  Distinct set to false, and readonly set to true.

11:42:55.592 [main] ERROR fedID does not exist.
[MockitoHint] FederateTest.testInvalidArgumentPrintsError (see javadoc for MockitoHint):
[MockitoHint] 1. Unused -> at org.eclipse.rdf4j.console.command.FederateTest.setUp(FederateTest.java:88)

11:42:55.599 [main] DEBUG Initializing MemoryStore...
11:42:55.599 [main] DEBUG Initializing data file...
11:42:55.600 [main] DEBUG Data file initialized
11:42:55.600 [main] DEBUG MemoryStore initialized
11:42:55.601 [main] DEBUG syncing data to file...
11:42:55.602 [main] DEBUG Data synced to file
11:42:55.604 [main] DEBUG Initializing MemoryStore...
11:42:55.605 [main] DEBUG Initializing data file...
11:42:55.605 [main] DEBUG Data file initialized
11:42:55.605 [main] DEBUG MemoryStore initialized
11:42:55.606 [main] DEBUG syncing data to file...
11:42:55.607 [main] DEBUG Data synced to file
11:42:55.613 [main] DEBUG Federate called with federation ID = fedID, and member ID's = [sparql][sparql2].
  Distinct set to false, and readonly set to true.

11:42:55.614 [main] DEBUG Federation repository root node: _:node1drlolk0tx494
11:42:55.614 [main] DEBUG _:node1drlolk0tx494 http://www.w3.org/1999/02/22-rdf-syntax-ns#type http://www.openrdf.org/config/repository#Repository
11:42:55.614 [main] DEBUG _:node1drlolk0tx494 http://www.openrdf.org/config/repository#repositoryID "fedID"
11:42:55.614 [main] DEBUG _:node1drlolk0tx494 http://www.w3.org/2000/01/rdf-schema#label "Test Federation Title"
11:42:55.614 [main] DEBUG _:node1drlolk0tx494 http://www.openrdf.org/config/repository#repositoryImpl _:node1drlolk0tx495
11:42:55.614 [main] DEBUG _:node1drlolk0tx495 http://www.openrdf.org/config/repository#repositoryType "openrdf:SailRepository"
11:42:55.614 [main] DEBUG _:node1drlolk0tx495 http://www.openrdf.org/config/repository/sail#sailImpl _:node1drlolk0tx496
11:42:55.615 [main] DEBUG _:node1drlolk0tx496 http://www.openrdf.org/config/sail#sailType "openrdf:Federation"
11:42:55.615 [main] DEBUG _:node1drlolk0tx496 http://www.openrdf.org/config/sail/federation#readOnly "true"^^<http://www.w3.org/2001/XMLSchema#boolean>
11:42:55.615 [main] DEBUG _:node1drlolk0tx496 http://www.openrdf.org/config/sail/federation#distinct "false"^^<http://www.w3.org/2001/XMLSchema#boolean>
11:42:55.615 [main] DEBUG Adding member: sparql
11:42:55.615 [main] DEBUG _:node1drlolk0tx496 http://www.openrdf.org/config/sail/federation#member _:node1drlolk0tx497
11:42:55.615 [main] DEBUG _:node1drlolk0tx497 http://www.openrdf.org/config/repository#repositoryType "openrdf:SPARQLRepository"
11:42:55.615 [main] DEBUG _:node1drlolk0tx497 http://www.openrdf.org/config/repository/sparql#query-endpoint http://localhost:8080/openrdf-sesame/repositories/sparql
11:42:55.615 [main] DEBUG Added member sparql: 
11:42:55.615 [main] DEBUG Adding member: sparql2
11:42:55.616 [main] DEBUG _:node1drlolk0tx496 http://www.openrdf.org/config/sail/federation#member _:node1drlolk0tx500
11:42:55.616 [main] DEBUG _:node1drlolk0tx500 http://www.openrdf.org/config/repository#repositoryType "openrdf:SPARQLRepository"
11:42:55.616 [main] DEBUG _:node1drlolk0tx500 http://www.openrdf.org/config/repository/sparql#query-endpoint http://localhost:8080/openrdf-sesame/repositories/sparql
11:42:55.616 [main] DEBUG Added member sparql2: 
11:42:55.626 [main] DEBUG Initializing MemoryStore...
11:42:55.627 [main] DEBUG Initializing data file...
11:42:55.627 [main] DEBUG Data file initialized
11:42:55.627 [main] DEBUG MemoryStore initialized
11:42:55.628 [main] DEBUG syncing data to file...
11:42:55.629 [main] DEBUG Data synced to file
11:42:55.630 [main] DEBUG Initializing MemoryStore...
11:42:55.631 [main] DEBUG Initializing data file...
11:42:55.631 [main] DEBUG Data file initialized
11:42:55.631 [main] DEBUG MemoryStore initialized
11:42:55.632 [main] DEBUG syncing data to file...
11:42:55.633 [main] DEBUG Data synced to file
11:42:55.639 [main] DEBUG Federate called with federation ID = fedID, and member ID's = [http][sparql].
  Distinct set to false, and readonly set to true.

11:42:55.640 [main] DEBUG Federation repository root node: _:node1drlolk0tx549
11:42:55.640 [main] DEBUG _:node1drlolk0tx549 http://www.w3.org/1999/02/22-rdf-syntax-ns#type http://www.openrdf.org/config/repository#Repository
11:42:55.640 [main] DEBUG _:node1drlolk0tx549 http://www.openrdf.org/config/repository#repositoryID "fedID"
11:42:55.640 [main] DEBUG _:node1drlolk0tx549 http://www.w3.org/2000/01/rdf-schema#label "Test Federation Title"
11:42:55.640 [main] DEBUG _:node1drlolk0tx549 http://www.openrdf.org/config/repository#repositoryImpl _:node1drlolk0tx550
11:42:55.640 [main] DEBUG _:node1drlolk0tx550 http://www.openrdf.org/config/repository#repositoryType "openrdf:SailRepository"
11:42:55.640 [main] DEBUG _:node1drlolk0tx550 http://www.openrdf.org/config/repository/sail#sailImpl _:node1drlolk0tx551
11:42:55.640 [main] DEBUG _:node1drlolk0tx551 http://www.openrdf.org/config/sail#sailType "openrdf:Federation"
11:42:55.640 [main] DEBUG _:node1drlolk0tx551 http://www.openrdf.org/config/sail/federation#readOnly "true"^^<http://www.w3.org/2001/XMLSchema#boolean>
11:42:55.640 [main] DEBUG _:node1drlolk0tx551 http://www.openrdf.org/config/sail/federation#distinct "false"^^<http://www.w3.org/2001/XMLSchema#boolean>
11:42:55.640 [main] DEBUG Adding member: http
11:42:55.640 [main] DEBUG _:node1drlolk0tx551 http://www.openrdf.org/config/sail/federation#member _:node1drlolk0tx552
11:42:55.641 [main] DEBUG _:node1drlolk0tx552 http://www.openrdf.org/config/repository#repositoryType "openrdf:HTTPRepository"
11:42:55.641 [main] DEBUG _:node1drlolk0tx552 http://www.openrdf.org/config/repository/http#repositoryURL http://localhost:8080/openrdf-sesame/repositories/http
11:42:55.641 [main] DEBUG Added member http: 
11:42:55.641 [main] DEBUG Adding member: sparql
11:42:55.641 [main] DEBUG _:node1drlolk0tx551 http://www.openrdf.org/config/sail/federation#member _:node1drlolk0tx555
11:42:55.642 [main] DEBUG _:node1drlolk0tx555 http://www.openrdf.org/config/repository#repositoryType "openrdf:SPARQLRepository"
11:42:55.642 [main] DEBUG _:node1drlolk0tx555 http://www.openrdf.org/config/repository/sparql#query-endpoint http://localhost:8080/openrdf-sesame/repositories/sparql
11:42:55.642 [main] DEBUG Added member sparql: 
11:42:55.652 [main] DEBUG Initializing MemoryStore...
11:42:55.653 [main] DEBUG Initializing data file...
11:42:55.653 [main] DEBUG Data file initialized
11:42:55.653 [main] DEBUG MemoryStore initialized
11:42:55.654 [main] DEBUG syncing data to file...
11:42:55.655 [main] DEBUG Data synced to file
11:42:55.657 [main] DEBUG Initializing MemoryStore...
11:42:55.658 [main] DEBUG Initializing data file...
11:42:55.658 [main] DEBUG Data file initialized
11:42:55.658 [main] DEBUG MemoryStore initialized
11:42:55.659 [main] DEBUG syncing data to file...
11:42:55.659 [main] DEBUG Data synced to file
11:42:55.665 [main] DEBUG Federate called with federation ID = fedID, and member ID's = [alien][FreeLunch].
  Distinct set to false, and readonly set to true.

11:42:55.666 [main] ERROR FreeLunch does not exist.
[MockitoHint] FederateTest.testNonexistentMemberPrintsSpecificError (see javadoc for MockitoHint):
[MockitoHint] 1. Unused -> at org.eclipse.rdf4j.console.command.FederateTest.setUp(FederateTest.java:88)

11:42:55.671 [main] DEBUG Initializing MemoryStore...
11:42:55.672 [main] DEBUG Initializing data file...
11:42:55.672 [main] DEBUG Data file initialized
11:42:55.672 [main] DEBUG MemoryStore initialized
11:42:55.673 [main] DEBUG syncing data to file...
11:42:55.674 [main] DEBUG Data synced to file
11:42:55.676 [main] DEBUG Initializing MemoryStore...
11:42:55.677 [main] DEBUG Initializing data file...
11:42:55.677 [main] DEBUG Data file initialized
11:42:55.677 [main] DEBUG MemoryStore initialized
11:42:55.678 [main] DEBUG syncing data to file...
11:42:55.678 [main] DEBUG Data synced to file
11:42:55.683 [main] ERROR Duplicate repository id's specified.
[MockitoHint] FederateTest.testFedSameAsMemberPrintsError (see javadoc for MockitoHint):
[MockitoHint] 1. Unused -> at org.eclipse.rdf4j.console.command.FederateTest.setUp(FederateTest.java:87)
[MockitoHint] 2. Unused -> at org.eclipse.rdf4j.console.command.FederateTest.setUp(FederateTest.java:88)

11:42:55.688 [main] DEBUG Initializing MemoryStore...
11:42:55.689 [main] DEBUG Initializing data file...
11:42:55.689 [main] DEBUG Data file initialized
11:42:55.689 [main] DEBUG MemoryStore initialized
11:42:55.690 [main] DEBUG syncing data to file...
11:42:55.691 [main] DEBUG Data synced to file
11:42:55.693 [main] DEBUG Initializing MemoryStore...
11:42:55.693 [main] DEBUG Initializing data file...
11:42:55.693 [main] DEBUG Data file initialized
11:42:55.693 [main] DEBUG MemoryStore initialized
11:42:55.694 [main] DEBUG syncing data to file...
11:42:55.695 [main] DEBUG Data synced to file
[MockitoHint] FederateTest.testTwoArgumentsPrintsHelp (see javadoc for MockitoHint):
[MockitoHint] 1. Unused -> at org.eclipse.rdf4j.console.command.FederateTest.setUp(FederateTest.java:87)
[MockitoHint] 2. Unused -> at org.eclipse.rdf4j.console.command.FederateTest.setUp(FederateTest.java:88)

11:42:55.705 [main] DEBUG Initializing MemoryStore...
11:42:55.706 [main] DEBUG Initializing data file...
11:42:55.706 [main] DEBUG Data file initialized
11:42:55.706 [main] DEBUG MemoryStore initialized
11:42:55.707 [main] DEBUG syncing data to file...
11:42:55.707 [main] DEBUG Data synced to file
11:42:55.709 [main] DEBUG Initializing MemoryStore...
11:42:55.710 [main] DEBUG Initializing data file...
11:42:55.710 [main] DEBUG Data file initialized
11:42:55.710 [main] DEBUG MemoryStore initialized
11:42:55.711 [main] DEBUG syncing data to file...
11:42:55.711 [main] DEBUG Data synced to file
11:42:55.717 [main] DEBUG Federate called with federation ID = fedID, and member ID's = [alien][scary].
  Distinct set to false, and readonly set to true.

11:42:55.718 [main] DEBUG Federation repository root node: _:node1drlolk0tx692
11:42:55.718 [main] DEBUG _:node1drlolk0tx692 http://www.w3.org/1999/02/22-rdf-syntax-ns#type http://www.openrdf.org/config/repository#Repository
11:42:55.718 [main] DEBUG _:node1drlolk0tx692 http://www.openrdf.org/config/repository#repositoryID "fedID"
11:42:55.718 [main] DEBUG _:node1drlolk0tx692 http://www.w3.org/2000/01/rdf-schema#label "Test Federation Title"
11:42:55.718 [main] DEBUG _:node1drlolk0tx692 http://www.openrdf.org/config/repository#repositoryImpl _:node1drlolk0tx693
11:42:55.718 [main] DEBUG _:node1drlolk0tx693 http://www.openrdf.org/config/repository#repositoryType "openrdf:SailRepository"
11:42:55.718 [main] DEBUG _:node1drlolk0tx693 http://www.openrdf.org/config/repository/sail#sailImpl _:node1drlolk0tx694
11:42:55.718 [main] DEBUG _:node1drlolk0tx694 http://www.openrdf.org/config/sail#sailType "openrdf:Federation"
11:42:55.718 [main] DEBUG _:node1drlolk0tx694 http://www.openrdf.org/config/sail/federation#readOnly "true"^^<http://www.w3.org/2001/XMLSchema#boolean>
11:42:55.718 [main] DEBUG _:node1drlolk0tx694 http://www.openrdf.org/config/sail/federation#distinct "false"^^<http://www.w3.org/2001/XMLSchema#boolean>
11:42:55.718 [main] DEBUG Adding member: alien
11:42:55.718 [main] DEBUG _:node1drlolk0tx694 http://www.openrdf.org/config/sail/federation#member _:node1drlolk0tx695
11:42:55.719 [main] DEBUG _:node1drlolk0tx695 http://www.openrdf.org/config/repository#repositoryType "openrdf:ProxyRepository"
11:42:55.719 [main] DEBUG _:node1drlolk0tx695 http://www.openrdf.org/config/repository/proxy#proxiedID "alien"
11:42:55.719 [main] DEBUG Added member alien: 
11:42:55.719 [main] DEBUG Adding member: scary
11:42:55.719 [main] DEBUG _:node1drlolk0tx694 http://www.openrdf.org/config/sail/federation#member _:node1drlolk0tx698
11:42:55.719 [main] DEBUG _:node1drlolk0tx698 http://www.openrdf.org/config/repository#repositoryType "openrdf:ProxyRepository"
11:42:55.719 [main] DEBUG _:node1drlolk0tx698 http://www.openrdf.org/config/repository/proxy#proxiedID "scary"
11:42:55.719 [main] DEBUG Added member scary: 
11:42:55.732 [main] DEBUG Initializing MemoryStore...
11:42:55.733 [main] DEBUG Initializing data file...
11:42:55.733 [main] DEBUG Data file initialized
11:42:55.733 [main] DEBUG MemoryStore initialized
11:42:55.734 [main] DEBUG syncing data to file...
11:42:55.735 [main] DEBUG Data synced to file
11:42:55.737 [main] DEBUG Initializing MemoryStore...
11:42:55.738 [main] DEBUG Initializing data file...
11:42:55.738 [main] DEBUG Data file initialized
11:42:55.738 [main] DEBUG MemoryStore initialized
11:42:55.739 [main] DEBUG syncing data to file...
11:42:55.740 [main] DEBUG Data synced to file
[MockitoHint] FederateTest.testOneArgumentPrintsHelp (see javadoc for MockitoHint):
[MockitoHint] 1. Unused -> at org.eclipse.rdf4j.console.command.FederateTest.setUp(FederateTest.java:87)
[MockitoHint] 2. Unused -> at org.eclipse.rdf4j.console.command.FederateTest.setUp(FederateTest.java:88)

11:42:55.751 [main] DEBUG Initializing MemoryStore...
11:42:55.752 [main] DEBUG Initializing data file...
11:42:55.752 [main] DEBUG Data file initialized
11:42:55.752 [main] DEBUG MemoryStore initialized
11:42:55.754 [main] DEBUG syncing data to file...
11:42:55.754 [main] DEBUG Data synced to file
11:42:55.756 [main] DEBUG Initializing MemoryStore...
11:42:55.757 [main] DEBUG Initializing data file...
11:42:55.757 [main] DEBUG Data file initialized
11:42:55.757 [main] DEBUG MemoryStore initialized
11:42:55.758 [main] DEBUG syncing data to file...
11:42:55.759 [main] DEBUG Data synced to file
11:42:55.764 [main] DEBUG Federate called with federation ID = fedID, and member ID's = [http][http2].
  Distinct set to false, and readonly set to true.

11:42:55.765 [main] DEBUG Federation repository root node: _:node1drlolk0tx784
11:42:55.766 [main] DEBUG _:node1drlolk0tx784 http://www.w3.org/1999/02/22-rdf-syntax-ns#type http://www.openrdf.org/config/repository#Repository
11:42:55.766 [main] DEBUG _:node1drlolk0tx784 http://www.openrdf.org/config/repository#repositoryID "fedID"
11:42:55.766 [main] DEBUG _:node1drlolk0tx784 http://www.w3.org/2000/01/rdf-schema#label "Test Federation Title"
11:42:55.766 [main] DEBUG _:node1drlolk0tx784 http://www.openrdf.org/config/repository#repositoryImpl _:node1drlolk0tx785
11:42:55.766 [main] DEBUG _:node1drlolk0tx785 http://www.openrdf.org/config/repository#repositoryType "openrdf:SailRepository"
11:42:55.766 [main] DEBUG _:node1drlolk0tx785 http://www.openrdf.org/config/repository/sail#sailImpl _:node1drlolk0tx786
11:42:55.766 [main] DEBUG _:node1drlolk0tx786 http://www.openrdf.org/config/sail#sailType "openrdf:Federation"
11:42:55.766 [main] DEBUG _:node1drlolk0tx786 http://www.openrdf.org/config/sail/federation#readOnly "true"^^<http://www.w3.org/2001/XMLSchema#boolean>
11:42:55.766 [main] DEBUG _:node1drlolk0tx786 http://www.openrdf.org/config/sail/federation#distinct "false"^^<http://www.w3.org/2001/XMLSchema#boolean>
11:42:55.766 [main] DEBUG Adding member: http
11:42:55.766 [main] DEBUG _:node1drlolk0tx786 http://www.openrdf.org/config/sail/federation#member _:node1drlolk0tx787
11:42:55.766 [main] DEBUG _:node1drlolk0tx787 http://www.openrdf.org/config/repository#repositoryType "openrdf:HTTPRepository"
11:42:55.766 [main] DEBUG _:node1drlolk0tx787 http://www.openrdf.org/config/repository/http#repositoryURL http://localhost:8080/openrdf-sesame/repositories/http
11:42:55.767 [main] DEBUG Added member http: 
11:42:55.767 [main] DEBUG Adding member: http2
11:42:55.767 [main] DEBUG _:node1drlolk0tx786 http://www.openrdf.org/config/sail/federation#member _:node1drlolk0tx790
11:42:55.767 [main] DEBUG _:node1drlolk0tx790 http://www.openrdf.org/config/repository#repositoryType "openrdf:HTTPRepository"
11:42:55.768 [main] DEBUG _:node1drlolk0tx790 http://www.openrdf.org/config/repository/http#repositoryURL http://localhost:8080/openrdf-sesame/repositories/http
11:42:55.768 [main] DEBUG Added member http2: 
[INFO] Tests run: 15, Failures: 0, Errors: 0, Skipped: 0, Time elapsed: 0.458 s - in org.eclipse.rdf4j.console.command.FederateTest
[INFO] Running org.eclipse.rdf4j.console.command.SparqlTest
[MockitoHint] SparqlTest.testInputFile (see javadoc for MockitoHint):
[MockitoHint] 1. Unused -> at org.eclipse.rdf4j.console.command.SparqlTest.setUp(SparqlTest.java:49)

11:42:55.809 [main] ERROR No suitable result writer found
[MockitoHint] SparqlTest.testSelectError (see javadoc for MockitoHint):
[MockitoHint] 1. Unused -> at org.eclipse.rdf4j.console.command.SparqlTest.setUp(SparqlTest.java:49)

[MockitoHint] SparqlTest.testSelectMissingBindings (see javadoc for MockitoHint):
[MockitoHint] 1. Unused -> at org.eclipse.rdf4j.console.command.SparqlTest.setUp(SparqlTest.java:49)

[MockitoHint] SparqlTest.testInputFileWorkdir (see javadoc for MockitoHint):
[MockitoHint] 1. Unused -> at org.eclipse.rdf4j.console.command.SparqlTest.setUp(SparqlTest.java:49)

[INFO] Tests run: 9, Failures: 0, Errors: 0, Skipped: 0, Time elapsed: 0.116 s - in org.eclipse.rdf4j.console.command.SparqlTest
[INFO] Running org.eclipse.rdf4j.console.UtilTest
 one, two
 three
 four
 five, six
 seven
 eight
[INFO] Tests run: 4, Failures: 0, Errors: 0, Skipped: 0, Time elapsed: 0.001 s - in org.eclipse.rdf4j.console.UtilTest
[INFO] Running org.eclipse.rdf4j.console.ConsoleIOTest
[INFO] Tests run: 3, Failures: 0, Errors: 0, Skipped: 0, Time elapsed: 0.04 s - in org.eclipse.rdf4j.console.ConsoleIOTest
[INFO] 
[INFO] Results:
[INFO] 
[INFO] Tests run: 64, Failures: 0, Errors: 0, Skipped: 0
[INFO] 
[JENKINS] Recording test results
[INFO] 
[INFO] --- animal-sniffer-maven-plugin:1.16:check (default) @ rdf4j-console ---
[INFO] Checking unresolved references to org.codehaus.mojo.signature:java18:1.0
[INFO] 
[INFO] --- maven-jar-plugin:2.3.1:jar (default-jar) @ rdf4j-console ---
[INFO] Building jar: /home/hudson/genie.rdf4j/.jenkins/jobs/rdf4j-pr-verify/workspace/tools/console/target/rdf4j-console-3.1.0-SNAPSHOT.jar