SuccessConsole Output

Started calculate disk usage of build
Finished Calculation of disk usage of build in 0 seconds
Started calculate disk usage of workspace
Finished Calculation of disk usage of workspace in 0 seconds
[INFO] 
[INFO] ------------------< org.eclipse.rdf4j:rdf4j-console >-------------------
[INFO] Building RDF4J: Console 3.1.0-SNAPSHOT                           [70/85]
[INFO] --------------------------------[ jar ]---------------------------------
[INFO] 
[INFO] --- buildnumber-maven-plugin:1.4:create (default) @ rdf4j-console ---
[INFO] ShortRevision tag detected. The value is '7'.
[INFO] Executing: /bin/sh -c cd '/home/hudson/genie.rdf4j/.jenkins/jobs/rdf4j-pr-verify/workspace/tools/console' && 'git' 'rev-parse' '--verify' '--short=7' 'HEAD'
[INFO] Working directory: /home/hudson/genie.rdf4j/.jenkins/jobs/rdf4j-pr-verify/workspace/tools/console
[INFO] Storing buildNumber: 600a968 at timestamp: 1575903720039
[WARNING] Cannot get the branch information from the git repository: 
Detecting the current branch failed: fatal: ref HEAD is not a symbolic ref

[INFO] ShortRevision tag detected. The value is '7'.
[INFO] Executing: /bin/sh -c cd '/home/hudson/genie.rdf4j/.jenkins/jobs/rdf4j-pr-verify/workspace/tools/console' && 'git' 'rev-parse' '--verify' '--short=7' 'HEAD'
[INFO] Working directory: /home/hudson/genie.rdf4j/.jenkins/jobs/rdf4j-pr-verify/workspace/tools/console
[INFO] Storing buildScmBranch: UNKNOWN
[INFO] 
[INFO] --- maven-enforcer-plugin:1.4.1:enforce (enforce-bytecode-version) @ rdf4j-console ---
[INFO] Adding ignore: META-INF/**/module-info
[INFO] 
[INFO] --- formatter-maven-plugin:2.8.1:validate (default) @ rdf4j-console ---
[INFO] Using 'UTF-8' encoding to format source files.
[INFO] Number of files to be formatted: 61
[INFO] Html formatting is skipped
[INFO] Successfully formatted:          0 file(s)
[INFO] Fail to format:                  0 file(s)
[INFO] Skipped:                         61 file(s)
[INFO] Read only skipped:               0 file(s)
[INFO] Approximate time taken:          0s
[INFO] 
[INFO] --- maven-resources-plugin:3.0.2:resources (default-resources) @ rdf4j-console ---
[INFO] Using 'UTF-8' encoding to copy filtered resources.
[INFO] skip non existing resourceDirectory /home/hudson/genie.rdf4j/.jenkins/jobs/rdf4j-pr-verify/workspace/tools/console/src/main/resources
[INFO] 
[INFO] --- maven-compiler-plugin:3.7.0:compile (default-compile) @ rdf4j-console ---
[INFO] Changes detected - recompiling the module!
[INFO] Compiling 42 source files to /home/hudson/genie.rdf4j/.jenkins/jobs/rdf4j-pr-verify/workspace/tools/console/target/classes
[INFO] 
[INFO] --- maven-resources-plugin:3.0.2:testResources (default-testResources) @ rdf4j-console ---
[INFO] Using 'UTF-8' encoding to copy filtered resources.
[INFO] Copying 29 resources
[INFO] 
[INFO] --- maven-compiler-plugin:3.7.0:testCompile (default-testCompile) @ rdf4j-console ---
[INFO] Changes detected - recompiling the module!
[INFO] Compiling 18 source files to /home/hudson/genie.rdf4j/.jenkins/jobs/rdf4j-pr-verify/workspace/tools/console/target/test-classes
[INFO] 
[INFO] --- maven-surefire-plugin:2.22.2:test (default-test) @ rdf4j-console ---
[INFO] 
[INFO] -------------------------------------------------------
[INFO]  T E S T S
[INFO] -------------------------------------------------------
[INFO] Running org.eclipse.rdf4j.console.setting.PrefixesTest
[INFO] Tests run: 3, Failures: 0, Errors: 0, Skipped: 0, Time elapsed: 0.748 s - in org.eclipse.rdf4j.console.setting.PrefixesTest
[INFO] Running org.eclipse.rdf4j.console.setting.LogLevelTest
10:02:09.354 [main] ERROR unknown logging level: chatty
[INFO] Tests run: 4, Failures: 0, Errors: 0, Skipped: 0, Time elapsed: 0.013 s - in org.eclipse.rdf4j.console.setting.LogLevelTest
[INFO] Running org.eclipse.rdf4j.console.setting.QueryPrefixTest
[INFO] Tests run: 1, Failures: 0, Errors: 0, Skipped: 0, Time elapsed: 0 s - in org.eclipse.rdf4j.console.setting.QueryPrefixTest
[INFO] Running org.eclipse.rdf4j.console.setting.ShowPrefixTest
[INFO] Tests run: 1, Failures: 0, Errors: 0, Skipped: 0, Time elapsed: 0 s - in org.eclipse.rdf4j.console.setting.ShowPrefixTest
[INFO] Running org.eclipse.rdf4j.console.setting.ConsoleWidthTest
[INFO] Tests run: 1, Failures: 0, Errors: 0, Skipped: 0, Time elapsed: 0 s - in org.eclipse.rdf4j.console.setting.ConsoleWidthTest
[INFO] Running org.eclipse.rdf4j.console.command.SetParametersTest
10:02:09.387 [main] ERROR Unknown parameter: unknown
[INFO] Tests run: 1, Failures: 0, Errors: 0, Skipped: 0, Time elapsed: 0.026 s - in org.eclipse.rdf4j.console.command.SetParametersTest
[INFO] Running org.eclipse.rdf4j.console.command.LoadTest
[MockitoHint] LoadTest.testLoad (see javadoc for MockitoHint):
[MockitoHint] 1. Unused -> at org.eclipse.rdf4j.console.command.LoadTest.setUp(LoadTest.java:49)

[MockitoHint] LoadTest.testLoadWorkDir (see javadoc for MockitoHint):
[MockitoHint] 1. Unused -> at org.eclipse.rdf4j.console.command.LoadTest.setUp(LoadTest.java:49)

[INFO] Tests run: 2, Failures: 0, Errors: 0, Skipped: 0, Time elapsed: 0.578 s - in org.eclipse.rdf4j.console.command.LoadTest
[INFO] Running org.eclipse.rdf4j.console.command.ConvertTest
10:02:10.295 [main] ERROR No RDF writer for /tmp/genie.rdf4j/junit7841063111445218458/alien.qyx
[MockitoHint] ConvertTest.testConvertInvalidFormat (see javadoc for MockitoHint):
[MockitoHint] 1. Unused -> at org.eclipse.rdf4j.console.command.ConvertTest.setup(ConvertTest.java:39)

10:02:10.305 [main] ERROR Failed to convert data
org.eclipse.rdf4j.rio.RDFParseException: Expected '<' or '_', found: e [line 1, column 101]
	at org.eclipse.rdf4j.rio.ntriples.NTriplesParser.parseSubject(NTriplesParser.java:313)
	at org.eclipse.rdf4j.rio.ntriples.NTriplesParser.parseTriple(NTriplesParser.java:252)
	at org.eclipse.rdf4j.rio.ntriples.NTriplesParser.parse(NTriplesParser.java:160)
	at org.eclipse.rdf4j.rio.ntriples.NTriplesParser.parse(NTriplesParser.java:109)
	at org.eclipse.rdf4j.console.command.Convert.convert(Convert.java:139)
	at org.eclipse.rdf4j.console.command.Convert.execute(Convert.java:74)
	at org.eclipse.rdf4j.console.command.ConvertTest.testConvertParseError(ConvertTest.java:92)
	at sun.reflect.NativeMethodAccessorImpl.invoke0(Native Method)
	at sun.reflect.NativeMethodAccessorImpl.invoke(NativeMethodAccessorImpl.java:62)
	at sun.reflect.DelegatingMethodAccessorImpl.invoke(DelegatingMethodAccessorImpl.java:43)
	at java.lang.reflect.Method.invoke(Method.java:498)
	at org.junit.runners.model.FrameworkMethod$1.runReflectiveCall(FrameworkMethod.java:50)
	at org.junit.internal.runners.model.ReflectiveCallable.run(ReflectiveCallable.java:12)
	at org.junit.runners.model.FrameworkMethod.invokeExplosively(FrameworkMethod.java:47)
	at org.junit.internal.runners.statements.InvokeMethod.evaluate(InvokeMethod.java:17)
	at org.junit.internal.runners.statements.RunBefores.evaluate(RunBefores.java:26)
	at org.junit.internal.runners.statements.RunAfters.evaluate(RunAfters.java:27)
	at org.mockito.internal.junit.JUnitRule$1.evaluateSafely(JUnitRule.java:52)
	at org.mockito.internal.junit.JUnitRule$1.evaluate(JUnitRule.java:43)
	at org.junit.rules.ExternalResource$1.evaluate(ExternalResource.java:48)
	at org.junit.rules.RunRules.evaluate(RunRules.java:20)
	at org.junit.runners.ParentRunner.runLeaf(ParentRunner.java:325)
	at org.junit.runners.BlockJUnit4ClassRunner.runChild(BlockJUnit4ClassRunner.java:78)
	at org.junit.runners.BlockJUnit4ClassRunner.runChild(BlockJUnit4ClassRunner.java:57)
	at org.junit.runners.ParentRunner$3.run(ParentRunner.java:290)
	at org.junit.runners.ParentRunner$1.schedule(ParentRunner.java:71)
	at org.junit.runners.ParentRunner.runChildren(ParentRunner.java:288)
	at org.junit.runners.ParentRunner.access$000(ParentRunner.java:58)
	at org.junit.runners.ParentRunner$2.evaluate(ParentRunner.java:268)
	at org.junit.runners.ParentRunner.run(ParentRunner.java:363)
	at org.apache.maven.surefire.junit4.JUnit4Provider.execute(JUnit4Provider.java:365)
	at org.apache.maven.surefire.junit4.JUnit4Provider.executeWithRerun(JUnit4Provider.java:273)
	at org.apache.maven.surefire.junit4.JUnit4Provider.executeTestSet(JUnit4Provider.java:238)
	at org.apache.maven.surefire.junit4.JUnit4Provider.invoke(JUnit4Provider.java:159)
	at org.apache.maven.surefire.booter.ForkedBooter.invokeProviderInSameClassLoader(ForkedBooter.java:384)
	at org.apache.maven.surefire.booter.ForkedBooter.runSuitesInProcess(ForkedBooter.java:345)
	at org.apache.maven.surefire.booter.ForkedBooter.execute(ForkedBooter.java:126)
	at org.apache.maven.surefire.booter.ForkedBooter.main(ForkedBooter.java:418)
[INFO] Tests run: 4, Failures: 0, Errors: 0, Skipped: 0, Time elapsed: 0.331 s - in org.eclipse.rdf4j.console.command.ConvertTest
[INFO] Running org.eclipse.rdf4j.console.command.ExportTest
[MockitoHint] ExportTest.testExportWorkDir (see javadoc for MockitoHint):
[MockitoHint] 1. Unused -> at org.eclipse.rdf4j.console.command.ExportTest.setUp(ExportTest.java:46)

[MockitoHint] ExportTest.testExportAll (see javadoc for MockitoHint):
[MockitoHint] 1. Unused -> at org.eclipse.rdf4j.console.command.ExportTest.setUp(ExportTest.java:46)

[MockitoHint] ExportTest.testExportContexts (see javadoc for MockitoHint):
[MockitoHint] 1. Unused -> at org.eclipse.rdf4j.console.command.ExportTest.setUp(ExportTest.java:46)

[INFO] Tests run: 3, Failures: 0, Errors: 0, Skipped: 0, Time elapsed: 0.087 s - in org.eclipse.rdf4j.console.command.ExportTest
[INFO] Running org.eclipse.rdf4j.console.command.VerifyTest
10:02:10.853 [main] ERROR Unexpected RDFParseException
org.eclipse.rdf4j.rio.RDFParseException: 'missing type' was not recognised, and could not be verified, with datatype http://example.rdf4j.org/type/wrong [line 1]
	at org.eclipse.rdf4j.rio.helpers.RDFParserHelper.reportError(RDFParserHelper.java:265)
	at org.eclipse.rdf4j.rio.helpers.RDFParserHelper.createLiteral(RDFParserHelper.java:180)
	at org.eclipse.rdf4j.rio.helpers.AbstractRDFParser.createLiteral(AbstractRDFParser.java:530)
	at org.eclipse.rdf4j.rio.turtle.TurtleParser.parseQuotedLiteral(TurtleParser.java:665)
	at org.eclipse.rdf4j.rio.turtle.TurtleParser.parseValue(TurtleParser.java:584)
	at org.eclipse.rdf4j.rio.turtle.TurtleParser.parseObject(TurtleParser.java:461)
	at org.eclipse.rdf4j.rio.turtle.TurtleParser.parseObjectList(TurtleParser.java:389)
	at org.eclipse.rdf4j.rio.turtle.TurtleParser.parsePredicateObjectList(TurtleParser.java:362)
	at org.eclipse.rdf4j.rio.turtle.TurtleParser.parseTriples(TurtleParser.java:349)
	at org.eclipse.rdf4j.rio.turtle.TurtleParser.parseStatement(TurtleParser.java:216)
	at org.eclipse.rdf4j.rio.turtle.TurtleParser.parse(TurtleParser.java:178)
	at org.eclipse.rdf4j.rio.turtle.TurtleParser.parse(TurtleParser.java:130)
	at org.eclipse.rdf4j.console.command.Verify.verify(Verify.java:145)
	at org.eclipse.rdf4j.console.command.Verify.execute(Verify.java:97)
	at org.eclipse.rdf4j.console.command.VerifyTest.testVerifyMissingType(VerifyTest.java:97)
	at sun.reflect.NativeMethodAccessorImpl.invoke0(Native Method)
	at sun.reflect.NativeMethodAccessorImpl.invoke(NativeMethodAccessorImpl.java:62)
	at sun.reflect.DelegatingMethodAccessorImpl.invoke(DelegatingMethodAccessorImpl.java:43)
	at java.lang.reflect.Method.invoke(Method.java:498)
	at org.junit.runners.model.FrameworkMethod$1.runReflectiveCall(FrameworkMethod.java:50)
	at org.junit.internal.runners.model.ReflectiveCallable.run(ReflectiveCallable.java:12)
	at org.junit.runners.model.FrameworkMethod.invokeExplosively(FrameworkMethod.java:47)
	at org.junit.internal.runners.statements.InvokeMethod.evaluate(InvokeMethod.java:17)
	at org.junit.internal.runners.statements.RunBefores.evaluate(RunBefores.java:26)
	at org.junit.internal.runners.statements.RunAfters.evaluate(RunAfters.java:27)
	at org.mockito.internal.junit.JUnitRule$1.evaluateSafely(JUnitRule.java:52)
	at org.mockito.internal.junit.JUnitRule$1.evaluate(JUnitRule.java:43)
	at org.junit.rules.ExternalResource$1.evaluate(ExternalResource.java:48)
	at org.junit.rules.RunRules.evaluate(RunRules.java:20)
	at org.junit.runners.ParentRunner.runLeaf(ParentRunner.java:325)
	at org.junit.runners.BlockJUnit4ClassRunner.runChild(BlockJUnit4ClassRunner.java:78)
	at org.junit.runners.BlockJUnit4ClassRunner.runChild(BlockJUnit4ClassRunner.java:57)
	at org.junit.runners.ParentRunner$3.run(ParentRunner.java:290)
	at org.junit.runners.ParentRunner$1.schedule(ParentRunner.java:71)
	at org.junit.runners.ParentRunner.runChildren(ParentRunner.java:288)
	at org.junit.runners.ParentRunner.access$000(ParentRunner.java:58)
	at org.junit.runners.ParentRunner$2.evaluate(ParentRunner.java:268)
	at org.junit.runners.ParentRunner.run(ParentRunner.java:363)
	at org.apache.maven.surefire.junit4.JUnit4Provider.execute(JUnit4Provider.java:365)
	at org.apache.maven.surefire.junit4.JUnit4Provider.executeWithRerun(JUnit4Provider.java:273)
	at org.apache.maven.surefire.junit4.JUnit4Provider.executeTestSet(JUnit4Provider.java:238)
	at org.apache.maven.surefire.junit4.JUnit4Provider.invoke(JUnit4Provider.java:159)
	at org.apache.maven.surefire.booter.ForkedBooter.invokeProviderInSameClassLoader(ForkedBooter.java:384)
	at org.apache.maven.surefire.booter.ForkedBooter.runSuitesInProcess(ForkedBooter.java:345)
	at org.apache.maven.surefire.booter.ForkedBooter.execute(ForkedBooter.java:126)
	at org.apache.maven.surefire.booter.ForkedBooter.main(ForkedBooter.java:418)
10:02:10.927 [main] ERROR SHACL validation failed, writing report to /tmp/genie.rdf4j/junit5052291206268975068/junit6188705115065742431.tmp
10:02:10.953 [main] ERROR Unexpected RDFParseException
org.eclipse.rdf4j.rio.RDFParseException: Unexpected end of file
	at org.eclipse.rdf4j.rio.turtle.TurtleParser.throwEOFException(TurtleParser.java:1317)
	at org.eclipse.rdf4j.rio.turtle.TurtleParser.parseValue(TurtleParser.java:589)
	at org.eclipse.rdf4j.rio.turtle.TurtleParser.parsePredicate(TurtleParser.java:434)
	at org.eclipse.rdf4j.rio.turtle.TurtleParser.parsePredicateObjectList(TurtleParser.java:358)
	at org.eclipse.rdf4j.rio.turtle.TurtleParser.parseTriples(TurtleParser.java:349)
	at org.eclipse.rdf4j.rio.turtle.TurtleParser.parseStatement(TurtleParser.java:216)
	at org.eclipse.rdf4j.rio.turtle.TurtleParser.parse(TurtleParser.java:178)
	at org.eclipse.rdf4j.rio.turtle.TurtleParser.parse(TurtleParser.java:130)
	at org.eclipse.rdf4j.console.command.Verify.verify(Verify.java:145)
	at org.eclipse.rdf4j.console.command.Verify.execute(Verify.java:97)
	at org.eclipse.rdf4j.console.command.VerifyTest.testVerifyBrokenFile(VerifyTest.java:91)
	at sun.reflect.NativeMethodAccessorImpl.invoke0(Native Method)
	at sun.reflect.NativeMethodAccessorImpl.invoke(NativeMethodAccessorImpl.java:62)
	at sun.reflect.DelegatingMethodAccessorImpl.invoke(DelegatingMethodAccessorImpl.java:43)
	at java.lang.reflect.Method.invoke(Method.java:498)
	at org.junit.runners.model.FrameworkMethod$1.runReflectiveCall(FrameworkMethod.java:50)
	at org.junit.internal.runners.model.ReflectiveCallable.run(ReflectiveCallable.java:12)
	at org.junit.runners.model.FrameworkMethod.invokeExplosively(FrameworkMethod.java:47)
	at org.junit.internal.runners.statements.InvokeMethod.evaluate(InvokeMethod.java:17)
	at org.junit.internal.runners.statements.RunBefores.evaluate(RunBefores.java:26)
	at org.junit.internal.runners.statements.RunAfters.evaluate(RunAfters.java:27)
	at org.mockito.internal.junit.JUnitRule$1.evaluateSafely(JUnitRule.java:52)
	at org.mockito.internal.junit.JUnitRule$1.evaluate(JUnitRule.java:43)
	at org.junit.rules.ExternalResource$1.evaluate(ExternalResource.java:48)
	at org.junit.rules.RunRules.evaluate(RunRules.java:20)
	at org.junit.runners.ParentRunner.runLeaf(ParentRunner.java:325)
	at org.junit.runners.BlockJUnit4ClassRunner.runChild(BlockJUnit4ClassRunner.java:78)
	at org.junit.runners.BlockJUnit4ClassRunner.runChild(BlockJUnit4ClassRunner.java:57)
	at org.junit.runners.ParentRunner$3.run(ParentRunner.java:290)
	at org.junit.runners.ParentRunner$1.schedule(ParentRunner.java:71)
	at org.junit.runners.ParentRunner.runChildren(ParentRunner.java:288)
	at org.junit.runners.ParentRunner.access$000(ParentRunner.java:58)
	at org.junit.runners.ParentRunner$2.evaluate(ParentRunner.java:268)
	at org.junit.runners.ParentRunner.run(ParentRunner.java:363)
	at org.apache.maven.surefire.junit4.JUnit4Provider.execute(JUnit4Provider.java:365)
	at org.apache.maven.surefire.junit4.JUnit4Provider.executeWithRerun(JUnit4Provider.java:273)
	at org.apache.maven.surefire.junit4.JUnit4Provider.executeTestSet(JUnit4Provider.java:238)
	at org.apache.maven.surefire.junit4.JUnit4Provider.invoke(JUnit4Provider.java:159)
	at org.apache.maven.surefire.booter.ForkedBooter.invokeProviderInSameClassLoader(ForkedBooter.java:384)
	at org.apache.maven.surefire.booter.ForkedBooter.runSuitesInProcess(ForkedBooter.java:345)
	at org.apache.maven.surefire.booter.ForkedBooter.execute(ForkedBooter.java:126)
	at org.apache.maven.surefire.booter.ForkedBooter.main(ForkedBooter.java:418)
10:02:10.972 [main] ERROR Unexpected RDFParseException
org.eclipse.rdf4j.rio.RDFParseException: Expected a letter, found '1' [line 1]
	at org.eclipse.rdf4j.rio.helpers.RDFParserHelper.reportError(RDFParserHelper.java:265)
	at org.eclipse.rdf4j.rio.helpers.AbstractRDFParser.reportError(AbstractRDFParser.java:628)
	at org.eclipse.rdf4j.rio.turtle.TurtleParser.reportError(TurtleParser.java:1297)
	at org.eclipse.rdf4j.rio.turtle.TurtleParser.parseQuotedLiteral(TurtleParser.java:619)
	at org.eclipse.rdf4j.rio.turtle.TurtleParser.parseValue(TurtleParser.java:584)
	at org.eclipse.rdf4j.rio.turtle.TurtleParser.parseObject(TurtleParser.java:461)
	at org.eclipse.rdf4j.rio.turtle.TurtleParser.parseObjectList(TurtleParser.java:389)
	at org.eclipse.rdf4j.rio.turtle.TurtleParser.parsePredicateObjectList(TurtleParser.java:362)
	at org.eclipse.rdf4j.rio.turtle.TurtleParser.parseTriples(TurtleParser.java:349)
	at org.eclipse.rdf4j.rio.turtle.TurtleParser.parseStatement(TurtleParser.java:216)
	at org.eclipse.rdf4j.rio.turtle.TurtleParser.parse(TurtleParser.java:178)
	at org.eclipse.rdf4j.rio.turtle.TurtleParser.parse(TurtleParser.java:130)
	at org.eclipse.rdf4j.console.command.Verify.verify(Verify.java:145)
	at org.eclipse.rdf4j.console.command.Verify.execute(Verify.java:97)
	at org.eclipse.rdf4j.console.command.VerifyTest.testVerifyWrongLang(VerifyTest.java:109)
	at sun.reflect.NativeMethodAccessorImpl.invoke0(Native Method)
	at sun.reflect.NativeMethodAccessorImpl.invoke(NativeMethodAccessorImpl.java:62)
	at sun.reflect.DelegatingMethodAccessorImpl.invoke(DelegatingMethodAccessorImpl.java:43)
	at java.lang.reflect.Method.invoke(Method.java:498)
	at org.junit.runners.model.FrameworkMethod$1.runReflectiveCall(FrameworkMethod.java:50)
	at org.junit.internal.runners.model.ReflectiveCallable.run(ReflectiveCallable.java:12)
	at org.junit.runners.model.FrameworkMethod.invokeExplosively(FrameworkMethod.java:47)
	at org.junit.internal.runners.statements.InvokeMethod.evaluate(InvokeMethod.java:17)
	at org.junit.internal.runners.statements.RunBefores.evaluate(RunBefores.java:26)
	at org.junit.internal.runners.statements.RunAfters.evaluate(RunAfters.java:27)
	at org.mockito.internal.junit.JUnitRule$1.evaluateSafely(JUnitRule.java:52)
	at org.mockito.internal.junit.JUnitRule$1.evaluate(JUnitRule.java:43)
	at org.junit.rules.ExternalResource$1.evaluate(ExternalResource.java:48)
	at org.junit.rules.RunRules.evaluate(RunRules.java:20)
	at org.junit.runners.ParentRunner.runLeaf(ParentRunner.java:325)
	at org.junit.runners.BlockJUnit4ClassRunner.runChild(BlockJUnit4ClassRunner.java:78)
	at org.junit.runners.BlockJUnit4ClassRunner.runChild(BlockJUnit4ClassRunner.java:57)
	at org.junit.runners.ParentRunner$3.run(ParentRunner.java:290)
	at org.junit.runners.ParentRunner$1.schedule(ParentRunner.java:71)
	at org.junit.runners.ParentRunner.runChildren(ParentRunner.java:288)
	at org.junit.runners.ParentRunner.access$000(ParentRunner.java:58)
	at org.junit.runners.ParentRunner$2.evaluate(ParentRunner.java:268)
	at org.junit.runners.ParentRunner.run(ParentRunner.java:363)
	at org.apache.maven.surefire.junit4.JUnit4Provider.execute(JUnit4Provider.java:365)
	at org.apache.maven.surefire.junit4.JUnit4Provider.executeWithRerun(JUnit4Provider.java:273)
	at org.apache.maven.surefire.junit4.JUnit4Provider.executeTestSet(JUnit4Provider.java:238)
	at org.apache.maven.surefire.junit4.JUnit4Provider.invoke(JUnit4Provider.java:159)
	at org.apache.maven.surefire.booter.ForkedBooter.invokeProviderInSameClassLoader(ForkedBooter.java:384)
	at org.apache.maven.surefire.booter.ForkedBooter.runSuitesInProcess(ForkedBooter.java:345)
	at org.apache.maven.surefire.booter.ForkedBooter.execute(ForkedBooter.java:126)
	at org.apache.maven.surefire.booter.ForkedBooter.main(ForkedBooter.java:418)
10:02:10.998 [main] ERROR No parser available for this RDF format
org.eclipse.rdf4j.rio.UnsupportedRDFormatException: Did not recognise RDF format string file:/home/hudson/genie.rdf4j/.jenkins/jobs/rdf4j-pr-verify/workspace/tools/console/does-not-exist.docx
	at org.eclipse.rdf4j.rio.Rio.lambda$unsupportedFormat$1(Rio.java:577)
	at java.util.Optional.orElseThrow(Optional.java:290)
	at org.eclipse.rdf4j.console.command.Verify.verify(Verify.java:124)
	at org.eclipse.rdf4j.console.command.Verify.execute(Verify.java:97)
	at org.eclipse.rdf4j.console.command.VerifyTest.testVerifyWrongFormat(VerifyTest.java:69)
	at sun.reflect.NativeMethodAccessorImpl.invoke0(Native Method)
	at sun.reflect.NativeMethodAccessorImpl.invoke(NativeMethodAccessorImpl.java:62)
	at sun.reflect.DelegatingMethodAccessorImpl.invoke(DelegatingMethodAccessorImpl.java:43)
	at java.lang.reflect.Method.invoke(Method.java:498)
	at org.junit.runners.model.FrameworkMethod$1.runReflectiveCall(FrameworkMethod.java:50)
	at org.junit.internal.runners.model.ReflectiveCallable.run(ReflectiveCallable.java:12)
	at org.junit.runners.model.FrameworkMethod.invokeExplosively(FrameworkMethod.java:47)
	at org.junit.internal.runners.statements.InvokeMethod.evaluate(InvokeMethod.java:17)
	at org.junit.internal.runners.statements.RunBefores.evaluate(RunBefores.java:26)
	at org.junit.internal.runners.statements.RunAfters.evaluate(RunAfters.java:27)
	at org.mockito.internal.junit.JUnitRule$1.evaluateSafely(JUnitRule.java:52)
	at org.mockito.internal.junit.JUnitRule$1.evaluate(JUnitRule.java:43)
	at org.junit.rules.ExternalResource$1.evaluate(ExternalResource.java:48)
	at org.junit.rules.RunRules.evaluate(RunRules.java:20)
	at org.junit.runners.ParentRunner.runLeaf(ParentRunner.java:325)
	at org.junit.runners.BlockJUnit4ClassRunner.runChild(BlockJUnit4ClassRunner.java:78)
	at org.junit.runners.BlockJUnit4ClassRunner.runChild(BlockJUnit4ClassRunner.java:57)
	at org.junit.runners.ParentRunner$3.run(ParentRunner.java:290)
	at org.junit.runners.ParentRunner$1.schedule(ParentRunner.java:71)
	at org.junit.runners.ParentRunner.runChildren(ParentRunner.java:288)
	at org.junit.runners.ParentRunner.access$000(ParentRunner.java:58)
	at org.junit.runners.ParentRunner$2.evaluate(ParentRunner.java:268)
	at org.junit.runners.ParentRunner.run(ParentRunner.java:363)
	at org.apache.maven.surefire.junit4.JUnit4Provider.execute(JUnit4Provider.java:365)
	at org.apache.maven.surefire.junit4.JUnit4Provider.executeWithRerun(JUnit4Provider.java:273)
	at org.apache.maven.surefire.junit4.JUnit4Provider.executeTestSet(JUnit4Provider.java:238)
	at org.apache.maven.surefire.junit4.JUnit4Provider.invoke(JUnit4Provider.java:159)
	at org.apache.maven.surefire.booter.ForkedBooter.invokeProviderInSameClassLoader(ForkedBooter.java:384)
	at org.apache.maven.surefire.booter.ForkedBooter.runSuitesInProcess(ForkedBooter.java:345)
	at org.apache.maven.surefire.booter.ForkedBooter.execute(ForkedBooter.java:126)
	at org.apache.maven.surefire.booter.ForkedBooter.main(ForkedBooter.java:418)
10:02:11.020 [main] ERROR Unexpected RDFParseException
org.eclipse.rdf4j.rio.RDFParseException: IRI included an unencoded space: '32' [line 1]
	at org.eclipse.rdf4j.rio.helpers.RDFParserHelper.reportError(RDFParserHelper.java:265)
	at org.eclipse.rdf4j.rio.helpers.AbstractRDFParser.reportError(AbstractRDFParser.java:628)
	at org.eclipse.rdf4j.rio.turtle.TurtleParser.reportError(TurtleParser.java:1297)
	at org.eclipse.rdf4j.rio.turtle.TurtleParser.parseURI(TurtleParser.java:902)
	at org.eclipse.rdf4j.rio.turtle.TurtleParser.parseValue(TurtleParser.java:575)
	at org.eclipse.rdf4j.rio.turtle.TurtleParser.parseSubject(TurtleParser.java:406)
	at org.eclipse.rdf4j.rio.turtle.TurtleParser.parseTriples(TurtleParser.java:347)
	at org.eclipse.rdf4j.rio.turtle.TurtleParser.parseStatement(TurtleParser.java:216)
	at org.eclipse.rdf4j.rio.turtle.TurtleParser.parse(TurtleParser.java:178)
	at org.eclipse.rdf4j.rio.turtle.TurtleParser.parse(TurtleParser.java:130)
	at org.eclipse.rdf4j.console.command.Verify.verify(Verify.java:145)
	at org.eclipse.rdf4j.console.command.Verify.execute(Verify.java:97)
	at org.eclipse.rdf4j.console.command.VerifyTest.testVerifySpaceIRI(VerifyTest.java:103)
	at sun.reflect.NativeMethodAccessorImpl.invoke0(Native Method)
	at sun.reflect.NativeMethodAccessorImpl.invoke(NativeMethodAccessorImpl.java:62)
	at sun.reflect.DelegatingMethodAccessorImpl.invoke(DelegatingMethodAccessorImpl.java:43)
	at java.lang.reflect.Method.invoke(Method.java:498)
	at org.junit.runners.model.FrameworkMethod$1.runReflectiveCall(FrameworkMethod.java:50)
	at org.junit.internal.runners.model.ReflectiveCallable.run(ReflectiveCallable.java:12)
	at org.junit.runners.model.FrameworkMethod.invokeExplosively(FrameworkMethod.java:47)
	at org.junit.internal.runners.statements.InvokeMethod.evaluate(InvokeMethod.java:17)
	at org.junit.internal.runners.statements.RunBefores.evaluate(RunBefores.java:26)
	at org.junit.internal.runners.statements.RunAfters.evaluate(RunAfters.java:27)
	at org.mockito.internal.junit.JUnitRule$1.evaluateSafely(JUnitRule.java:52)
	at org.mockito.internal.junit.JUnitRule$1.evaluate(JUnitRule.java:43)
	at org.junit.rules.ExternalResource$1.evaluate(ExternalResource.java:48)
	at org.junit.rules.RunRules.evaluate(RunRules.java:20)
	at org.junit.runners.ParentRunner.runLeaf(ParentRunner.java:325)
	at org.junit.runners.BlockJUnit4ClassRunner.runChild(BlockJUnit4ClassRunner.java:78)
	at org.junit.runners.BlockJUnit4ClassRunner.runChild(BlockJUnit4ClassRunner.java:57)
	at org.junit.runners.ParentRunner$3.run(ParentRunner.java:290)
	at org.junit.runners.ParentRunner$1.schedule(ParentRunner.java:71)
	at org.junit.runners.ParentRunner.runChildren(ParentRunner.java:288)
	at org.junit.runners.ParentRunner.access$000(ParentRunner.java:58)
	at org.junit.runners.ParentRunner$2.evaluate(ParentRunner.java:268)
	at org.junit.runners.ParentRunner.run(ParentRunner.java:363)
	at org.apache.maven.surefire.junit4.JUnit4Provider.execute(JUnit4Provider.java:365)
	at org.apache.maven.surefire.junit4.JUnit4Provider.executeWithRerun(JUnit4Provider.java:273)
	at org.apache.maven.surefire.junit4.JUnit4Provider.executeTestSet(JUnit4Provider.java:238)
	at org.apache.maven.surefire.junit4.JUnit4Provider.invoke(JUnit4Provider.java:159)
	at org.apache.maven.surefire.booter.ForkedBooter.invokeProviderInSameClassLoader(ForkedBooter.java:384)
	at org.apache.maven.surefire.booter.ForkedBooter.runSuitesInProcess(ForkedBooter.java:345)
	at org.apache.maven.surefire.booter.ForkedBooter.execute(ForkedBooter.java:126)
	at org.apache.maven.surefire.booter.ForkedBooter.main(ForkedBooter.java:418)
[INFO] Tests run: 10, Failures: 0, Errors: 0, Skipped: 0, Time elapsed: 0.662 s - in org.eclipse.rdf4j.console.command.VerifyTest
[INFO] Running org.eclipse.rdf4j.console.command.DropTest
[MockitoHint] DropTest.testUserAbortedUnsafeDropBeforeWarning (see javadoc for MockitoHint):
[MockitoHint] 1. Unused -> at org.eclipse.rdf4j.console.command.DropTest.setUp(DropTest.java:50)

[INFO] Tests run: 3, Failures: 0, Errors: 0, Skipped: 0, Time elapsed: 0.171 s - in org.eclipse.rdf4j.console.command.DropTest
[INFO] Running org.eclipse.rdf4j.console.command.FederateTest
10:02:11.261 [main] DEBUG Initializing MemoryStore...
10:02:11.262 [main] DEBUG Initializing data file...
10:02:11.263 [main] DEBUG Data file initialized
10:02:11.263 [main] DEBUG MemoryStore initialized
10:02:11.265 [main] DEBUG syncing data to file...
10:02:11.265 [main] DEBUG Data synced to file
10:02:11.278 [main] DEBUG Initializing MemoryStore...
10:02:11.279 [main] DEBUG Initializing data file...
10:02:11.279 [main] DEBUG Data file initialized
10:02:11.279 [main] DEBUG MemoryStore initialized
10:02:11.280 [main] DEBUG syncing data to file...
10:02:11.281 [main] DEBUG Data synced to file
10:02:11.300 [main] DEBUG Federate called with federation ID = fedID, and member ID's = [sparql][alien][http].
  Distinct set to false, and readonly set to true.

10:02:11.303 [main] DEBUG Federation repository root node: _:node1drlit502x216
10:02:11.304 [main] DEBUG _:node1drlit502x216 http://www.w3.org/1999/02/22-rdf-syntax-ns#type http://www.openrdf.org/config/repository#Repository
10:02:11.304 [main] DEBUG _:node1drlit502x216 http://www.openrdf.org/config/repository#repositoryID "fedID"
10:02:11.304 [main] DEBUG _:node1drlit502x216 http://www.w3.org/2000/01/rdf-schema#label "Test Federation Title"
10:02:11.304 [main] DEBUG _:node1drlit502x216 http://www.openrdf.org/config/repository#repositoryImpl _:node1drlit502x217
10:02:11.304 [main] DEBUG _:node1drlit502x217 http://www.openrdf.org/config/repository#repositoryType "openrdf:SailRepository"
10:02:11.304 [main] DEBUG _:node1drlit502x217 http://www.openrdf.org/config/repository/sail#sailImpl _:node1drlit502x218
10:02:11.304 [main] DEBUG _:node1drlit502x218 http://www.openrdf.org/config/sail#sailType "openrdf:Federation"
10:02:11.305 [main] DEBUG _:node1drlit502x218 http://www.openrdf.org/config/sail/federation#readOnly "true"^^<http://www.w3.org/2001/XMLSchema#boolean>
10:02:11.305 [main] DEBUG _:node1drlit502x218 http://www.openrdf.org/config/sail/federation#distinct "false"^^<http://www.w3.org/2001/XMLSchema#boolean>
10:02:11.305 [main] DEBUG Adding member: sparql
10:02:11.305 [main] DEBUG _:node1drlit502x218 http://www.openrdf.org/config/sail/federation#member _:node1drlit502x219
10:02:11.305 [main] DEBUG _:node1drlit502x219 http://www.openrdf.org/config/repository#repositoryType "openrdf:SPARQLRepository"
10:02:11.306 [main] DEBUG _:node1drlit502x219 http://www.openrdf.org/config/repository/sparql#query-endpoint http://localhost:8080/openrdf-sesame/repositories/sparql
10:02:11.306 [main] DEBUG Added member sparql: 
10:02:11.306 [main] DEBUG Adding member: alien
10:02:11.306 [main] DEBUG _:node1drlit502x218 http://www.openrdf.org/config/sail/federation#member _:node1drlit502x222
10:02:11.307 [main] DEBUG _:node1drlit502x222 http://www.openrdf.org/config/repository#repositoryType "openrdf:ProxyRepository"
10:02:11.307 [main] DEBUG _:node1drlit502x222 http://www.openrdf.org/config/repository/proxy#proxiedID "alien"
10:02:11.307 [main] DEBUG Added member alien: 
10:02:11.307 [main] DEBUG Adding member: http
10:02:11.307 [main] DEBUG _:node1drlit502x218 http://www.openrdf.org/config/sail/federation#member _:node1drlit502x225
10:02:11.308 [main] DEBUG _:node1drlit502x225 http://www.openrdf.org/config/repository#repositoryType "openrdf:HTTPRepository"
10:02:11.308 [main] DEBUG _:node1drlit502x225 http://www.openrdf.org/config/repository/http#repositoryURL http://localhost:8080/openrdf-sesame/repositories/http
10:02:11.309 [main] DEBUG Added member http: 
10:02:11.336 [main] DEBUG Initializing MemoryStore...
10:02:11.337 [main] DEBUG Initializing data file...
10:02:11.337 [main] DEBUG Data file initialized
10:02:11.337 [main] DEBUG MemoryStore initialized
10:02:11.339 [main] DEBUG syncing data to file...
10:02:11.340 [main] DEBUG Data synced to file
10:02:11.343 [main] DEBUG Initializing MemoryStore...
10:02:11.345 [main] DEBUG Initializing data file...
10:02:11.345 [main] DEBUG Data file initialized
10:02:11.345 [main] DEBUG MemoryStore initialized
10:02:11.346 [main] DEBUG syncing data to file...
10:02:11.347 [main] DEBUG Data synced to file
10:02:11.354 [main] ERROR Duplicate repository id's specified.
[MockitoHint] FederateTest.testDuplicateMembersPrintsError (see javadoc for MockitoHint):
[MockitoHint] 1. Unused -> at org.eclipse.rdf4j.console.command.FederateTest.setUp(FederateTest.java:87)
[MockitoHint] 2. Unused -> at org.eclipse.rdf4j.console.command.FederateTest.setUp(FederateTest.java:88)

10:02:11.361 [main] DEBUG Initializing MemoryStore...
10:02:11.362 [main] DEBUG Initializing data file...
10:02:11.362 [main] DEBUG Data file initialized
10:02:11.362 [main] DEBUG MemoryStore initialized
10:02:11.364 [main] DEBUG syncing data to file...
10:02:11.364 [main] DEBUG Data synced to file
10:02:11.367 [main] DEBUG Initializing MemoryStore...
10:02:11.368 [main] DEBUG Initializing data file...
10:02:11.368 [main] DEBUG Data file initialized
10:02:11.368 [main] DEBUG MemoryStore initialized
10:02:11.369 [main] DEBUG syncing data to file...
10:02:11.370 [main] DEBUG Data synced to file
10:02:11.377 [main] DEBUG Federate called with federation ID = alien, and member ID's = [fedID][scary].
  Distinct set to false, and readonly set to true.

10:02:11.377 [main] ERROR alien already exists.
[MockitoHint] FederateTest.testFedAlreadyExistsPrintsSpecificError (see javadoc for MockitoHint):
[MockitoHint] 1. Unused -> at org.eclipse.rdf4j.console.command.FederateTest.setUp(FederateTest.java:88)

10:02:11.384 [main] DEBUG Initializing MemoryStore...
10:02:11.384 [main] DEBUG Initializing data file...
10:02:11.385 [main] DEBUG Data file initialized
10:02:11.385 [main] DEBUG MemoryStore initialized
10:02:11.386 [main] DEBUG syncing data to file...
10:02:11.387 [main] DEBUG Data synced to file
10:02:11.389 [main] DEBUG Initializing MemoryStore...
10:02:11.390 [main] DEBUG Initializing data file...
10:02:11.390 [main] DEBUG Data file initialized
10:02:11.390 [main] DEBUG MemoryStore initialized
10:02:11.392 [main] DEBUG syncing data to file...
10:02:11.392 [main] DEBUG Data synced to file
10:02:11.401 [main] DEBUG Federate called with federation ID = fedID, and member ID's = [alien][scary].
  Distinct set to true, and readonly set to false.

10:02:11.403 [main] DEBUG Federation repository root node: _:node1drlit502x338
10:02:11.403 [main] DEBUG _:node1drlit502x338 http://www.w3.org/1999/02/22-rdf-syntax-ns#type http://www.openrdf.org/config/repository#Repository
10:02:11.403 [main] DEBUG _:node1drlit502x338 http://www.openrdf.org/config/repository#repositoryID "fedID"
10:02:11.403 [main] DEBUG _:node1drlit502x338 http://www.w3.org/2000/01/rdf-schema#label "Test Federation Title"
10:02:11.403 [main] DEBUG _:node1drlit502x338 http://www.openrdf.org/config/repository#repositoryImpl _:node1drlit502x339
10:02:11.403 [main] DEBUG _:node1drlit502x339 http://www.openrdf.org/config/repository#repositoryType "openrdf:SailRepository"
10:02:11.403 [main] DEBUG _:node1drlit502x339 http://www.openrdf.org/config/repository/sail#sailImpl _:node1drlit502x340
10:02:11.403 [main] DEBUG _:node1drlit502x340 http://www.openrdf.org/config/sail#sailType "openrdf:Federation"
10:02:11.403 [main] DEBUG _:node1drlit502x340 http://www.openrdf.org/config/sail/federation#readOnly "false"^^<http://www.w3.org/2001/XMLSchema#boolean>
10:02:11.403 [main] DEBUG _:node1drlit502x340 http://www.openrdf.org/config/sail/federation#distinct "true"^^<http://www.w3.org/2001/XMLSchema#boolean>
10:02:11.403 [main] DEBUG Adding member: alien
10:02:11.403 [main] DEBUG _:node1drlit502x340 http://www.openrdf.org/config/sail/federation#member _:node1drlit502x341
10:02:11.404 [main] DEBUG _:node1drlit502x341 http://www.openrdf.org/config/repository#repositoryType "openrdf:ProxyRepository"
10:02:11.404 [main] DEBUG _:node1drlit502x341 http://www.openrdf.org/config/repository/proxy#proxiedID "alien"
10:02:11.404 [main] DEBUG Added member alien: 
10:02:11.404 [main] DEBUG Adding member: scary
10:02:11.404 [main] DEBUG _:node1drlit502x340 http://www.openrdf.org/config/sail/federation#member _:node1drlit502x344
10:02:11.405 [main] DEBUG _:node1drlit502x344 http://www.openrdf.org/config/repository#repositoryType "openrdf:ProxyRepository"
10:02:11.405 [main] DEBUG _:node1drlit502x344 http://www.openrdf.org/config/repository/proxy#proxiedID "scary"
10:02:11.405 [main] DEBUG Added member scary: 
10:02:11.427 [main] DEBUG Initializing MemoryStore...
10:02:11.428 [main] DEBUG Initializing data file...
10:02:11.428 [main] DEBUG Data file initialized
10:02:11.428 [main] DEBUG MemoryStore initialized
10:02:11.430 [main] DEBUG syncing data to file...
10:02:11.430 [main] DEBUG Data synced to file
10:02:11.433 [main] DEBUG Initializing MemoryStore...
10:02:11.434 [main] DEBUG Initializing data file...
10:02:11.434 [main] DEBUG Data file initialized
10:02:11.434 [main] DEBUG MemoryStore initialized
10:02:11.436 [main] DEBUG syncing data to file...
10:02:11.436 [main] DEBUG Data synced to file
10:02:11.443 [main] DEBUG Federate called with federation ID = fedID, and member ID's = [sparql][sparql2].
  Distinct set to false, and readonly set to false.

10:02:11.446 [main] ERROR sparql is read-only.
10:02:11.447 [main] ERROR sparql2 is read-only.
[MockitoHint] FederateTest.testSparqlAndNotReadOnlyPrintsError (see javadoc for MockitoHint):
[MockitoHint] 1. Unused -> at org.eclipse.rdf4j.console.command.FederateTest.setUp(FederateTest.java:88)

10:02:11.454 [main] DEBUG Initializing MemoryStore...
10:02:11.455 [main] DEBUG Initializing data file...
10:02:11.455 [main] DEBUG Data file initialized
10:02:11.455 [main] DEBUG MemoryStore initialized
10:02:11.457 [main] DEBUG syncing data to file...
10:02:11.457 [main] DEBUG Data synced to file
10:02:11.461 [main] DEBUG Initializing MemoryStore...
10:02:11.461 [main] DEBUG Initializing data file...
10:02:11.461 [main] DEBUG Data file initialized
10:02:11.461 [main] DEBUG MemoryStore initialized
10:02:11.463 [main] DEBUG syncing data to file...
10:02:11.464 [main] DEBUG Data synced to file
[MockitoHint] FederateTest.testNoArgumentsPrintsHelp (see javadoc for MockitoHint):
[MockitoHint] 1. Unused -> at org.eclipse.rdf4j.console.command.FederateTest.setUp(FederateTest.java:87)
[MockitoHint] 2. Unused -> at org.eclipse.rdf4j.console.command.FederateTest.setUp(FederateTest.java:88)

10:02:11.478 [main] DEBUG Initializing MemoryStore...
10:02:11.478 [main] DEBUG Initializing data file...
10:02:11.479 [main] DEBUG Data file initialized
10:02:11.479 [main] DEBUG MemoryStore initialized
10:02:11.480 [main] DEBUG syncing data to file...
10:02:11.480 [main] DEBUG Data synced to file
10:02:11.483 [main] DEBUG Initializing MemoryStore...
10:02:11.484 [main] DEBUG Initializing data file...
10:02:11.484 [main] DEBUG Data file initialized
10:02:11.484 [main] DEBUG MemoryStore initialized
10:02:11.485 [main] DEBUG syncing data to file...
10:02:11.485 [main] DEBUG Data synced to file
10:02:11.491 [main] DEBUG Federate called with federation ID = type=memory, and member ID's = [fedID][alien][scary].
  Distinct set to false, and readonly set to true.

10:02:11.491 [main] ERROR fedID does not exist.
[MockitoHint] FederateTest.testInvalidArgumentPrintsError (see javadoc for MockitoHint):
[MockitoHint] 1. Unused -> at org.eclipse.rdf4j.console.command.FederateTest.setUp(FederateTest.java:88)

10:02:11.498 [main] DEBUG Initializing MemoryStore...
10:02:11.499 [main] DEBUG Initializing data file...
10:02:11.499 [main] DEBUG Data file initialized
10:02:11.499 [main] DEBUG MemoryStore initialized
10:02:11.500 [main] DEBUG syncing data to file...
10:02:11.501 [main] DEBUG Data synced to file
10:02:11.503 [main] DEBUG Initializing MemoryStore...
10:02:11.503 [main] DEBUG Initializing data file...
10:02:11.504 [main] DEBUG Data file initialized
10:02:11.504 [main] DEBUG MemoryStore initialized
10:02:11.505 [main] DEBUG syncing data to file...
10:02:11.505 [main] DEBUG Data synced to file
10:02:11.510 [main] DEBUG Federate called with federation ID = fedID, and member ID's = [sparql][sparql2].
  Distinct set to false, and readonly set to true.

10:02:11.511 [main] DEBUG Federation repository root node: _:node1drlit502x494
10:02:11.511 [main] DEBUG _:node1drlit502x494 http://www.w3.org/1999/02/22-rdf-syntax-ns#type http://www.openrdf.org/config/repository#Repository
10:02:11.511 [main] DEBUG _:node1drlit502x494 http://www.openrdf.org/config/repository#repositoryID "fedID"
10:02:11.511 [main] DEBUG _:node1drlit502x494 http://www.w3.org/2000/01/rdf-schema#label "Test Federation Title"
10:02:11.511 [main] DEBUG _:node1drlit502x494 http://www.openrdf.org/config/repository#repositoryImpl _:node1drlit502x495
10:02:11.511 [main] DEBUG _:node1drlit502x495 http://www.openrdf.org/config/repository#repositoryType "openrdf:SailRepository"
10:02:11.511 [main] DEBUG _:node1drlit502x495 http://www.openrdf.org/config/repository/sail#sailImpl _:node1drlit502x496
10:02:11.511 [main] DEBUG _:node1drlit502x496 http://www.openrdf.org/config/sail#sailType "openrdf:Federation"
10:02:11.511 [main] DEBUG _:node1drlit502x496 http://www.openrdf.org/config/sail/federation#readOnly "true"^^<http://www.w3.org/2001/XMLSchema#boolean>
10:02:11.511 [main] DEBUG _:node1drlit502x496 http://www.openrdf.org/config/sail/federation#distinct "false"^^<http://www.w3.org/2001/XMLSchema#boolean>
10:02:11.511 [main] DEBUG Adding member: sparql
10:02:11.511 [main] DEBUG _:node1drlit502x496 http://www.openrdf.org/config/sail/federation#member _:node1drlit502x497
10:02:11.512 [main] DEBUG _:node1drlit502x497 http://www.openrdf.org/config/repository#repositoryType "openrdf:SPARQLRepository"
10:02:11.512 [main] DEBUG _:node1drlit502x497 http://www.openrdf.org/config/repository/sparql#query-endpoint http://localhost:8080/openrdf-sesame/repositories/sparql
10:02:11.512 [main] DEBUG Added member sparql: 
10:02:11.512 [main] DEBUG Adding member: sparql2
10:02:11.512 [main] DEBUG _:node1drlit502x496 http://www.openrdf.org/config/sail/federation#member _:node1drlit502x500
10:02:11.512 [main] DEBUG _:node1drlit502x500 http://www.openrdf.org/config/repository#repositoryType "openrdf:SPARQLRepository"
10:02:11.513 [main] DEBUG _:node1drlit502x500 http://www.openrdf.org/config/repository/sparql#query-endpoint http://localhost:8080/openrdf-sesame/repositories/sparql
10:02:11.513 [main] DEBUG Added member sparql2: 
10:02:11.521 [main] DEBUG Initializing MemoryStore...
10:02:11.522 [main] DEBUG Initializing data file...
10:02:11.522 [main] DEBUG Data file initialized
10:02:11.522 [main] DEBUG MemoryStore initialized
10:02:11.523 [main] DEBUG syncing data to file...
10:02:11.523 [main] DEBUG Data synced to file
10:02:11.525 [main] DEBUG Initializing MemoryStore...
10:02:11.525 [main] DEBUG Initializing data file...
10:02:11.525 [main] DEBUG Data file initialized
10:02:11.526 [main] DEBUG MemoryStore initialized
10:02:11.526 [main] DEBUG syncing data to file...
10:02:11.527 [main] DEBUG Data synced to file
10:02:11.531 [main] DEBUG Federate called with federation ID = fedID, and member ID's = [http][sparql].
  Distinct set to false, and readonly set to true.

10:02:11.532 [main] DEBUG Federation repository root node: _:node1drlit502x549
10:02:11.532 [main] DEBUG _:node1drlit502x549 http://www.w3.org/1999/02/22-rdf-syntax-ns#type http://www.openrdf.org/config/repository#Repository
10:02:11.532 [main] DEBUG _:node1drlit502x549 http://www.openrdf.org/config/repository#repositoryID "fedID"
10:02:11.532 [main] DEBUG _:node1drlit502x549 http://www.w3.org/2000/01/rdf-schema#label "Test Federation Title"
10:02:11.532 [main] DEBUG _:node1drlit502x549 http://www.openrdf.org/config/repository#repositoryImpl _:node1drlit502x550
10:02:11.532 [main] DEBUG _:node1drlit502x550 http://www.openrdf.org/config/repository#repositoryType "openrdf:SailRepository"
10:02:11.532 [main] DEBUG _:node1drlit502x550 http://www.openrdf.org/config/repository/sail#sailImpl _:node1drlit502x551
10:02:11.532 [main] DEBUG _:node1drlit502x551 http://www.openrdf.org/config/sail#sailType "openrdf:Federation"
10:02:11.532 [main] DEBUG _:node1drlit502x551 http://www.openrdf.org/config/sail/federation#readOnly "true"^^<http://www.w3.org/2001/XMLSchema#boolean>
10:02:11.532 [main] DEBUG _:node1drlit502x551 http://www.openrdf.org/config/sail/federation#distinct "false"^^<http://www.w3.org/2001/XMLSchema#boolean>
10:02:11.532 [main] DEBUG Adding member: http
10:02:11.532 [main] DEBUG _:node1drlit502x551 http://www.openrdf.org/config/sail/federation#member _:node1drlit502x552
10:02:11.532 [main] DEBUG _:node1drlit502x552 http://www.openrdf.org/config/repository#repositoryType "openrdf:HTTPRepository"
10:02:11.533 [main] DEBUG _:node1drlit502x552 http://www.openrdf.org/config/repository/http#repositoryURL http://localhost:8080/openrdf-sesame/repositories/http
10:02:11.533 [main] DEBUG Added member http: 
10:02:11.533 [main] DEBUG Adding member: sparql
10:02:11.533 [main] DEBUG _:node1drlit502x551 http://www.openrdf.org/config/sail/federation#member _:node1drlit502x555
10:02:11.533 [main] DEBUG _:node1drlit502x555 http://www.openrdf.org/config/repository#repositoryType "openrdf:SPARQLRepository"
10:02:11.534 [main] DEBUG _:node1drlit502x555 http://www.openrdf.org/config/repository/sparql#query-endpoint http://localhost:8080/openrdf-sesame/repositories/sparql
10:02:11.534 [main] DEBUG Added member sparql: 
10:02:11.542 [main] DEBUG Initializing MemoryStore...
10:02:11.542 [main] DEBUG Initializing data file...
10:02:11.543 [main] DEBUG Data file initialized
10:02:11.543 [main] DEBUG MemoryStore initialized
10:02:11.544 [main] DEBUG syncing data to file...
10:02:11.544 [main] DEBUG Data synced to file
10:02:11.546 [main] DEBUG Initializing MemoryStore...
10:02:11.547 [main] DEBUG Initializing data file...
10:02:11.547 [main] DEBUG Data file initialized
10:02:11.547 [main] DEBUG MemoryStore initialized
10:02:11.548 [main] DEBUG syncing data to file...
10:02:11.548 [main] DEBUG Data synced to file
10:02:11.553 [main] DEBUG Federate called with federation ID = fedID, and member ID's = [alien][FreeLunch].
  Distinct set to false, and readonly set to true.

10:02:11.553 [main] ERROR FreeLunch does not exist.
[MockitoHint] FederateTest.testNonexistentMemberPrintsSpecificError (see javadoc for MockitoHint):
[MockitoHint] 1. Unused -> at org.eclipse.rdf4j.console.command.FederateTest.setUp(FederateTest.java:88)

10:02:11.559 [main] DEBUG Initializing MemoryStore...
10:02:11.560 [main] DEBUG Initializing data file...
10:02:11.560 [main] DEBUG Data file initialized
10:02:11.560 [main] DEBUG MemoryStore initialized
10:02:11.561 [main] DEBUG syncing data to file...
10:02:11.561 [main] DEBUG Data synced to file
10:02:11.563 [main] DEBUG Initializing MemoryStore...
10:02:11.564 [main] DEBUG Initializing data file...
10:02:11.564 [main] DEBUG Data file initialized
10:02:11.564 [main] DEBUG MemoryStore initialized
10:02:11.565 [main] DEBUG syncing data to file...
10:02:11.565 [main] DEBUG Data synced to file
10:02:11.569 [main] ERROR Duplicate repository id's specified.
[MockitoHint] FederateTest.testFedSameAsMemberPrintsError (see javadoc for MockitoHint):
[MockitoHint] 1. Unused -> at org.eclipse.rdf4j.console.command.FederateTest.setUp(FederateTest.java:87)
[MockitoHint] 2. Unused -> at org.eclipse.rdf4j.console.command.FederateTest.setUp(FederateTest.java:88)

10:02:11.575 [main] DEBUG Initializing MemoryStore...
10:02:11.575 [main] DEBUG Initializing data file...
10:02:11.575 [main] DEBUG Data file initialized
10:02:11.575 [main] DEBUG MemoryStore initialized
10:02:11.576 [main] DEBUG syncing data to file...
10:02:11.577 [main] DEBUG Data synced to file
10:02:11.578 [main] DEBUG Initializing MemoryStore...
10:02:11.579 [main] DEBUG Initializing data file...
10:02:11.579 [main] DEBUG Data file initialized
10:02:11.579 [main] DEBUG MemoryStore initialized
10:02:11.580 [main] DEBUG syncing data to file...
10:02:11.580 [main] DEBUG Data synced to file
[MockitoHint] FederateTest.testTwoArgumentsPrintsHelp (see javadoc for MockitoHint):
[MockitoHint] 1. Unused -> at org.eclipse.rdf4j.console.command.FederateTest.setUp(FederateTest.java:87)
[MockitoHint] 2. Unused -> at org.eclipse.rdf4j.console.command.FederateTest.setUp(FederateTest.java:88)

10:02:11.590 [main] DEBUG Initializing MemoryStore...
10:02:11.591 [main] DEBUG Initializing data file...
10:02:11.591 [main] DEBUG Data file initialized
10:02:11.591 [main] DEBUG MemoryStore initialized
10:02:11.592 [main] DEBUG syncing data to file...
10:02:11.592 [main] DEBUG Data synced to file
10:02:11.594 [main] DEBUG Initializing MemoryStore...
10:02:11.595 [main] DEBUG Initializing data file...
10:02:11.595 [main] DEBUG Data file initialized
10:02:11.595 [main] DEBUG MemoryStore initialized
10:02:11.595 [main] DEBUG syncing data to file...
10:02:11.596 [main] DEBUG Data synced to file
10:02:11.600 [main] DEBUG Federate called with federation ID = fedID, and member ID's = [alien][scary].
  Distinct set to false, and readonly set to true.

10:02:11.601 [main] DEBUG Federation repository root node: _:node1drlit502x692
10:02:11.601 [main] DEBUG _:node1drlit502x692 http://www.w3.org/1999/02/22-rdf-syntax-ns#type http://www.openrdf.org/config/repository#Repository
10:02:11.601 [main] DEBUG _:node1drlit502x692 http://www.openrdf.org/config/repository#repositoryID "fedID"
10:02:11.601 [main] DEBUG _:node1drlit502x692 http://www.w3.org/2000/01/rdf-schema#label "Test Federation Title"
10:02:11.601 [main] DEBUG _:node1drlit502x692 http://www.openrdf.org/config/repository#repositoryImpl _:node1drlit502x693
10:02:11.601 [main] DEBUG _:node1drlit502x693 http://www.openrdf.org/config/repository#repositoryType "openrdf:SailRepository"
10:02:11.601 [main] DEBUG _:node1drlit502x693 http://www.openrdf.org/config/repository/sail#sailImpl _:node1drlit502x694
10:02:11.601 [main] DEBUG _:node1drlit502x694 http://www.openrdf.org/config/sail#sailType "openrdf:Federation"
10:02:11.601 [main] DEBUG _:node1drlit502x694 http://www.openrdf.org/config/sail/federation#readOnly "true"^^<http://www.w3.org/2001/XMLSchema#boolean>
10:02:11.601 [main] DEBUG _:node1drlit502x694 http://www.openrdf.org/config/sail/federation#distinct "false"^^<http://www.w3.org/2001/XMLSchema#boolean>
10:02:11.601 [main] DEBUG Adding member: alien
10:02:11.601 [main] DEBUG _:node1drlit502x694 http://www.openrdf.org/config/sail/federation#member _:node1drlit502x695
10:02:11.602 [main] DEBUG _:node1drlit502x695 http://www.openrdf.org/config/repository#repositoryType "openrdf:ProxyRepository"
10:02:11.602 [main] DEBUG _:node1drlit502x695 http://www.openrdf.org/config/repository/proxy#proxiedID "alien"
10:02:11.602 [main] DEBUG Added member alien: 
10:02:11.602 [main] DEBUG Adding member: scary
10:02:11.602 [main] DEBUG _:node1drlit502x694 http://www.openrdf.org/config/sail/federation#member _:node1drlit502x698
10:02:11.602 [main] DEBUG _:node1drlit502x698 http://www.openrdf.org/config/repository#repositoryType "openrdf:ProxyRepository"
10:02:11.602 [main] DEBUG _:node1drlit502x698 http://www.openrdf.org/config/repository/proxy#proxiedID "scary"
10:02:11.602 [main] DEBUG Added member scary: 
10:02:11.614 [main] DEBUG Initializing MemoryStore...
10:02:11.614 [main] DEBUG Initializing data file...
10:02:11.615 [main] DEBUG Data file initialized
10:02:11.615 [main] DEBUG MemoryStore initialized
10:02:11.616 [main] DEBUG syncing data to file...
10:02:11.616 [main] DEBUG Data synced to file
10:02:11.618 [main] DEBUG Initializing MemoryStore...
10:02:11.618 [main] DEBUG Initializing data file...
10:02:11.625 [main] DEBUG Data file initialized
10:02:11.625 [main] DEBUG MemoryStore initialized
10:02:11.635 [main] DEBUG syncing data to file...
10:02:11.636 [main] DEBUG Data synced to file
[MockitoHint] FederateTest.testOneArgumentPrintsHelp (see javadoc for MockitoHint):
[MockitoHint] 1. Unused -> at org.eclipse.rdf4j.console.command.FederateTest.setUp(FederateTest.java:87)
[MockitoHint] 2. Unused -> at org.eclipse.rdf4j.console.command.FederateTest.setUp(FederateTest.java:88)

10:02:11.647 [main] DEBUG Initializing MemoryStore...
10:02:11.648 [main] DEBUG Initializing data file...
10:02:11.648 [main] DEBUG Data file initialized
10:02:11.648 [main] DEBUG MemoryStore initialized
10:02:11.649 [main] DEBUG syncing data to file...
10:02:11.649 [main] DEBUG Data synced to file
10:02:11.651 [main] DEBUG Initializing MemoryStore...
10:02:11.651 [main] DEBUG Initializing data file...
10:02:11.651 [main] DEBUG Data file initialized
10:02:11.651 [main] DEBUG MemoryStore initialized
10:02:11.652 [main] DEBUG syncing data to file...
10:02:11.652 [main] DEBUG Data synced to file
10:02:11.666 [main] DEBUG Federate called with federation ID = fedID, and member ID's = [http][http2].
  Distinct set to false, and readonly set to true.

10:02:11.667 [main] DEBUG Federation repository root node: _:node1drlit502x784
10:02:11.667 [main] DEBUG _:node1drlit502x784 http://www.w3.org/1999/02/22-rdf-syntax-ns#type http://www.openrdf.org/config/repository#Repository
10:02:11.668 [main] DEBUG _:node1drlit502x784 http://www.openrdf.org/config/repository#repositoryID "fedID"
10:02:11.668 [main] DEBUG _:node1drlit502x784 http://www.w3.org/2000/01/rdf-schema#label "Test Federation Title"
10:02:11.668 [main] DEBUG _:node1drlit502x784 http://www.openrdf.org/config/repository#repositoryImpl _:node1drlit502x785
10:02:11.668 [main] DEBUG _:node1drlit502x785 http://www.openrdf.org/config/repository#repositoryType "openrdf:SailRepository"
10:02:11.668 [main] DEBUG _:node1drlit502x785 http://www.openrdf.org/config/repository/sail#sailImpl _:node1drlit502x786
10:02:11.668 [main] DEBUG _:node1drlit502x786 http://www.openrdf.org/config/sail#sailType "openrdf:Federation"
10:02:11.668 [main] DEBUG _:node1drlit502x786 http://www.openrdf.org/config/sail/federation#readOnly "true"^^<http://www.w3.org/2001/XMLSchema#boolean>
10:02:11.668 [main] DEBUG _:node1drlit502x786 http://www.openrdf.org/config/sail/federation#distinct "false"^^<http://www.w3.org/2001/XMLSchema#boolean>
10:02:11.668 [main] DEBUG Adding member: http
10:02:11.668 [main] DEBUG _:node1drlit502x786 http://www.openrdf.org/config/sail/federation#member _:node1drlit502x787
10:02:11.668 [main] DEBUG _:node1drlit502x787 http://www.openrdf.org/config/repository#repositoryType "openrdf:HTTPRepository"
10:02:11.668 [main] DEBUG _:node1drlit502x787 http://www.openrdf.org/config/repository/http#repositoryURL http://localhost:8080/openrdf-sesame/repositories/http
10:02:11.668 [main] DEBUG Added member http: 
10:02:11.668 [main] DEBUG Adding member: http2
10:02:11.668 [main] DEBUG _:node1drlit502x786 http://www.openrdf.org/config/sail/federation#member _:node1drlit502x790
10:02:11.669 [main] DEBUG _:node1drlit502x790 http://www.openrdf.org/config/repository#repositoryType "openrdf:HTTPRepository"
10:02:11.669 [main] DEBUG _:node1drlit502x790 http://www.openrdf.org/config/repository/http#repositoryURL http://localhost:8080/openrdf-sesame/repositories/http
10:02:11.669 [main] DEBUG Added member http2: 
[INFO] Tests run: 15, Failures: 0, Errors: 0, Skipped: 0, Time elapsed: 0.435 s - in org.eclipse.rdf4j.console.command.FederateTest
[INFO] Running org.eclipse.rdf4j.console.command.SparqlTest
[MockitoHint] SparqlTest.testInputFile (see javadoc for MockitoHint):
[MockitoHint] 1. Unused -> at org.eclipse.rdf4j.console.command.SparqlTest.setUp(SparqlTest.java:49)

10:02:11.729 [main] ERROR No suitable result writer found
[MockitoHint] SparqlTest.testSelectError (see javadoc for MockitoHint):
[MockitoHint] 1. Unused -> at org.eclipse.rdf4j.console.command.SparqlTest.setUp(SparqlTest.java:49)

[MockitoHint] SparqlTest.testSelectMissingBindings (see javadoc for MockitoHint):
[MockitoHint] 1. Unused -> at org.eclipse.rdf4j.console.command.SparqlTest.setUp(SparqlTest.java:49)

[MockitoHint] SparqlTest.testInputFileWorkdir (see javadoc for MockitoHint):
[MockitoHint] 1. Unused -> at org.eclipse.rdf4j.console.command.SparqlTest.setUp(SparqlTest.java:49)

[INFO] Tests run: 9, Failures: 0, Errors: 0, Skipped: 0, Time elapsed: 0.125 s - in org.eclipse.rdf4j.console.command.SparqlTest
[INFO] Running org.eclipse.rdf4j.console.UtilTest
 one, two
 three
 four
 five, six
 seven
 eight
[INFO] Tests run: 4, Failures: 0, Errors: 0, Skipped: 0, Time elapsed: 0 s - in org.eclipse.rdf4j.console.UtilTest
[INFO] Running org.eclipse.rdf4j.console.ConsoleIOTest
[INFO] Tests run: 3, Failures: 0, Errors: 0, Skipped: 0, Time elapsed: 0.03 s - in org.eclipse.rdf4j.console.ConsoleIOTest
[INFO] 
[INFO] Results:
[INFO] 
[INFO] Tests run: 64, Failures: 0, Errors: 0, Skipped: 0
[INFO] 
[JENKINS] Recording test results
[INFO] 
[INFO] --- animal-sniffer-maven-plugin:1.16:check (default) @ rdf4j-console ---
[INFO] Checking unresolved references to org.codehaus.mojo.signature:java18:1.0
[INFO] 
[INFO] --- maven-jar-plugin:2.3.1:jar (default-jar) @ rdf4j-console ---
[INFO] Building jar: /home/hudson/genie.rdf4j/.jenkins/jobs/rdf4j-pr-verify/workspace/tools/console/target/rdf4j-console-3.1.0-SNAPSHOT.jar