SuccessConsole Output

Started calculate disk usage of build
Finished Calculation of disk usage of build in 0 seconds
Started calculate disk usage of workspace
Finished Calculation of disk usage of workspace in 0 seconds
[INFO] 
[INFO] ------------------< org.eclipse.rdf4j:rdf4j-console >-------------------
[INFO] Building RDF4J: Console 3.1.0-SNAPSHOT                           [70/85]
[INFO] --------------------------------[ jar ]---------------------------------
[INFO] 
[INFO] --- buildnumber-maven-plugin:1.4:create (default) @ rdf4j-console ---
[INFO] ShortRevision tag detected. The value is '7'.
[INFO] Executing: /bin/sh -c cd '/home/hudson/genie.rdf4j/.jenkins/jobs/rdf4j-pr-verify/workspace/tools/console' && 'git' 'rev-parse' '--verify' '--short=7' 'HEAD'
[INFO] Working directory: /home/hudson/genie.rdf4j/.jenkins/jobs/rdf4j-pr-verify/workspace/tools/console
[INFO] Storing buildNumber: adc8da5 at timestamp: 1575897094397
[WARNING] Cannot get the branch information from the git repository: 
Detecting the current branch failed: fatal: ref HEAD is not a symbolic ref

[INFO] ShortRevision tag detected. The value is '7'.
[INFO] Executing: /bin/sh -c cd '/home/hudson/genie.rdf4j/.jenkins/jobs/rdf4j-pr-verify/workspace/tools/console' && 'git' 'rev-parse' '--verify' '--short=7' 'HEAD'
[INFO] Working directory: /home/hudson/genie.rdf4j/.jenkins/jobs/rdf4j-pr-verify/workspace/tools/console
[INFO] Storing buildScmBranch: UNKNOWN
[INFO] 
[INFO] --- maven-enforcer-plugin:1.4.1:enforce (enforce-bytecode-version) @ rdf4j-console ---
[INFO] Adding ignore: META-INF/**/module-info
[INFO] 
[INFO] --- formatter-maven-plugin:2.8.1:validate (default) @ rdf4j-console ---
[INFO] Using 'UTF-8' encoding to format source files.
[INFO] Number of files to be formatted: 61
[INFO] Html formatting is skipped
[INFO] Successfully formatted:          0 file(s)
[INFO] Fail to format:                  0 file(s)
[INFO] Skipped:                         61 file(s)
[INFO] Read only skipped:               0 file(s)
[INFO] Approximate time taken:          0s
[INFO] 
[INFO] --- maven-resources-plugin:3.0.2:resources (default-resources) @ rdf4j-console ---
[INFO] Using 'UTF-8' encoding to copy filtered resources.
[INFO] skip non existing resourceDirectory /home/hudson/genie.rdf4j/.jenkins/jobs/rdf4j-pr-verify/workspace/tools/console/src/main/resources
[INFO] 
[INFO] --- maven-compiler-plugin:3.7.0:compile (default-compile) @ rdf4j-console ---
[INFO] Changes detected - recompiling the module!
[INFO] Compiling 42 source files to /home/hudson/genie.rdf4j/.jenkins/jobs/rdf4j-pr-verify/workspace/tools/console/target/classes
[INFO] 
[INFO] --- maven-resources-plugin:3.0.2:testResources (default-testResources) @ rdf4j-console ---
[INFO] Using 'UTF-8' encoding to copy filtered resources.
[INFO] Copying 29 resources
[INFO] 
[INFO] --- maven-compiler-plugin:3.7.0:testCompile (default-testCompile) @ rdf4j-console ---
[INFO] Changes detected - recompiling the module!
[INFO] Compiling 18 source files to /home/hudson/genie.rdf4j/.jenkins/jobs/rdf4j-pr-verify/workspace/tools/console/target/test-classes
[INFO] 
[INFO] --- maven-surefire-plugin:2.22.2:test (default-test) @ rdf4j-console ---
[INFO] 
[INFO] -------------------------------------------------------
[INFO]  T E S T S
[INFO] -------------------------------------------------------
[INFO] Running org.eclipse.rdf4j.console.setting.PrefixesTest
[INFO] Tests run: 3, Failures: 0, Errors: 0, Skipped: 0, Time elapsed: 1.033 s - in org.eclipse.rdf4j.console.setting.PrefixesTest
[INFO] Running org.eclipse.rdf4j.console.setting.LogLevelTest
08:11:40.327 [main] ERROR unknown logging level: chatty
[INFO] Tests run: 4, Failures: 0, Errors: 0, Skipped: 0, Time elapsed: 0.012 s - in org.eclipse.rdf4j.console.setting.LogLevelTest
[INFO] Running org.eclipse.rdf4j.console.setting.QueryPrefixTest
[INFO] Tests run: 1, Failures: 0, Errors: 0, Skipped: 0, Time elapsed: 0 s - in org.eclipse.rdf4j.console.setting.QueryPrefixTest
[INFO] Running org.eclipse.rdf4j.console.setting.ShowPrefixTest
[INFO] Tests run: 1, Failures: 0, Errors: 0, Skipped: 0, Time elapsed: 0 s - in org.eclipse.rdf4j.console.setting.ShowPrefixTest
[INFO] Running org.eclipse.rdf4j.console.setting.ConsoleWidthTest
[INFO] Tests run: 1, Failures: 0, Errors: 0, Skipped: 0, Time elapsed: 0 s - in org.eclipse.rdf4j.console.setting.ConsoleWidthTest
[INFO] Running org.eclipse.rdf4j.console.command.SetParametersTest
08:11:40.362 [main] ERROR Unknown parameter: unknown
[INFO] Tests run: 1, Failures: 0, Errors: 0, Skipped: 0, Time elapsed: 0.021 s - in org.eclipse.rdf4j.console.command.SetParametersTest
[INFO] Running org.eclipse.rdf4j.console.command.LoadTest
[MockitoHint] LoadTest.testLoad (see javadoc for MockitoHint):
[MockitoHint] 1. Unused -> at org.eclipse.rdf4j.console.command.LoadTest.setUp(LoadTest.java:49)

[MockitoHint] LoadTest.testLoadWorkDir (see javadoc for MockitoHint):
[MockitoHint] 1. Unused -> at org.eclipse.rdf4j.console.command.LoadTest.setUp(LoadTest.java:49)

[INFO] Tests run: 2, Failures: 0, Errors: 0, Skipped: 0, Time elapsed: 0.252 s - in org.eclipse.rdf4j.console.command.LoadTest
[INFO] Running org.eclipse.rdf4j.console.command.ConvertTest
08:11:40.881 [main] ERROR No RDF writer for /tmp/genie.rdf4j/junit492004307871799500/alien.qyx
[MockitoHint] ConvertTest.testConvertInvalidFormat (see javadoc for MockitoHint):
[MockitoHint] 1. Unused -> at org.eclipse.rdf4j.console.command.ConvertTest.setup(ConvertTest.java:39)

08:11:40.887 [main] ERROR Failed to convert data
org.eclipse.rdf4j.rio.RDFParseException: Expected '<' or '_', found: e [line 1, column 101]
	at org.eclipse.rdf4j.rio.ntriples.NTriplesParser.parseSubject(NTriplesParser.java:313)
	at org.eclipse.rdf4j.rio.ntriples.NTriplesParser.parseTriple(NTriplesParser.java:252)
	at org.eclipse.rdf4j.rio.ntriples.NTriplesParser.parse(NTriplesParser.java:160)
	at org.eclipse.rdf4j.rio.ntriples.NTriplesParser.parse(NTriplesParser.java:109)
	at org.eclipse.rdf4j.console.command.Convert.convert(Convert.java:139)
	at org.eclipse.rdf4j.console.command.Convert.execute(Convert.java:74)
	at org.eclipse.rdf4j.console.command.ConvertTest.testConvertParseError(ConvertTest.java:92)
	at sun.reflect.NativeMethodAccessorImpl.invoke0(Native Method)
	at sun.reflect.NativeMethodAccessorImpl.invoke(NativeMethodAccessorImpl.java:62)
	at sun.reflect.DelegatingMethodAccessorImpl.invoke(DelegatingMethodAccessorImpl.java:43)
	at java.lang.reflect.Method.invoke(Method.java:498)
	at org.junit.runners.model.FrameworkMethod$1.runReflectiveCall(FrameworkMethod.java:50)
	at org.junit.internal.runners.model.ReflectiveCallable.run(ReflectiveCallable.java:12)
	at org.junit.runners.model.FrameworkMethod.invokeExplosively(FrameworkMethod.java:47)
	at org.junit.internal.runners.statements.InvokeMethod.evaluate(InvokeMethod.java:17)
	at org.junit.internal.runners.statements.RunBefores.evaluate(RunBefores.java:26)
	at org.junit.internal.runners.statements.RunAfters.evaluate(RunAfters.java:27)
	at org.mockito.internal.junit.JUnitRule$1.evaluateSafely(JUnitRule.java:52)
	at org.mockito.internal.junit.JUnitRule$1.evaluate(JUnitRule.java:43)
	at org.junit.rules.ExternalResource$1.evaluate(ExternalResource.java:48)
	at org.junit.rules.RunRules.evaluate(RunRules.java:20)
	at org.junit.runners.ParentRunner.runLeaf(ParentRunner.java:325)
	at org.junit.runners.BlockJUnit4ClassRunner.runChild(BlockJUnit4ClassRunner.java:78)
	at org.junit.runners.BlockJUnit4ClassRunner.runChild(BlockJUnit4ClassRunner.java:57)
	at org.junit.runners.ParentRunner$3.run(ParentRunner.java:290)
	at org.junit.runners.ParentRunner$1.schedule(ParentRunner.java:71)
	at org.junit.runners.ParentRunner.runChildren(ParentRunner.java:288)
	at org.junit.runners.ParentRunner.access$000(ParentRunner.java:58)
	at org.junit.runners.ParentRunner$2.evaluate(ParentRunner.java:268)
	at org.junit.runners.ParentRunner.run(ParentRunner.java:363)
	at org.apache.maven.surefire.junit4.JUnit4Provider.execute(JUnit4Provider.java:365)
	at org.apache.maven.surefire.junit4.JUnit4Provider.executeWithRerun(JUnit4Provider.java:273)
	at org.apache.maven.surefire.junit4.JUnit4Provider.executeTestSet(JUnit4Provider.java:238)
	at org.apache.maven.surefire.junit4.JUnit4Provider.invoke(JUnit4Provider.java:159)
	at org.apache.maven.surefire.booter.ForkedBooter.invokeProviderInSameClassLoader(ForkedBooter.java:384)
	at org.apache.maven.surefire.booter.ForkedBooter.runSuitesInProcess(ForkedBooter.java:345)
	at org.apache.maven.surefire.booter.ForkedBooter.execute(ForkedBooter.java:126)
	at org.apache.maven.surefire.booter.ForkedBooter.main(ForkedBooter.java:418)
[INFO] Tests run: 4, Failures: 0, Errors: 0, Skipped: 0, Time elapsed: 0.264 s - in org.eclipse.rdf4j.console.command.ConvertTest
[INFO] Running org.eclipse.rdf4j.console.command.ExportTest
[MockitoHint] ExportTest.testExportWorkDir (see javadoc for MockitoHint):
[MockitoHint] 1. Unused -> at org.eclipse.rdf4j.console.command.ExportTest.setUp(ExportTest.java:46)

[MockitoHint] ExportTest.testExportAll (see javadoc for MockitoHint):
[MockitoHint] 1. Unused -> at org.eclipse.rdf4j.console.command.ExportTest.setUp(ExportTest.java:46)

[MockitoHint] ExportTest.testExportContexts (see javadoc for MockitoHint):
[MockitoHint] 1. Unused -> at org.eclipse.rdf4j.console.command.ExportTest.setUp(ExportTest.java:46)

[INFO] Tests run: 3, Failures: 0, Errors: 0, Skipped: 0, Time elapsed: 0.092 s - in org.eclipse.rdf4j.console.command.ExportTest
[INFO] Running org.eclipse.rdf4j.console.command.VerifyTest
08:11:41.461 [main] ERROR Unexpected RDFParseException
org.eclipse.rdf4j.rio.RDFParseException: 'missing type' was not recognised, and could not be verified, with datatype http://example.rdf4j.org/type/wrong [line 1]
	at org.eclipse.rdf4j.rio.helpers.RDFParserHelper.reportError(RDFParserHelper.java:265)
	at org.eclipse.rdf4j.rio.helpers.RDFParserHelper.createLiteral(RDFParserHelper.java:180)
	at org.eclipse.rdf4j.rio.helpers.AbstractRDFParser.createLiteral(AbstractRDFParser.java:530)
	at org.eclipse.rdf4j.rio.turtle.TurtleParser.parseQuotedLiteral(TurtleParser.java:665)
	at org.eclipse.rdf4j.rio.turtle.TurtleParser.parseValue(TurtleParser.java:584)
	at org.eclipse.rdf4j.rio.turtle.TurtleParser.parseObject(TurtleParser.java:461)
	at org.eclipse.rdf4j.rio.turtle.TurtleParser.parseObjectList(TurtleParser.java:389)
	at org.eclipse.rdf4j.rio.turtle.TurtleParser.parsePredicateObjectList(TurtleParser.java:362)
	at org.eclipse.rdf4j.rio.turtle.TurtleParser.parseTriples(TurtleParser.java:349)
	at org.eclipse.rdf4j.rio.turtle.TurtleParser.parseStatement(TurtleParser.java:216)
	at org.eclipse.rdf4j.rio.turtle.TurtleParser.parse(TurtleParser.java:178)
	at org.eclipse.rdf4j.rio.turtle.TurtleParser.parse(TurtleParser.java:130)
	at org.eclipse.rdf4j.console.command.Verify.verify(Verify.java:145)
	at org.eclipse.rdf4j.console.command.Verify.execute(Verify.java:97)
	at org.eclipse.rdf4j.console.command.VerifyTest.testVerifyMissingType(VerifyTest.java:97)
	at sun.reflect.NativeMethodAccessorImpl.invoke0(Native Method)
	at sun.reflect.NativeMethodAccessorImpl.invoke(NativeMethodAccessorImpl.java:62)
	at sun.reflect.DelegatingMethodAccessorImpl.invoke(DelegatingMethodAccessorImpl.java:43)
	at java.lang.reflect.Method.invoke(Method.java:498)
	at org.junit.runners.model.FrameworkMethod$1.runReflectiveCall(FrameworkMethod.java:50)
	at org.junit.internal.runners.model.ReflectiveCallable.run(ReflectiveCallable.java:12)
	at org.junit.runners.model.FrameworkMethod.invokeExplosively(FrameworkMethod.java:47)
	at org.junit.internal.runners.statements.InvokeMethod.evaluate(InvokeMethod.java:17)
	at org.junit.internal.runners.statements.RunBefores.evaluate(RunBefores.java:26)
	at org.junit.internal.runners.statements.RunAfters.evaluate(RunAfters.java:27)
	at org.mockito.internal.junit.JUnitRule$1.evaluateSafely(JUnitRule.java:52)
	at org.mockito.internal.junit.JUnitRule$1.evaluate(JUnitRule.java:43)
	at org.junit.rules.ExternalResource$1.evaluate(ExternalResource.java:48)
	at org.junit.rules.RunRules.evaluate(RunRules.java:20)
	at org.junit.runners.ParentRunner.runLeaf(ParentRunner.java:325)
	at org.junit.runners.BlockJUnit4ClassRunner.runChild(BlockJUnit4ClassRunner.java:78)
	at org.junit.runners.BlockJUnit4ClassRunner.runChild(BlockJUnit4ClassRunner.java:57)
	at org.junit.runners.ParentRunner$3.run(ParentRunner.java:290)
	at org.junit.runners.ParentRunner$1.schedule(ParentRunner.java:71)
	at org.junit.runners.ParentRunner.runChildren(ParentRunner.java:288)
	at org.junit.runners.ParentRunner.access$000(ParentRunner.java:58)
	at org.junit.runners.ParentRunner$2.evaluate(ParentRunner.java:268)
	at org.junit.runners.ParentRunner.run(ParentRunner.java:363)
	at org.apache.maven.surefire.junit4.JUnit4Provider.execute(JUnit4Provider.java:365)
	at org.apache.maven.surefire.junit4.JUnit4Provider.executeWithRerun(JUnit4Provider.java:273)
	at org.apache.maven.surefire.junit4.JUnit4Provider.executeTestSet(JUnit4Provider.java:238)
	at org.apache.maven.surefire.junit4.JUnit4Provider.invoke(JUnit4Provider.java:159)
	at org.apache.maven.surefire.booter.ForkedBooter.invokeProviderInSameClassLoader(ForkedBooter.java:384)
	at org.apache.maven.surefire.booter.ForkedBooter.runSuitesInProcess(ForkedBooter.java:345)
	at org.apache.maven.surefire.booter.ForkedBooter.execute(ForkedBooter.java:126)
	at org.apache.maven.surefire.booter.ForkedBooter.main(ForkedBooter.java:418)
08:11:41.569 [main] ERROR SHACL validation failed, writing report to /tmp/genie.rdf4j/junit1726500780248898832/junit2680743420945144374.tmp
08:11:41.601 [main] ERROR Unexpected RDFParseException
org.eclipse.rdf4j.rio.RDFParseException: Unexpected end of file
	at org.eclipse.rdf4j.rio.turtle.TurtleParser.throwEOFException(TurtleParser.java:1317)
	at org.eclipse.rdf4j.rio.turtle.TurtleParser.parseValue(TurtleParser.java:589)
	at org.eclipse.rdf4j.rio.turtle.TurtleParser.parsePredicate(TurtleParser.java:434)
	at org.eclipse.rdf4j.rio.turtle.TurtleParser.parsePredicateObjectList(TurtleParser.java:358)
	at org.eclipse.rdf4j.rio.turtle.TurtleParser.parseTriples(TurtleParser.java:349)
	at org.eclipse.rdf4j.rio.turtle.TurtleParser.parseStatement(TurtleParser.java:216)
	at org.eclipse.rdf4j.rio.turtle.TurtleParser.parse(TurtleParser.java:178)
	at org.eclipse.rdf4j.rio.turtle.TurtleParser.parse(TurtleParser.java:130)
	at org.eclipse.rdf4j.console.command.Verify.verify(Verify.java:145)
	at org.eclipse.rdf4j.console.command.Verify.execute(Verify.java:97)
	at org.eclipse.rdf4j.console.command.VerifyTest.testVerifyBrokenFile(VerifyTest.java:91)
	at sun.reflect.NativeMethodAccessorImpl.invoke0(Native Method)
	at sun.reflect.NativeMethodAccessorImpl.invoke(NativeMethodAccessorImpl.java:62)
	at sun.reflect.DelegatingMethodAccessorImpl.invoke(DelegatingMethodAccessorImpl.java:43)
	at java.lang.reflect.Method.invoke(Method.java:498)
	at org.junit.runners.model.FrameworkMethod$1.runReflectiveCall(FrameworkMethod.java:50)
	at org.junit.internal.runners.model.ReflectiveCallable.run(ReflectiveCallable.java:12)
	at org.junit.runners.model.FrameworkMethod.invokeExplosively(FrameworkMethod.java:47)
	at org.junit.internal.runners.statements.InvokeMethod.evaluate(InvokeMethod.java:17)
	at org.junit.internal.runners.statements.RunBefores.evaluate(RunBefores.java:26)
	at org.junit.internal.runners.statements.RunAfters.evaluate(RunAfters.java:27)
	at org.mockito.internal.junit.JUnitRule$1.evaluateSafely(JUnitRule.java:52)
	at org.mockito.internal.junit.JUnitRule$1.evaluate(JUnitRule.java:43)
	at org.junit.rules.ExternalResource$1.evaluate(ExternalResource.java:48)
	at org.junit.rules.RunRules.evaluate(RunRules.java:20)
	at org.junit.runners.ParentRunner.runLeaf(ParentRunner.java:325)
	at org.junit.runners.BlockJUnit4ClassRunner.runChild(BlockJUnit4ClassRunner.java:78)
	at org.junit.runners.BlockJUnit4ClassRunner.runChild(BlockJUnit4ClassRunner.java:57)
	at org.junit.runners.ParentRunner$3.run(ParentRunner.java:290)
	at org.junit.runners.ParentRunner$1.schedule(ParentRunner.java:71)
	at org.junit.runners.ParentRunner.runChildren(ParentRunner.java:288)
	at org.junit.runners.ParentRunner.access$000(ParentRunner.java:58)
	at org.junit.runners.ParentRunner$2.evaluate(ParentRunner.java:268)
	at org.junit.runners.ParentRunner.run(ParentRunner.java:363)
	at org.apache.maven.surefire.junit4.JUnit4Provider.execute(JUnit4Provider.java:365)
	at org.apache.maven.surefire.junit4.JUnit4Provider.executeWithRerun(JUnit4Provider.java:273)
	at org.apache.maven.surefire.junit4.JUnit4Provider.executeTestSet(JUnit4Provider.java:238)
	at org.apache.maven.surefire.junit4.JUnit4Provider.invoke(JUnit4Provider.java:159)
	at org.apache.maven.surefire.booter.ForkedBooter.invokeProviderInSameClassLoader(ForkedBooter.java:384)
	at org.apache.maven.surefire.booter.ForkedBooter.runSuitesInProcess(ForkedBooter.java:345)
	at org.apache.maven.surefire.booter.ForkedBooter.execute(ForkedBooter.java:126)
	at org.apache.maven.surefire.booter.ForkedBooter.main(ForkedBooter.java:418)
08:11:41.631 [main] ERROR Unexpected RDFParseException
org.eclipse.rdf4j.rio.RDFParseException: Expected a letter, found '1' [line 1]
	at org.eclipse.rdf4j.rio.helpers.RDFParserHelper.reportError(RDFParserHelper.java:265)
	at org.eclipse.rdf4j.rio.helpers.AbstractRDFParser.reportError(AbstractRDFParser.java:628)
	at org.eclipse.rdf4j.rio.turtle.TurtleParser.reportError(TurtleParser.java:1297)
	at org.eclipse.rdf4j.rio.turtle.TurtleParser.parseQuotedLiteral(TurtleParser.java:619)
	at org.eclipse.rdf4j.rio.turtle.TurtleParser.parseValue(TurtleParser.java:584)
	at org.eclipse.rdf4j.rio.turtle.TurtleParser.parseObject(TurtleParser.java:461)
	at org.eclipse.rdf4j.rio.turtle.TurtleParser.parseObjectList(TurtleParser.java:389)
	at org.eclipse.rdf4j.rio.turtle.TurtleParser.parsePredicateObjectList(TurtleParser.java:362)
	at org.eclipse.rdf4j.rio.turtle.TurtleParser.parseTriples(TurtleParser.java:349)
	at org.eclipse.rdf4j.rio.turtle.TurtleParser.parseStatement(TurtleParser.java:216)
	at org.eclipse.rdf4j.rio.turtle.TurtleParser.parse(TurtleParser.java:178)
	at org.eclipse.rdf4j.rio.turtle.TurtleParser.parse(TurtleParser.java:130)
	at org.eclipse.rdf4j.console.command.Verify.verify(Verify.java:145)
	at org.eclipse.rdf4j.console.command.Verify.execute(Verify.java:97)
	at org.eclipse.rdf4j.console.command.VerifyTest.testVerifyWrongLang(VerifyTest.java:109)
	at sun.reflect.NativeMethodAccessorImpl.invoke0(Native Method)
	at sun.reflect.NativeMethodAccessorImpl.invoke(NativeMethodAccessorImpl.java:62)
	at sun.reflect.DelegatingMethodAccessorImpl.invoke(DelegatingMethodAccessorImpl.java:43)
	at java.lang.reflect.Method.invoke(Method.java:498)
	at org.junit.runners.model.FrameworkMethod$1.runReflectiveCall(FrameworkMethod.java:50)
	at org.junit.internal.runners.model.ReflectiveCallable.run(ReflectiveCallable.java:12)
	at org.junit.runners.model.FrameworkMethod.invokeExplosively(FrameworkMethod.java:47)
	at org.junit.internal.runners.statements.InvokeMethod.evaluate(InvokeMethod.java:17)
	at org.junit.internal.runners.statements.RunBefores.evaluate(RunBefores.java:26)
	at org.junit.internal.runners.statements.RunAfters.evaluate(RunAfters.java:27)
	at org.mockito.internal.junit.JUnitRule$1.evaluateSafely(JUnitRule.java:52)
	at org.mockito.internal.junit.JUnitRule$1.evaluate(JUnitRule.java:43)
	at org.junit.rules.ExternalResource$1.evaluate(ExternalResource.java:48)
	at org.junit.rules.RunRules.evaluate(RunRules.java:20)
	at org.junit.runners.ParentRunner.runLeaf(ParentRunner.java:325)
	at org.junit.runners.BlockJUnit4ClassRunner.runChild(BlockJUnit4ClassRunner.java:78)
	at org.junit.runners.BlockJUnit4ClassRunner.runChild(BlockJUnit4ClassRunner.java:57)
	at org.junit.runners.ParentRunner$3.run(ParentRunner.java:290)
	at org.junit.runners.ParentRunner$1.schedule(ParentRunner.java:71)
	at org.junit.runners.ParentRunner.runChildren(ParentRunner.java:288)
	at org.junit.runners.ParentRunner.access$000(ParentRunner.java:58)
	at org.junit.runners.ParentRunner$2.evaluate(ParentRunner.java:268)
	at org.junit.runners.ParentRunner.run(ParentRunner.java:363)
	at org.apache.maven.surefire.junit4.JUnit4Provider.execute(JUnit4Provider.java:365)
	at org.apache.maven.surefire.junit4.JUnit4Provider.executeWithRerun(JUnit4Provider.java:273)
	at org.apache.maven.surefire.junit4.JUnit4Provider.executeTestSet(JUnit4Provider.java:238)
	at org.apache.maven.surefire.junit4.JUnit4Provider.invoke(JUnit4Provider.java:159)
	at org.apache.maven.surefire.booter.ForkedBooter.invokeProviderInSameClassLoader(ForkedBooter.java:384)
	at org.apache.maven.surefire.booter.ForkedBooter.runSuitesInProcess(ForkedBooter.java:345)
	at org.apache.maven.surefire.booter.ForkedBooter.execute(ForkedBooter.java:126)
	at org.apache.maven.surefire.booter.ForkedBooter.main(ForkedBooter.java:418)
08:11:41.650 [main] ERROR No parser available for this RDF format
org.eclipse.rdf4j.rio.UnsupportedRDFormatException: Did not recognise RDF format string file:/home/hudson/genie.rdf4j/.jenkins/jobs/rdf4j-pr-verify/workspace/tools/console/does-not-exist.docx
	at org.eclipse.rdf4j.rio.Rio.lambda$unsupportedFormat$1(Rio.java:577)
	at java.util.Optional.orElseThrow(Optional.java:290)
	at org.eclipse.rdf4j.console.command.Verify.verify(Verify.java:124)
	at org.eclipse.rdf4j.console.command.Verify.execute(Verify.java:97)
	at org.eclipse.rdf4j.console.command.VerifyTest.testVerifyWrongFormat(VerifyTest.java:69)
	at sun.reflect.NativeMethodAccessorImpl.invoke0(Native Method)
	at sun.reflect.NativeMethodAccessorImpl.invoke(NativeMethodAccessorImpl.java:62)
	at sun.reflect.DelegatingMethodAccessorImpl.invoke(DelegatingMethodAccessorImpl.java:43)
	at java.lang.reflect.Method.invoke(Method.java:498)
	at org.junit.runners.model.FrameworkMethod$1.runReflectiveCall(FrameworkMethod.java:50)
	at org.junit.internal.runners.model.ReflectiveCallable.run(ReflectiveCallable.java:12)
	at org.junit.runners.model.FrameworkMethod.invokeExplosively(FrameworkMethod.java:47)
	at org.junit.internal.runners.statements.InvokeMethod.evaluate(InvokeMethod.java:17)
	at org.junit.internal.runners.statements.RunBefores.evaluate(RunBefores.java:26)
	at org.junit.internal.runners.statements.RunAfters.evaluate(RunAfters.java:27)
	at org.mockito.internal.junit.JUnitRule$1.evaluateSafely(JUnitRule.java:52)
	at org.mockito.internal.junit.JUnitRule$1.evaluate(JUnitRule.java:43)
	at org.junit.rules.ExternalResource$1.evaluate(ExternalResource.java:48)
	at org.junit.rules.RunRules.evaluate(RunRules.java:20)
	at org.junit.runners.ParentRunner.runLeaf(ParentRunner.java:325)
	at org.junit.runners.BlockJUnit4ClassRunner.runChild(BlockJUnit4ClassRunner.java:78)
	at org.junit.runners.BlockJUnit4ClassRunner.runChild(BlockJUnit4ClassRunner.java:57)
	at org.junit.runners.ParentRunner$3.run(ParentRunner.java:290)
	at org.junit.runners.ParentRunner$1.schedule(ParentRunner.java:71)
	at org.junit.runners.ParentRunner.runChildren(ParentRunner.java:288)
	at org.junit.runners.ParentRunner.access$000(ParentRunner.java:58)
	at org.junit.runners.ParentRunner$2.evaluate(ParentRunner.java:268)
	at org.junit.runners.ParentRunner.run(ParentRunner.java:363)
	at org.apache.maven.surefire.junit4.JUnit4Provider.execute(JUnit4Provider.java:365)
	at org.apache.maven.surefire.junit4.JUnit4Provider.executeWithRerun(JUnit4Provider.java:273)
	at org.apache.maven.surefire.junit4.JUnit4Provider.executeTestSet(JUnit4Provider.java:238)
	at org.apache.maven.surefire.junit4.JUnit4Provider.invoke(JUnit4Provider.java:159)
	at org.apache.maven.surefire.booter.ForkedBooter.invokeProviderInSameClassLoader(ForkedBooter.java:384)
	at org.apache.maven.surefire.booter.ForkedBooter.runSuitesInProcess(ForkedBooter.java:345)
	at org.apache.maven.surefire.booter.ForkedBooter.execute(ForkedBooter.java:126)
	at org.apache.maven.surefire.booter.ForkedBooter.main(ForkedBooter.java:418)
08:11:41.685 [main] ERROR Unexpected RDFParseException
org.eclipse.rdf4j.rio.RDFParseException: IRI included an unencoded space: '32' [line 1]
	at org.eclipse.rdf4j.rio.helpers.RDFParserHelper.reportError(RDFParserHelper.java:265)
	at org.eclipse.rdf4j.rio.helpers.AbstractRDFParser.reportError(AbstractRDFParser.java:628)
	at org.eclipse.rdf4j.rio.turtle.TurtleParser.reportError(TurtleParser.java:1297)
	at org.eclipse.rdf4j.rio.turtle.TurtleParser.parseURI(TurtleParser.java:902)
	at org.eclipse.rdf4j.rio.turtle.TurtleParser.parseValue(TurtleParser.java:575)
	at org.eclipse.rdf4j.rio.turtle.TurtleParser.parseSubject(TurtleParser.java:406)
	at org.eclipse.rdf4j.rio.turtle.TurtleParser.parseTriples(TurtleParser.java:347)
	at org.eclipse.rdf4j.rio.turtle.TurtleParser.parseStatement(TurtleParser.java:216)
	at org.eclipse.rdf4j.rio.turtle.TurtleParser.parse(TurtleParser.java:178)
	at org.eclipse.rdf4j.rio.turtle.TurtleParser.parse(TurtleParser.java:130)
	at org.eclipse.rdf4j.console.command.Verify.verify(Verify.java:145)
	at org.eclipse.rdf4j.console.command.Verify.execute(Verify.java:97)
	at org.eclipse.rdf4j.console.command.VerifyTest.testVerifySpaceIRI(VerifyTest.java:103)
	at sun.reflect.NativeMethodAccessorImpl.invoke0(Native Method)
	at sun.reflect.NativeMethodAccessorImpl.invoke(NativeMethodAccessorImpl.java:62)
	at sun.reflect.DelegatingMethodAccessorImpl.invoke(DelegatingMethodAccessorImpl.java:43)
	at java.lang.reflect.Method.invoke(Method.java:498)
	at org.junit.runners.model.FrameworkMethod$1.runReflectiveCall(FrameworkMethod.java:50)
	at org.junit.internal.runners.model.ReflectiveCallable.run(ReflectiveCallable.java:12)
	at org.junit.runners.model.FrameworkMethod.invokeExplosively(FrameworkMethod.java:47)
	at org.junit.internal.runners.statements.InvokeMethod.evaluate(InvokeMethod.java:17)
	at org.junit.internal.runners.statements.RunBefores.evaluate(RunBefores.java:26)
	at org.junit.internal.runners.statements.RunAfters.evaluate(RunAfters.java:27)
	at org.mockito.internal.junit.JUnitRule$1.evaluateSafely(JUnitRule.java:52)
	at org.mockito.internal.junit.JUnitRule$1.evaluate(JUnitRule.java:43)
	at org.junit.rules.ExternalResource$1.evaluate(ExternalResource.java:48)
	at org.junit.rules.RunRules.evaluate(RunRules.java:20)
	at org.junit.runners.ParentRunner.runLeaf(ParentRunner.java:325)
	at org.junit.runners.BlockJUnit4ClassRunner.runChild(BlockJUnit4ClassRunner.java:78)
	at org.junit.runners.BlockJUnit4ClassRunner.runChild(BlockJUnit4ClassRunner.java:57)
	at org.junit.runners.ParentRunner$3.run(ParentRunner.java:290)
	at org.junit.runners.ParentRunner$1.schedule(ParentRunner.java:71)
	at org.junit.runners.ParentRunner.runChildren(ParentRunner.java:288)
	at org.junit.runners.ParentRunner.access$000(ParentRunner.java:58)
	at org.junit.runners.ParentRunner$2.evaluate(ParentRunner.java:268)
	at org.junit.runners.ParentRunner.run(ParentRunner.java:363)
	at org.apache.maven.surefire.junit4.JUnit4Provider.execute(JUnit4Provider.java:365)
	at org.apache.maven.surefire.junit4.JUnit4Provider.executeWithRerun(JUnit4Provider.java:273)
	at org.apache.maven.surefire.junit4.JUnit4Provider.executeTestSet(JUnit4Provider.java:238)
	at org.apache.maven.surefire.junit4.JUnit4Provider.invoke(JUnit4Provider.java:159)
	at org.apache.maven.surefire.booter.ForkedBooter.invokeProviderInSameClassLoader(ForkedBooter.java:384)
	at org.apache.maven.surefire.booter.ForkedBooter.runSuitesInProcess(ForkedBooter.java:345)
	at org.apache.maven.surefire.booter.ForkedBooter.execute(ForkedBooter.java:126)
	at org.apache.maven.surefire.booter.ForkedBooter.main(ForkedBooter.java:418)
[INFO] Tests run: 10, Failures: 0, Errors: 0, Skipped: 0, Time elapsed: 0.766 s - in org.eclipse.rdf4j.console.command.VerifyTest
[INFO] Running org.eclipse.rdf4j.console.command.DropTest
[MockitoHint] DropTest.testUserAbortedUnsafeDropBeforeWarning (see javadoc for MockitoHint):
[MockitoHint] 1. Unused -> at org.eclipse.rdf4j.console.command.DropTest.setUp(DropTest.java:50)

[INFO] Tests run: 3, Failures: 0, Errors: 0, Skipped: 0, Time elapsed: 0.141 s - in org.eclipse.rdf4j.console.command.DropTest
[INFO] Running org.eclipse.rdf4j.console.command.FederateTest
08:11:41.909 [main] DEBUG Initializing MemoryStore...
08:11:41.910 [main] DEBUG Initializing data file...
08:11:41.910 [main] DEBUG Data file initialized
08:11:41.910 [main] DEBUG MemoryStore initialized
08:11:41.911 [main] DEBUG syncing data to file...
08:11:41.912 [main] DEBUG Data synced to file
08:11:41.925 [main] DEBUG Initializing MemoryStore...
08:11:41.926 [main] DEBUG Initializing data file...
08:11:41.927 [main] DEBUG Data file initialized
08:11:41.927 [main] DEBUG MemoryStore initialized
08:11:41.933 [main] DEBUG syncing data to file...
08:11:41.934 [main] DEBUG Data synced to file
08:11:41.958 [main] DEBUG Federate called with federation ID = fedID, and member ID's = [sparql][alien][http].
  Distinct set to false, and readonly set to true.

08:11:41.962 [main] DEBUG Federation repository root node: _:node1drlcir2hx216
08:11:41.964 [main] DEBUG _:node1drlcir2hx216 http://www.w3.org/1999/02/22-rdf-syntax-ns#type http://www.openrdf.org/config/repository#Repository
08:11:41.964 [main] DEBUG _:node1drlcir2hx216 http://www.openrdf.org/config/repository#repositoryID "fedID"
08:11:41.964 [main] DEBUG _:node1drlcir2hx216 http://www.w3.org/2000/01/rdf-schema#label "Test Federation Title"
08:11:41.964 [main] DEBUG _:node1drlcir2hx216 http://www.openrdf.org/config/repository#repositoryImpl _:node1drlcir2hx217
08:11:41.964 [main] DEBUG _:node1drlcir2hx217 http://www.openrdf.org/config/repository#repositoryType "openrdf:SailRepository"
08:11:41.964 [main] DEBUG _:node1drlcir2hx217 http://www.openrdf.org/config/repository/sail#sailImpl _:node1drlcir2hx218
08:11:41.964 [main] DEBUG _:node1drlcir2hx218 http://www.openrdf.org/config/sail#sailType "openrdf:Federation"
08:11:41.965 [main] DEBUG _:node1drlcir2hx218 http://www.openrdf.org/config/sail/federation#readOnly "true"^^<http://www.w3.org/2001/XMLSchema#boolean>
08:11:41.965 [main] DEBUG _:node1drlcir2hx218 http://www.openrdf.org/config/sail/federation#distinct "false"^^<http://www.w3.org/2001/XMLSchema#boolean>
08:11:41.965 [main] DEBUG Adding member: sparql
08:11:41.965 [main] DEBUG _:node1drlcir2hx218 http://www.openrdf.org/config/sail/federation#member _:node1drlcir2hx219
08:11:41.966 [main] DEBUG _:node1drlcir2hx219 http://www.openrdf.org/config/repository#repositoryType "openrdf:SPARQLRepository"
08:11:41.967 [main] DEBUG _:node1drlcir2hx219 http://www.openrdf.org/config/repository/sparql#query-endpoint http://localhost:8080/openrdf-sesame/repositories/sparql
08:11:41.967 [main] DEBUG Added member sparql: 
08:11:41.967 [main] DEBUG Adding member: alien
08:11:41.967 [main] DEBUG _:node1drlcir2hx218 http://www.openrdf.org/config/sail/federation#member _:node1drlcir2hx222
08:11:41.968 [main] DEBUG _:node1drlcir2hx222 http://www.openrdf.org/config/repository#repositoryType "openrdf:ProxyRepository"
08:11:41.968 [main] DEBUG _:node1drlcir2hx222 http://www.openrdf.org/config/repository/proxy#proxiedID "alien"
08:11:41.968 [main] DEBUG Added member alien: 
08:11:41.968 [main] DEBUG Adding member: http
08:11:41.968 [main] DEBUG _:node1drlcir2hx218 http://www.openrdf.org/config/sail/federation#member _:node1drlcir2hx225
08:11:41.968 [main] DEBUG _:node1drlcir2hx225 http://www.openrdf.org/config/repository#repositoryType "openrdf:HTTPRepository"
08:11:41.969 [main] DEBUG _:node1drlcir2hx225 http://www.openrdf.org/config/repository/http#repositoryURL http://localhost:8080/openrdf-sesame/repositories/http
08:11:41.969 [main] DEBUG Added member http: 
08:11:42.001 [main] DEBUG Initializing MemoryStore...
08:11:42.002 [main] DEBUG Initializing data file...
08:11:42.002 [main] DEBUG Data file initialized
08:11:42.002 [main] DEBUG MemoryStore initialized
08:11:42.005 [main] DEBUG syncing data to file...
08:11:42.006 [main] DEBUG Data synced to file
08:11:42.010 [main] DEBUG Initializing MemoryStore...
08:11:42.011 [main] DEBUG Initializing data file...
08:11:42.012 [main] DEBUG Data file initialized
08:11:42.012 [main] DEBUG MemoryStore initialized
08:11:42.014 [main] DEBUG syncing data to file...
08:11:42.015 [main] DEBUG Data synced to file
08:11:42.026 [main] ERROR Duplicate repository id's specified.
[MockitoHint] FederateTest.testDuplicateMembersPrintsError (see javadoc for MockitoHint):
[MockitoHint] 1. Unused -> at org.eclipse.rdf4j.console.command.FederateTest.setUp(FederateTest.java:87)
[MockitoHint] 2. Unused -> at org.eclipse.rdf4j.console.command.FederateTest.setUp(FederateTest.java:88)

08:11:42.034 [main] DEBUG Initializing MemoryStore...
08:11:42.035 [main] DEBUG Initializing data file...
08:11:42.035 [main] DEBUG Data file initialized
08:11:42.035 [main] DEBUG MemoryStore initialized
08:11:42.037 [main] DEBUG syncing data to file...
08:11:42.037 [main] DEBUG Data synced to file
08:11:42.041 [main] DEBUG Initializing MemoryStore...
08:11:42.042 [main] DEBUG Initializing data file...
08:11:42.042 [main] DEBUG Data file initialized
08:11:42.042 [main] DEBUG MemoryStore initialized
08:11:42.043 [main] DEBUG syncing data to file...
08:11:42.044 [main] DEBUG Data synced to file
08:11:42.052 [main] DEBUG Federate called with federation ID = alien, and member ID's = [fedID][scary].
  Distinct set to false, and readonly set to true.

08:11:42.053 [main] ERROR alien already exists.
[MockitoHint] FederateTest.testFedAlreadyExistsPrintsSpecificError (see javadoc for MockitoHint):
[MockitoHint] 1. Unused -> at org.eclipse.rdf4j.console.command.FederateTest.setUp(FederateTest.java:88)

08:11:42.061 [main] DEBUG Initializing MemoryStore...
08:11:42.061 [main] DEBUG Initializing data file...
08:11:42.062 [main] DEBUG Data file initialized
08:11:42.062 [main] DEBUG MemoryStore initialized
08:11:42.063 [main] DEBUG syncing data to file...
08:11:42.064 [main] DEBUG Data synced to file
08:11:42.068 [main] DEBUG Initializing MemoryStore...
08:11:42.068 [main] DEBUG Initializing data file...
08:11:42.069 [main] DEBUG Data file initialized
08:11:42.069 [main] DEBUG MemoryStore initialized
08:11:42.071 [main] DEBUG syncing data to file...
08:11:42.071 [main] DEBUG Data synced to file
08:11:42.084 [main] DEBUG Federate called with federation ID = fedID, and member ID's = [alien][scary].
  Distinct set to true, and readonly set to false.

08:11:42.086 [main] DEBUG Federation repository root node: _:node1drlcir2hx338
08:11:42.086 [main] DEBUG _:node1drlcir2hx338 http://www.w3.org/1999/02/22-rdf-syntax-ns#type http://www.openrdf.org/config/repository#Repository
08:11:42.086 [main] DEBUG _:node1drlcir2hx338 http://www.openrdf.org/config/repository#repositoryID "fedID"
08:11:42.086 [main] DEBUG _:node1drlcir2hx338 http://www.w3.org/2000/01/rdf-schema#label "Test Federation Title"
08:11:42.086 [main] DEBUG _:node1drlcir2hx338 http://www.openrdf.org/config/repository#repositoryImpl _:node1drlcir2hx339
08:11:42.086 [main] DEBUG _:node1drlcir2hx339 http://www.openrdf.org/config/repository#repositoryType "openrdf:SailRepository"
08:11:42.086 [main] DEBUG _:node1drlcir2hx339 http://www.openrdf.org/config/repository/sail#sailImpl _:node1drlcir2hx340
08:11:42.086 [main] DEBUG _:node1drlcir2hx340 http://www.openrdf.org/config/sail#sailType "openrdf:Federation"
08:11:42.086 [main] DEBUG _:node1drlcir2hx340 http://www.openrdf.org/config/sail/federation#readOnly "false"^^<http://www.w3.org/2001/XMLSchema#boolean>
08:11:42.086 [main] DEBUG _:node1drlcir2hx340 http://www.openrdf.org/config/sail/federation#distinct "true"^^<http://www.w3.org/2001/XMLSchema#boolean>
08:11:42.086 [main] DEBUG Adding member: alien
08:11:42.086 [main] DEBUG _:node1drlcir2hx340 http://www.openrdf.org/config/sail/federation#member _:node1drlcir2hx341
08:11:42.087 [main] DEBUG _:node1drlcir2hx341 http://www.openrdf.org/config/repository#repositoryType "openrdf:ProxyRepository"
08:11:42.087 [main] DEBUG _:node1drlcir2hx341 http://www.openrdf.org/config/repository/proxy#proxiedID "alien"
08:11:42.087 [main] DEBUG Added member alien: 
08:11:42.087 [main] DEBUG Adding member: scary
08:11:42.087 [main] DEBUG _:node1drlcir2hx340 http://www.openrdf.org/config/sail/federation#member _:node1drlcir2hx344
08:11:42.088 [main] DEBUG _:node1drlcir2hx344 http://www.openrdf.org/config/repository#repositoryType "openrdf:ProxyRepository"
08:11:42.088 [main] DEBUG _:node1drlcir2hx344 http://www.openrdf.org/config/repository/proxy#proxiedID "scary"
08:11:42.088 [main] DEBUG Added member scary: 
08:11:42.111 [main] DEBUG Initializing MemoryStore...
08:11:42.112 [main] DEBUG Initializing data file...
08:11:42.112 [main] DEBUG Data file initialized
08:11:42.112 [main] DEBUG MemoryStore initialized
08:11:42.114 [main] DEBUG syncing data to file...
08:11:42.115 [main] DEBUG Data synced to file
08:11:42.118 [main] DEBUG Initializing MemoryStore...
08:11:42.119 [main] DEBUG Initializing data file...
08:11:42.119 [main] DEBUG Data file initialized
08:11:42.119 [main] DEBUG MemoryStore initialized
08:11:42.121 [main] DEBUG syncing data to file...
08:11:42.121 [main] DEBUG Data synced to file
08:11:42.130 [main] DEBUG Federate called with federation ID = fedID, and member ID's = [sparql][sparql2].
  Distinct set to false, and readonly set to false.

08:11:42.132 [main] ERROR sparql is read-only.
08:11:42.133 [main] ERROR sparql2 is read-only.
[MockitoHint] FederateTest.testSparqlAndNotReadOnlyPrintsError (see javadoc for MockitoHint):
[MockitoHint] 1. Unused -> at org.eclipse.rdf4j.console.command.FederateTest.setUp(FederateTest.java:88)

08:11:42.142 [main] DEBUG Initializing MemoryStore...
08:11:42.143 [main] DEBUG Initializing data file...
08:11:42.143 [main] DEBUG Data file initialized
08:11:42.143 [main] DEBUG MemoryStore initialized
08:11:42.146 [main] DEBUG syncing data to file...
08:11:42.147 [main] DEBUG Data synced to file
08:11:42.151 [main] DEBUG Initializing MemoryStore...
08:11:42.151 [main] DEBUG Initializing data file...
08:11:42.152 [main] DEBUG Data file initialized
08:11:42.152 [main] DEBUG MemoryStore initialized
08:11:42.153 [main] DEBUG syncing data to file...
08:11:42.154 [main] DEBUG Data synced to file
[MockitoHint] FederateTest.testNoArgumentsPrintsHelp (see javadoc for MockitoHint):
[MockitoHint] 1. Unused -> at org.eclipse.rdf4j.console.command.FederateTest.setUp(FederateTest.java:87)
[MockitoHint] 2. Unused -> at org.eclipse.rdf4j.console.command.FederateTest.setUp(FederateTest.java:88)

08:11:42.174 [main] DEBUG Initializing MemoryStore...
08:11:42.176 [main] DEBUG Initializing data file...
08:11:42.176 [main] DEBUG Data file initialized
08:11:42.176 [main] DEBUG MemoryStore initialized
08:11:42.178 [main] DEBUG syncing data to file...
08:11:42.179 [main] DEBUG Data synced to file
08:11:42.183 [main] DEBUG Initializing MemoryStore...
08:11:42.184 [main] DEBUG Initializing data file...
08:11:42.185 [main] DEBUG Data file initialized
08:11:42.185 [main] DEBUG MemoryStore initialized
08:11:42.186 [main] DEBUG syncing data to file...
08:11:42.187 [main] DEBUG Data synced to file
08:11:42.194 [main] DEBUG Federate called with federation ID = type=memory, and member ID's = [fedID][alien][scary].
  Distinct set to false, and readonly set to true.

08:11:42.194 [main] ERROR fedID does not exist.
[MockitoHint] FederateTest.testInvalidArgumentPrintsError (see javadoc for MockitoHint):
[MockitoHint] 1. Unused -> at org.eclipse.rdf4j.console.command.FederateTest.setUp(FederateTest.java:88)

08:11:42.203 [main] DEBUG Initializing MemoryStore...
08:11:42.204 [main] DEBUG Initializing data file...
08:11:42.204 [main] DEBUG Data file initialized
08:11:42.204 [main] DEBUG MemoryStore initialized
08:11:42.205 [main] DEBUG syncing data to file...
08:11:42.206 [main] DEBUG Data synced to file
08:11:42.209 [main] DEBUG Initializing MemoryStore...
08:11:42.210 [main] DEBUG Initializing data file...
08:11:42.210 [main] DEBUG Data file initialized
08:11:42.210 [main] DEBUG MemoryStore initialized
08:11:42.211 [main] DEBUG syncing data to file...
08:11:42.212 [main] DEBUG Data synced to file
08:11:42.219 [main] DEBUG Federate called with federation ID = fedID, and member ID's = [sparql][sparql2].
  Distinct set to false, and readonly set to true.

08:11:42.221 [main] DEBUG Federation repository root node: _:node1drlcir2hx494
08:11:42.221 [main] DEBUG _:node1drlcir2hx494 http://www.w3.org/1999/02/22-rdf-syntax-ns#type http://www.openrdf.org/config/repository#Repository
08:11:42.221 [main] DEBUG _:node1drlcir2hx494 http://www.openrdf.org/config/repository#repositoryID "fedID"
08:11:42.221 [main] DEBUG _:node1drlcir2hx494 http://www.w3.org/2000/01/rdf-schema#label "Test Federation Title"
08:11:42.221 [main] DEBUG _:node1drlcir2hx494 http://www.openrdf.org/config/repository#repositoryImpl _:node1drlcir2hx495
08:11:42.221 [main] DEBUG _:node1drlcir2hx495 http://www.openrdf.org/config/repository#repositoryType "openrdf:SailRepository"
08:11:42.221 [main] DEBUG _:node1drlcir2hx495 http://www.openrdf.org/config/repository/sail#sailImpl _:node1drlcir2hx496
08:11:42.221 [main] DEBUG _:node1drlcir2hx496 http://www.openrdf.org/config/sail#sailType "openrdf:Federation"
08:11:42.221 [main] DEBUG _:node1drlcir2hx496 http://www.openrdf.org/config/sail/federation#readOnly "true"^^<http://www.w3.org/2001/XMLSchema#boolean>
08:11:42.221 [main] DEBUG _:node1drlcir2hx496 http://www.openrdf.org/config/sail/federation#distinct "false"^^<http://www.w3.org/2001/XMLSchema#boolean>
08:11:42.221 [main] DEBUG Adding member: sparql
08:11:42.221 [main] DEBUG _:node1drlcir2hx496 http://www.openrdf.org/config/sail/federation#member _:node1drlcir2hx497
08:11:42.222 [main] DEBUG _:node1drlcir2hx497 http://www.openrdf.org/config/repository#repositoryType "openrdf:SPARQLRepository"
08:11:42.223 [main] DEBUG _:node1drlcir2hx497 http://www.openrdf.org/config/repository/sparql#query-endpoint http://localhost:8080/openrdf-sesame/repositories/sparql
08:11:42.223 [main] DEBUG Added member sparql: 
08:11:42.223 [main] DEBUG Adding member: sparql2
08:11:42.223 [main] DEBUG _:node1drlcir2hx496 http://www.openrdf.org/config/sail/federation#member _:node1drlcir2hx500
08:11:42.223 [main] DEBUG _:node1drlcir2hx500 http://www.openrdf.org/config/repository#repositoryType "openrdf:SPARQLRepository"
08:11:42.224 [main] DEBUG _:node1drlcir2hx500 http://www.openrdf.org/config/repository/sparql#query-endpoint http://localhost:8080/openrdf-sesame/repositories/sparql
08:11:42.224 [main] DEBUG Added member sparql2: 
08:11:42.236 [main] DEBUG Initializing MemoryStore...
08:11:42.237 [main] DEBUG Initializing data file...
08:11:42.237 [main] DEBUG Data file initialized
08:11:42.237 [main] DEBUG MemoryStore initialized
08:11:42.239 [main] DEBUG syncing data to file...
08:11:42.239 [main] DEBUG Data synced to file
08:11:42.242 [main] DEBUG Initializing MemoryStore...
08:11:42.242 [main] DEBUG Initializing data file...
08:11:42.243 [main] DEBUG Data file initialized
08:11:42.243 [main] DEBUG MemoryStore initialized
08:11:42.244 [main] DEBUG syncing data to file...
08:11:42.245 [main] DEBUG Data synced to file
08:11:42.251 [main] DEBUG Federate called with federation ID = fedID, and member ID's = [http][sparql].
  Distinct set to false, and readonly set to true.

08:11:42.253 [main] DEBUG Federation repository root node: _:node1drlcir2hx549
08:11:42.253 [main] DEBUG _:node1drlcir2hx549 http://www.w3.org/1999/02/22-rdf-syntax-ns#type http://www.openrdf.org/config/repository#Repository
08:11:42.253 [main] DEBUG _:node1drlcir2hx549 http://www.openrdf.org/config/repository#repositoryID "fedID"
08:11:42.253 [main] DEBUG _:node1drlcir2hx549 http://www.w3.org/2000/01/rdf-schema#label "Test Federation Title"
08:11:42.253 [main] DEBUG _:node1drlcir2hx549 http://www.openrdf.org/config/repository#repositoryImpl _:node1drlcir2hx550
08:11:42.253 [main] DEBUG _:node1drlcir2hx550 http://www.openrdf.org/config/repository#repositoryType "openrdf:SailRepository"
08:11:42.253 [main] DEBUG _:node1drlcir2hx550 http://www.openrdf.org/config/repository/sail#sailImpl _:node1drlcir2hx551
08:11:42.253 [main] DEBUG _:node1drlcir2hx551 http://www.openrdf.org/config/sail#sailType "openrdf:Federation"
08:11:42.253 [main] DEBUG _:node1drlcir2hx551 http://www.openrdf.org/config/sail/federation#readOnly "true"^^<http://www.w3.org/2001/XMLSchema#boolean>
08:11:42.253 [main] DEBUG _:node1drlcir2hx551 http://www.openrdf.org/config/sail/federation#distinct "false"^^<http://www.w3.org/2001/XMLSchema#boolean>
08:11:42.253 [main] DEBUG Adding member: http
08:11:42.253 [main] DEBUG _:node1drlcir2hx551 http://www.openrdf.org/config/sail/federation#member _:node1drlcir2hx552
08:11:42.254 [main] DEBUG _:node1drlcir2hx552 http://www.openrdf.org/config/repository#repositoryType "openrdf:HTTPRepository"
08:11:42.254 [main] DEBUG _:node1drlcir2hx552 http://www.openrdf.org/config/repository/http#repositoryURL http://localhost:8080/openrdf-sesame/repositories/http
08:11:42.254 [main] DEBUG Added member http: 
08:11:42.254 [main] DEBUG Adding member: sparql
08:11:42.254 [main] DEBUG _:node1drlcir2hx551 http://www.openrdf.org/config/sail/federation#member _:node1drlcir2hx555
08:11:42.257 [main] DEBUG _:node1drlcir2hx555 http://www.openrdf.org/config/repository#repositoryType "openrdf:SPARQLRepository"
08:11:42.257 [main] DEBUG _:node1drlcir2hx555 http://www.openrdf.org/config/repository/sparql#query-endpoint http://localhost:8080/openrdf-sesame/repositories/sparql
08:11:42.257 [main] DEBUG Added member sparql: 
08:11:42.269 [main] DEBUG Initializing MemoryStore...
08:11:42.270 [main] DEBUG Initializing data file...
08:11:42.271 [main] DEBUG Data file initialized
08:11:42.271 [main] DEBUG MemoryStore initialized
08:11:42.272 [main] DEBUG syncing data to file...
08:11:42.273 [main] DEBUG Data synced to file
08:11:42.276 [main] DEBUG Initializing MemoryStore...
08:11:42.277 [main] DEBUG Initializing data file...
08:11:42.277 [main] DEBUG Data file initialized
08:11:42.277 [main] DEBUG MemoryStore initialized
08:11:42.278 [main] DEBUG syncing data to file...
08:11:42.279 [main] DEBUG Data synced to file
08:11:42.286 [main] DEBUG Federate called with federation ID = fedID, and member ID's = [alien][FreeLunch].
  Distinct set to false, and readonly set to true.

08:11:42.287 [main] ERROR FreeLunch does not exist.
[MockitoHint] FederateTest.testNonexistentMemberPrintsSpecificError (see javadoc for MockitoHint):
[MockitoHint] 1. Unused -> at org.eclipse.rdf4j.console.command.FederateTest.setUp(FederateTest.java:88)

08:11:42.295 [main] DEBUG Initializing MemoryStore...
08:11:42.296 [main] DEBUG Initializing data file...
08:11:42.297 [main] DEBUG Data file initialized
08:11:42.297 [main] DEBUG MemoryStore initialized
08:11:42.300 [main] DEBUG syncing data to file...
08:11:42.300 [main] DEBUG Data synced to file
08:11:42.304 [main] DEBUG Initializing MemoryStore...
08:11:42.305 [main] DEBUG Initializing data file...
08:11:42.305 [main] DEBUG Data file initialized
08:11:42.305 [main] DEBUG MemoryStore initialized
08:11:42.307 [main] DEBUG syncing data to file...
08:11:42.307 [main] DEBUG Data synced to file
08:11:42.314 [main] ERROR Duplicate repository id's specified.
[MockitoHint] FederateTest.testFedSameAsMemberPrintsError (see javadoc for MockitoHint):
[MockitoHint] 1. Unused -> at org.eclipse.rdf4j.console.command.FederateTest.setUp(FederateTest.java:87)
[MockitoHint] 2. Unused -> at org.eclipse.rdf4j.console.command.FederateTest.setUp(FederateTest.java:88)

08:11:42.321 [main] DEBUG Initializing MemoryStore...
08:11:42.322 [main] DEBUG Initializing data file...
08:11:42.322 [main] DEBUG Data file initialized
08:11:42.322 [main] DEBUG MemoryStore initialized
08:11:42.323 [main] DEBUG syncing data to file...
08:11:42.324 [main] DEBUG Data synced to file
08:11:42.327 [main] DEBUG Initializing MemoryStore...
08:11:42.327 [main] DEBUG Initializing data file...
08:11:42.327 [main] DEBUG Data file initialized
08:11:42.327 [main] DEBUG MemoryStore initialized
08:11:42.329 [main] DEBUG syncing data to file...
08:11:42.329 [main] DEBUG Data synced to file
[MockitoHint] FederateTest.testTwoArgumentsPrintsHelp (see javadoc for MockitoHint):
[MockitoHint] 1. Unused -> at org.eclipse.rdf4j.console.command.FederateTest.setUp(FederateTest.java:87)
[MockitoHint] 2. Unused -> at org.eclipse.rdf4j.console.command.FederateTest.setUp(FederateTest.java:88)

08:11:42.343 [main] DEBUG Initializing MemoryStore...
08:11:42.344 [main] DEBUG Initializing data file...
08:11:42.344 [main] DEBUG Data file initialized
08:11:42.344 [main] DEBUG MemoryStore initialized
08:11:42.345 [main] DEBUG syncing data to file...
08:11:42.346 [main] DEBUG Data synced to file
08:11:42.348 [main] DEBUG Initializing MemoryStore...
08:11:42.349 [main] DEBUG Initializing data file...
08:11:42.349 [main] DEBUG Data file initialized
08:11:42.349 [main] DEBUG MemoryStore initialized
08:11:42.350 [main] DEBUG syncing data to file...
08:11:42.351 [main] DEBUG Data synced to file
08:11:42.357 [main] DEBUG Federate called with federation ID = fedID, and member ID's = [alien][scary].
  Distinct set to false, and readonly set to true.

08:11:42.359 [main] DEBUG Federation repository root node: _:node1drlcir2hx692
08:11:42.359 [main] DEBUG _:node1drlcir2hx692 http://www.w3.org/1999/02/22-rdf-syntax-ns#type http://www.openrdf.org/config/repository#Repository
08:11:42.359 [main] DEBUG _:node1drlcir2hx692 http://www.openrdf.org/config/repository#repositoryID "fedID"
08:11:42.359 [main] DEBUG _:node1drlcir2hx692 http://www.w3.org/2000/01/rdf-schema#label "Test Federation Title"
08:11:42.359 [main] DEBUG _:node1drlcir2hx692 http://www.openrdf.org/config/repository#repositoryImpl _:node1drlcir2hx693
08:11:42.359 [main] DEBUG _:node1drlcir2hx693 http://www.openrdf.org/config/repository#repositoryType "openrdf:SailRepository"
08:11:42.359 [main] DEBUG _:node1drlcir2hx693 http://www.openrdf.org/config/repository/sail#sailImpl _:node1drlcir2hx694
08:11:42.359 [main] DEBUG _:node1drlcir2hx694 http://www.openrdf.org/config/sail#sailType "openrdf:Federation"
08:11:42.359 [main] DEBUG _:node1drlcir2hx694 http://www.openrdf.org/config/sail/federation#readOnly "true"^^<http://www.w3.org/2001/XMLSchema#boolean>
08:11:42.359 [main] DEBUG _:node1drlcir2hx694 http://www.openrdf.org/config/sail/federation#distinct "false"^^<http://www.w3.org/2001/XMLSchema#boolean>
08:11:42.359 [main] DEBUG Adding member: alien
08:11:42.359 [main] DEBUG _:node1drlcir2hx694 http://www.openrdf.org/config/sail/federation#member _:node1drlcir2hx695
08:11:42.360 [main] DEBUG _:node1drlcir2hx695 http://www.openrdf.org/config/repository#repositoryType "openrdf:ProxyRepository"
08:11:42.360 [main] DEBUG _:node1drlcir2hx695 http://www.openrdf.org/config/repository/proxy#proxiedID "alien"
08:11:42.360 [main] DEBUG Added member alien: 
08:11:42.360 [main] DEBUG Adding member: scary
08:11:42.360 [main] DEBUG _:node1drlcir2hx694 http://www.openrdf.org/config/sail/federation#member _:node1drlcir2hx698
08:11:42.360 [main] DEBUG _:node1drlcir2hx698 http://www.openrdf.org/config/repository#repositoryType "openrdf:ProxyRepository"
08:11:42.360 [main] DEBUG _:node1drlcir2hx698 http://www.openrdf.org/config/repository/proxy#proxiedID "scary"
08:11:42.360 [main] DEBUG Added member scary: 
08:11:42.384 [main] DEBUG Initializing MemoryStore...
08:11:42.386 [main] DEBUG Initializing data file...
08:11:42.386 [main] DEBUG Data file initialized
08:11:42.386 [main] DEBUG MemoryStore initialized
08:11:42.389 [main] DEBUG syncing data to file...
08:11:42.389 [main] DEBUG Data synced to file
08:11:42.394 [main] DEBUG Initializing MemoryStore...
08:11:42.395 [main] DEBUG Initializing data file...
08:11:42.396 [main] DEBUG Data file initialized
08:11:42.396 [main] DEBUG MemoryStore initialized
08:11:42.398 [main] DEBUG syncing data to file...
08:11:42.398 [main] DEBUG Data synced to file
[MockitoHint] FederateTest.testOneArgumentPrintsHelp (see javadoc for MockitoHint):
[MockitoHint] 1. Unused -> at org.eclipse.rdf4j.console.command.FederateTest.setUp(FederateTest.java:87)
[MockitoHint] 2. Unused -> at org.eclipse.rdf4j.console.command.FederateTest.setUp(FederateTest.java:88)

08:11:42.413 [main] DEBUG Initializing MemoryStore...
08:11:42.414 [main] DEBUG Initializing data file...
08:11:42.414 [main] DEBUG Data file initialized
08:11:42.414 [main] DEBUG MemoryStore initialized
08:11:42.416 [main] DEBUG syncing data to file...
08:11:42.416 [main] DEBUG Data synced to file
08:11:42.419 [main] DEBUG Initializing MemoryStore...
08:11:42.420 [main] DEBUG Initializing data file...
08:11:42.420 [main] DEBUG Data file initialized
08:11:42.420 [main] DEBUG MemoryStore initialized
08:11:42.422 [main] DEBUG syncing data to file...
08:11:42.422 [main] DEBUG Data synced to file
08:11:42.430 [main] DEBUG Federate called with federation ID = fedID, and member ID's = [http][http2].
  Distinct set to false, and readonly set to true.

08:11:42.431 [main] DEBUG Federation repository root node: _:node1drlcir2hx784
08:11:42.431 [main] DEBUG _:node1drlcir2hx784 http://www.w3.org/1999/02/22-rdf-syntax-ns#type http://www.openrdf.org/config/repository#Repository
08:11:42.432 [main] DEBUG _:node1drlcir2hx784 http://www.openrdf.org/config/repository#repositoryID "fedID"
08:11:42.432 [main] DEBUG _:node1drlcir2hx784 http://www.w3.org/2000/01/rdf-schema#label "Test Federation Title"
08:11:42.432 [main] DEBUG _:node1drlcir2hx784 http://www.openrdf.org/config/repository#repositoryImpl _:node1drlcir2hx785
08:11:42.432 [main] DEBUG _:node1drlcir2hx785 http://www.openrdf.org/config/repository#repositoryType "openrdf:SailRepository"
08:11:42.432 [main] DEBUG _:node1drlcir2hx785 http://www.openrdf.org/config/repository/sail#sailImpl _:node1drlcir2hx786
08:11:42.432 [main] DEBUG _:node1drlcir2hx786 http://www.openrdf.org/config/sail#sailType "openrdf:Federation"
08:11:42.432 [main] DEBUG _:node1drlcir2hx786 http://www.openrdf.org/config/sail/federation#readOnly "true"^^<http://www.w3.org/2001/XMLSchema#boolean>
08:11:42.432 [main] DEBUG _:node1drlcir2hx786 http://www.openrdf.org/config/sail/federation#distinct "false"^^<http://www.w3.org/2001/XMLSchema#boolean>
08:11:42.432 [main] DEBUG Adding member: http
08:11:42.432 [main] DEBUG _:node1drlcir2hx786 http://www.openrdf.org/config/sail/federation#member _:node1drlcir2hx787
08:11:42.432 [main] DEBUG _:node1drlcir2hx787 http://www.openrdf.org/config/repository#repositoryType "openrdf:HTTPRepository"
08:11:42.433 [main] DEBUG _:node1drlcir2hx787 http://www.openrdf.org/config/repository/http#repositoryURL http://localhost:8080/openrdf-sesame/repositories/http
08:11:42.433 [main] DEBUG Added member http: 
08:11:42.433 [main] DEBUG Adding member: http2
08:11:42.433 [main] DEBUG _:node1drlcir2hx786 http://www.openrdf.org/config/sail/federation#member _:node1drlcir2hx790
08:11:42.433 [main] DEBUG _:node1drlcir2hx790 http://www.openrdf.org/config/repository#repositoryType "openrdf:HTTPRepository"
08:11:42.434 [main] DEBUG _:node1drlcir2hx790 http://www.openrdf.org/config/repository/http#repositoryURL http://localhost:8080/openrdf-sesame/repositories/http
08:11:42.434 [main] DEBUG Added member http2: 
[INFO] Tests run: 15, Failures: 0, Errors: 0, Skipped: 0, Time elapsed: 0.539 s - in org.eclipse.rdf4j.console.command.FederateTest
[INFO] Running org.eclipse.rdf4j.console.command.SparqlTest
[MockitoHint] SparqlTest.testInputFile (see javadoc for MockitoHint):
[MockitoHint] 1. Unused -> at org.eclipse.rdf4j.console.command.SparqlTest.setUp(SparqlTest.java:49)

08:11:42.507 [main] ERROR No suitable result writer found
[MockitoHint] SparqlTest.testSelectError (see javadoc for MockitoHint):
[MockitoHint] 1. Unused -> at org.eclipse.rdf4j.console.command.SparqlTest.setUp(SparqlTest.java:49)

[MockitoHint] SparqlTest.testSelectMissingBindings (see javadoc for MockitoHint):
[MockitoHint] 1. Unused -> at org.eclipse.rdf4j.console.command.SparqlTest.setUp(SparqlTest.java:49)

[MockitoHint] SparqlTest.testInputFileWorkdir (see javadoc for MockitoHint):
[MockitoHint] 1. Unused -> at org.eclipse.rdf4j.console.command.SparqlTest.setUp(SparqlTest.java:49)

[INFO] Tests run: 9, Failures: 0, Errors: 0, Skipped: 0, Time elapsed: 0.164 s - in org.eclipse.rdf4j.console.command.SparqlTest
[INFO] Running org.eclipse.rdf4j.console.UtilTest
 one, two
 three
 four
 five, six
 seven
 eight
[INFO] Tests run: 4, Failures: 0, Errors: 0, Skipped: 0, Time elapsed: 0.001 s - in org.eclipse.rdf4j.console.UtilTest
[INFO] Running org.eclipse.rdf4j.console.ConsoleIOTest
[INFO] Tests run: 3, Failures: 0, Errors: 0, Skipped: 0, Time elapsed: 0.048 s - in org.eclipse.rdf4j.console.ConsoleIOTest
[INFO] 
[INFO] Results:
[INFO] 
[INFO] Tests run: 64, Failures: 0, Errors: 0, Skipped: 0
[INFO] 
[JENKINS] Recording test results
[INFO] 
[INFO] --- animal-sniffer-maven-plugin:1.16:check (default) @ rdf4j-console ---
[INFO] Checking unresolved references to org.codehaus.mojo.signature:java18:1.0
[INFO] 
[INFO] --- maven-jar-plugin:2.3.1:jar (default-jar) @ rdf4j-console ---
[INFO] Building jar: /home/hudson/genie.rdf4j/.jenkins/jobs/rdf4j-pr-verify/workspace/tools/console/target/rdf4j-console-3.1.0-SNAPSHOT.jar