SuccessConsole Output

Started calculate disk usage of build
Finished Calculation of disk usage of build in 0 seconds
Started calculate disk usage of workspace
Finished Calculation of disk usage of workspace in 0 seconds
[INFO] 
[INFO] ------------------< org.eclipse.rdf4j:rdf4j-console >-------------------
[INFO] Building RDF4J: Console 3.1.0-SNAPSHOT                           [70/85]
[INFO] --------------------------------[ jar ]---------------------------------
[INFO] 
[INFO] --- buildnumber-maven-plugin:1.4:create (default) @ rdf4j-console ---
[INFO] ShortRevision tag detected. The value is '7'.
[INFO] Executing: /bin/sh -c cd '/home/hudson/genie.rdf4j/.jenkins/jobs/rdf4j-pr-verify/workspace/tools/console' && 'git' 'rev-parse' '--verify' '--short=7' 'HEAD'
[INFO] Working directory: /home/hudson/genie.rdf4j/.jenkins/jobs/rdf4j-pr-verify/workspace/tools/console
[INFO] Storing buildNumber: 7a5acf1 at timestamp: 1575874219551
[WARNING] Cannot get the branch information from the git repository: 
Detecting the current branch failed: fatal: ref HEAD is not a symbolic ref

[INFO] ShortRevision tag detected. The value is '7'.
[INFO] Executing: /bin/sh -c cd '/home/hudson/genie.rdf4j/.jenkins/jobs/rdf4j-pr-verify/workspace/tools/console' && 'git' 'rev-parse' '--verify' '--short=7' 'HEAD'
[INFO] Working directory: /home/hudson/genie.rdf4j/.jenkins/jobs/rdf4j-pr-verify/workspace/tools/console
[INFO] Storing buildScmBranch: UNKNOWN
[INFO] 
[INFO] --- maven-enforcer-plugin:1.4.1:enforce (enforce-bytecode-version) @ rdf4j-console ---
[INFO] Adding ignore: META-INF/**/module-info
[INFO] 
[INFO] --- formatter-maven-plugin:2.8.1:validate (default) @ rdf4j-console ---
[INFO] Using 'UTF-8' encoding to format source files.
[INFO] Number of files to be formatted: 61
[INFO] Html formatting is skipped
[INFO] Successfully formatted:          0 file(s)
[INFO] Fail to format:                  0 file(s)
[INFO] Skipped:                         61 file(s)
[INFO] Read only skipped:               0 file(s)
[INFO] Approximate time taken:          0s
[INFO] 
[INFO] --- maven-resources-plugin:3.0.2:resources (default-resources) @ rdf4j-console ---
[INFO] Using 'UTF-8' encoding to copy filtered resources.
[INFO] skip non existing resourceDirectory /home/hudson/genie.rdf4j/.jenkins/jobs/rdf4j-pr-verify/workspace/tools/console/src/main/resources
[INFO] 
[INFO] --- maven-compiler-plugin:3.7.0:compile (default-compile) @ rdf4j-console ---
[INFO] Changes detected - recompiling the module!
[INFO] Compiling 42 source files to /home/hudson/genie.rdf4j/.jenkins/jobs/rdf4j-pr-verify/workspace/tools/console/target/classes
[INFO] 
[INFO] --- maven-resources-plugin:3.0.2:testResources (default-testResources) @ rdf4j-console ---
[INFO] Using 'UTF-8' encoding to copy filtered resources.
[INFO] Copying 29 resources
[INFO] 
[INFO] --- maven-compiler-plugin:3.7.0:testCompile (default-testCompile) @ rdf4j-console ---
[INFO] Changes detected - recompiling the module!
[INFO] Compiling 18 source files to /home/hudson/genie.rdf4j/.jenkins/jobs/rdf4j-pr-verify/workspace/tools/console/target/test-classes
[INFO] 
[INFO] --- maven-surefire-plugin:2.22.2:test (default-test) @ rdf4j-console ---
[INFO] 
[INFO] -------------------------------------------------------
[INFO]  T E S T S
[INFO] -------------------------------------------------------
[INFO] Running org.eclipse.rdf4j.console.setting.PrefixesTest
[INFO] Tests run: 3, Failures: 0, Errors: 0, Skipped: 0, Time elapsed: 0.662 s - in org.eclipse.rdf4j.console.setting.PrefixesTest
[INFO] Running org.eclipse.rdf4j.console.setting.LogLevelTest
01:50:24.627 [main] ERROR unknown logging level: chatty
[INFO] Tests run: 4, Failures: 0, Errors: 0, Skipped: 0, Time elapsed: 0.015 s - in org.eclipse.rdf4j.console.setting.LogLevelTest
[INFO] Running org.eclipse.rdf4j.console.setting.QueryPrefixTest
[INFO] Tests run: 1, Failures: 0, Errors: 0, Skipped: 0, Time elapsed: 0 s - in org.eclipse.rdf4j.console.setting.QueryPrefixTest
[INFO] Running org.eclipse.rdf4j.console.setting.ShowPrefixTest
[INFO] Tests run: 1, Failures: 0, Errors: 0, Skipped: 0, Time elapsed: 0 s - in org.eclipse.rdf4j.console.setting.ShowPrefixTest
[INFO] Running org.eclipse.rdf4j.console.setting.ConsoleWidthTest
[INFO] Tests run: 1, Failures: 0, Errors: 0, Skipped: 0, Time elapsed: 0 s - in org.eclipse.rdf4j.console.setting.ConsoleWidthTest
[INFO] Running org.eclipse.rdf4j.console.command.SetParametersTest
01:50:24.663 [main] ERROR Unknown parameter: unknown
[INFO] Tests run: 1, Failures: 0, Errors: 0, Skipped: 0, Time elapsed: 0.023 s - in org.eclipse.rdf4j.console.command.SetParametersTest
[INFO] Running org.eclipse.rdf4j.console.command.LoadTest
[MockitoHint] LoadTest.testLoad (see javadoc for MockitoHint):
[MockitoHint] 1. Unused -> at org.eclipse.rdf4j.console.command.LoadTest.setUp(LoadTest.java:49)

[MockitoHint] LoadTest.testLoadWorkDir (see javadoc for MockitoHint):
[MockitoHint] 1. Unused -> at org.eclipse.rdf4j.console.command.LoadTest.setUp(LoadTest.java:49)

[INFO] Tests run: 2, Failures: 0, Errors: 0, Skipped: 0, Time elapsed: 0.172 s - in org.eclipse.rdf4j.console.command.LoadTest
[INFO] Running org.eclipse.rdf4j.console.command.ConvertTest
01:50:25.059 [main] ERROR No RDF writer for /tmp/genie.rdf4j/junit4868243313001665806/alien.qyx
[MockitoHint] ConvertTest.testConvertInvalidFormat (see javadoc for MockitoHint):
[MockitoHint] 1. Unused -> at org.eclipse.rdf4j.console.command.ConvertTest.setup(ConvertTest.java:39)

01:50:25.065 [main] ERROR Failed to convert data
org.eclipse.rdf4j.rio.RDFParseException: Expected '<' or '_', found: e [line 1, column 101]
	at org.eclipse.rdf4j.rio.ntriples.NTriplesParser.parseSubject(NTriplesParser.java:313)
	at org.eclipse.rdf4j.rio.ntriples.NTriplesParser.parseTriple(NTriplesParser.java:252)
	at org.eclipse.rdf4j.rio.ntriples.NTriplesParser.parse(NTriplesParser.java:160)
	at org.eclipse.rdf4j.rio.ntriples.NTriplesParser.parse(NTriplesParser.java:109)
	at org.eclipse.rdf4j.console.command.Convert.convert(Convert.java:139)
	at org.eclipse.rdf4j.console.command.Convert.execute(Convert.java:74)
	at org.eclipse.rdf4j.console.command.ConvertTest.testConvertParseError(ConvertTest.java:92)
	at sun.reflect.NativeMethodAccessorImpl.invoke0(Native Method)
	at sun.reflect.NativeMethodAccessorImpl.invoke(NativeMethodAccessorImpl.java:62)
	at sun.reflect.DelegatingMethodAccessorImpl.invoke(DelegatingMethodAccessorImpl.java:43)
	at java.lang.reflect.Method.invoke(Method.java:498)
	at org.junit.runners.model.FrameworkMethod$1.runReflectiveCall(FrameworkMethod.java:50)
	at org.junit.internal.runners.model.ReflectiveCallable.run(ReflectiveCallable.java:12)
	at org.junit.runners.model.FrameworkMethod.invokeExplosively(FrameworkMethod.java:47)
	at org.junit.internal.runners.statements.InvokeMethod.evaluate(InvokeMethod.java:17)
	at org.junit.internal.runners.statements.RunBefores.evaluate(RunBefores.java:26)
	at org.junit.internal.runners.statements.RunAfters.evaluate(RunAfters.java:27)
	at org.mockito.internal.junit.JUnitRule$1.evaluateSafely(JUnitRule.java:52)
	at org.mockito.internal.junit.JUnitRule$1.evaluate(JUnitRule.java:43)
	at org.junit.rules.ExternalResource$1.evaluate(ExternalResource.java:48)
	at org.junit.rules.RunRules.evaluate(RunRules.java:20)
	at org.junit.runners.ParentRunner.runLeaf(ParentRunner.java:325)
	at org.junit.runners.BlockJUnit4ClassRunner.runChild(BlockJUnit4ClassRunner.java:78)
	at org.junit.runners.BlockJUnit4ClassRunner.runChild(BlockJUnit4ClassRunner.java:57)
	at org.junit.runners.ParentRunner$3.run(ParentRunner.java:290)
	at org.junit.runners.ParentRunner$1.schedule(ParentRunner.java:71)
	at org.junit.runners.ParentRunner.runChildren(ParentRunner.java:288)
	at org.junit.runners.ParentRunner.access$000(ParentRunner.java:58)
	at org.junit.runners.ParentRunner$2.evaluate(ParentRunner.java:268)
	at org.junit.runners.ParentRunner.run(ParentRunner.java:363)
	at org.apache.maven.surefire.junit4.JUnit4Provider.execute(JUnit4Provider.java:365)
	at org.apache.maven.surefire.junit4.JUnit4Provider.executeWithRerun(JUnit4Provider.java:273)
	at org.apache.maven.surefire.junit4.JUnit4Provider.executeTestSet(JUnit4Provider.java:238)
	at org.apache.maven.surefire.junit4.JUnit4Provider.invoke(JUnit4Provider.java:159)
	at org.apache.maven.surefire.booter.ForkedBooter.invokeProviderInSameClassLoader(ForkedBooter.java:384)
	at org.apache.maven.surefire.booter.ForkedBooter.runSuitesInProcess(ForkedBooter.java:345)
	at org.apache.maven.surefire.booter.ForkedBooter.execute(ForkedBooter.java:126)
	at org.apache.maven.surefire.booter.ForkedBooter.main(ForkedBooter.java:418)
[INFO] Tests run: 4, Failures: 0, Errors: 0, Skipped: 0, Time elapsed: 0.219 s - in org.eclipse.rdf4j.console.command.ConvertTest
[INFO] Running org.eclipse.rdf4j.console.command.ExportTest
[MockitoHint] ExportTest.testExportWorkDir (see javadoc for MockitoHint):
[MockitoHint] 1. Unused -> at org.eclipse.rdf4j.console.command.ExportTest.setUp(ExportTest.java:46)

[MockitoHint] ExportTest.testExportAll (see javadoc for MockitoHint):
[MockitoHint] 1. Unused -> at org.eclipse.rdf4j.console.command.ExportTest.setUp(ExportTest.java:46)

[MockitoHint] ExportTest.testExportContexts (see javadoc for MockitoHint):
[MockitoHint] 1. Unused -> at org.eclipse.rdf4j.console.command.ExportTest.setUp(ExportTest.java:46)

[INFO] Tests run: 3, Failures: 0, Errors: 0, Skipped: 0, Time elapsed: 0.045 s - in org.eclipse.rdf4j.console.command.ExportTest
[INFO] Running org.eclipse.rdf4j.console.command.VerifyTest
01:50:25.429 [main] ERROR Unexpected RDFParseException
org.eclipse.rdf4j.rio.RDFParseException: 'missing type' was not recognised, and could not be verified, with datatype http://example.rdf4j.org/type/wrong [line 1]
	at org.eclipse.rdf4j.rio.helpers.RDFParserHelper.reportError(RDFParserHelper.java:265)
	at org.eclipse.rdf4j.rio.helpers.RDFParserHelper.createLiteral(RDFParserHelper.java:180)
	at org.eclipse.rdf4j.rio.helpers.AbstractRDFParser.createLiteral(AbstractRDFParser.java:530)
	at org.eclipse.rdf4j.rio.turtle.TurtleParser.parseQuotedLiteral(TurtleParser.java:665)
	at org.eclipse.rdf4j.rio.turtle.TurtleParser.parseValue(TurtleParser.java:584)
	at org.eclipse.rdf4j.rio.turtle.TurtleParser.parseObject(TurtleParser.java:461)
	at org.eclipse.rdf4j.rio.turtle.TurtleParser.parseObjectList(TurtleParser.java:389)
	at org.eclipse.rdf4j.rio.turtle.TurtleParser.parsePredicateObjectList(TurtleParser.java:362)
	at org.eclipse.rdf4j.rio.turtle.TurtleParser.parseTriples(TurtleParser.java:349)
	at org.eclipse.rdf4j.rio.turtle.TurtleParser.parseStatement(TurtleParser.java:216)
	at org.eclipse.rdf4j.rio.turtle.TurtleParser.parse(TurtleParser.java:178)
	at org.eclipse.rdf4j.rio.turtle.TurtleParser.parse(TurtleParser.java:130)
	at org.eclipse.rdf4j.console.command.Verify.verify(Verify.java:145)
	at org.eclipse.rdf4j.console.command.Verify.execute(Verify.java:97)
	at org.eclipse.rdf4j.console.command.VerifyTest.testVerifyMissingType(VerifyTest.java:97)
	at sun.reflect.NativeMethodAccessorImpl.invoke0(Native Method)
	at sun.reflect.NativeMethodAccessorImpl.invoke(NativeMethodAccessorImpl.java:62)
	at sun.reflect.DelegatingMethodAccessorImpl.invoke(DelegatingMethodAccessorImpl.java:43)
	at java.lang.reflect.Method.invoke(Method.java:498)
	at org.junit.runners.model.FrameworkMethod$1.runReflectiveCall(FrameworkMethod.java:50)
	at org.junit.internal.runners.model.ReflectiveCallable.run(ReflectiveCallable.java:12)
	at org.junit.runners.model.FrameworkMethod.invokeExplosively(FrameworkMethod.java:47)
	at org.junit.internal.runners.statements.InvokeMethod.evaluate(InvokeMethod.java:17)
	at org.junit.internal.runners.statements.RunBefores.evaluate(RunBefores.java:26)
	at org.junit.internal.runners.statements.RunAfters.evaluate(RunAfters.java:27)
	at org.mockito.internal.junit.JUnitRule$1.evaluateSafely(JUnitRule.java:52)
	at org.mockito.internal.junit.JUnitRule$1.evaluate(JUnitRule.java:43)
	at org.junit.rules.ExternalResource$1.evaluate(ExternalResource.java:48)
	at org.junit.rules.RunRules.evaluate(RunRules.java:20)
	at org.junit.runners.ParentRunner.runLeaf(ParentRunner.java:325)
	at org.junit.runners.BlockJUnit4ClassRunner.runChild(BlockJUnit4ClassRunner.java:78)
	at org.junit.runners.BlockJUnit4ClassRunner.runChild(BlockJUnit4ClassRunner.java:57)
	at org.junit.runners.ParentRunner$3.run(ParentRunner.java:290)
	at org.junit.runners.ParentRunner$1.schedule(ParentRunner.java:71)
	at org.junit.runners.ParentRunner.runChildren(ParentRunner.java:288)
	at org.junit.runners.ParentRunner.access$000(ParentRunner.java:58)
	at org.junit.runners.ParentRunner$2.evaluate(ParentRunner.java:268)
	at org.junit.runners.ParentRunner.run(ParentRunner.java:363)
	at org.apache.maven.surefire.junit4.JUnit4Provider.execute(JUnit4Provider.java:365)
	at org.apache.maven.surefire.junit4.JUnit4Provider.executeWithRerun(JUnit4Provider.java:273)
	at org.apache.maven.surefire.junit4.JUnit4Provider.executeTestSet(JUnit4Provider.java:238)
	at org.apache.maven.surefire.junit4.JUnit4Provider.invoke(JUnit4Provider.java:159)
	at org.apache.maven.surefire.booter.ForkedBooter.invokeProviderInSameClassLoader(ForkedBooter.java:384)
	at org.apache.maven.surefire.booter.ForkedBooter.runSuitesInProcess(ForkedBooter.java:345)
	at org.apache.maven.surefire.booter.ForkedBooter.execute(ForkedBooter.java:126)
	at org.apache.maven.surefire.booter.ForkedBooter.main(ForkedBooter.java:418)
01:50:25.477 [main] ERROR SHACL validation failed, writing report to /tmp/genie.rdf4j/junit4138231874040987718/junit3749904811787086660.tmp
01:50:25.492 [main] ERROR Unexpected RDFParseException
org.eclipse.rdf4j.rio.RDFParseException: Unexpected end of file
	at org.eclipse.rdf4j.rio.turtle.TurtleParser.throwEOFException(TurtleParser.java:1317)
	at org.eclipse.rdf4j.rio.turtle.TurtleParser.parseValue(TurtleParser.java:589)
	at org.eclipse.rdf4j.rio.turtle.TurtleParser.parsePredicate(TurtleParser.java:434)
	at org.eclipse.rdf4j.rio.turtle.TurtleParser.parsePredicateObjectList(TurtleParser.java:358)
	at org.eclipse.rdf4j.rio.turtle.TurtleParser.parseTriples(TurtleParser.java:349)
	at org.eclipse.rdf4j.rio.turtle.TurtleParser.parseStatement(TurtleParser.java:216)
	at org.eclipse.rdf4j.rio.turtle.TurtleParser.parse(TurtleParser.java:178)
	at org.eclipse.rdf4j.rio.turtle.TurtleParser.parse(TurtleParser.java:130)
	at org.eclipse.rdf4j.console.command.Verify.verify(Verify.java:145)
	at org.eclipse.rdf4j.console.command.Verify.execute(Verify.java:97)
	at org.eclipse.rdf4j.console.command.VerifyTest.testVerifyBrokenFile(VerifyTest.java:91)
	at sun.reflect.NativeMethodAccessorImpl.invoke0(Native Method)
	at sun.reflect.NativeMethodAccessorImpl.invoke(NativeMethodAccessorImpl.java:62)
	at sun.reflect.DelegatingMethodAccessorImpl.invoke(DelegatingMethodAccessorImpl.java:43)
	at java.lang.reflect.Method.invoke(Method.java:498)
	at org.junit.runners.model.FrameworkMethod$1.runReflectiveCall(FrameworkMethod.java:50)
	at org.junit.internal.runners.model.ReflectiveCallable.run(ReflectiveCallable.java:12)
	at org.junit.runners.model.FrameworkMethod.invokeExplosively(FrameworkMethod.java:47)
	at org.junit.internal.runners.statements.InvokeMethod.evaluate(InvokeMethod.java:17)
	at org.junit.internal.runners.statements.RunBefores.evaluate(RunBefores.java:26)
	at org.junit.internal.runners.statements.RunAfters.evaluate(RunAfters.java:27)
	at org.mockito.internal.junit.JUnitRule$1.evaluateSafely(JUnitRule.java:52)
	at org.mockito.internal.junit.JUnitRule$1.evaluate(JUnitRule.java:43)
	at org.junit.rules.ExternalResource$1.evaluate(ExternalResource.java:48)
	at org.junit.rules.RunRules.evaluate(RunRules.java:20)
	at org.junit.runners.ParentRunner.runLeaf(ParentRunner.java:325)
	at org.junit.runners.BlockJUnit4ClassRunner.runChild(BlockJUnit4ClassRunner.java:78)
	at org.junit.runners.BlockJUnit4ClassRunner.runChild(BlockJUnit4ClassRunner.java:57)
	at org.junit.runners.ParentRunner$3.run(ParentRunner.java:290)
	at org.junit.runners.ParentRunner$1.schedule(ParentRunner.java:71)
	at org.junit.runners.ParentRunner.runChildren(ParentRunner.java:288)
	at org.junit.runners.ParentRunner.access$000(ParentRunner.java:58)
	at org.junit.runners.ParentRunner$2.evaluate(ParentRunner.java:268)
	at org.junit.runners.ParentRunner.run(ParentRunner.java:363)
	at org.apache.maven.surefire.junit4.JUnit4Provider.execute(JUnit4Provider.java:365)
	at org.apache.maven.surefire.junit4.JUnit4Provider.executeWithRerun(JUnit4Provider.java:273)
	at org.apache.maven.surefire.junit4.JUnit4Provider.executeTestSet(JUnit4Provider.java:238)
	at org.apache.maven.surefire.junit4.JUnit4Provider.invoke(JUnit4Provider.java:159)
	at org.apache.maven.surefire.booter.ForkedBooter.invokeProviderInSameClassLoader(ForkedBooter.java:384)
	at org.apache.maven.surefire.booter.ForkedBooter.runSuitesInProcess(ForkedBooter.java:345)
	at org.apache.maven.surefire.booter.ForkedBooter.execute(ForkedBooter.java:126)
	at org.apache.maven.surefire.booter.ForkedBooter.main(ForkedBooter.java:418)
01:50:25.509 [main] ERROR Unexpected RDFParseException
org.eclipse.rdf4j.rio.RDFParseException: Expected a letter, found '1' [line 1]
	at org.eclipse.rdf4j.rio.helpers.RDFParserHelper.reportError(RDFParserHelper.java:265)
	at org.eclipse.rdf4j.rio.helpers.AbstractRDFParser.reportError(AbstractRDFParser.java:628)
	at org.eclipse.rdf4j.rio.turtle.TurtleParser.reportError(TurtleParser.java:1297)
	at org.eclipse.rdf4j.rio.turtle.TurtleParser.parseQuotedLiteral(TurtleParser.java:619)
	at org.eclipse.rdf4j.rio.turtle.TurtleParser.parseValue(TurtleParser.java:584)
	at org.eclipse.rdf4j.rio.turtle.TurtleParser.parseObject(TurtleParser.java:461)
	at org.eclipse.rdf4j.rio.turtle.TurtleParser.parseObjectList(TurtleParser.java:389)
	at org.eclipse.rdf4j.rio.turtle.TurtleParser.parsePredicateObjectList(TurtleParser.java:362)
	at org.eclipse.rdf4j.rio.turtle.TurtleParser.parseTriples(TurtleParser.java:349)
	at org.eclipse.rdf4j.rio.turtle.TurtleParser.parseStatement(TurtleParser.java:216)
	at org.eclipse.rdf4j.rio.turtle.TurtleParser.parse(TurtleParser.java:178)
	at org.eclipse.rdf4j.rio.turtle.TurtleParser.parse(TurtleParser.java:130)
	at org.eclipse.rdf4j.console.command.Verify.verify(Verify.java:145)
	at org.eclipse.rdf4j.console.command.Verify.execute(Verify.java:97)
	at org.eclipse.rdf4j.console.command.VerifyTest.testVerifyWrongLang(VerifyTest.java:109)
	at sun.reflect.NativeMethodAccessorImpl.invoke0(Native Method)
	at sun.reflect.NativeMethodAccessorImpl.invoke(NativeMethodAccessorImpl.java:62)
	at sun.reflect.DelegatingMethodAccessorImpl.invoke(DelegatingMethodAccessorImpl.java:43)
	at java.lang.reflect.Method.invoke(Method.java:498)
	at org.junit.runners.model.FrameworkMethod$1.runReflectiveCall(FrameworkMethod.java:50)
	at org.junit.internal.runners.model.ReflectiveCallable.run(ReflectiveCallable.java:12)
	at org.junit.runners.model.FrameworkMethod.invokeExplosively(FrameworkMethod.java:47)
	at org.junit.internal.runners.statements.InvokeMethod.evaluate(InvokeMethod.java:17)
	at org.junit.internal.runners.statements.RunBefores.evaluate(RunBefores.java:26)
	at org.junit.internal.runners.statements.RunAfters.evaluate(RunAfters.java:27)
	at org.mockito.internal.junit.JUnitRule$1.evaluateSafely(JUnitRule.java:52)
	at org.mockito.internal.junit.JUnitRule$1.evaluate(JUnitRule.java:43)
	at org.junit.rules.ExternalResource$1.evaluate(ExternalResource.java:48)
	at org.junit.rules.RunRules.evaluate(RunRules.java:20)
	at org.junit.runners.ParentRunner.runLeaf(ParentRunner.java:325)
	at org.junit.runners.BlockJUnit4ClassRunner.runChild(BlockJUnit4ClassRunner.java:78)
	at org.junit.runners.BlockJUnit4ClassRunner.runChild(BlockJUnit4ClassRunner.java:57)
	at org.junit.runners.ParentRunner$3.run(ParentRunner.java:290)
	at org.junit.runners.ParentRunner$1.schedule(ParentRunner.java:71)
	at org.junit.runners.ParentRunner.runChildren(ParentRunner.java:288)
	at org.junit.runners.ParentRunner.access$000(ParentRunner.java:58)
	at org.junit.runners.ParentRunner$2.evaluate(ParentRunner.java:268)
	at org.junit.runners.ParentRunner.run(ParentRunner.java:363)
	at org.apache.maven.surefire.junit4.JUnit4Provider.execute(JUnit4Provider.java:365)
	at org.apache.maven.surefire.junit4.JUnit4Provider.executeWithRerun(JUnit4Provider.java:273)
	at org.apache.maven.surefire.junit4.JUnit4Provider.executeTestSet(JUnit4Provider.java:238)
	at org.apache.maven.surefire.junit4.JUnit4Provider.invoke(JUnit4Provider.java:159)
	at org.apache.maven.surefire.booter.ForkedBooter.invokeProviderInSameClassLoader(ForkedBooter.java:384)
	at org.apache.maven.surefire.booter.ForkedBooter.runSuitesInProcess(ForkedBooter.java:345)
	at org.apache.maven.surefire.booter.ForkedBooter.execute(ForkedBooter.java:126)
	at org.apache.maven.surefire.booter.ForkedBooter.main(ForkedBooter.java:418)
01:50:25.519 [main] ERROR No parser available for this RDF format
org.eclipse.rdf4j.rio.UnsupportedRDFormatException: Did not recognise RDF format string file:/home/hudson/genie.rdf4j/.jenkins/jobs/rdf4j-pr-verify/workspace/tools/console/does-not-exist.docx
	at org.eclipse.rdf4j.rio.Rio.lambda$unsupportedFormat$1(Rio.java:577)
	at java.util.Optional.orElseThrow(Optional.java:290)
	at org.eclipse.rdf4j.console.command.Verify.verify(Verify.java:124)
	at org.eclipse.rdf4j.console.command.Verify.execute(Verify.java:97)
	at org.eclipse.rdf4j.console.command.VerifyTest.testVerifyWrongFormat(VerifyTest.java:69)
	at sun.reflect.NativeMethodAccessorImpl.invoke0(Native Method)
	at sun.reflect.NativeMethodAccessorImpl.invoke(NativeMethodAccessorImpl.java:62)
	at sun.reflect.DelegatingMethodAccessorImpl.invoke(DelegatingMethodAccessorImpl.java:43)
	at java.lang.reflect.Method.invoke(Method.java:498)
	at org.junit.runners.model.FrameworkMethod$1.runReflectiveCall(FrameworkMethod.java:50)
	at org.junit.internal.runners.model.ReflectiveCallable.run(ReflectiveCallable.java:12)
	at org.junit.runners.model.FrameworkMethod.invokeExplosively(FrameworkMethod.java:47)
	at org.junit.internal.runners.statements.InvokeMethod.evaluate(InvokeMethod.java:17)
	at org.junit.internal.runners.statements.RunBefores.evaluate(RunBefores.java:26)
	at org.junit.internal.runners.statements.RunAfters.evaluate(RunAfters.java:27)
	at org.mockito.internal.junit.JUnitRule$1.evaluateSafely(JUnitRule.java:52)
	at org.mockito.internal.junit.JUnitRule$1.evaluate(JUnitRule.java:43)
	at org.junit.rules.ExternalResource$1.evaluate(ExternalResource.java:48)
	at org.junit.rules.RunRules.evaluate(RunRules.java:20)
	at org.junit.runners.ParentRunner.runLeaf(ParentRunner.java:325)
	at org.junit.runners.BlockJUnit4ClassRunner.runChild(BlockJUnit4ClassRunner.java:78)
	at org.junit.runners.BlockJUnit4ClassRunner.runChild(BlockJUnit4ClassRunner.java:57)
	at org.junit.runners.ParentRunner$3.run(ParentRunner.java:290)
	at org.junit.runners.ParentRunner$1.schedule(ParentRunner.java:71)
	at org.junit.runners.ParentRunner.runChildren(ParentRunner.java:288)
	at org.junit.runners.ParentRunner.access$000(ParentRunner.java:58)
	at org.junit.runners.ParentRunner$2.evaluate(ParentRunner.java:268)
	at org.junit.runners.ParentRunner.run(ParentRunner.java:363)
	at org.apache.maven.surefire.junit4.JUnit4Provider.execute(JUnit4Provider.java:365)
	at org.apache.maven.surefire.junit4.JUnit4Provider.executeWithRerun(JUnit4Provider.java:273)
	at org.apache.maven.surefire.junit4.JUnit4Provider.executeTestSet(JUnit4Provider.java:238)
	at org.apache.maven.surefire.junit4.JUnit4Provider.invoke(JUnit4Provider.java:159)
	at org.apache.maven.surefire.booter.ForkedBooter.invokeProviderInSameClassLoader(ForkedBooter.java:384)
	at org.apache.maven.surefire.booter.ForkedBooter.runSuitesInProcess(ForkedBooter.java:345)
	at org.apache.maven.surefire.booter.ForkedBooter.execute(ForkedBooter.java:126)
	at org.apache.maven.surefire.booter.ForkedBooter.main(ForkedBooter.java:418)
01:50:25.540 [main] ERROR Unexpected RDFParseException
org.eclipse.rdf4j.rio.RDFParseException: IRI included an unencoded space: '32' [line 1]
	at org.eclipse.rdf4j.rio.helpers.RDFParserHelper.reportError(RDFParserHelper.java:265)
	at org.eclipse.rdf4j.rio.helpers.AbstractRDFParser.reportError(AbstractRDFParser.java:628)
	at org.eclipse.rdf4j.rio.turtle.TurtleParser.reportError(TurtleParser.java:1297)
	at org.eclipse.rdf4j.rio.turtle.TurtleParser.parseURI(TurtleParser.java:902)
	at org.eclipse.rdf4j.rio.turtle.TurtleParser.parseValue(TurtleParser.java:575)
	at org.eclipse.rdf4j.rio.turtle.TurtleParser.parseSubject(TurtleParser.java:406)
	at org.eclipse.rdf4j.rio.turtle.TurtleParser.parseTriples(TurtleParser.java:347)
	at org.eclipse.rdf4j.rio.turtle.TurtleParser.parseStatement(TurtleParser.java:216)
	at org.eclipse.rdf4j.rio.turtle.TurtleParser.parse(TurtleParser.java:178)
	at org.eclipse.rdf4j.rio.turtle.TurtleParser.parse(TurtleParser.java:130)
	at org.eclipse.rdf4j.console.command.Verify.verify(Verify.java:145)
	at org.eclipse.rdf4j.console.command.Verify.execute(Verify.java:97)
	at org.eclipse.rdf4j.console.command.VerifyTest.testVerifySpaceIRI(VerifyTest.java:103)
	at sun.reflect.NativeMethodAccessorImpl.invoke0(Native Method)
	at sun.reflect.NativeMethodAccessorImpl.invoke(NativeMethodAccessorImpl.java:62)
	at sun.reflect.DelegatingMethodAccessorImpl.invoke(DelegatingMethodAccessorImpl.java:43)
	at java.lang.reflect.Method.invoke(Method.java:498)
	at org.junit.runners.model.FrameworkMethod$1.runReflectiveCall(FrameworkMethod.java:50)
	at org.junit.internal.runners.model.ReflectiveCallable.run(ReflectiveCallable.java:12)
	at org.junit.runners.model.FrameworkMethod.invokeExplosively(FrameworkMethod.java:47)
	at org.junit.internal.runners.statements.InvokeMethod.evaluate(InvokeMethod.java:17)
	at org.junit.internal.runners.statements.RunBefores.evaluate(RunBefores.java:26)
	at org.junit.internal.runners.statements.RunAfters.evaluate(RunAfters.java:27)
	at org.mockito.internal.junit.JUnitRule$1.evaluateSafely(JUnitRule.java:52)
	at org.mockito.internal.junit.JUnitRule$1.evaluate(JUnitRule.java:43)
	at org.junit.rules.ExternalResource$1.evaluate(ExternalResource.java:48)
	at org.junit.rules.RunRules.evaluate(RunRules.java:20)
	at org.junit.runners.ParentRunner.runLeaf(ParentRunner.java:325)
	at org.junit.runners.BlockJUnit4ClassRunner.runChild(BlockJUnit4ClassRunner.java:78)
	at org.junit.runners.BlockJUnit4ClassRunner.runChild(BlockJUnit4ClassRunner.java:57)
	at org.junit.runners.ParentRunner$3.run(ParentRunner.java:290)
	at org.junit.runners.ParentRunner$1.schedule(ParentRunner.java:71)
	at org.junit.runners.ParentRunner.runChildren(ParentRunner.java:288)
	at org.junit.runners.ParentRunner.access$000(ParentRunner.java:58)
	at org.junit.runners.ParentRunner$2.evaluate(ParentRunner.java:268)
	at org.junit.runners.ParentRunner.run(ParentRunner.java:363)
	at org.apache.maven.surefire.junit4.JUnit4Provider.execute(JUnit4Provider.java:365)
	at org.apache.maven.surefire.junit4.JUnit4Provider.executeWithRerun(JUnit4Provider.java:273)
	at org.apache.maven.surefire.junit4.JUnit4Provider.executeTestSet(JUnit4Provider.java:238)
	at org.apache.maven.surefire.junit4.JUnit4Provider.invoke(JUnit4Provider.java:159)
	at org.apache.maven.surefire.booter.ForkedBooter.invokeProviderInSameClassLoader(ForkedBooter.java:384)
	at org.apache.maven.surefire.booter.ForkedBooter.runSuitesInProcess(ForkedBooter.java:345)
	at org.apache.maven.surefire.booter.ForkedBooter.execute(ForkedBooter.java:126)
	at org.apache.maven.surefire.booter.ForkedBooter.main(ForkedBooter.java:418)
[INFO] Tests run: 10, Failures: 0, Errors: 0, Skipped: 0, Time elapsed: 0.442 s - in org.eclipse.rdf4j.console.command.VerifyTest
[INFO] Running org.eclipse.rdf4j.console.command.DropTest
[MockitoHint] DropTest.testUserAbortedUnsafeDropBeforeWarning (see javadoc for MockitoHint):
[MockitoHint] 1. Unused -> at org.eclipse.rdf4j.console.command.DropTest.setUp(DropTest.java:50)

[INFO] Tests run: 3, Failures: 0, Errors: 0, Skipped: 0, Time elapsed: 0.112 s - in org.eclipse.rdf4j.console.command.DropTest
[INFO] Running org.eclipse.rdf4j.console.command.FederateTest
01:50:25.692 [main] DEBUG Initializing MemoryStore...
01:50:25.693 [main] DEBUG Initializing data file...
01:50:25.693 [main] DEBUG Data file initialized
01:50:25.693 [main] DEBUG MemoryStore initialized
01:50:25.695 [main] DEBUG syncing data to file...
01:50:25.696 [main] DEBUG Data synced to file
01:50:25.699 [main] DEBUG Initializing MemoryStore...
01:50:25.700 [main] DEBUG Initializing data file...
01:50:25.701 [main] DEBUG Data file initialized
01:50:25.701 [main] DEBUG MemoryStore initialized
01:50:25.702 [main] DEBUG syncing data to file...
01:50:25.703 [main] DEBUG Data synced to file
01:50:25.720 [main] DEBUG Federate called with federation ID = fedID, and member ID's = [sparql][alien][http].
  Distinct set to false, and readonly set to true.

01:50:25.724 [main] DEBUG Federation repository root node: _:node1drkmons2x216
01:50:25.725 [main] DEBUG _:node1drkmons2x216 http://www.w3.org/1999/02/22-rdf-syntax-ns#type http://www.openrdf.org/config/repository#Repository
01:50:25.725 [main] DEBUG _:node1drkmons2x216 http://www.openrdf.org/config/repository#repositoryID "fedID"
01:50:25.725 [main] DEBUG _:node1drkmons2x216 http://www.w3.org/2000/01/rdf-schema#label "Test Federation Title"
01:50:25.725 [main] DEBUG _:node1drkmons2x216 http://www.openrdf.org/config/repository#repositoryImpl _:node1drkmons2x217
01:50:25.725 [main] DEBUG _:node1drkmons2x217 http://www.openrdf.org/config/repository#repositoryType "openrdf:SailRepository"
01:50:25.725 [main] DEBUG _:node1drkmons2x217 http://www.openrdf.org/config/repository/sail#sailImpl _:node1drkmons2x218
01:50:25.726 [main] DEBUG _:node1drkmons2x218 http://www.openrdf.org/config/sail#sailType "openrdf:Federation"
01:50:25.726 [main] DEBUG _:node1drkmons2x218 http://www.openrdf.org/config/sail/federation#readOnly "true"^^<http://www.w3.org/2001/XMLSchema#boolean>
01:50:25.726 [main] DEBUG _:node1drkmons2x218 http://www.openrdf.org/config/sail/federation#distinct "false"^^<http://www.w3.org/2001/XMLSchema#boolean>
01:50:25.726 [main] DEBUG Adding member: sparql
01:50:25.726 [main] DEBUG _:node1drkmons2x218 http://www.openrdf.org/config/sail/federation#member _:node1drkmons2x219
01:50:25.727 [main] DEBUG _:node1drkmons2x219 http://www.openrdf.org/config/repository#repositoryType "openrdf:SPARQLRepository"
01:50:25.728 [main] DEBUG _:node1drkmons2x219 http://www.openrdf.org/config/repository/sparql#query-endpoint http://localhost:8080/openrdf-sesame/repositories/sparql
01:50:25.728 [main] DEBUG Added member sparql: 
01:50:25.728 [main] DEBUG Adding member: alien
01:50:25.728 [main] DEBUG _:node1drkmons2x218 http://www.openrdf.org/config/sail/federation#member _:node1drkmons2x222
01:50:25.729 [main] DEBUG _:node1drkmons2x222 http://www.openrdf.org/config/repository#repositoryType "openrdf:ProxyRepository"
01:50:25.729 [main] DEBUG _:node1drkmons2x222 http://www.openrdf.org/config/repository/proxy#proxiedID "alien"
01:50:25.729 [main] DEBUG Added member alien: 
01:50:25.729 [main] DEBUG Adding member: http
01:50:25.729 [main] DEBUG _:node1drkmons2x218 http://www.openrdf.org/config/sail/federation#member _:node1drkmons2x225
01:50:25.729 [main] DEBUG _:node1drkmons2x225 http://www.openrdf.org/config/repository#repositoryType "openrdf:HTTPRepository"
01:50:25.730 [main] DEBUG _:node1drkmons2x225 http://www.openrdf.org/config/repository/http#repositoryURL http://localhost:8080/openrdf-sesame/repositories/http
01:50:25.730 [main] DEBUG Added member http: 
01:50:25.765 [main] DEBUG Initializing MemoryStore...
01:50:25.766 [main] DEBUG Initializing data file...
01:50:25.767 [main] DEBUG Data file initialized
01:50:25.767 [main] DEBUG MemoryStore initialized
01:50:25.770 [main] DEBUG syncing data to file...
01:50:25.771 [main] DEBUG Data synced to file
01:50:25.775 [main] DEBUG Initializing MemoryStore...
01:50:25.776 [main] DEBUG Initializing data file...
01:50:25.777 [main] DEBUG Data file initialized
01:50:25.777 [main] DEBUG MemoryStore initialized
01:50:25.780 [main] DEBUG syncing data to file...
01:50:25.781 [main] DEBUG Data synced to file
01:50:25.794 [main] ERROR Duplicate repository id's specified.
[MockitoHint] FederateTest.testDuplicateMembersPrintsError (see javadoc for MockitoHint):
[MockitoHint] 1. Unused -> at org.eclipse.rdf4j.console.command.FederateTest.setUp(FederateTest.java:87)
[MockitoHint] 2. Unused -> at org.eclipse.rdf4j.console.command.FederateTest.setUp(FederateTest.java:88)

01:50:25.804 [main] DEBUG Initializing MemoryStore...
01:50:25.805 [main] DEBUG Initializing data file...
01:50:25.805 [main] DEBUG Data file initialized
01:50:25.805 [main] DEBUG MemoryStore initialized
01:50:25.806 [main] DEBUG syncing data to file...
01:50:25.807 [main] DEBUG Data synced to file
01:50:25.810 [main] DEBUG Initializing MemoryStore...
01:50:25.811 [main] DEBUG Initializing data file...
01:50:25.812 [main] DEBUG Data file initialized
01:50:25.812 [main] DEBUG MemoryStore initialized
01:50:25.813 [main] DEBUG syncing data to file...
01:50:25.814 [main] DEBUG Data synced to file
01:50:25.823 [main] DEBUG Federate called with federation ID = alien, and member ID's = [fedID][scary].
  Distinct set to false, and readonly set to true.

01:50:25.824 [main] ERROR alien already exists.
[MockitoHint] FederateTest.testFedAlreadyExistsPrintsSpecificError (see javadoc for MockitoHint):
[MockitoHint] 1. Unused -> at org.eclipse.rdf4j.console.command.FederateTest.setUp(FederateTest.java:88)

01:50:25.832 [main] DEBUG Initializing MemoryStore...
01:50:25.833 [main] DEBUG Initializing data file...
01:50:25.833 [main] DEBUG Data file initialized
01:50:25.833 [main] DEBUG MemoryStore initialized
01:50:25.836 [main] DEBUG syncing data to file...
01:50:25.836 [main] DEBUG Data synced to file
01:50:25.839 [main] DEBUG Initializing MemoryStore...
01:50:25.840 [main] DEBUG Initializing data file...
01:50:25.840 [main] DEBUG Data file initialized
01:50:25.841 [main] DEBUG MemoryStore initialized
01:50:25.842 [main] DEBUG syncing data to file...
01:50:25.843 [main] DEBUG Data synced to file
01:50:25.850 [main] DEBUG Federate called with federation ID = fedID, and member ID's = [alien][scary].
  Distinct set to true, and readonly set to false.

01:50:25.852 [main] DEBUG Federation repository root node: _:node1drkmons2x338
01:50:25.852 [main] DEBUG _:node1drkmons2x338 http://www.w3.org/1999/02/22-rdf-syntax-ns#type http://www.openrdf.org/config/repository#Repository
01:50:25.852 [main] DEBUG _:node1drkmons2x338 http://www.openrdf.org/config/repository#repositoryID "fedID"
01:50:25.852 [main] DEBUG _:node1drkmons2x338 http://www.w3.org/2000/01/rdf-schema#label "Test Federation Title"
01:50:25.852 [main] DEBUG _:node1drkmons2x338 http://www.openrdf.org/config/repository#repositoryImpl _:node1drkmons2x339
01:50:25.852 [main] DEBUG _:node1drkmons2x339 http://www.openrdf.org/config/repository#repositoryType "openrdf:SailRepository"
01:50:25.852 [main] DEBUG _:node1drkmons2x339 http://www.openrdf.org/config/repository/sail#sailImpl _:node1drkmons2x340
01:50:25.852 [main] DEBUG _:node1drkmons2x340 http://www.openrdf.org/config/sail#sailType "openrdf:Federation"
01:50:25.852 [main] DEBUG _:node1drkmons2x340 http://www.openrdf.org/config/sail/federation#readOnly "false"^^<http://www.w3.org/2001/XMLSchema#boolean>
01:50:25.852 [main] DEBUG _:node1drkmons2x340 http://www.openrdf.org/config/sail/federation#distinct "true"^^<http://www.w3.org/2001/XMLSchema#boolean>
01:50:25.852 [main] DEBUG Adding member: alien
01:50:25.852 [main] DEBUG _:node1drkmons2x340 http://www.openrdf.org/config/sail/federation#member _:node1drkmons2x341
01:50:25.853 [main] DEBUG _:node1drkmons2x341 http://www.openrdf.org/config/repository#repositoryType "openrdf:ProxyRepository"
01:50:25.853 [main] DEBUG _:node1drkmons2x341 http://www.openrdf.org/config/repository/proxy#proxiedID "alien"
01:50:25.853 [main] DEBUG Added member alien: 
01:50:25.853 [main] DEBUG Adding member: scary
01:50:25.853 [main] DEBUG _:node1drkmons2x340 http://www.openrdf.org/config/sail/federation#member _:node1drkmons2x344
01:50:25.853 [main] DEBUG _:node1drkmons2x344 http://www.openrdf.org/config/repository#repositoryType "openrdf:ProxyRepository"
01:50:25.854 [main] DEBUG _:node1drkmons2x344 http://www.openrdf.org/config/repository/proxy#proxiedID "scary"
01:50:25.854 [main] DEBUG Added member scary: 
01:50:25.884 [main] DEBUG Initializing MemoryStore...
01:50:25.885 [main] DEBUG Initializing data file...
01:50:25.885 [main] DEBUG Data file initialized
01:50:25.885 [main] DEBUG MemoryStore initialized
01:50:25.887 [main] DEBUG syncing data to file...
01:50:25.887 [main] DEBUG Data synced to file
01:50:25.890 [main] DEBUG Initializing MemoryStore...
01:50:25.891 [main] DEBUG Initializing data file...
01:50:25.891 [main] DEBUG Data file initialized
01:50:25.891 [main] DEBUG MemoryStore initialized
01:50:25.892 [main] DEBUG syncing data to file...
01:50:25.893 [main] DEBUG Data synced to file
01:50:25.902 [main] DEBUG Federate called with federation ID = fedID, and member ID's = [sparql][sparql2].
  Distinct set to false, and readonly set to false.

01:50:25.904 [main] ERROR sparql is read-only.
01:50:25.905 [main] ERROR sparql2 is read-only.
[MockitoHint] FederateTest.testSparqlAndNotReadOnlyPrintsError (see javadoc for MockitoHint):
[MockitoHint] 1. Unused -> at org.eclipse.rdf4j.console.command.FederateTest.setUp(FederateTest.java:88)

01:50:25.913 [main] DEBUG Initializing MemoryStore...
01:50:25.914 [main] DEBUG Initializing data file...
01:50:25.914 [main] DEBUG Data file initialized
01:50:25.914 [main] DEBUG MemoryStore initialized
01:50:25.916 [main] DEBUG syncing data to file...
01:50:25.917 [main] DEBUG Data synced to file
01:50:25.920 [main] DEBUG Initializing MemoryStore...
01:50:25.921 [main] DEBUG Initializing data file...
01:50:25.921 [main] DEBUG Data file initialized
01:50:25.921 [main] DEBUG MemoryStore initialized
01:50:25.923 [main] DEBUG syncing data to file...
01:50:25.923 [main] DEBUG Data synced to file
[MockitoHint] FederateTest.testNoArgumentsPrintsHelp (see javadoc for MockitoHint):
[MockitoHint] 1. Unused -> at org.eclipse.rdf4j.console.command.FederateTest.setUp(FederateTest.java:87)
[MockitoHint] 2. Unused -> at org.eclipse.rdf4j.console.command.FederateTest.setUp(FederateTest.java:88)

01:50:25.941 [main] DEBUG Initializing MemoryStore...
01:50:25.941 [main] DEBUG Initializing data file...
01:50:25.942 [main] DEBUG Data file initialized
01:50:25.942 [main] DEBUG MemoryStore initialized
01:50:25.943 [main] DEBUG syncing data to file...
01:50:25.944 [main] DEBUG Data synced to file
01:50:25.947 [main] DEBUG Initializing MemoryStore...
01:50:25.948 [main] DEBUG Initializing data file...
01:50:25.948 [main] DEBUG Data file initialized
01:50:25.948 [main] DEBUG MemoryStore initialized
01:50:25.949 [main] DEBUG syncing data to file...
01:50:25.950 [main] DEBUG Data synced to file
01:50:25.957 [main] DEBUG Federate called with federation ID = type=memory, and member ID's = [fedID][alien][scary].
  Distinct set to false, and readonly set to true.

01:50:25.957 [main] ERROR fedID does not exist.
[MockitoHint] FederateTest.testInvalidArgumentPrintsError (see javadoc for MockitoHint):
[MockitoHint] 1. Unused -> at org.eclipse.rdf4j.console.command.FederateTest.setUp(FederateTest.java:88)

01:50:25.966 [main] DEBUG Initializing MemoryStore...
01:50:25.967 [main] DEBUG Initializing data file...
01:50:25.967 [main] DEBUG Data file initialized
01:50:25.967 [main] DEBUG MemoryStore initialized
01:50:25.969 [main] DEBUG syncing data to file...
01:50:25.969 [main] DEBUG Data synced to file
01:50:25.972 [main] DEBUG Initializing MemoryStore...
01:50:25.973 [main] DEBUG Initializing data file...
01:50:25.973 [main] DEBUG Data file initialized
01:50:25.973 [main] DEBUG MemoryStore initialized
01:50:25.975 [main] DEBUG syncing data to file...
01:50:25.975 [main] DEBUG Data synced to file
01:50:25.983 [main] DEBUG Federate called with federation ID = fedID, and member ID's = [sparql][sparql2].
  Distinct set to false, and readonly set to true.

01:50:25.985 [main] DEBUG Federation repository root node: _:node1drkmons2x494
01:50:25.985 [main] DEBUG _:node1drkmons2x494 http://www.w3.org/1999/02/22-rdf-syntax-ns#type http://www.openrdf.org/config/repository#Repository
01:50:25.985 [main] DEBUG _:node1drkmons2x494 http://www.openrdf.org/config/repository#repositoryID "fedID"
01:50:25.985 [main] DEBUG _:node1drkmons2x494 http://www.w3.org/2000/01/rdf-schema#label "Test Federation Title"
01:50:25.985 [main] DEBUG _:node1drkmons2x494 http://www.openrdf.org/config/repository#repositoryImpl _:node1drkmons2x495
01:50:25.985 [main] DEBUG _:node1drkmons2x495 http://www.openrdf.org/config/repository#repositoryType "openrdf:SailRepository"
01:50:25.985 [main] DEBUG _:node1drkmons2x495 http://www.openrdf.org/config/repository/sail#sailImpl _:node1drkmons2x496
01:50:25.985 [main] DEBUG _:node1drkmons2x496 http://www.openrdf.org/config/sail#sailType "openrdf:Federation"
01:50:25.985 [main] DEBUG _:node1drkmons2x496 http://www.openrdf.org/config/sail/federation#readOnly "true"^^<http://www.w3.org/2001/XMLSchema#boolean>
01:50:25.985 [main] DEBUG _:node1drkmons2x496 http://www.openrdf.org/config/sail/federation#distinct "false"^^<http://www.w3.org/2001/XMLSchema#boolean>
01:50:25.985 [main] DEBUG Adding member: sparql
01:50:25.985 [main] DEBUG _:node1drkmons2x496 http://www.openrdf.org/config/sail/federation#member _:node1drkmons2x497
01:50:25.986 [main] DEBUG _:node1drkmons2x497 http://www.openrdf.org/config/repository#repositoryType "openrdf:SPARQLRepository"
01:50:25.986 [main] DEBUG _:node1drkmons2x497 http://www.openrdf.org/config/repository/sparql#query-endpoint http://localhost:8080/openrdf-sesame/repositories/sparql
01:50:25.986 [main] DEBUG Added member sparql: 
01:50:25.986 [main] DEBUG Adding member: sparql2
01:50:25.986 [main] DEBUG _:node1drkmons2x496 http://www.openrdf.org/config/sail/federation#member _:node1drkmons2x500
01:50:25.987 [main] DEBUG _:node1drkmons2x500 http://www.openrdf.org/config/repository#repositoryType "openrdf:SPARQLRepository"
01:50:25.987 [main] DEBUG _:node1drkmons2x500 http://www.openrdf.org/config/repository/sparql#query-endpoint http://localhost:8080/openrdf-sesame/repositories/sparql
01:50:25.987 [main] DEBUG Added member sparql2: 
01:50:26.000 [main] DEBUG Initializing MemoryStore...
01:50:26.001 [main] DEBUG Initializing data file...
01:50:26.001 [main] DEBUG Data file initialized
01:50:26.001 [main] DEBUG MemoryStore initialized
01:50:26.003 [main] DEBUG syncing data to file...
01:50:26.004 [main] DEBUG Data synced to file
01:50:26.006 [main] DEBUG Initializing MemoryStore...
01:50:26.007 [main] DEBUG Initializing data file...
01:50:26.007 [main] DEBUG Data file initialized
01:50:26.007 [main] DEBUG MemoryStore initialized
01:50:26.009 [main] DEBUG syncing data to file...
01:50:26.009 [main] DEBUG Data synced to file
01:50:26.017 [main] DEBUG Federate called with federation ID = fedID, and member ID's = [http][sparql].
  Distinct set to false, and readonly set to true.

01:50:26.018 [main] DEBUG Federation repository root node: _:node1drkmons2x549
01:50:26.018 [main] DEBUG _:node1drkmons2x549 http://www.w3.org/1999/02/22-rdf-syntax-ns#type http://www.openrdf.org/config/repository#Repository
01:50:26.018 [main] DEBUG _:node1drkmons2x549 http://www.openrdf.org/config/repository#repositoryID "fedID"
01:50:26.018 [main] DEBUG _:node1drkmons2x549 http://www.w3.org/2000/01/rdf-schema#label "Test Federation Title"
01:50:26.018 [main] DEBUG _:node1drkmons2x549 http://www.openrdf.org/config/repository#repositoryImpl _:node1drkmons2x550
01:50:26.018 [main] DEBUG _:node1drkmons2x550 http://www.openrdf.org/config/repository#repositoryType "openrdf:SailRepository"
01:50:26.018 [main] DEBUG _:node1drkmons2x550 http://www.openrdf.org/config/repository/sail#sailImpl _:node1drkmons2x551
01:50:26.018 [main] DEBUG _:node1drkmons2x551 http://www.openrdf.org/config/sail#sailType "openrdf:Federation"
01:50:26.019 [main] DEBUG _:node1drkmons2x551 http://www.openrdf.org/config/sail/federation#readOnly "true"^^<http://www.w3.org/2001/XMLSchema#boolean>
01:50:26.019 [main] DEBUG _:node1drkmons2x551 http://www.openrdf.org/config/sail/federation#distinct "false"^^<http://www.w3.org/2001/XMLSchema#boolean>
01:50:26.019 [main] DEBUG Adding member: http
01:50:26.019 [main] DEBUG _:node1drkmons2x551 http://www.openrdf.org/config/sail/federation#member _:node1drkmons2x552
01:50:26.019 [main] DEBUG _:node1drkmons2x552 http://www.openrdf.org/config/repository#repositoryType "openrdf:HTTPRepository"
01:50:26.020 [main] DEBUG _:node1drkmons2x552 http://www.openrdf.org/config/repository/http#repositoryURL http://localhost:8080/openrdf-sesame/repositories/http
01:50:26.020 [main] DEBUG Added member http: 
01:50:26.020 [main] DEBUG Adding member: sparql
01:50:26.020 [main] DEBUG _:node1drkmons2x551 http://www.openrdf.org/config/sail/federation#member _:node1drkmons2x555
01:50:26.021 [main] DEBUG _:node1drkmons2x555 http://www.openrdf.org/config/repository#repositoryType "openrdf:SPARQLRepository"
01:50:26.021 [main] DEBUG _:node1drkmons2x555 http://www.openrdf.org/config/repository/sparql#query-endpoint http://localhost:8080/openrdf-sesame/repositories/sparql
01:50:26.021 [main] DEBUG Added member sparql: 
01:50:26.034 [main] DEBUG Initializing MemoryStore...
01:50:26.035 [main] DEBUG Initializing data file...
01:50:26.035 [main] DEBUG Data file initialized
01:50:26.035 [main] DEBUG MemoryStore initialized
01:50:26.037 [main] DEBUG syncing data to file...
01:50:26.038 [main] DEBUG Data synced to file
01:50:26.041 [main] DEBUG Initializing MemoryStore...
01:50:26.042 [main] DEBUG Initializing data file...
01:50:26.042 [main] DEBUG Data file initialized
01:50:26.042 [main] DEBUG MemoryStore initialized
01:50:26.043 [main] DEBUG syncing data to file...
01:50:26.044 [main] DEBUG Data synced to file
01:50:26.053 [main] DEBUG Federate called with federation ID = fedID, and member ID's = [alien][FreeLunch].
  Distinct set to false, and readonly set to true.

01:50:26.054 [main] ERROR FreeLunch does not exist.
[MockitoHint] FederateTest.testNonexistentMemberPrintsSpecificError (see javadoc for MockitoHint):
[MockitoHint] 1. Unused -> at org.eclipse.rdf4j.console.command.FederateTest.setUp(FederateTest.java:88)

01:50:26.062 [main] DEBUG Initializing MemoryStore...
01:50:26.062 [main] DEBUG Initializing data file...
01:50:26.063 [main] DEBUG Data file initialized
01:50:26.063 [main] DEBUG MemoryStore initialized
01:50:26.064 [main] DEBUG syncing data to file...
01:50:26.065 [main] DEBUG Data synced to file
01:50:26.068 [main] DEBUG Initializing MemoryStore...
01:50:26.068 [main] DEBUG Initializing data file...
01:50:26.069 [main] DEBUG Data file initialized
01:50:26.069 [main] DEBUG MemoryStore initialized
01:50:26.070 [main] DEBUG syncing data to file...
01:50:26.071 [main] DEBUG Data synced to file
01:50:26.078 [main] ERROR Duplicate repository id's specified.
[MockitoHint] FederateTest.testFedSameAsMemberPrintsError (see javadoc for MockitoHint):
[MockitoHint] 1. Unused -> at org.eclipse.rdf4j.console.command.FederateTest.setUp(FederateTest.java:87)
[MockitoHint] 2. Unused -> at org.eclipse.rdf4j.console.command.FederateTest.setUp(FederateTest.java:88)

01:50:26.086 [main] DEBUG Initializing MemoryStore...
01:50:26.087 [main] DEBUG Initializing data file...
01:50:26.087 [main] DEBUG Data file initialized
01:50:26.087 [main] DEBUG MemoryStore initialized
01:50:26.089 [main] DEBUG syncing data to file...
01:50:26.089 [main] DEBUG Data synced to file
01:50:26.092 [main] DEBUG Initializing MemoryStore...
01:50:26.093 [main] DEBUG Initializing data file...
01:50:26.093 [main] DEBUG Data file initialized
01:50:26.093 [main] DEBUG MemoryStore initialized
01:50:26.094 [main] DEBUG syncing data to file...
01:50:26.095 [main] DEBUG Data synced to file
[MockitoHint] FederateTest.testTwoArgumentsPrintsHelp (see javadoc for MockitoHint):
[MockitoHint] 1. Unused -> at org.eclipse.rdf4j.console.command.FederateTest.setUp(FederateTest.java:87)
[MockitoHint] 2. Unused -> at org.eclipse.rdf4j.console.command.FederateTest.setUp(FederateTest.java:88)

01:50:26.110 [main] DEBUG Initializing MemoryStore...
01:50:26.111 [main] DEBUG Initializing data file...
01:50:26.111 [main] DEBUG Data file initialized
01:50:26.111 [main] DEBUG MemoryStore initialized
01:50:26.112 [main] DEBUG syncing data to file...
01:50:26.113 [main] DEBUG Data synced to file
01:50:26.116 [main] DEBUG Initializing MemoryStore...
01:50:26.116 [main] DEBUG Initializing data file...
01:50:26.117 [main] DEBUG Data file initialized
01:50:26.117 [main] DEBUG MemoryStore initialized
01:50:26.118 [main] DEBUG syncing data to file...
01:50:26.118 [main] DEBUG Data synced to file
01:50:26.125 [main] DEBUG Federate called with federation ID = fedID, and member ID's = [alien][scary].
  Distinct set to false, and readonly set to true.

01:50:26.126 [main] DEBUG Federation repository root node: _:node1drkmons2x692
01:50:26.127 [main] DEBUG _:node1drkmons2x692 http://www.w3.org/1999/02/22-rdf-syntax-ns#type http://www.openrdf.org/config/repository#Repository
01:50:26.127 [main] DEBUG _:node1drkmons2x692 http://www.openrdf.org/config/repository#repositoryID "fedID"
01:50:26.127 [main] DEBUG _:node1drkmons2x692 http://www.w3.org/2000/01/rdf-schema#label "Test Federation Title"
01:50:26.127 [main] DEBUG _:node1drkmons2x692 http://www.openrdf.org/config/repository#repositoryImpl _:node1drkmons2x693
01:50:26.127 [main] DEBUG _:node1drkmons2x693 http://www.openrdf.org/config/repository#repositoryType "openrdf:SailRepository"
01:50:26.127 [main] DEBUG _:node1drkmons2x693 http://www.openrdf.org/config/repository/sail#sailImpl _:node1drkmons2x694
01:50:26.127 [main] DEBUG _:node1drkmons2x694 http://www.openrdf.org/config/sail#sailType "openrdf:Federation"
01:50:26.127 [main] DEBUG _:node1drkmons2x694 http://www.openrdf.org/config/sail/federation#readOnly "true"^^<http://www.w3.org/2001/XMLSchema#boolean>
01:50:26.127 [main] DEBUG _:node1drkmons2x694 http://www.openrdf.org/config/sail/federation#distinct "false"^^<http://www.w3.org/2001/XMLSchema#boolean>
01:50:26.127 [main] DEBUG Adding member: alien
01:50:26.127 [main] DEBUG _:node1drkmons2x694 http://www.openrdf.org/config/sail/federation#member _:node1drkmons2x695
01:50:26.127 [main] DEBUG _:node1drkmons2x695 http://www.openrdf.org/config/repository#repositoryType "openrdf:ProxyRepository"
01:50:26.127 [main] DEBUG _:node1drkmons2x695 http://www.openrdf.org/config/repository/proxy#proxiedID "alien"
01:50:26.127 [main] DEBUG Added member alien: 
01:50:26.127 [main] DEBUG Adding member: scary
01:50:26.128 [main] DEBUG _:node1drkmons2x694 http://www.openrdf.org/config/sail/federation#member _:node1drkmons2x698
01:50:26.128 [main] DEBUG _:node1drkmons2x698 http://www.openrdf.org/config/repository#repositoryType "openrdf:ProxyRepository"
01:50:26.128 [main] DEBUG _:node1drkmons2x698 http://www.openrdf.org/config/repository/proxy#proxiedID "scary"
01:50:26.128 [main] DEBUG Added member scary: 
01:50:26.144 [main] DEBUG Initializing MemoryStore...
01:50:26.144 [main] DEBUG Initializing data file...
01:50:26.145 [main] DEBUG Data file initialized
01:50:26.145 [main] DEBUG MemoryStore initialized
01:50:26.146 [main] DEBUG syncing data to file...
01:50:26.147 [main] DEBUG Data synced to file
01:50:26.149 [main] DEBUG Initializing MemoryStore...
01:50:26.150 [main] DEBUG Initializing data file...
01:50:26.150 [main] DEBUG Data file initialized
01:50:26.150 [main] DEBUG MemoryStore initialized
01:50:26.152 [main] DEBUG syncing data to file...
01:50:26.152 [main] DEBUG Data synced to file
[MockitoHint] FederateTest.testOneArgumentPrintsHelp (see javadoc for MockitoHint):
[MockitoHint] 1. Unused -> at org.eclipse.rdf4j.console.command.FederateTest.setUp(FederateTest.java:87)
[MockitoHint] 2. Unused -> at org.eclipse.rdf4j.console.command.FederateTest.setUp(FederateTest.java:88)

01:50:26.165 [main] DEBUG Initializing MemoryStore...
01:50:26.166 [main] DEBUG Initializing data file...
01:50:26.166 [main] DEBUG Data file initialized
01:50:26.166 [main] DEBUG MemoryStore initialized
01:50:26.167 [main] DEBUG syncing data to file...
01:50:26.167 [main] DEBUG Data synced to file
01:50:26.170 [main] DEBUG Initializing MemoryStore...
01:50:26.170 [main] DEBUG Initializing data file...
01:50:26.170 [main] DEBUG Data file initialized
01:50:26.170 [main] DEBUG MemoryStore initialized
01:50:26.171 [main] DEBUG syncing data to file...
01:50:26.172 [main] DEBUG Data synced to file
01:50:26.178 [main] DEBUG Federate called with federation ID = fedID, and member ID's = [http][http2].
  Distinct set to false, and readonly set to true.

01:50:26.179 [main] DEBUG Federation repository root node: _:node1drkmons2x784
01:50:26.179 [main] DEBUG _:node1drkmons2x784 http://www.w3.org/1999/02/22-rdf-syntax-ns#type http://www.openrdf.org/config/repository#Repository
01:50:26.179 [main] DEBUG _:node1drkmons2x784 http://www.openrdf.org/config/repository#repositoryID "fedID"
01:50:26.179 [main] DEBUG _:node1drkmons2x784 http://www.w3.org/2000/01/rdf-schema#label "Test Federation Title"
01:50:26.180 [main] DEBUG _:node1drkmons2x784 http://www.openrdf.org/config/repository#repositoryImpl _:node1drkmons2x785
01:50:26.180 [main] DEBUG _:node1drkmons2x785 http://www.openrdf.org/config/repository#repositoryType "openrdf:SailRepository"
01:50:26.180 [main] DEBUG _:node1drkmons2x785 http://www.openrdf.org/config/repository/sail#sailImpl _:node1drkmons2x786
01:50:26.180 [main] DEBUG _:node1drkmons2x786 http://www.openrdf.org/config/sail#sailType "openrdf:Federation"
01:50:26.180 [main] DEBUG _:node1drkmons2x786 http://www.openrdf.org/config/sail/federation#readOnly "true"^^<http://www.w3.org/2001/XMLSchema#boolean>
01:50:26.180 [main] DEBUG _:node1drkmons2x786 http://www.openrdf.org/config/sail/federation#distinct "false"^^<http://www.w3.org/2001/XMLSchema#boolean>
01:50:26.180 [main] DEBUG Adding member: http
01:50:26.180 [main] DEBUG _:node1drkmons2x786 http://www.openrdf.org/config/sail/federation#member _:node1drkmons2x787
01:50:26.180 [main] DEBUG _:node1drkmons2x787 http://www.openrdf.org/config/repository#repositoryType "openrdf:HTTPRepository"
01:50:26.181 [main] DEBUG _:node1drkmons2x787 http://www.openrdf.org/config/repository/http#repositoryURL http://localhost:8080/openrdf-sesame/repositories/http
01:50:26.181 [main] DEBUG Added member http: 
01:50:26.181 [main] DEBUG Adding member: http2
01:50:26.181 [main] DEBUG _:node1drkmons2x786 http://www.openrdf.org/config/sail/federation#member _:node1drkmons2x790
01:50:26.181 [main] DEBUG _:node1drkmons2x790 http://www.openrdf.org/config/repository#repositoryType "openrdf:HTTPRepository"
01:50:26.181 [main] DEBUG _:node1drkmons2x790 http://www.openrdf.org/config/repository/http#repositoryURL http://localhost:8080/openrdf-sesame/repositories/http
01:50:26.181 [main] DEBUG Added member http2: 
[INFO] Tests run: 15, Failures: 0, Errors: 0, Skipped: 0, Time elapsed: 0.51 s - in org.eclipse.rdf4j.console.command.FederateTest
[INFO] Running org.eclipse.rdf4j.console.command.SparqlTest
[MockitoHint] SparqlTest.testInputFile (see javadoc for MockitoHint):
[MockitoHint] 1. Unused -> at org.eclipse.rdf4j.console.command.SparqlTest.setUp(SparqlTest.java:49)

01:50:26.223 [main] ERROR No suitable result writer found
[MockitoHint] SparqlTest.testSelectError (see javadoc for MockitoHint):
[MockitoHint] 1. Unused -> at org.eclipse.rdf4j.console.command.SparqlTest.setUp(SparqlTest.java:49)

[MockitoHint] SparqlTest.testSelectMissingBindings (see javadoc for MockitoHint):
[MockitoHint] 1. Unused -> at org.eclipse.rdf4j.console.command.SparqlTest.setUp(SparqlTest.java:49)

[MockitoHint] SparqlTest.testInputFileWorkdir (see javadoc for MockitoHint):
[MockitoHint] 1. Unused -> at org.eclipse.rdf4j.console.command.SparqlTest.setUp(SparqlTest.java:49)

[INFO] Tests run: 9, Failures: 0, Errors: 0, Skipped: 0, Time elapsed: 0.125 s - in org.eclipse.rdf4j.console.command.SparqlTest
[INFO] Running org.eclipse.rdf4j.console.UtilTest
 one, two
 three
 four
 five, six
 seven
 eight
[INFO] Tests run: 4, Failures: 0, Errors: 0, Skipped: 0, Time elapsed: 0 s - in org.eclipse.rdf4j.console.UtilTest
[INFO] Running org.eclipse.rdf4j.console.ConsoleIOTest
[INFO] Tests run: 3, Failures: 0, Errors: 0, Skipped: 0, Time elapsed: 0.045 s - in org.eclipse.rdf4j.console.ConsoleIOTest
[INFO] 
[INFO] Results:
[INFO] 
[INFO] Tests run: 64, Failures: 0, Errors: 0, Skipped: 0
[INFO] 
[JENKINS] Recording test results
[INFO] 
[INFO] --- animal-sniffer-maven-plugin:1.16:check (default) @ rdf4j-console ---
[INFO] Checking unresolved references to org.codehaus.mojo.signature:java18:1.0
[INFO] 
[INFO] --- maven-jar-plugin:2.3.1:jar (default-jar) @ rdf4j-console ---
[INFO] Building jar: /home/hudson/genie.rdf4j/.jenkins/jobs/rdf4j-pr-verify/workspace/tools/console/target/rdf4j-console-3.1.0-SNAPSHOT.jar