SuccessConsole Output

Started calculate disk usage of build
Finished Calculation of disk usage of build in 0 seconds
Started calculate disk usage of workspace
Finished Calculation of disk usage of workspace in 0 seconds
[INFO] 
[INFO] ------------------< org.eclipse.rdf4j:rdf4j-console >-------------------
[INFO] Building RDF4J: Console 3.1.0-SNAPSHOT                           [70/85]
[INFO] --------------------------------[ jar ]---------------------------------
[INFO] 
[INFO] --- buildnumber-maven-plugin:1.4:create (default) @ rdf4j-console ---
[INFO] ShortRevision tag detected. The value is '7'.
[INFO] Executing: /bin/sh -c cd '/home/hudson/genie.rdf4j/.jenkins/jobs/rdf4j-pr-verify/workspace/tools/console' && 'git' 'rev-parse' '--verify' '--short=7' 'HEAD'
[INFO] Working directory: /home/hudson/genie.rdf4j/.jenkins/jobs/rdf4j-pr-verify/workspace/tools/console
[INFO] Storing buildNumber: b687f54 at timestamp: 1575849571159
[WARNING] Cannot get the branch information from the git repository: 
Detecting the current branch failed: fatal: ref HEAD is not a symbolic ref

[INFO] ShortRevision tag detected. The value is '7'.
[INFO] Executing: /bin/sh -c cd '/home/hudson/genie.rdf4j/.jenkins/jobs/rdf4j-pr-verify/workspace/tools/console' && 'git' 'rev-parse' '--verify' '--short=7' 'HEAD'
[INFO] Working directory: /home/hudson/genie.rdf4j/.jenkins/jobs/rdf4j-pr-verify/workspace/tools/console
[INFO] Storing buildScmBranch: UNKNOWN
[INFO] 
[INFO] --- maven-enforcer-plugin:1.4.1:enforce (enforce-bytecode-version) @ rdf4j-console ---
[INFO] Adding ignore: META-INF/**/module-info
[INFO] 
[INFO] --- formatter-maven-plugin:2.8.1:validate (default) @ rdf4j-console ---
[INFO] Using 'UTF-8' encoding to format source files.
[INFO] Number of files to be formatted: 61
[INFO] Html formatting is skipped
[INFO] Successfully formatted:          0 file(s)
[INFO] Fail to format:                  0 file(s)
[INFO] Skipped:                         61 file(s)
[INFO] Read only skipped:               0 file(s)
[INFO] Approximate time taken:          0s
[INFO] 
[INFO] --- maven-resources-plugin:3.0.2:resources (default-resources) @ rdf4j-console ---
[INFO] Using 'UTF-8' encoding to copy filtered resources.
[INFO] skip non existing resourceDirectory /home/hudson/genie.rdf4j/.jenkins/jobs/rdf4j-pr-verify/workspace/tools/console/src/main/resources
[INFO] 
[INFO] --- maven-compiler-plugin:3.7.0:compile (default-compile) @ rdf4j-console ---
[INFO] Changes detected - recompiling the module!
[INFO] Compiling 42 source files to /home/hudson/genie.rdf4j/.jenkins/jobs/rdf4j-pr-verify/workspace/tools/console/target/classes
[INFO] 
[INFO] --- maven-resources-plugin:3.0.2:testResources (default-testResources) @ rdf4j-console ---
[INFO] Using 'UTF-8' encoding to copy filtered resources.
[INFO] Copying 29 resources
[INFO] 
[INFO] --- maven-compiler-plugin:3.7.0:testCompile (default-testCompile) @ rdf4j-console ---
[INFO] Changes detected - recompiling the module!
[INFO] Compiling 18 source files to /home/hudson/genie.rdf4j/.jenkins/jobs/rdf4j-pr-verify/workspace/tools/console/target/test-classes
[INFO] 
[INFO] --- maven-surefire-plugin:2.22.2:test (default-test) @ rdf4j-console ---
[INFO] 
[INFO] -------------------------------------------------------
[INFO]  T E S T S
[INFO] -------------------------------------------------------
[INFO] Running org.eclipse.rdf4j.console.setting.PrefixesTest
[INFO] Tests run: 3, Failures: 0, Errors: 0, Skipped: 0, Time elapsed: 0.622 s - in org.eclipse.rdf4j.console.setting.PrefixesTest
[INFO] Running org.eclipse.rdf4j.console.setting.LogLevelTest
18:59:35.702 [main] ERROR unknown logging level: chatty
[INFO] Tests run: 4, Failures: 0, Errors: 0, Skipped: 0, Time elapsed: 0.012 s - in org.eclipse.rdf4j.console.setting.LogLevelTest
[INFO] Running org.eclipse.rdf4j.console.setting.QueryPrefixTest
[INFO] Tests run: 1, Failures: 0, Errors: 0, Skipped: 0, Time elapsed: 0 s - in org.eclipse.rdf4j.console.setting.QueryPrefixTest
[INFO] Running org.eclipse.rdf4j.console.setting.ShowPrefixTest
[INFO] Tests run: 1, Failures: 0, Errors: 0, Skipped: 0, Time elapsed: 0 s - in org.eclipse.rdf4j.console.setting.ShowPrefixTest
[INFO] Running org.eclipse.rdf4j.console.setting.ConsoleWidthTest
[INFO] Tests run: 1, Failures: 0, Errors: 0, Skipped: 0, Time elapsed: 0 s - in org.eclipse.rdf4j.console.setting.ConsoleWidthTest
[INFO] Running org.eclipse.rdf4j.console.command.SetParametersTest
18:59:35.734 [main] ERROR Unknown parameter: unknown
[INFO] Tests run: 1, Failures: 0, Errors: 0, Skipped: 0, Time elapsed: 0.016 s - in org.eclipse.rdf4j.console.command.SetParametersTest
[INFO] Running org.eclipse.rdf4j.console.command.LoadTest
[MockitoHint] LoadTest.testLoad (see javadoc for MockitoHint):
[MockitoHint] 1. Unused -> at org.eclipse.rdf4j.console.command.LoadTest.setUp(LoadTest.java:49)

[MockitoHint] LoadTest.testLoadWorkDir (see javadoc for MockitoHint):
[MockitoHint] 1. Unused -> at org.eclipse.rdf4j.console.command.LoadTest.setUp(LoadTest.java:49)

[INFO] Tests run: 2, Failures: 0, Errors: 0, Skipped: 0, Time elapsed: 0.185 s - in org.eclipse.rdf4j.console.command.LoadTest
[INFO] Running org.eclipse.rdf4j.console.command.ConvertTest
18:59:36.205 [main] ERROR No RDF writer for /tmp/genie.rdf4j/junit8968736710168012107/alien.qyx
[MockitoHint] ConvertTest.testConvertInvalidFormat (see javadoc for MockitoHint):
[MockitoHint] 1. Unused -> at org.eclipse.rdf4j.console.command.ConvertTest.setup(ConvertTest.java:39)

18:59:36.214 [main] ERROR Failed to convert data
org.eclipse.rdf4j.rio.RDFParseException: Expected '<' or '_', found: e [line 1, column 101]
	at org.eclipse.rdf4j.rio.ntriples.NTriplesParser.parseSubject(NTriplesParser.java:313)
	at org.eclipse.rdf4j.rio.ntriples.NTriplesParser.parseTriple(NTriplesParser.java:252)
	at org.eclipse.rdf4j.rio.ntriples.NTriplesParser.parse(NTriplesParser.java:160)
	at org.eclipse.rdf4j.rio.ntriples.NTriplesParser.parse(NTriplesParser.java:109)
	at org.eclipse.rdf4j.console.command.Convert.convert(Convert.java:139)
	at org.eclipse.rdf4j.console.command.Convert.execute(Convert.java:74)
	at org.eclipse.rdf4j.console.command.ConvertTest.testConvertParseError(ConvertTest.java:92)
	at sun.reflect.NativeMethodAccessorImpl.invoke0(Native Method)
	at sun.reflect.NativeMethodAccessorImpl.invoke(NativeMethodAccessorImpl.java:62)
	at sun.reflect.DelegatingMethodAccessorImpl.invoke(DelegatingMethodAccessorImpl.java:43)
	at java.lang.reflect.Method.invoke(Method.java:498)
	at org.junit.runners.model.FrameworkMethod$1.runReflectiveCall(FrameworkMethod.java:50)
	at org.junit.internal.runners.model.ReflectiveCallable.run(ReflectiveCallable.java:12)
	at org.junit.runners.model.FrameworkMethod.invokeExplosively(FrameworkMethod.java:47)
	at org.junit.internal.runners.statements.InvokeMethod.evaluate(InvokeMethod.java:17)
	at org.junit.internal.runners.statements.RunBefores.evaluate(RunBefores.java:26)
	at org.junit.internal.runners.statements.RunAfters.evaluate(RunAfters.java:27)
	at org.mockito.internal.junit.JUnitRule$1.evaluateSafely(JUnitRule.java:52)
	at org.mockito.internal.junit.JUnitRule$1.evaluate(JUnitRule.java:43)
	at org.junit.rules.ExternalResource$1.evaluate(ExternalResource.java:48)
	at org.junit.rules.RunRules.evaluate(RunRules.java:20)
	at org.junit.runners.ParentRunner.runLeaf(ParentRunner.java:325)
	at org.junit.runners.BlockJUnit4ClassRunner.runChild(BlockJUnit4ClassRunner.java:78)
	at org.junit.runners.BlockJUnit4ClassRunner.runChild(BlockJUnit4ClassRunner.java:57)
	at org.junit.runners.ParentRunner$3.run(ParentRunner.java:290)
	at org.junit.runners.ParentRunner$1.schedule(ParentRunner.java:71)
	at org.junit.runners.ParentRunner.runChildren(ParentRunner.java:288)
	at org.junit.runners.ParentRunner.access$000(ParentRunner.java:58)
	at org.junit.runners.ParentRunner$2.evaluate(ParentRunner.java:268)
	at org.junit.runners.ParentRunner.run(ParentRunner.java:363)
	at org.apache.maven.surefire.junit4.JUnit4Provider.execute(JUnit4Provider.java:365)
	at org.apache.maven.surefire.junit4.JUnit4Provider.executeWithRerun(JUnit4Provider.java:273)
	at org.apache.maven.surefire.junit4.JUnit4Provider.executeTestSet(JUnit4Provider.java:238)
	at org.apache.maven.surefire.junit4.JUnit4Provider.invoke(JUnit4Provider.java:159)
	at org.apache.maven.surefire.booter.ForkedBooter.invokeProviderInSameClassLoader(ForkedBooter.java:384)
	at org.apache.maven.surefire.booter.ForkedBooter.runSuitesInProcess(ForkedBooter.java:345)
	at org.apache.maven.surefire.booter.ForkedBooter.execute(ForkedBooter.java:126)
	at org.apache.maven.surefire.booter.ForkedBooter.main(ForkedBooter.java:418)
[INFO] Tests run: 4, Failures: 0, Errors: 0, Skipped: 0, Time elapsed: 0.284 s - in org.eclipse.rdf4j.console.command.ConvertTest
[INFO] Running org.eclipse.rdf4j.console.command.ExportTest
[MockitoHint] ExportTest.testExportWorkDir (see javadoc for MockitoHint):
[MockitoHint] 1. Unused -> at org.eclipse.rdf4j.console.command.ExportTest.setUp(ExportTest.java:46)

[MockitoHint] ExportTest.testExportAll (see javadoc for MockitoHint):
[MockitoHint] 1. Unused -> at org.eclipse.rdf4j.console.command.ExportTest.setUp(ExportTest.java:46)

[MockitoHint] ExportTest.testExportContexts (see javadoc for MockitoHint):
[MockitoHint] 1. Unused -> at org.eclipse.rdf4j.console.command.ExportTest.setUp(ExportTest.java:46)

[INFO] Tests run: 3, Failures: 0, Errors: 0, Skipped: 0, Time elapsed: 0.063 s - in org.eclipse.rdf4j.console.command.ExportTest
[INFO] Running org.eclipse.rdf4j.console.command.VerifyTest
18:59:36.649 [main] ERROR Unexpected RDFParseException
org.eclipse.rdf4j.rio.RDFParseException: 'missing type' was not recognised, and could not be verified, with datatype http://example.rdf4j.org/type/wrong [line 1]
	at org.eclipse.rdf4j.rio.helpers.RDFParserHelper.reportError(RDFParserHelper.java:265)
	at org.eclipse.rdf4j.rio.helpers.RDFParserHelper.createLiteral(RDFParserHelper.java:180)
	at org.eclipse.rdf4j.rio.helpers.AbstractRDFParser.createLiteral(AbstractRDFParser.java:530)
	at org.eclipse.rdf4j.rio.turtle.TurtleParser.parseQuotedLiteral(TurtleParser.java:665)
	at org.eclipse.rdf4j.rio.turtle.TurtleParser.parseValue(TurtleParser.java:584)
	at org.eclipse.rdf4j.rio.turtle.TurtleParser.parseObject(TurtleParser.java:461)
	at org.eclipse.rdf4j.rio.turtle.TurtleParser.parseObjectList(TurtleParser.java:389)
	at org.eclipse.rdf4j.rio.turtle.TurtleParser.parsePredicateObjectList(TurtleParser.java:362)
	at org.eclipse.rdf4j.rio.turtle.TurtleParser.parseTriples(TurtleParser.java:349)
	at org.eclipse.rdf4j.rio.turtle.TurtleParser.parseStatement(TurtleParser.java:216)
	at org.eclipse.rdf4j.rio.turtle.TurtleParser.parse(TurtleParser.java:178)
	at org.eclipse.rdf4j.rio.turtle.TurtleParser.parse(TurtleParser.java:130)
	at org.eclipse.rdf4j.console.command.Verify.verify(Verify.java:145)
	at org.eclipse.rdf4j.console.command.Verify.execute(Verify.java:97)
	at org.eclipse.rdf4j.console.command.VerifyTest.testVerifyMissingType(VerifyTest.java:97)
	at sun.reflect.NativeMethodAccessorImpl.invoke0(Native Method)
	at sun.reflect.NativeMethodAccessorImpl.invoke(NativeMethodAccessorImpl.java:62)
	at sun.reflect.DelegatingMethodAccessorImpl.invoke(DelegatingMethodAccessorImpl.java:43)
	at java.lang.reflect.Method.invoke(Method.java:498)
	at org.junit.runners.model.FrameworkMethod$1.runReflectiveCall(FrameworkMethod.java:50)
	at org.junit.internal.runners.model.ReflectiveCallable.run(ReflectiveCallable.java:12)
	at org.junit.runners.model.FrameworkMethod.invokeExplosively(FrameworkMethod.java:47)
	at org.junit.internal.runners.statements.InvokeMethod.evaluate(InvokeMethod.java:17)
	at org.junit.internal.runners.statements.RunBefores.evaluate(RunBefores.java:26)
	at org.junit.internal.runners.statements.RunAfters.evaluate(RunAfters.java:27)
	at org.mockito.internal.junit.JUnitRule$1.evaluateSafely(JUnitRule.java:52)
	at org.mockito.internal.junit.JUnitRule$1.evaluate(JUnitRule.java:43)
	at org.junit.rules.ExternalResource$1.evaluate(ExternalResource.java:48)
	at org.junit.rules.RunRules.evaluate(RunRules.java:20)
	at org.junit.runners.ParentRunner.runLeaf(ParentRunner.java:325)
	at org.junit.runners.BlockJUnit4ClassRunner.runChild(BlockJUnit4ClassRunner.java:78)
	at org.junit.runners.BlockJUnit4ClassRunner.runChild(BlockJUnit4ClassRunner.java:57)
	at org.junit.runners.ParentRunner$3.run(ParentRunner.java:290)
	at org.junit.runners.ParentRunner$1.schedule(ParentRunner.java:71)
	at org.junit.runners.ParentRunner.runChildren(ParentRunner.java:288)
	at org.junit.runners.ParentRunner.access$000(ParentRunner.java:58)
	at org.junit.runners.ParentRunner$2.evaluate(ParentRunner.java:268)
	at org.junit.runners.ParentRunner.run(ParentRunner.java:363)
	at org.apache.maven.surefire.junit4.JUnit4Provider.execute(JUnit4Provider.java:365)
	at org.apache.maven.surefire.junit4.JUnit4Provider.executeWithRerun(JUnit4Provider.java:273)
	at org.apache.maven.surefire.junit4.JUnit4Provider.executeTestSet(JUnit4Provider.java:238)
	at org.apache.maven.surefire.junit4.JUnit4Provider.invoke(JUnit4Provider.java:159)
	at org.apache.maven.surefire.booter.ForkedBooter.invokeProviderInSameClassLoader(ForkedBooter.java:384)
	at org.apache.maven.surefire.booter.ForkedBooter.runSuitesInProcess(ForkedBooter.java:345)
	at org.apache.maven.surefire.booter.ForkedBooter.execute(ForkedBooter.java:126)
	at org.apache.maven.surefire.booter.ForkedBooter.main(ForkedBooter.java:418)
18:59:36.698 [main] ERROR SHACL validation failed, writing report to /tmp/genie.rdf4j/junit1462825193742136096/junit5597918510857502218.tmp
18:59:36.712 [main] ERROR Unexpected RDFParseException
org.eclipse.rdf4j.rio.RDFParseException: Unexpected end of file
	at org.eclipse.rdf4j.rio.turtle.TurtleParser.throwEOFException(TurtleParser.java:1317)
	at org.eclipse.rdf4j.rio.turtle.TurtleParser.parseValue(TurtleParser.java:589)
	at org.eclipse.rdf4j.rio.turtle.TurtleParser.parsePredicate(TurtleParser.java:434)
	at org.eclipse.rdf4j.rio.turtle.TurtleParser.parsePredicateObjectList(TurtleParser.java:358)
	at org.eclipse.rdf4j.rio.turtle.TurtleParser.parseTriples(TurtleParser.java:349)
	at org.eclipse.rdf4j.rio.turtle.TurtleParser.parseStatement(TurtleParser.java:216)
	at org.eclipse.rdf4j.rio.turtle.TurtleParser.parse(TurtleParser.java:178)
	at org.eclipse.rdf4j.rio.turtle.TurtleParser.parse(TurtleParser.java:130)
	at org.eclipse.rdf4j.console.command.Verify.verify(Verify.java:145)
	at org.eclipse.rdf4j.console.command.Verify.execute(Verify.java:97)
	at org.eclipse.rdf4j.console.command.VerifyTest.testVerifyBrokenFile(VerifyTest.java:91)
	at sun.reflect.NativeMethodAccessorImpl.invoke0(Native Method)
	at sun.reflect.NativeMethodAccessorImpl.invoke(NativeMethodAccessorImpl.java:62)
	at sun.reflect.DelegatingMethodAccessorImpl.invoke(DelegatingMethodAccessorImpl.java:43)
	at java.lang.reflect.Method.invoke(Method.java:498)
	at org.junit.runners.model.FrameworkMethod$1.runReflectiveCall(FrameworkMethod.java:50)
	at org.junit.internal.runners.model.ReflectiveCallable.run(ReflectiveCallable.java:12)
	at org.junit.runners.model.FrameworkMethod.invokeExplosively(FrameworkMethod.java:47)
	at org.junit.internal.runners.statements.InvokeMethod.evaluate(InvokeMethod.java:17)
	at org.junit.internal.runners.statements.RunBefores.evaluate(RunBefores.java:26)
	at org.junit.internal.runners.statements.RunAfters.evaluate(RunAfters.java:27)
	at org.mockito.internal.junit.JUnitRule$1.evaluateSafely(JUnitRule.java:52)
	at org.mockito.internal.junit.JUnitRule$1.evaluate(JUnitRule.java:43)
	at org.junit.rules.ExternalResource$1.evaluate(ExternalResource.java:48)
	at org.junit.rules.RunRules.evaluate(RunRules.java:20)
	at org.junit.runners.ParentRunner.runLeaf(ParentRunner.java:325)
	at org.junit.runners.BlockJUnit4ClassRunner.runChild(BlockJUnit4ClassRunner.java:78)
	at org.junit.runners.BlockJUnit4ClassRunner.runChild(BlockJUnit4ClassRunner.java:57)
	at org.junit.runners.ParentRunner$3.run(ParentRunner.java:290)
	at org.junit.runners.ParentRunner$1.schedule(ParentRunner.java:71)
	at org.junit.runners.ParentRunner.runChildren(ParentRunner.java:288)
	at org.junit.runners.ParentRunner.access$000(ParentRunner.java:58)
	at org.junit.runners.ParentRunner$2.evaluate(ParentRunner.java:268)
	at org.junit.runners.ParentRunner.run(ParentRunner.java:363)
	at org.apache.maven.surefire.junit4.JUnit4Provider.execute(JUnit4Provider.java:365)
	at org.apache.maven.surefire.junit4.JUnit4Provider.executeWithRerun(JUnit4Provider.java:273)
	at org.apache.maven.surefire.junit4.JUnit4Provider.executeTestSet(JUnit4Provider.java:238)
	at org.apache.maven.surefire.junit4.JUnit4Provider.invoke(JUnit4Provider.java:159)
	at org.apache.maven.surefire.booter.ForkedBooter.invokeProviderInSameClassLoader(ForkedBooter.java:384)
	at org.apache.maven.surefire.booter.ForkedBooter.runSuitesInProcess(ForkedBooter.java:345)
	at org.apache.maven.surefire.booter.ForkedBooter.execute(ForkedBooter.java:126)
	at org.apache.maven.surefire.booter.ForkedBooter.main(ForkedBooter.java:418)
18:59:36.724 [main] ERROR Unexpected RDFParseException
org.eclipse.rdf4j.rio.RDFParseException: Expected a letter, found '1' [line 1]
	at org.eclipse.rdf4j.rio.helpers.RDFParserHelper.reportError(RDFParserHelper.java:265)
	at org.eclipse.rdf4j.rio.helpers.AbstractRDFParser.reportError(AbstractRDFParser.java:628)
	at org.eclipse.rdf4j.rio.turtle.TurtleParser.reportError(TurtleParser.java:1297)
	at org.eclipse.rdf4j.rio.turtle.TurtleParser.parseQuotedLiteral(TurtleParser.java:619)
	at org.eclipse.rdf4j.rio.turtle.TurtleParser.parseValue(TurtleParser.java:584)
	at org.eclipse.rdf4j.rio.turtle.TurtleParser.parseObject(TurtleParser.java:461)
	at org.eclipse.rdf4j.rio.turtle.TurtleParser.parseObjectList(TurtleParser.java:389)
	at org.eclipse.rdf4j.rio.turtle.TurtleParser.parsePredicateObjectList(TurtleParser.java:362)
	at org.eclipse.rdf4j.rio.turtle.TurtleParser.parseTriples(TurtleParser.java:349)
	at org.eclipse.rdf4j.rio.turtle.TurtleParser.parseStatement(TurtleParser.java:216)
	at org.eclipse.rdf4j.rio.turtle.TurtleParser.parse(TurtleParser.java:178)
	at org.eclipse.rdf4j.rio.turtle.TurtleParser.parse(TurtleParser.java:130)
	at org.eclipse.rdf4j.console.command.Verify.verify(Verify.java:145)
	at org.eclipse.rdf4j.console.command.Verify.execute(Verify.java:97)
	at org.eclipse.rdf4j.console.command.VerifyTest.testVerifyWrongLang(VerifyTest.java:109)
	at sun.reflect.NativeMethodAccessorImpl.invoke0(Native Method)
	at sun.reflect.NativeMethodAccessorImpl.invoke(NativeMethodAccessorImpl.java:62)
	at sun.reflect.DelegatingMethodAccessorImpl.invoke(DelegatingMethodAccessorImpl.java:43)
	at java.lang.reflect.Method.invoke(Method.java:498)
	at org.junit.runners.model.FrameworkMethod$1.runReflectiveCall(FrameworkMethod.java:50)
	at org.junit.internal.runners.model.ReflectiveCallable.run(ReflectiveCallable.java:12)
	at org.junit.runners.model.FrameworkMethod.invokeExplosively(FrameworkMethod.java:47)
	at org.junit.internal.runners.statements.InvokeMethod.evaluate(InvokeMethod.java:17)
	at org.junit.internal.runners.statements.RunBefores.evaluate(RunBefores.java:26)
	at org.junit.internal.runners.statements.RunAfters.evaluate(RunAfters.java:27)
	at org.mockito.internal.junit.JUnitRule$1.evaluateSafely(JUnitRule.java:52)
	at org.mockito.internal.junit.JUnitRule$1.evaluate(JUnitRule.java:43)
	at org.junit.rules.ExternalResource$1.evaluate(ExternalResource.java:48)
	at org.junit.rules.RunRules.evaluate(RunRules.java:20)
	at org.junit.runners.ParentRunner.runLeaf(ParentRunner.java:325)
	at org.junit.runners.BlockJUnit4ClassRunner.runChild(BlockJUnit4ClassRunner.java:78)
	at org.junit.runners.BlockJUnit4ClassRunner.runChild(BlockJUnit4ClassRunner.java:57)
	at org.junit.runners.ParentRunner$3.run(ParentRunner.java:290)
	at org.junit.runners.ParentRunner$1.schedule(ParentRunner.java:71)
	at org.junit.runners.ParentRunner.runChildren(ParentRunner.java:288)
	at org.junit.runners.ParentRunner.access$000(ParentRunner.java:58)
	at org.junit.runners.ParentRunner$2.evaluate(ParentRunner.java:268)
	at org.junit.runners.ParentRunner.run(ParentRunner.java:363)
	at org.apache.maven.surefire.junit4.JUnit4Provider.execute(JUnit4Provider.java:365)
	at org.apache.maven.surefire.junit4.JUnit4Provider.executeWithRerun(JUnit4Provider.java:273)
	at org.apache.maven.surefire.junit4.JUnit4Provider.executeTestSet(JUnit4Provider.java:238)
	at org.apache.maven.surefire.junit4.JUnit4Provider.invoke(JUnit4Provider.java:159)
	at org.apache.maven.surefire.booter.ForkedBooter.invokeProviderInSameClassLoader(ForkedBooter.java:384)
	at org.apache.maven.surefire.booter.ForkedBooter.runSuitesInProcess(ForkedBooter.java:345)
	at org.apache.maven.surefire.booter.ForkedBooter.execute(ForkedBooter.java:126)
	at org.apache.maven.surefire.booter.ForkedBooter.main(ForkedBooter.java:418)
18:59:36.734 [main] ERROR No parser available for this RDF format
org.eclipse.rdf4j.rio.UnsupportedRDFormatException: Did not recognise RDF format string file:/home/hudson/genie.rdf4j/.jenkins/jobs/rdf4j-pr-verify/workspace/tools/console/does-not-exist.docx
	at org.eclipse.rdf4j.rio.Rio.lambda$unsupportedFormat$1(Rio.java:577)
	at java.util.Optional.orElseThrow(Optional.java:290)
	at org.eclipse.rdf4j.console.command.Verify.verify(Verify.java:124)
	at org.eclipse.rdf4j.console.command.Verify.execute(Verify.java:97)
	at org.eclipse.rdf4j.console.command.VerifyTest.testVerifyWrongFormat(VerifyTest.java:69)
	at sun.reflect.NativeMethodAccessorImpl.invoke0(Native Method)
	at sun.reflect.NativeMethodAccessorImpl.invoke(NativeMethodAccessorImpl.java:62)
	at sun.reflect.DelegatingMethodAccessorImpl.invoke(DelegatingMethodAccessorImpl.java:43)
	at java.lang.reflect.Method.invoke(Method.java:498)
	at org.junit.runners.model.FrameworkMethod$1.runReflectiveCall(FrameworkMethod.java:50)
	at org.junit.internal.runners.model.ReflectiveCallable.run(ReflectiveCallable.java:12)
	at org.junit.runners.model.FrameworkMethod.invokeExplosively(FrameworkMethod.java:47)
	at org.junit.internal.runners.statements.InvokeMethod.evaluate(InvokeMethod.java:17)
	at org.junit.internal.runners.statements.RunBefores.evaluate(RunBefores.java:26)
	at org.junit.internal.runners.statements.RunAfters.evaluate(RunAfters.java:27)
	at org.mockito.internal.junit.JUnitRule$1.evaluateSafely(JUnitRule.java:52)
	at org.mockito.internal.junit.JUnitRule$1.evaluate(JUnitRule.java:43)
	at org.junit.rules.ExternalResource$1.evaluate(ExternalResource.java:48)
	at org.junit.rules.RunRules.evaluate(RunRules.java:20)
	at org.junit.runners.ParentRunner.runLeaf(ParentRunner.java:325)
	at org.junit.runners.BlockJUnit4ClassRunner.runChild(BlockJUnit4ClassRunner.java:78)
	at org.junit.runners.BlockJUnit4ClassRunner.runChild(BlockJUnit4ClassRunner.java:57)
	at org.junit.runners.ParentRunner$3.run(ParentRunner.java:290)
	at org.junit.runners.ParentRunner$1.schedule(ParentRunner.java:71)
	at org.junit.runners.ParentRunner.runChildren(ParentRunner.java:288)
	at org.junit.runners.ParentRunner.access$000(ParentRunner.java:58)
	at org.junit.runners.ParentRunner$2.evaluate(ParentRunner.java:268)
	at org.junit.runners.ParentRunner.run(ParentRunner.java:363)
	at org.apache.maven.surefire.junit4.JUnit4Provider.execute(JUnit4Provider.java:365)
	at org.apache.maven.surefire.junit4.JUnit4Provider.executeWithRerun(JUnit4Provider.java:273)
	at org.apache.maven.surefire.junit4.JUnit4Provider.executeTestSet(JUnit4Provider.java:238)
	at org.apache.maven.surefire.junit4.JUnit4Provider.invoke(JUnit4Provider.java:159)
	at org.apache.maven.surefire.booter.ForkedBooter.invokeProviderInSameClassLoader(ForkedBooter.java:384)
	at org.apache.maven.surefire.booter.ForkedBooter.runSuitesInProcess(ForkedBooter.java:345)
	at org.apache.maven.surefire.booter.ForkedBooter.execute(ForkedBooter.java:126)
	at org.apache.maven.surefire.booter.ForkedBooter.main(ForkedBooter.java:418)
18:59:36.745 [main] ERROR Unexpected RDFParseException
org.eclipse.rdf4j.rio.RDFParseException: IRI included an unencoded space: '32' [line 1]
	at org.eclipse.rdf4j.rio.helpers.RDFParserHelper.reportError(RDFParserHelper.java:265)
	at org.eclipse.rdf4j.rio.helpers.AbstractRDFParser.reportError(AbstractRDFParser.java:628)
	at org.eclipse.rdf4j.rio.turtle.TurtleParser.reportError(TurtleParser.java:1297)
	at org.eclipse.rdf4j.rio.turtle.TurtleParser.parseURI(TurtleParser.java:902)
	at org.eclipse.rdf4j.rio.turtle.TurtleParser.parseValue(TurtleParser.java:575)
	at org.eclipse.rdf4j.rio.turtle.TurtleParser.parseSubject(TurtleParser.java:406)
	at org.eclipse.rdf4j.rio.turtle.TurtleParser.parseTriples(TurtleParser.java:347)
	at org.eclipse.rdf4j.rio.turtle.TurtleParser.parseStatement(TurtleParser.java:216)
	at org.eclipse.rdf4j.rio.turtle.TurtleParser.parse(TurtleParser.java:178)
	at org.eclipse.rdf4j.rio.turtle.TurtleParser.parse(TurtleParser.java:130)
	at org.eclipse.rdf4j.console.command.Verify.verify(Verify.java:145)
	at org.eclipse.rdf4j.console.command.Verify.execute(Verify.java:97)
	at org.eclipse.rdf4j.console.command.VerifyTest.testVerifySpaceIRI(VerifyTest.java:103)
	at sun.reflect.NativeMethodAccessorImpl.invoke0(Native Method)
	at sun.reflect.NativeMethodAccessorImpl.invoke(NativeMethodAccessorImpl.java:62)
	at sun.reflect.DelegatingMethodAccessorImpl.invoke(DelegatingMethodAccessorImpl.java:43)
	at java.lang.reflect.Method.invoke(Method.java:498)
	at org.junit.runners.model.FrameworkMethod$1.runReflectiveCall(FrameworkMethod.java:50)
	at org.junit.internal.runners.model.ReflectiveCallable.run(ReflectiveCallable.java:12)
	at org.junit.runners.model.FrameworkMethod.invokeExplosively(FrameworkMethod.java:47)
	at org.junit.internal.runners.statements.InvokeMethod.evaluate(InvokeMethod.java:17)
	at org.junit.internal.runners.statements.RunBefores.evaluate(RunBefores.java:26)
	at org.junit.internal.runners.statements.RunAfters.evaluate(RunAfters.java:27)
	at org.mockito.internal.junit.JUnitRule$1.evaluateSafely(JUnitRule.java:52)
	at org.mockito.internal.junit.JUnitRule$1.evaluate(JUnitRule.java:43)
	at org.junit.rules.ExternalResource$1.evaluate(ExternalResource.java:48)
	at org.junit.rules.RunRules.evaluate(RunRules.java:20)
	at org.junit.runners.ParentRunner.runLeaf(ParentRunner.java:325)
	at org.junit.runners.BlockJUnit4ClassRunner.runChild(BlockJUnit4ClassRunner.java:78)
	at org.junit.runners.BlockJUnit4ClassRunner.runChild(BlockJUnit4ClassRunner.java:57)
	at org.junit.runners.ParentRunner$3.run(ParentRunner.java:290)
	at org.junit.runners.ParentRunner$1.schedule(ParentRunner.java:71)
	at org.junit.runners.ParentRunner.runChildren(ParentRunner.java:288)
	at org.junit.runners.ParentRunner.access$000(ParentRunner.java:58)
	at org.junit.runners.ParentRunner$2.evaluate(ParentRunner.java:268)
	at org.junit.runners.ParentRunner.run(ParentRunner.java:363)
	at org.apache.maven.surefire.junit4.JUnit4Provider.execute(JUnit4Provider.java:365)
	at org.apache.maven.surefire.junit4.JUnit4Provider.executeWithRerun(JUnit4Provider.java:273)
	at org.apache.maven.surefire.junit4.JUnit4Provider.executeTestSet(JUnit4Provider.java:238)
	at org.apache.maven.surefire.junit4.JUnit4Provider.invoke(JUnit4Provider.java:159)
	at org.apache.maven.surefire.booter.ForkedBooter.invokeProviderInSameClassLoader(ForkedBooter.java:384)
	at org.apache.maven.surefire.booter.ForkedBooter.runSuitesInProcess(ForkedBooter.java:345)
	at org.apache.maven.surefire.booter.ForkedBooter.execute(ForkedBooter.java:126)
	at org.apache.maven.surefire.booter.ForkedBooter.main(ForkedBooter.java:418)
[INFO] Tests run: 10, Failures: 0, Errors: 0, Skipped: 0, Time elapsed: 0.48 s - in org.eclipse.rdf4j.console.command.VerifyTest
[INFO] Running org.eclipse.rdf4j.console.command.DropTest
[MockitoHint] DropTest.testUserAbortedUnsafeDropBeforeWarning (see javadoc for MockitoHint):
[MockitoHint] 1. Unused -> at org.eclipse.rdf4j.console.command.DropTest.setUp(DropTest.java:50)

[INFO] Tests run: 3, Failures: 0, Errors: 0, Skipped: 0, Time elapsed: 0.1 s - in org.eclipse.rdf4j.console.command.DropTest
[INFO] Running org.eclipse.rdf4j.console.command.FederateTest
18:59:36.889 [main] DEBUG Initializing MemoryStore...
18:59:36.890 [main] DEBUG Initializing data file...
18:59:36.891 [main] DEBUG Data file initialized
18:59:36.891 [main] DEBUG MemoryStore initialized
18:59:36.893 [main] DEBUG syncing data to file...
18:59:36.894 [main] DEBUG Data synced to file
18:59:36.900 [main] DEBUG Initializing MemoryStore...
18:59:36.900 [main] DEBUG Initializing data file...
18:59:36.901 [main] DEBUG Data file initialized
18:59:36.901 [main] DEBUG MemoryStore initialized
18:59:36.903 [main] DEBUG syncing data to file...
18:59:36.904 [main] DEBUG Data synced to file
18:59:36.921 [main] DEBUG Federate called with federation ID = fedID, and member ID's = [sparql][alien][http].
  Distinct set to false, and readonly set to true.

18:59:36.925 [main] DEBUG Federation repository root node: _:node1drjv8gmex216
18:59:36.926 [main] DEBUG _:node1drjv8gmex216 http://www.w3.org/1999/02/22-rdf-syntax-ns#type http://www.openrdf.org/config/repository#Repository
18:59:36.927 [main] DEBUG _:node1drjv8gmex216 http://www.openrdf.org/config/repository#repositoryID "fedID"
18:59:36.927 [main] DEBUG _:node1drjv8gmex216 http://www.w3.org/2000/01/rdf-schema#label "Test Federation Title"
18:59:36.927 [main] DEBUG _:node1drjv8gmex216 http://www.openrdf.org/config/repository#repositoryImpl _:node1drjv8gmex217
18:59:36.927 [main] DEBUG _:node1drjv8gmex217 http://www.openrdf.org/config/repository#repositoryType "openrdf:SailRepository"
18:59:36.927 [main] DEBUG _:node1drjv8gmex217 http://www.openrdf.org/config/repository/sail#sailImpl _:node1drjv8gmex218
18:59:36.927 [main] DEBUG _:node1drjv8gmex218 http://www.openrdf.org/config/sail#sailType "openrdf:Federation"
18:59:36.928 [main] DEBUG _:node1drjv8gmex218 http://www.openrdf.org/config/sail/federation#readOnly "true"^^<http://www.w3.org/2001/XMLSchema#boolean>
18:59:36.928 [main] DEBUG _:node1drjv8gmex218 http://www.openrdf.org/config/sail/federation#distinct "false"^^<http://www.w3.org/2001/XMLSchema#boolean>
18:59:36.928 [main] DEBUG Adding member: sparql
18:59:36.928 [main] DEBUG _:node1drjv8gmex218 http://www.openrdf.org/config/sail/federation#member _:node1drjv8gmex219
18:59:36.929 [main] DEBUG _:node1drjv8gmex219 http://www.openrdf.org/config/repository#repositoryType "openrdf:SPARQLRepository"
18:59:36.929 [main] DEBUG _:node1drjv8gmex219 http://www.openrdf.org/config/repository/sparql#query-endpoint http://localhost:8080/openrdf-sesame/repositories/sparql
18:59:36.930 [main] DEBUG Added member sparql: 
18:59:36.930 [main] DEBUG Adding member: alien
18:59:36.930 [main] DEBUG _:node1drjv8gmex218 http://www.openrdf.org/config/sail/federation#member _:node1drjv8gmex222
18:59:36.930 [main] DEBUG _:node1drjv8gmex222 http://www.openrdf.org/config/repository#repositoryType "openrdf:ProxyRepository"
18:59:36.931 [main] DEBUG _:node1drjv8gmex222 http://www.openrdf.org/config/repository/proxy#proxiedID "alien"
18:59:36.931 [main] DEBUG Added member alien: 
18:59:36.931 [main] DEBUG Adding member: http
18:59:36.931 [main] DEBUG _:node1drjv8gmex218 http://www.openrdf.org/config/sail/federation#member _:node1drjv8gmex225
18:59:36.932 [main] DEBUG _:node1drjv8gmex225 http://www.openrdf.org/config/repository#repositoryType "openrdf:HTTPRepository"
18:59:36.932 [main] DEBUG _:node1drjv8gmex225 http://www.openrdf.org/config/repository/http#repositoryURL http://localhost:8080/openrdf-sesame/repositories/http
18:59:36.933 [main] DEBUG Added member http: 
18:59:36.964 [main] DEBUG Initializing MemoryStore...
18:59:36.965 [main] DEBUG Initializing data file...
18:59:36.965 [main] DEBUG Data file initialized
18:59:36.965 [main] DEBUG MemoryStore initialized
18:59:36.967 [main] DEBUG syncing data to file...
18:59:36.968 [main] DEBUG Data synced to file
18:59:36.971 [main] DEBUG Initializing MemoryStore...
18:59:36.972 [main] DEBUG Initializing data file...
18:59:36.972 [main] DEBUG Data file initialized
18:59:36.972 [main] DEBUG MemoryStore initialized
18:59:36.974 [main] DEBUG syncing data to file...
18:59:36.975 [main] DEBUG Data synced to file
18:59:36.984 [main] ERROR Duplicate repository id's specified.
[MockitoHint] FederateTest.testDuplicateMembersPrintsError (see javadoc for MockitoHint):
[MockitoHint] 1. Unused -> at org.eclipse.rdf4j.console.command.FederateTest.setUp(FederateTest.java:87)
[MockitoHint] 2. Unused -> at org.eclipse.rdf4j.console.command.FederateTest.setUp(FederateTest.java:88)

18:59:36.991 [main] DEBUG Initializing MemoryStore...
18:59:36.992 [main] DEBUG Initializing data file...
18:59:36.992 [main] DEBUG Data file initialized
18:59:36.992 [main] DEBUG MemoryStore initialized
18:59:36.994 [main] DEBUG syncing data to file...
18:59:36.995 [main] DEBUG Data synced to file
18:59:36.998 [main] DEBUG Initializing MemoryStore...
18:59:36.999 [main] DEBUG Initializing data file...
18:59:36.999 [main] DEBUG Data file initialized
18:59:36.999 [main] DEBUG MemoryStore initialized
18:59:37.001 [main] DEBUG syncing data to file...
18:59:37.001 [main] DEBUG Data synced to file
18:59:37.010 [main] DEBUG Federate called with federation ID = alien, and member ID's = [fedID][scary].
  Distinct set to false, and readonly set to true.

18:59:37.011 [main] ERROR alien already exists.
[MockitoHint] FederateTest.testFedAlreadyExistsPrintsSpecificError (see javadoc for MockitoHint):
[MockitoHint] 1. Unused -> at org.eclipse.rdf4j.console.command.FederateTest.setUp(FederateTest.java:88)

18:59:37.018 [main] DEBUG Initializing MemoryStore...
18:59:37.019 [main] DEBUG Initializing data file...
18:59:37.019 [main] DEBUG Data file initialized
18:59:37.019 [main] DEBUG MemoryStore initialized
18:59:37.021 [main] DEBUG syncing data to file...
18:59:37.022 [main] DEBUG Data synced to file
18:59:37.025 [main] DEBUG Initializing MemoryStore...
18:59:37.026 [main] DEBUG Initializing data file...
18:59:37.026 [main] DEBUG Data file initialized
18:59:37.026 [main] DEBUG MemoryStore initialized
18:59:37.027 [main] DEBUG syncing data to file...
18:59:37.028 [main] DEBUG Data synced to file
18:59:37.037 [main] DEBUG Federate called with federation ID = fedID, and member ID's = [alien][scary].
  Distinct set to true, and readonly set to false.

18:59:37.040 [main] DEBUG Federation repository root node: _:node1drjv8gmex338
18:59:37.040 [main] DEBUG _:node1drjv8gmex338 http://www.w3.org/1999/02/22-rdf-syntax-ns#type http://www.openrdf.org/config/repository#Repository
18:59:37.040 [main] DEBUG _:node1drjv8gmex338 http://www.openrdf.org/config/repository#repositoryID "fedID"
18:59:37.040 [main] DEBUG _:node1drjv8gmex338 http://www.w3.org/2000/01/rdf-schema#label "Test Federation Title"
18:59:37.040 [main] DEBUG _:node1drjv8gmex338 http://www.openrdf.org/config/repository#repositoryImpl _:node1drjv8gmex339
18:59:37.040 [main] DEBUG _:node1drjv8gmex339 http://www.openrdf.org/config/repository#repositoryType "openrdf:SailRepository"
18:59:37.040 [main] DEBUG _:node1drjv8gmex339 http://www.openrdf.org/config/repository/sail#sailImpl _:node1drjv8gmex340
18:59:37.040 [main] DEBUG _:node1drjv8gmex340 http://www.openrdf.org/config/sail#sailType "openrdf:Federation"
18:59:37.040 [main] DEBUG _:node1drjv8gmex340 http://www.openrdf.org/config/sail/federation#readOnly "false"^^<http://www.w3.org/2001/XMLSchema#boolean>
18:59:37.040 [main] DEBUG _:node1drjv8gmex340 http://www.openrdf.org/config/sail/federation#distinct "true"^^<http://www.w3.org/2001/XMLSchema#boolean>
18:59:37.040 [main] DEBUG Adding member: alien
18:59:37.040 [main] DEBUG _:node1drjv8gmex340 http://www.openrdf.org/config/sail/federation#member _:node1drjv8gmex341
18:59:37.041 [main] DEBUG _:node1drjv8gmex341 http://www.openrdf.org/config/repository#repositoryType "openrdf:ProxyRepository"
18:59:37.041 [main] DEBUG _:node1drjv8gmex341 http://www.openrdf.org/config/repository/proxy#proxiedID "alien"
18:59:37.041 [main] DEBUG Added member alien: 
18:59:37.041 [main] DEBUG Adding member: scary
18:59:37.041 [main] DEBUG _:node1drjv8gmex340 http://www.openrdf.org/config/sail/federation#member _:node1drjv8gmex344
18:59:37.042 [main] DEBUG _:node1drjv8gmex344 http://www.openrdf.org/config/repository#repositoryType "openrdf:ProxyRepository"
18:59:37.042 [main] DEBUG _:node1drjv8gmex344 http://www.openrdf.org/config/repository/proxy#proxiedID "scary"
18:59:37.042 [main] DEBUG Added member scary: 
18:59:37.069 [main] DEBUG Initializing MemoryStore...
18:59:37.070 [main] DEBUG Initializing data file...
18:59:37.070 [main] DEBUG Data file initialized
18:59:37.070 [main] DEBUG MemoryStore initialized
18:59:37.072 [main] DEBUG syncing data to file...
18:59:37.073 [main] DEBUG Data synced to file
18:59:37.077 [main] DEBUG Initializing MemoryStore...
18:59:37.078 [main] DEBUG Initializing data file...
18:59:37.079 [main] DEBUG Data file initialized
18:59:37.079 [main] DEBUG MemoryStore initialized
18:59:37.081 [main] DEBUG syncing data to file...
18:59:37.082 [main] DEBUG Data synced to file
18:59:37.093 [main] DEBUG Federate called with federation ID = fedID, and member ID's = [sparql][sparql2].
  Distinct set to false, and readonly set to false.

18:59:37.095 [main] ERROR sparql is read-only.
18:59:37.096 [main] ERROR sparql2 is read-only.
[MockitoHint] FederateTest.testSparqlAndNotReadOnlyPrintsError (see javadoc for MockitoHint):
[MockitoHint] 1. Unused -> at org.eclipse.rdf4j.console.command.FederateTest.setUp(FederateTest.java:88)

18:59:37.105 [main] DEBUG Initializing MemoryStore...
18:59:37.105 [main] DEBUG Initializing data file...
18:59:37.106 [main] DEBUG Data file initialized
18:59:37.106 [main] DEBUG MemoryStore initialized
18:59:37.107 [main] DEBUG syncing data to file...
18:59:37.108 [main] DEBUG Data synced to file
18:59:37.111 [main] DEBUG Initializing MemoryStore...
18:59:37.112 [main] DEBUG Initializing data file...
18:59:37.113 [main] DEBUG Data file initialized
18:59:37.113 [main] DEBUG MemoryStore initialized
18:59:37.115 [main] DEBUG syncing data to file...
18:59:37.116 [main] DEBUG Data synced to file
[MockitoHint] FederateTest.testNoArgumentsPrintsHelp (see javadoc for MockitoHint):
[MockitoHint] 1. Unused -> at org.eclipse.rdf4j.console.command.FederateTest.setUp(FederateTest.java:87)
[MockitoHint] 2. Unused -> at org.eclipse.rdf4j.console.command.FederateTest.setUp(FederateTest.java:88)

18:59:37.131 [main] DEBUG Initializing MemoryStore...
18:59:37.132 [main] DEBUG Initializing data file...
18:59:37.132 [main] DEBUG Data file initialized
18:59:37.132 [main] DEBUG MemoryStore initialized
18:59:37.134 [main] DEBUG syncing data to file...
18:59:37.135 [main] DEBUG Data synced to file
18:59:37.138 [main] DEBUG Initializing MemoryStore...
18:59:37.139 [main] DEBUG Initializing data file...
18:59:37.139 [main] DEBUG Data file initialized
18:59:37.139 [main] DEBUG MemoryStore initialized
18:59:37.140 [main] DEBUG syncing data to file...
18:59:37.141 [main] DEBUG Data synced to file
18:59:37.149 [main] DEBUG Federate called with federation ID = type=memory, and member ID's = [fedID][alien][scary].
  Distinct set to false, and readonly set to true.

18:59:37.149 [main] ERROR fedID does not exist.
[MockitoHint] FederateTest.testInvalidArgumentPrintsError (see javadoc for MockitoHint):
[MockitoHint] 1. Unused -> at org.eclipse.rdf4j.console.command.FederateTest.setUp(FederateTest.java:88)

18:59:37.157 [main] DEBUG Initializing MemoryStore...
18:59:37.158 [main] DEBUG Initializing data file...
18:59:37.158 [main] DEBUG Data file initialized
18:59:37.158 [main] DEBUG MemoryStore initialized
18:59:37.160 [main] DEBUG syncing data to file...
18:59:37.160 [main] DEBUG Data synced to file
18:59:37.163 [main] DEBUG Initializing MemoryStore...
18:59:37.164 [main] DEBUG Initializing data file...
18:59:37.164 [main] DEBUG Data file initialized
18:59:37.164 [main] DEBUG MemoryStore initialized
18:59:37.166 [main] DEBUG syncing data to file...
18:59:37.167 [main] DEBUG Data synced to file
18:59:37.175 [main] DEBUG Federate called with federation ID = fedID, and member ID's = [sparql][sparql2].
  Distinct set to false, and readonly set to true.

18:59:37.177 [main] DEBUG Federation repository root node: _:node1drjv8gmex494
18:59:37.177 [main] DEBUG _:node1drjv8gmex494 http://www.w3.org/1999/02/22-rdf-syntax-ns#type http://www.openrdf.org/config/repository#Repository
18:59:37.177 [main] DEBUG _:node1drjv8gmex494 http://www.openrdf.org/config/repository#repositoryID "fedID"
18:59:37.177 [main] DEBUG _:node1drjv8gmex494 http://www.w3.org/2000/01/rdf-schema#label "Test Federation Title"
18:59:37.177 [main] DEBUG _:node1drjv8gmex494 http://www.openrdf.org/config/repository#repositoryImpl _:node1drjv8gmex495
18:59:37.177 [main] DEBUG _:node1drjv8gmex495 http://www.openrdf.org/config/repository#repositoryType "openrdf:SailRepository"
18:59:37.177 [main] DEBUG _:node1drjv8gmex495 http://www.openrdf.org/config/repository/sail#sailImpl _:node1drjv8gmex496
18:59:37.177 [main] DEBUG _:node1drjv8gmex496 http://www.openrdf.org/config/sail#sailType "openrdf:Federation"
18:59:37.177 [main] DEBUG _:node1drjv8gmex496 http://www.openrdf.org/config/sail/federation#readOnly "true"^^<http://www.w3.org/2001/XMLSchema#boolean>
18:59:37.177 [main] DEBUG _:node1drjv8gmex496 http://www.openrdf.org/config/sail/federation#distinct "false"^^<http://www.w3.org/2001/XMLSchema#boolean>
18:59:37.177 [main] DEBUG Adding member: sparql
18:59:37.177 [main] DEBUG _:node1drjv8gmex496 http://www.openrdf.org/config/sail/federation#member _:node1drjv8gmex497
18:59:37.178 [main] DEBUG _:node1drjv8gmex497 http://www.openrdf.org/config/repository#repositoryType "openrdf:SPARQLRepository"
18:59:37.178 [main] DEBUG _:node1drjv8gmex497 http://www.openrdf.org/config/repository/sparql#query-endpoint http://localhost:8080/openrdf-sesame/repositories/sparql
18:59:37.178 [main] DEBUG Added member sparql: 
18:59:37.178 [main] DEBUG Adding member: sparql2
18:59:37.178 [main] DEBUG _:node1drjv8gmex496 http://www.openrdf.org/config/sail/federation#member _:node1drjv8gmex500
18:59:37.178 [main] DEBUG _:node1drjv8gmex500 http://www.openrdf.org/config/repository#repositoryType "openrdf:SPARQLRepository"
18:59:37.179 [main] DEBUG _:node1drjv8gmex500 http://www.openrdf.org/config/repository/sparql#query-endpoint http://localhost:8080/openrdf-sesame/repositories/sparql
18:59:37.179 [main] DEBUG Added member sparql2: 
18:59:37.191 [main] DEBUG Initializing MemoryStore...
18:59:37.192 [main] DEBUG Initializing data file...
18:59:37.193 [main] DEBUG Data file initialized
18:59:37.193 [main] DEBUG MemoryStore initialized
18:59:37.194 [main] DEBUG syncing data to file...
18:59:37.195 [main] DEBUG Data synced to file
18:59:37.197 [main] DEBUG Initializing MemoryStore...
18:59:37.198 [main] DEBUG Initializing data file...
18:59:37.198 [main] DEBUG Data file initialized
18:59:37.198 [main] DEBUG MemoryStore initialized
18:59:37.200 [main] DEBUG syncing data to file...
18:59:37.200 [main] DEBUG Data synced to file
18:59:37.207 [main] DEBUG Federate called with federation ID = fedID, and member ID's = [http][sparql].
  Distinct set to false, and readonly set to true.

18:59:37.209 [main] DEBUG Federation repository root node: _:node1drjv8gmex549
18:59:37.209 [main] DEBUG _:node1drjv8gmex549 http://www.w3.org/1999/02/22-rdf-syntax-ns#type http://www.openrdf.org/config/repository#Repository
18:59:37.209 [main] DEBUG _:node1drjv8gmex549 http://www.openrdf.org/config/repository#repositoryID "fedID"
18:59:37.209 [main] DEBUG _:node1drjv8gmex549 http://www.w3.org/2000/01/rdf-schema#label "Test Federation Title"
18:59:37.209 [main] DEBUG _:node1drjv8gmex549 http://www.openrdf.org/config/repository#repositoryImpl _:node1drjv8gmex550
18:59:37.209 [main] DEBUG _:node1drjv8gmex550 http://www.openrdf.org/config/repository#repositoryType "openrdf:SailRepository"
18:59:37.209 [main] DEBUG _:node1drjv8gmex550 http://www.openrdf.org/config/repository/sail#sailImpl _:node1drjv8gmex551
18:59:37.209 [main] DEBUG _:node1drjv8gmex551 http://www.openrdf.org/config/sail#sailType "openrdf:Federation"
18:59:37.209 [main] DEBUG _:node1drjv8gmex551 http://www.openrdf.org/config/sail/federation#readOnly "true"^^<http://www.w3.org/2001/XMLSchema#boolean>
18:59:37.209 [main] DEBUG _:node1drjv8gmex551 http://www.openrdf.org/config/sail/federation#distinct "false"^^<http://www.w3.org/2001/XMLSchema#boolean>
18:59:37.209 [main] DEBUG Adding member: http
18:59:37.209 [main] DEBUG _:node1drjv8gmex551 http://www.openrdf.org/config/sail/federation#member _:node1drjv8gmex552
18:59:37.210 [main] DEBUG _:node1drjv8gmex552 http://www.openrdf.org/config/repository#repositoryType "openrdf:HTTPRepository"
18:59:37.211 [main] DEBUG _:node1drjv8gmex552 http://www.openrdf.org/config/repository/http#repositoryURL http://localhost:8080/openrdf-sesame/repositories/http
18:59:37.211 [main] DEBUG Added member http: 
18:59:37.211 [main] DEBUG Adding member: sparql
18:59:37.211 [main] DEBUG _:node1drjv8gmex551 http://www.openrdf.org/config/sail/federation#member _:node1drjv8gmex555
18:59:37.211 [main] DEBUG _:node1drjv8gmex555 http://www.openrdf.org/config/repository#repositoryType "openrdf:SPARQLRepository"
18:59:37.212 [main] DEBUG _:node1drjv8gmex555 http://www.openrdf.org/config/repository/sparql#query-endpoint http://localhost:8080/openrdf-sesame/repositories/sparql
18:59:37.212 [main] DEBUG Added member sparql: 
18:59:37.225 [main] DEBUG Initializing MemoryStore...
18:59:37.225 [main] DEBUG Initializing data file...
18:59:37.226 [main] DEBUG Data file initialized
18:59:37.226 [main] DEBUG MemoryStore initialized
18:59:37.228 [main] DEBUG syncing data to file...
18:59:37.229 [main] DEBUG Data synced to file
18:59:37.231 [main] DEBUG Initializing MemoryStore...
18:59:37.232 [main] DEBUG Initializing data file...
18:59:37.232 [main] DEBUG Data file initialized
18:59:37.232 [main] DEBUG MemoryStore initialized
18:59:37.234 [main] DEBUG syncing data to file...
18:59:37.234 [main] DEBUG Data synced to file
18:59:37.242 [main] DEBUG Federate called with federation ID = fedID, and member ID's = [alien][FreeLunch].
  Distinct set to false, and readonly set to true.

18:59:37.243 [main] ERROR FreeLunch does not exist.
[MockitoHint] FederateTest.testNonexistentMemberPrintsSpecificError (see javadoc for MockitoHint):
[MockitoHint] 1. Unused -> at org.eclipse.rdf4j.console.command.FederateTest.setUp(FederateTest.java:88)

18:59:37.250 [main] DEBUG Initializing MemoryStore...
18:59:37.250 [main] DEBUG Initializing data file...
18:59:37.251 [main] DEBUG Data file initialized
18:59:37.251 [main] DEBUG MemoryStore initialized
18:59:37.252 [main] DEBUG syncing data to file...
18:59:37.253 [main] DEBUG Data synced to file
18:59:37.256 [main] DEBUG Initializing MemoryStore...
18:59:37.257 [main] DEBUG Initializing data file...
18:59:37.257 [main] DEBUG Data file initialized
18:59:37.257 [main] DEBUG MemoryStore initialized
18:59:37.258 [main] DEBUG syncing data to file...
18:59:37.259 [main] DEBUG Data synced to file
18:59:37.266 [main] ERROR Duplicate repository id's specified.
[MockitoHint] FederateTest.testFedSameAsMemberPrintsError (see javadoc for MockitoHint):
[MockitoHint] 1. Unused -> at org.eclipse.rdf4j.console.command.FederateTest.setUp(FederateTest.java:87)
[MockitoHint] 2. Unused -> at org.eclipse.rdf4j.console.command.FederateTest.setUp(FederateTest.java:88)

18:59:37.272 [main] DEBUG Initializing MemoryStore...
18:59:37.273 [main] DEBUG Initializing data file...
18:59:37.274 [main] DEBUG Data file initialized
18:59:37.274 [main] DEBUG MemoryStore initialized
18:59:37.275 [main] DEBUG syncing data to file...
18:59:37.276 [main] DEBUG Data synced to file
18:59:37.278 [main] DEBUG Initializing MemoryStore...
18:59:37.279 [main] DEBUG Initializing data file...
18:59:37.279 [main] DEBUG Data file initialized
18:59:37.279 [main] DEBUG MemoryStore initialized
18:59:37.280 [main] DEBUG syncing data to file...
18:59:37.281 [main] DEBUG Data synced to file
[MockitoHint] FederateTest.testTwoArgumentsPrintsHelp (see javadoc for MockitoHint):
[MockitoHint] 1. Unused -> at org.eclipse.rdf4j.console.command.FederateTest.setUp(FederateTest.java:87)
[MockitoHint] 2. Unused -> at org.eclipse.rdf4j.console.command.FederateTest.setUp(FederateTest.java:88)

18:59:37.295 [main] DEBUG Initializing MemoryStore...
18:59:37.296 [main] DEBUG Initializing data file...
18:59:37.296 [main] DEBUG Data file initialized
18:59:37.296 [main] DEBUG MemoryStore initialized
18:59:37.298 [main] DEBUG syncing data to file...
18:59:37.298 [main] DEBUG Data synced to file
18:59:37.301 [main] DEBUG Initializing MemoryStore...
18:59:37.302 [main] DEBUG Initializing data file...
18:59:37.302 [main] DEBUG Data file initialized
18:59:37.302 [main] DEBUG MemoryStore initialized
18:59:37.303 [main] DEBUG syncing data to file...
18:59:37.303 [main] DEBUG Data synced to file
18:59:37.310 [main] DEBUG Federate called with federation ID = fedID, and member ID's = [alien][scary].
  Distinct set to false, and readonly set to true.

18:59:37.311 [main] DEBUG Federation repository root node: _:node1drjv8gmex692
18:59:37.311 [main] DEBUG _:node1drjv8gmex692 http://www.w3.org/1999/02/22-rdf-syntax-ns#type http://www.openrdf.org/config/repository#Repository
18:59:37.311 [main] DEBUG _:node1drjv8gmex692 http://www.openrdf.org/config/repository#repositoryID "fedID"
18:59:37.311 [main] DEBUG _:node1drjv8gmex692 http://www.w3.org/2000/01/rdf-schema#label "Test Federation Title"
18:59:37.311 [main] DEBUG _:node1drjv8gmex692 http://www.openrdf.org/config/repository#repositoryImpl _:node1drjv8gmex693
18:59:37.311 [main] DEBUG _:node1drjv8gmex693 http://www.openrdf.org/config/repository#repositoryType "openrdf:SailRepository"
18:59:37.311 [main] DEBUG _:node1drjv8gmex693 http://www.openrdf.org/config/repository/sail#sailImpl _:node1drjv8gmex694
18:59:37.312 [main] DEBUG _:node1drjv8gmex694 http://www.openrdf.org/config/sail#sailType "openrdf:Federation"
18:59:37.312 [main] DEBUG _:node1drjv8gmex694 http://www.openrdf.org/config/sail/federation#readOnly "true"^^<http://www.w3.org/2001/XMLSchema#boolean>
18:59:37.312 [main] DEBUG _:node1drjv8gmex694 http://www.openrdf.org/config/sail/federation#distinct "false"^^<http://www.w3.org/2001/XMLSchema#boolean>
18:59:37.312 [main] DEBUG Adding member: alien
18:59:37.312 [main] DEBUG _:node1drjv8gmex694 http://www.openrdf.org/config/sail/federation#member _:node1drjv8gmex695
18:59:37.312 [main] DEBUG _:node1drjv8gmex695 http://www.openrdf.org/config/repository#repositoryType "openrdf:ProxyRepository"
18:59:37.312 [main] DEBUG _:node1drjv8gmex695 http://www.openrdf.org/config/repository/proxy#proxiedID "alien"
18:59:37.312 [main] DEBUG Added member alien: 
18:59:37.312 [main] DEBUG Adding member: scary
18:59:37.312 [main] DEBUG _:node1drjv8gmex694 http://www.openrdf.org/config/sail/federation#member _:node1drjv8gmex698
18:59:37.313 [main] DEBUG _:node1drjv8gmex698 http://www.openrdf.org/config/repository#repositoryType "openrdf:ProxyRepository"
18:59:37.313 [main] DEBUG _:node1drjv8gmex698 http://www.openrdf.org/config/repository/proxy#proxiedID "scary"
18:59:37.313 [main] DEBUG Added member scary: 
18:59:37.327 [main] DEBUG Initializing MemoryStore...
18:59:37.327 [main] DEBUG Initializing data file...
18:59:37.327 [main] DEBUG Data file initialized
18:59:37.327 [main] DEBUG MemoryStore initialized
18:59:37.329 [main] DEBUG syncing data to file...
18:59:37.329 [main] DEBUG Data synced to file
18:59:37.331 [main] DEBUG Initializing MemoryStore...
18:59:37.332 [main] DEBUG Initializing data file...
18:59:37.333 [main] DEBUG Data file initialized
18:59:37.333 [main] DEBUG MemoryStore initialized
18:59:37.334 [main] DEBUG syncing data to file...
18:59:37.334 [main] DEBUG Data synced to file
[MockitoHint] FederateTest.testOneArgumentPrintsHelp (see javadoc for MockitoHint):
[MockitoHint] 1. Unused -> at org.eclipse.rdf4j.console.command.FederateTest.setUp(FederateTest.java:87)
[MockitoHint] 2. Unused -> at org.eclipse.rdf4j.console.command.FederateTest.setUp(FederateTest.java:88)

18:59:37.346 [main] DEBUG Initializing MemoryStore...
18:59:37.347 [main] DEBUG Initializing data file...
18:59:37.347 [main] DEBUG Data file initialized
18:59:37.347 [main] DEBUG MemoryStore initialized
18:59:37.349 [main] DEBUG syncing data to file...
18:59:37.349 [main] DEBUG Data synced to file
18:59:37.351 [main] DEBUG Initializing MemoryStore...
18:59:37.352 [main] DEBUG Initializing data file...
18:59:37.352 [main] DEBUG Data file initialized
18:59:37.352 [main] DEBUG MemoryStore initialized
18:59:37.353 [main] DEBUG syncing data to file...
18:59:37.353 [main] DEBUG Data synced to file
18:59:37.360 [main] DEBUG Federate called with federation ID = fedID, and member ID's = [http][http2].
  Distinct set to false, and readonly set to true.

18:59:37.361 [main] DEBUG Federation repository root node: _:node1drjv8gmex784
18:59:37.361 [main] DEBUG _:node1drjv8gmex784 http://www.w3.org/1999/02/22-rdf-syntax-ns#type http://www.openrdf.org/config/repository#Repository
18:59:37.361 [main] DEBUG _:node1drjv8gmex784 http://www.openrdf.org/config/repository#repositoryID "fedID"
18:59:37.361 [main] DEBUG _:node1drjv8gmex784 http://www.w3.org/2000/01/rdf-schema#label "Test Federation Title"
18:59:37.361 [main] DEBUG _:node1drjv8gmex784 http://www.openrdf.org/config/repository#repositoryImpl _:node1drjv8gmex785
18:59:37.361 [main] DEBUG _:node1drjv8gmex785 http://www.openrdf.org/config/repository#repositoryType "openrdf:SailRepository"
18:59:37.361 [main] DEBUG _:node1drjv8gmex785 http://www.openrdf.org/config/repository/sail#sailImpl _:node1drjv8gmex786
18:59:37.361 [main] DEBUG _:node1drjv8gmex786 http://www.openrdf.org/config/sail#sailType "openrdf:Federation"
18:59:37.361 [main] DEBUG _:node1drjv8gmex786 http://www.openrdf.org/config/sail/federation#readOnly "true"^^<http://www.w3.org/2001/XMLSchema#boolean>
18:59:37.361 [main] DEBUG _:node1drjv8gmex786 http://www.openrdf.org/config/sail/federation#distinct "false"^^<http://www.w3.org/2001/XMLSchema#boolean>
18:59:37.361 [main] DEBUG Adding member: http
18:59:37.361 [main] DEBUG _:node1drjv8gmex786 http://www.openrdf.org/config/sail/federation#member _:node1drjv8gmex787
18:59:37.362 [main] DEBUG _:node1drjv8gmex787 http://www.openrdf.org/config/repository#repositoryType "openrdf:HTTPRepository"
18:59:37.362 [main] DEBUG _:node1drjv8gmex787 http://www.openrdf.org/config/repository/http#repositoryURL http://localhost:8080/openrdf-sesame/repositories/http
18:59:37.362 [main] DEBUG Added member http: 
18:59:37.362 [main] DEBUG Adding member: http2
18:59:37.362 [main] DEBUG _:node1drjv8gmex786 http://www.openrdf.org/config/sail/federation#member _:node1drjv8gmex790
18:59:37.363 [main] DEBUG _:node1drjv8gmex790 http://www.openrdf.org/config/repository#repositoryType "openrdf:HTTPRepository"
18:59:37.363 [main] DEBUG _:node1drjv8gmex790 http://www.openrdf.org/config/repository/http#repositoryURL http://localhost:8080/openrdf-sesame/repositories/http
18:59:37.363 [main] DEBUG Added member http2: 
[INFO] Tests run: 15, Failures: 0, Errors: 0, Skipped: 0, Time elapsed: 0.489 s - in org.eclipse.rdf4j.console.command.FederateTest
[INFO] Running org.eclipse.rdf4j.console.command.SparqlTest
[MockitoHint] SparqlTest.testInputFile (see javadoc for MockitoHint):
[MockitoHint] 1. Unused -> at org.eclipse.rdf4j.console.command.SparqlTest.setUp(SparqlTest.java:49)

18:59:37.401 [main] ERROR No suitable result writer found
[MockitoHint] SparqlTest.testSelectError (see javadoc for MockitoHint):
[MockitoHint] 1. Unused -> at org.eclipse.rdf4j.console.command.SparqlTest.setUp(SparqlTest.java:49)

[MockitoHint] SparqlTest.testSelectMissingBindings (see javadoc for MockitoHint):
[MockitoHint] 1. Unused -> at org.eclipse.rdf4j.console.command.SparqlTest.setUp(SparqlTest.java:49)

[MockitoHint] SparqlTest.testInputFileWorkdir (see javadoc for MockitoHint):
[MockitoHint] 1. Unused -> at org.eclipse.rdf4j.console.command.SparqlTest.setUp(SparqlTest.java:49)

[INFO] Tests run: 9, Failures: 0, Errors: 0, Skipped: 0, Time elapsed: 0.108 s - in org.eclipse.rdf4j.console.command.SparqlTest
[INFO] Running org.eclipse.rdf4j.console.UtilTest
 one, two
 three
 four
 five, six
 seven
 eight
[INFO] Tests run: 4, Failures: 0, Errors: 0, Skipped: 0, Time elapsed: 0 s - in org.eclipse.rdf4j.console.UtilTest
[INFO] Running org.eclipse.rdf4j.console.ConsoleIOTest
[INFO] Tests run: 3, Failures: 0, Errors: 0, Skipped: 0, Time elapsed: 0.035 s - in org.eclipse.rdf4j.console.ConsoleIOTest
[INFO] 
[INFO] Results:
[INFO] 
[INFO] Tests run: 64, Failures: 0, Errors: 0, Skipped: 0
[INFO] 
[JENKINS] Recording test results
[INFO] 
[INFO] --- animal-sniffer-maven-plugin:1.16:check (default) @ rdf4j-console ---
[INFO] Checking unresolved references to org.codehaus.mojo.signature:java18:1.0
[INFO] 
[INFO] --- maven-jar-plugin:2.3.1:jar (default-jar) @ rdf4j-console ---
[INFO] Building jar: /home/hudson/genie.rdf4j/.jenkins/jobs/rdf4j-pr-verify/workspace/tools/console/target/rdf4j-console-3.1.0-SNAPSHOT.jar