SuccessConsole Output

Started calculate disk usage of build
Finished Calculation of disk usage of build in 0 seconds
Started calculate disk usage of workspace
Finished Calculation of disk usage of workspace in 0 seconds
[INFO] 
[INFO] ------------------< org.eclipse.rdf4j:rdf4j-console >-------------------
[INFO] Building RDF4J: Console 3.1.0-SNAPSHOT                           [70/85]
[INFO] --------------------------------[ jar ]---------------------------------
[INFO] 
[INFO] --- buildnumber-maven-plugin:1.4:create (default) @ rdf4j-console ---
[INFO] ShortRevision tag detected. The value is '7'.
[INFO] Executing: /bin/sh -c cd '/home/hudson/genie.rdf4j/.jenkins/jobs/rdf4j-pr-verify/workspace/tools/console' && 'git' 'rev-parse' '--verify' '--short=7' 'HEAD'
[INFO] Working directory: /home/hudson/genie.rdf4j/.jenkins/jobs/rdf4j-pr-verify/workspace/tools/console
[INFO] Storing buildNumber: d89b6ce at timestamp: 1575789602130
[WARNING] Cannot get the branch information from the git repository: 
Detecting the current branch failed: fatal: ref HEAD is not a symbolic ref

[INFO] ShortRevision tag detected. The value is '7'.
[INFO] Executing: /bin/sh -c cd '/home/hudson/genie.rdf4j/.jenkins/jobs/rdf4j-pr-verify/workspace/tools/console' && 'git' 'rev-parse' '--verify' '--short=7' 'HEAD'
[INFO] Working directory: /home/hudson/genie.rdf4j/.jenkins/jobs/rdf4j-pr-verify/workspace/tools/console
[INFO] Storing buildScmBranch: UNKNOWN
[INFO] 
[INFO] --- maven-enforcer-plugin:1.4.1:enforce (enforce-bytecode-version) @ rdf4j-console ---
[INFO] Adding ignore: META-INF/**/module-info
[INFO] 
[INFO] --- formatter-maven-plugin:2.8.1:validate (default) @ rdf4j-console ---
[INFO] Using 'UTF-8' encoding to format source files.
[INFO] Number of files to be formatted: 61
[INFO] Html formatting is skipped
[INFO] Successfully formatted:          0 file(s)
[INFO] Fail to format:                  0 file(s)
[INFO] Skipped:                         61 file(s)
[INFO] Read only skipped:               0 file(s)
[INFO] Approximate time taken:          0s
[INFO] 
[INFO] --- maven-resources-plugin:3.0.2:resources (default-resources) @ rdf4j-console ---
[INFO] Using 'UTF-8' encoding to copy filtered resources.
[INFO] skip non existing resourceDirectory /home/hudson/genie.rdf4j/.jenkins/jobs/rdf4j-pr-verify/workspace/tools/console/src/main/resources
[INFO] 
[INFO] --- maven-compiler-plugin:3.7.0:compile (default-compile) @ rdf4j-console ---
[INFO] Changes detected - recompiling the module!
[INFO] Compiling 42 source files to /home/hudson/genie.rdf4j/.jenkins/jobs/rdf4j-pr-verify/workspace/tools/console/target/classes
[INFO] 
[INFO] --- maven-resources-plugin:3.0.2:testResources (default-testResources) @ rdf4j-console ---
[INFO] Using 'UTF-8' encoding to copy filtered resources.
[INFO] Copying 29 resources
[INFO] 
[INFO] --- maven-compiler-plugin:3.7.0:testCompile (default-testCompile) @ rdf4j-console ---
[INFO] Changes detected - recompiling the module!
[INFO] Compiling 18 source files to /home/hudson/genie.rdf4j/.jenkins/jobs/rdf4j-pr-verify/workspace/tools/console/target/test-classes
[INFO] 
[INFO] --- maven-surefire-plugin:2.22.2:test (default-test) @ rdf4j-console ---
[INFO] 
[INFO] -------------------------------------------------------
[INFO]  T E S T S
[INFO] -------------------------------------------------------
[INFO] Running org.eclipse.rdf4j.console.setting.PrefixesTest
[INFO] Tests run: 3, Failures: 0, Errors: 0, Skipped: 0, Time elapsed: 0.645 s - in org.eclipse.rdf4j.console.setting.PrefixesTest
[INFO] Running org.eclipse.rdf4j.console.setting.LogLevelTest
02:20:06.732 [main] ERROR unknown logging level: chatty
[INFO] Tests run: 4, Failures: 0, Errors: 0, Skipped: 0, Time elapsed: 0 s - in org.eclipse.rdf4j.console.setting.LogLevelTest
[INFO] Running org.eclipse.rdf4j.console.setting.QueryPrefixTest
[INFO] Tests run: 1, Failures: 0, Errors: 0, Skipped: 0, Time elapsed: 0 s - in org.eclipse.rdf4j.console.setting.QueryPrefixTest
[INFO] Running org.eclipse.rdf4j.console.setting.ShowPrefixTest
[INFO] Tests run: 1, Failures: 0, Errors: 0, Skipped: 0, Time elapsed: 0 s - in org.eclipse.rdf4j.console.setting.ShowPrefixTest
[INFO] Running org.eclipse.rdf4j.console.setting.ConsoleWidthTest
[INFO] Tests run: 1, Failures: 0, Errors: 0, Skipped: 0, Time elapsed: 0 s - in org.eclipse.rdf4j.console.setting.ConsoleWidthTest
[INFO] Running org.eclipse.rdf4j.console.command.SetParametersTest
02:20:07.796 [main] ERROR Unknown parameter: unknown
[INFO] Tests run: 1, Failures: 0, Errors: 0, Skipped: 0, Time elapsed: 0.442 s - in org.eclipse.rdf4j.console.command.SetParametersTest
[INFO] Running org.eclipse.rdf4j.console.command.LoadTest
[MockitoHint] LoadTest.testLoad (see javadoc for MockitoHint):
[MockitoHint] 1. Unused -> at org.eclipse.rdf4j.console.command.LoadTest.setUp(LoadTest.java:49)

[MockitoHint] LoadTest.testLoadWorkDir (see javadoc for MockitoHint):
[MockitoHint] 1. Unused -> at org.eclipse.rdf4j.console.command.LoadTest.setUp(LoadTest.java:49)

[INFO] Tests run: 2, Failures: 0, Errors: 0, Skipped: 0, Time elapsed: 0.927 s - in org.eclipse.rdf4j.console.command.LoadTest
[INFO] Running org.eclipse.rdf4j.console.command.ConvertTest
02:20:08.999 [main] ERROR No RDF writer for /tmp/genie.rdf4j/junit1204406997739372027/alien.qyx
[MockitoHint] ConvertTest.testConvertInvalidFormat (see javadoc for MockitoHint):
[MockitoHint] 1. Unused -> at org.eclipse.rdf4j.console.command.ConvertTest.setup(ConvertTest.java:39)

02:20:09.005 [main] ERROR Failed to convert data
org.eclipse.rdf4j.rio.RDFParseException: Expected '<' or '_', found: e [line 1, column 101]
	at org.eclipse.rdf4j.rio.ntriples.NTriplesParser.parseSubject(NTriplesParser.java:313)
	at org.eclipse.rdf4j.rio.ntriples.NTriplesParser.parseTriple(NTriplesParser.java:252)
	at org.eclipse.rdf4j.rio.ntriples.NTriplesParser.parse(NTriplesParser.java:160)
	at org.eclipse.rdf4j.rio.ntriples.NTriplesParser.parse(NTriplesParser.java:109)
	at org.eclipse.rdf4j.console.command.Convert.convert(Convert.java:139)
	at org.eclipse.rdf4j.console.command.Convert.execute(Convert.java:74)
	at org.eclipse.rdf4j.console.command.ConvertTest.testConvertParseError(ConvertTest.java:92)
	at sun.reflect.NativeMethodAccessorImpl.invoke0(Native Method)
	at sun.reflect.NativeMethodAccessorImpl.invoke(NativeMethodAccessorImpl.java:62)
	at sun.reflect.DelegatingMethodAccessorImpl.invoke(DelegatingMethodAccessorImpl.java:43)
	at java.lang.reflect.Method.invoke(Method.java:498)
	at org.junit.runners.model.FrameworkMethod$1.runReflectiveCall(FrameworkMethod.java:50)
	at org.junit.internal.runners.model.ReflectiveCallable.run(ReflectiveCallable.java:12)
	at org.junit.runners.model.FrameworkMethod.invokeExplosively(FrameworkMethod.java:47)
	at org.junit.internal.runners.statements.InvokeMethod.evaluate(InvokeMethod.java:17)
	at org.junit.internal.runners.statements.RunBefores.evaluate(RunBefores.java:26)
	at org.junit.internal.runners.statements.RunAfters.evaluate(RunAfters.java:27)
	at org.mockito.internal.junit.JUnitRule$1.evaluateSafely(JUnitRule.java:52)
	at org.mockito.internal.junit.JUnitRule$1.evaluate(JUnitRule.java:43)
	at org.junit.rules.ExternalResource$1.evaluate(ExternalResource.java:48)
	at org.junit.rules.RunRules.evaluate(RunRules.java:20)
	at org.junit.runners.ParentRunner.runLeaf(ParentRunner.java:325)
	at org.junit.runners.BlockJUnit4ClassRunner.runChild(BlockJUnit4ClassRunner.java:78)
	at org.junit.runners.BlockJUnit4ClassRunner.runChild(BlockJUnit4ClassRunner.java:57)
	at org.junit.runners.ParentRunner$3.run(ParentRunner.java:290)
	at org.junit.runners.ParentRunner$1.schedule(ParentRunner.java:71)
	at org.junit.runners.ParentRunner.runChildren(ParentRunner.java:288)
	at org.junit.runners.ParentRunner.access$000(ParentRunner.java:58)
	at org.junit.runners.ParentRunner$2.evaluate(ParentRunner.java:268)
	at org.junit.runners.ParentRunner.run(ParentRunner.java:363)
	at org.apache.maven.surefire.junit4.JUnit4Provider.execute(JUnit4Provider.java:365)
	at org.apache.maven.surefire.junit4.JUnit4Provider.executeWithRerun(JUnit4Provider.java:273)
	at org.apache.maven.surefire.junit4.JUnit4Provider.executeTestSet(JUnit4Provider.java:238)
	at org.apache.maven.surefire.junit4.JUnit4Provider.invoke(JUnit4Provider.java:159)
	at org.apache.maven.surefire.booter.ForkedBooter.invokeProviderInSameClassLoader(ForkedBooter.java:384)
	at org.apache.maven.surefire.booter.ForkedBooter.runSuitesInProcess(ForkedBooter.java:345)
	at org.apache.maven.surefire.booter.ForkedBooter.execute(ForkedBooter.java:126)
	at org.apache.maven.surefire.booter.ForkedBooter.main(ForkedBooter.java:418)
[INFO] Tests run: 4, Failures: 0, Errors: 0, Skipped: 0, Time elapsed: 0.266 s - in org.eclipse.rdf4j.console.command.ConvertTest
[INFO] Running org.eclipse.rdf4j.console.command.ExportTest
[MockitoHint] ExportTest.testExportWorkDir (see javadoc for MockitoHint):
[MockitoHint] 1. Unused -> at org.eclipse.rdf4j.console.command.ExportTest.setUp(ExportTest.java:46)

[MockitoHint] ExportTest.testExportAll (see javadoc for MockitoHint):
[MockitoHint] 1. Unused -> at org.eclipse.rdf4j.console.command.ExportTest.setUp(ExportTest.java:46)

[MockitoHint] ExportTest.testExportContexts (see javadoc for MockitoHint):
[MockitoHint] 1. Unused -> at org.eclipse.rdf4j.console.command.ExportTest.setUp(ExportTest.java:46)

[INFO] Tests run: 3, Failures: 0, Errors: 0, Skipped: 0, Time elapsed: 0.052 s - in org.eclipse.rdf4j.console.command.ExportTest
[INFO] Running org.eclipse.rdf4j.console.command.VerifyTest
02:20:09.442 [main] ERROR Unexpected RDFParseException
org.eclipse.rdf4j.rio.RDFParseException: 'missing type' was not recognised, and could not be verified, with datatype http://example.rdf4j.org/type/wrong [line 1]
	at org.eclipse.rdf4j.rio.helpers.RDFParserHelper.reportError(RDFParserHelper.java:265)
	at org.eclipse.rdf4j.rio.helpers.RDFParserHelper.createLiteral(RDFParserHelper.java:180)
	at org.eclipse.rdf4j.rio.helpers.AbstractRDFParser.createLiteral(AbstractRDFParser.java:530)
	at org.eclipse.rdf4j.rio.turtle.TurtleParser.parseQuotedLiteral(TurtleParser.java:665)
	at org.eclipse.rdf4j.rio.turtle.TurtleParser.parseValue(TurtleParser.java:584)
	at org.eclipse.rdf4j.rio.turtle.TurtleParser.parseObject(TurtleParser.java:461)
	at org.eclipse.rdf4j.rio.turtle.TurtleParser.parseObjectList(TurtleParser.java:389)
	at org.eclipse.rdf4j.rio.turtle.TurtleParser.parsePredicateObjectList(TurtleParser.java:362)
	at org.eclipse.rdf4j.rio.turtle.TurtleParser.parseTriples(TurtleParser.java:349)
	at org.eclipse.rdf4j.rio.turtle.TurtleParser.parseStatement(TurtleParser.java:216)
	at org.eclipse.rdf4j.rio.turtle.TurtleParser.parse(TurtleParser.java:178)
	at org.eclipse.rdf4j.rio.turtle.TurtleParser.parse(TurtleParser.java:130)
	at org.eclipse.rdf4j.console.command.Verify.verify(Verify.java:145)
	at org.eclipse.rdf4j.console.command.Verify.execute(Verify.java:97)
	at org.eclipse.rdf4j.console.command.VerifyTest.testVerifyMissingType(VerifyTest.java:97)
	at sun.reflect.NativeMethodAccessorImpl.invoke0(Native Method)
	at sun.reflect.NativeMethodAccessorImpl.invoke(NativeMethodAccessorImpl.java:62)
	at sun.reflect.DelegatingMethodAccessorImpl.invoke(DelegatingMethodAccessorImpl.java:43)
	at java.lang.reflect.Method.invoke(Method.java:498)
	at org.junit.runners.model.FrameworkMethod$1.runReflectiveCall(FrameworkMethod.java:50)
	at org.junit.internal.runners.model.ReflectiveCallable.run(ReflectiveCallable.java:12)
	at org.junit.runners.model.FrameworkMethod.invokeExplosively(FrameworkMethod.java:47)
	at org.junit.internal.runners.statements.InvokeMethod.evaluate(InvokeMethod.java:17)
	at org.junit.internal.runners.statements.RunBefores.evaluate(RunBefores.java:26)
	at org.junit.internal.runners.statements.RunAfters.evaluate(RunAfters.java:27)
	at org.mockito.internal.junit.JUnitRule$1.evaluateSafely(JUnitRule.java:52)
	at org.mockito.internal.junit.JUnitRule$1.evaluate(JUnitRule.java:43)
	at org.junit.rules.ExternalResource$1.evaluate(ExternalResource.java:48)
	at org.junit.rules.RunRules.evaluate(RunRules.java:20)
	at org.junit.runners.ParentRunner.runLeaf(ParentRunner.java:325)
	at org.junit.runners.BlockJUnit4ClassRunner.runChild(BlockJUnit4ClassRunner.java:78)
	at org.junit.runners.BlockJUnit4ClassRunner.runChild(BlockJUnit4ClassRunner.java:57)
	at org.junit.runners.ParentRunner$3.run(ParentRunner.java:290)
	at org.junit.runners.ParentRunner$1.schedule(ParentRunner.java:71)
	at org.junit.runners.ParentRunner.runChildren(ParentRunner.java:288)
	at org.junit.runners.ParentRunner.access$000(ParentRunner.java:58)
	at org.junit.runners.ParentRunner$2.evaluate(ParentRunner.java:268)
	at org.junit.runners.ParentRunner.run(ParentRunner.java:363)
	at org.apache.maven.surefire.junit4.JUnit4Provider.execute(JUnit4Provider.java:365)
	at org.apache.maven.surefire.junit4.JUnit4Provider.executeWithRerun(JUnit4Provider.java:273)
	at org.apache.maven.surefire.junit4.JUnit4Provider.executeTestSet(JUnit4Provider.java:238)
	at org.apache.maven.surefire.junit4.JUnit4Provider.invoke(JUnit4Provider.java:159)
	at org.apache.maven.surefire.booter.ForkedBooter.invokeProviderInSameClassLoader(ForkedBooter.java:384)
	at org.apache.maven.surefire.booter.ForkedBooter.runSuitesInProcess(ForkedBooter.java:345)
	at org.apache.maven.surefire.booter.ForkedBooter.execute(ForkedBooter.java:126)
	at org.apache.maven.surefire.booter.ForkedBooter.main(ForkedBooter.java:418)
02:20:09.511 [main] ERROR SHACL validation failed, writing report to /tmp/genie.rdf4j/junit1302498226272051940/junit4377962968076654876.tmp
02:20:09.529 [main] ERROR Unexpected RDFParseException
org.eclipse.rdf4j.rio.RDFParseException: Unexpected end of file
	at org.eclipse.rdf4j.rio.turtle.TurtleParser.throwEOFException(TurtleParser.java:1317)
	at org.eclipse.rdf4j.rio.turtle.TurtleParser.parseValue(TurtleParser.java:589)
	at org.eclipse.rdf4j.rio.turtle.TurtleParser.parsePredicate(TurtleParser.java:434)
	at org.eclipse.rdf4j.rio.turtle.TurtleParser.parsePredicateObjectList(TurtleParser.java:358)
	at org.eclipse.rdf4j.rio.turtle.TurtleParser.parseTriples(TurtleParser.java:349)
	at org.eclipse.rdf4j.rio.turtle.TurtleParser.parseStatement(TurtleParser.java:216)
	at org.eclipse.rdf4j.rio.turtle.TurtleParser.parse(TurtleParser.java:178)
	at org.eclipse.rdf4j.rio.turtle.TurtleParser.parse(TurtleParser.java:130)
	at org.eclipse.rdf4j.console.command.Verify.verify(Verify.java:145)
	at org.eclipse.rdf4j.console.command.Verify.execute(Verify.java:97)
	at org.eclipse.rdf4j.console.command.VerifyTest.testVerifyBrokenFile(VerifyTest.java:91)
	at sun.reflect.NativeMethodAccessorImpl.invoke0(Native Method)
	at sun.reflect.NativeMethodAccessorImpl.invoke(NativeMethodAccessorImpl.java:62)
	at sun.reflect.DelegatingMethodAccessorImpl.invoke(DelegatingMethodAccessorImpl.java:43)
	at java.lang.reflect.Method.invoke(Method.java:498)
	at org.junit.runners.model.FrameworkMethod$1.runReflectiveCall(FrameworkMethod.java:50)
	at org.junit.internal.runners.model.ReflectiveCallable.run(ReflectiveCallable.java:12)
	at org.junit.runners.model.FrameworkMethod.invokeExplosively(FrameworkMethod.java:47)
	at org.junit.internal.runners.statements.InvokeMethod.evaluate(InvokeMethod.java:17)
	at org.junit.internal.runners.statements.RunBefores.evaluate(RunBefores.java:26)
	at org.junit.internal.runners.statements.RunAfters.evaluate(RunAfters.java:27)
	at org.mockito.internal.junit.JUnitRule$1.evaluateSafely(JUnitRule.java:52)
	at org.mockito.internal.junit.JUnitRule$1.evaluate(JUnitRule.java:43)
	at org.junit.rules.ExternalResource$1.evaluate(ExternalResource.java:48)
	at org.junit.rules.RunRules.evaluate(RunRules.java:20)
	at org.junit.runners.ParentRunner.runLeaf(ParentRunner.java:325)
	at org.junit.runners.BlockJUnit4ClassRunner.runChild(BlockJUnit4ClassRunner.java:78)
	at org.junit.runners.BlockJUnit4ClassRunner.runChild(BlockJUnit4ClassRunner.java:57)
	at org.junit.runners.ParentRunner$3.run(ParentRunner.java:290)
	at org.junit.runners.ParentRunner$1.schedule(ParentRunner.java:71)
	at org.junit.runners.ParentRunner.runChildren(ParentRunner.java:288)
	at org.junit.runners.ParentRunner.access$000(ParentRunner.java:58)
	at org.junit.runners.ParentRunner$2.evaluate(ParentRunner.java:268)
	at org.junit.runners.ParentRunner.run(ParentRunner.java:363)
	at org.apache.maven.surefire.junit4.JUnit4Provider.execute(JUnit4Provider.java:365)
	at org.apache.maven.surefire.junit4.JUnit4Provider.executeWithRerun(JUnit4Provider.java:273)
	at org.apache.maven.surefire.junit4.JUnit4Provider.executeTestSet(JUnit4Provider.java:238)
	at org.apache.maven.surefire.junit4.JUnit4Provider.invoke(JUnit4Provider.java:159)
	at org.apache.maven.surefire.booter.ForkedBooter.invokeProviderInSameClassLoader(ForkedBooter.java:384)
	at org.apache.maven.surefire.booter.ForkedBooter.runSuitesInProcess(ForkedBooter.java:345)
	at org.apache.maven.surefire.booter.ForkedBooter.execute(ForkedBooter.java:126)
	at org.apache.maven.surefire.booter.ForkedBooter.main(ForkedBooter.java:418)
02:20:09.545 [main] ERROR Unexpected RDFParseException
org.eclipse.rdf4j.rio.RDFParseException: Expected a letter, found '1' [line 1]
	at org.eclipse.rdf4j.rio.helpers.RDFParserHelper.reportError(RDFParserHelper.java:265)
	at org.eclipse.rdf4j.rio.helpers.AbstractRDFParser.reportError(AbstractRDFParser.java:628)
	at org.eclipse.rdf4j.rio.turtle.TurtleParser.reportError(TurtleParser.java:1297)
	at org.eclipse.rdf4j.rio.turtle.TurtleParser.parseQuotedLiteral(TurtleParser.java:619)
	at org.eclipse.rdf4j.rio.turtle.TurtleParser.parseValue(TurtleParser.java:584)
	at org.eclipse.rdf4j.rio.turtle.TurtleParser.parseObject(TurtleParser.java:461)
	at org.eclipse.rdf4j.rio.turtle.TurtleParser.parseObjectList(TurtleParser.java:389)
	at org.eclipse.rdf4j.rio.turtle.TurtleParser.parsePredicateObjectList(TurtleParser.java:362)
	at org.eclipse.rdf4j.rio.turtle.TurtleParser.parseTriples(TurtleParser.java:349)
	at org.eclipse.rdf4j.rio.turtle.TurtleParser.parseStatement(TurtleParser.java:216)
	at org.eclipse.rdf4j.rio.turtle.TurtleParser.parse(TurtleParser.java:178)
	at org.eclipse.rdf4j.rio.turtle.TurtleParser.parse(TurtleParser.java:130)
	at org.eclipse.rdf4j.console.command.Verify.verify(Verify.java:145)
	at org.eclipse.rdf4j.console.command.Verify.execute(Verify.java:97)
	at org.eclipse.rdf4j.console.command.VerifyTest.testVerifyWrongLang(VerifyTest.java:109)
	at sun.reflect.NativeMethodAccessorImpl.invoke0(Native Method)
	at sun.reflect.NativeMethodAccessorImpl.invoke(NativeMethodAccessorImpl.java:62)
	at sun.reflect.DelegatingMethodAccessorImpl.invoke(DelegatingMethodAccessorImpl.java:43)
	at java.lang.reflect.Method.invoke(Method.java:498)
	at org.junit.runners.model.FrameworkMethod$1.runReflectiveCall(FrameworkMethod.java:50)
	at org.junit.internal.runners.model.ReflectiveCallable.run(ReflectiveCallable.java:12)
	at org.junit.runners.model.FrameworkMethod.invokeExplosively(FrameworkMethod.java:47)
	at org.junit.internal.runners.statements.InvokeMethod.evaluate(InvokeMethod.java:17)
	at org.junit.internal.runners.statements.RunBefores.evaluate(RunBefores.java:26)
	at org.junit.internal.runners.statements.RunAfters.evaluate(RunAfters.java:27)
	at org.mockito.internal.junit.JUnitRule$1.evaluateSafely(JUnitRule.java:52)
	at org.mockito.internal.junit.JUnitRule$1.evaluate(JUnitRule.java:43)
	at org.junit.rules.ExternalResource$1.evaluate(ExternalResource.java:48)
	at org.junit.rules.RunRules.evaluate(RunRules.java:20)
	at org.junit.runners.ParentRunner.runLeaf(ParentRunner.java:325)
	at org.junit.runners.BlockJUnit4ClassRunner.runChild(BlockJUnit4ClassRunner.java:78)
	at org.junit.runners.BlockJUnit4ClassRunner.runChild(BlockJUnit4ClassRunner.java:57)
	at org.junit.runners.ParentRunner$3.run(ParentRunner.java:290)
	at org.junit.runners.ParentRunner$1.schedule(ParentRunner.java:71)
	at org.junit.runners.ParentRunner.runChildren(ParentRunner.java:288)
	at org.junit.runners.ParentRunner.access$000(ParentRunner.java:58)
	at org.junit.runners.ParentRunner$2.evaluate(ParentRunner.java:268)
	at org.junit.runners.ParentRunner.run(ParentRunner.java:363)
	at org.apache.maven.surefire.junit4.JUnit4Provider.execute(JUnit4Provider.java:365)
	at org.apache.maven.surefire.junit4.JUnit4Provider.executeWithRerun(JUnit4Provider.java:273)
	at org.apache.maven.surefire.junit4.JUnit4Provider.executeTestSet(JUnit4Provider.java:238)
	at org.apache.maven.surefire.junit4.JUnit4Provider.invoke(JUnit4Provider.java:159)
	at org.apache.maven.surefire.booter.ForkedBooter.invokeProviderInSameClassLoader(ForkedBooter.java:384)
	at org.apache.maven.surefire.booter.ForkedBooter.runSuitesInProcess(ForkedBooter.java:345)
	at org.apache.maven.surefire.booter.ForkedBooter.execute(ForkedBooter.java:126)
	at org.apache.maven.surefire.booter.ForkedBooter.main(ForkedBooter.java:418)
02:20:09.557 [main] ERROR No parser available for this RDF format
org.eclipse.rdf4j.rio.UnsupportedRDFormatException: Did not recognise RDF format string file:/home/hudson/genie.rdf4j/.jenkins/jobs/rdf4j-pr-verify/workspace/tools/console/does-not-exist.docx
	at org.eclipse.rdf4j.rio.Rio.lambda$unsupportedFormat$1(Rio.java:577)
	at java.util.Optional.orElseThrow(Optional.java:290)
	at org.eclipse.rdf4j.console.command.Verify.verify(Verify.java:124)
	at org.eclipse.rdf4j.console.command.Verify.execute(Verify.java:97)
	at org.eclipse.rdf4j.console.command.VerifyTest.testVerifyWrongFormat(VerifyTest.java:69)
	at sun.reflect.NativeMethodAccessorImpl.invoke0(Native Method)
	at sun.reflect.NativeMethodAccessorImpl.invoke(NativeMethodAccessorImpl.java:62)
	at sun.reflect.DelegatingMethodAccessorImpl.invoke(DelegatingMethodAccessorImpl.java:43)
	at java.lang.reflect.Method.invoke(Method.java:498)
	at org.junit.runners.model.FrameworkMethod$1.runReflectiveCall(FrameworkMethod.java:50)
	at org.junit.internal.runners.model.ReflectiveCallable.run(ReflectiveCallable.java:12)
	at org.junit.runners.model.FrameworkMethod.invokeExplosively(FrameworkMethod.java:47)
	at org.junit.internal.runners.statements.InvokeMethod.evaluate(InvokeMethod.java:17)
	at org.junit.internal.runners.statements.RunBefores.evaluate(RunBefores.java:26)
	at org.junit.internal.runners.statements.RunAfters.evaluate(RunAfters.java:27)
	at org.mockito.internal.junit.JUnitRule$1.evaluateSafely(JUnitRule.java:52)
	at org.mockito.internal.junit.JUnitRule$1.evaluate(JUnitRule.java:43)
	at org.junit.rules.ExternalResource$1.evaluate(ExternalResource.java:48)
	at org.junit.rules.RunRules.evaluate(RunRules.java:20)
	at org.junit.runners.ParentRunner.runLeaf(ParentRunner.java:325)
	at org.junit.runners.BlockJUnit4ClassRunner.runChild(BlockJUnit4ClassRunner.java:78)
	at org.junit.runners.BlockJUnit4ClassRunner.runChild(BlockJUnit4ClassRunner.java:57)
	at org.junit.runners.ParentRunner$3.run(ParentRunner.java:290)
	at org.junit.runners.ParentRunner$1.schedule(ParentRunner.java:71)
	at org.junit.runners.ParentRunner.runChildren(ParentRunner.java:288)
	at org.junit.runners.ParentRunner.access$000(ParentRunner.java:58)
	at org.junit.runners.ParentRunner$2.evaluate(ParentRunner.java:268)
	at org.junit.runners.ParentRunner.run(ParentRunner.java:363)
	at org.apache.maven.surefire.junit4.JUnit4Provider.execute(JUnit4Provider.java:365)
	at org.apache.maven.surefire.junit4.JUnit4Provider.executeWithRerun(JUnit4Provider.java:273)
	at org.apache.maven.surefire.junit4.JUnit4Provider.executeTestSet(JUnit4Provider.java:238)
	at org.apache.maven.surefire.junit4.JUnit4Provider.invoke(JUnit4Provider.java:159)
	at org.apache.maven.surefire.booter.ForkedBooter.invokeProviderInSameClassLoader(ForkedBooter.java:384)
	at org.apache.maven.surefire.booter.ForkedBooter.runSuitesInProcess(ForkedBooter.java:345)
	at org.apache.maven.surefire.booter.ForkedBooter.execute(ForkedBooter.java:126)
	at org.apache.maven.surefire.booter.ForkedBooter.main(ForkedBooter.java:418)
02:20:09.570 [main] ERROR Unexpected RDFParseException
org.eclipse.rdf4j.rio.RDFParseException: IRI included an unencoded space: '32' [line 1]
	at org.eclipse.rdf4j.rio.helpers.RDFParserHelper.reportError(RDFParserHelper.java:265)
	at org.eclipse.rdf4j.rio.helpers.AbstractRDFParser.reportError(AbstractRDFParser.java:628)
	at org.eclipse.rdf4j.rio.turtle.TurtleParser.reportError(TurtleParser.java:1297)
	at org.eclipse.rdf4j.rio.turtle.TurtleParser.parseURI(TurtleParser.java:902)
	at org.eclipse.rdf4j.rio.turtle.TurtleParser.parseValue(TurtleParser.java:575)
	at org.eclipse.rdf4j.rio.turtle.TurtleParser.parseSubject(TurtleParser.java:406)
	at org.eclipse.rdf4j.rio.turtle.TurtleParser.parseTriples(TurtleParser.java:347)
	at org.eclipse.rdf4j.rio.turtle.TurtleParser.parseStatement(TurtleParser.java:216)
	at org.eclipse.rdf4j.rio.turtle.TurtleParser.parse(TurtleParser.java:178)
	at org.eclipse.rdf4j.rio.turtle.TurtleParser.parse(TurtleParser.java:130)
	at org.eclipse.rdf4j.console.command.Verify.verify(Verify.java:145)
	at org.eclipse.rdf4j.console.command.Verify.execute(Verify.java:97)
	at org.eclipse.rdf4j.console.command.VerifyTest.testVerifySpaceIRI(VerifyTest.java:103)
	at sun.reflect.NativeMethodAccessorImpl.invoke0(Native Method)
	at sun.reflect.NativeMethodAccessorImpl.invoke(NativeMethodAccessorImpl.java:62)
	at sun.reflect.DelegatingMethodAccessorImpl.invoke(DelegatingMethodAccessorImpl.java:43)
	at java.lang.reflect.Method.invoke(Method.java:498)
	at org.junit.runners.model.FrameworkMethod$1.runReflectiveCall(FrameworkMethod.java:50)
	at org.junit.internal.runners.model.ReflectiveCallable.run(ReflectiveCallable.java:12)
	at org.junit.runners.model.FrameworkMethod.invokeExplosively(FrameworkMethod.java:47)
	at org.junit.internal.runners.statements.InvokeMethod.evaluate(InvokeMethod.java:17)
	at org.junit.internal.runners.statements.RunBefores.evaluate(RunBefores.java:26)
	at org.junit.internal.runners.statements.RunAfters.evaluate(RunAfters.java:27)
	at org.mockito.internal.junit.JUnitRule$1.evaluateSafely(JUnitRule.java:52)
	at org.mockito.internal.junit.JUnitRule$1.evaluate(JUnitRule.java:43)
	at org.junit.rules.ExternalResource$1.evaluate(ExternalResource.java:48)
	at org.junit.rules.RunRules.evaluate(RunRules.java:20)
	at org.junit.runners.ParentRunner.runLeaf(ParentRunner.java:325)
	at org.junit.runners.BlockJUnit4ClassRunner.runChild(BlockJUnit4ClassRunner.java:78)
	at org.junit.runners.BlockJUnit4ClassRunner.runChild(BlockJUnit4ClassRunner.java:57)
	at org.junit.runners.ParentRunner$3.run(ParentRunner.java:290)
	at org.junit.runners.ParentRunner$1.schedule(ParentRunner.java:71)
	at org.junit.runners.ParentRunner.runChildren(ParentRunner.java:288)
	at org.junit.runners.ParentRunner.access$000(ParentRunner.java:58)
	at org.junit.runners.ParentRunner$2.evaluate(ParentRunner.java:268)
	at org.junit.runners.ParentRunner.run(ParentRunner.java:363)
	at org.apache.maven.surefire.junit4.JUnit4Provider.execute(JUnit4Provider.java:365)
	at org.apache.maven.surefire.junit4.JUnit4Provider.executeWithRerun(JUnit4Provider.java:273)
	at org.apache.maven.surefire.junit4.JUnit4Provider.executeTestSet(JUnit4Provider.java:238)
	at org.apache.maven.surefire.junit4.JUnit4Provider.invoke(JUnit4Provider.java:159)
	at org.apache.maven.surefire.booter.ForkedBooter.invokeProviderInSameClassLoader(ForkedBooter.java:384)
	at org.apache.maven.surefire.booter.ForkedBooter.runSuitesInProcess(ForkedBooter.java:345)
	at org.apache.maven.surefire.booter.ForkedBooter.execute(ForkedBooter.java:126)
	at org.apache.maven.surefire.booter.ForkedBooter.main(ForkedBooter.java:418)
[INFO] Tests run: 10, Failures: 0, Errors: 0, Skipped: 0, Time elapsed: 0.535 s - in org.eclipse.rdf4j.console.command.VerifyTest
[INFO] Running org.eclipse.rdf4j.console.command.DropTest
[MockitoHint] DropTest.testUserAbortedUnsafeDropBeforeWarning (see javadoc for MockitoHint):
[MockitoHint] 1. Unused -> at org.eclipse.rdf4j.console.command.DropTest.setUp(DropTest.java:50)

[INFO] Tests run: 3, Failures: 0, Errors: 0, Skipped: 0, Time elapsed: 0.13 s - in org.eclipse.rdf4j.console.command.DropTest
[INFO] Running org.eclipse.rdf4j.console.command.FederateTest
02:20:09.756 [main] DEBUG Initializing MemoryStore...
02:20:09.757 [main] DEBUG Initializing data file...
02:20:09.757 [main] DEBUG Data file initialized
02:20:09.757 [main] DEBUG MemoryStore initialized
02:20:09.759 [main] DEBUG syncing data to file...
02:20:09.760 [main] DEBUG Data synced to file
02:20:09.765 [main] DEBUG Initializing MemoryStore...
02:20:09.766 [main] DEBUG Initializing data file...
02:20:09.767 [main] DEBUG Data file initialized
02:20:09.767 [main] DEBUG MemoryStore initialized
02:20:09.769 [main] DEBUG syncing data to file...
02:20:09.770 [main] DEBUG Data synced to file
02:20:09.786 [main] DEBUG Federate called with federation ID = fedID, and member ID's = [sparql][alien][http].
  Distinct set to false, and readonly set to true.

02:20:09.790 [main] DEBUG Federation repository root node: _:node1dri62d7cx216
02:20:09.791 [main] DEBUG _:node1dri62d7cx216 http://www.w3.org/1999/02/22-rdf-syntax-ns#type http://www.openrdf.org/config/repository#Repository
02:20:09.791 [main] DEBUG _:node1dri62d7cx216 http://www.openrdf.org/config/repository#repositoryID "fedID"
02:20:09.791 [main] DEBUG _:node1dri62d7cx216 http://www.w3.org/2000/01/rdf-schema#label "Test Federation Title"
02:20:09.791 [main] DEBUG _:node1dri62d7cx216 http://www.openrdf.org/config/repository#repositoryImpl _:node1dri62d7cx217
02:20:09.792 [main] DEBUG _:node1dri62d7cx217 http://www.openrdf.org/config/repository#repositoryType "openrdf:SailRepository"
02:20:09.792 [main] DEBUG _:node1dri62d7cx217 http://www.openrdf.org/config/repository/sail#sailImpl _:node1dri62d7cx218
02:20:09.792 [main] DEBUG _:node1dri62d7cx218 http://www.openrdf.org/config/sail#sailType "openrdf:Federation"
02:20:09.792 [main] DEBUG _:node1dri62d7cx218 http://www.openrdf.org/config/sail/federation#readOnly "true"^^<http://www.w3.org/2001/XMLSchema#boolean>
02:20:09.792 [main] DEBUG _:node1dri62d7cx218 http://www.openrdf.org/config/sail/federation#distinct "false"^^<http://www.w3.org/2001/XMLSchema#boolean>
02:20:09.793 [main] DEBUG Adding member: sparql
02:20:09.793 [main] DEBUG _:node1dri62d7cx218 http://www.openrdf.org/config/sail/federation#member _:node1dri62d7cx219
02:20:09.794 [main] DEBUG _:node1dri62d7cx219 http://www.openrdf.org/config/repository#repositoryType "openrdf:SPARQLRepository"
02:20:09.794 [main] DEBUG _:node1dri62d7cx219 http://www.openrdf.org/config/repository/sparql#query-endpoint http://localhost:8080/openrdf-sesame/repositories/sparql
02:20:09.794 [main] DEBUG Added member sparql: 
02:20:09.795 [main] DEBUG Adding member: alien
02:20:09.795 [main] DEBUG _:node1dri62d7cx218 http://www.openrdf.org/config/sail/federation#member _:node1dri62d7cx222
02:20:09.795 [main] DEBUG _:node1dri62d7cx222 http://www.openrdf.org/config/repository#repositoryType "openrdf:ProxyRepository"
02:20:09.795 [main] DEBUG _:node1dri62d7cx222 http://www.openrdf.org/config/repository/proxy#proxiedID "alien"
02:20:09.796 [main] DEBUG Added member alien: 
02:20:09.796 [main] DEBUG Adding member: http
02:20:09.796 [main] DEBUG _:node1dri62d7cx218 http://www.openrdf.org/config/sail/federation#member _:node1dri62d7cx225
02:20:09.797 [main] DEBUG _:node1dri62d7cx225 http://www.openrdf.org/config/repository#repositoryType "openrdf:HTTPRepository"
02:20:09.797 [main] DEBUG _:node1dri62d7cx225 http://www.openrdf.org/config/repository/http#repositoryURL http://localhost:8080/openrdf-sesame/repositories/http
02:20:09.797 [main] DEBUG Added member http: 
02:20:09.829 [main] DEBUG Initializing MemoryStore...
02:20:09.830 [main] DEBUG Initializing data file...
02:20:09.831 [main] DEBUG Data file initialized
02:20:09.831 [main] DEBUG MemoryStore initialized
02:20:09.833 [main] DEBUG syncing data to file...
02:20:09.833 [main] DEBUG Data synced to file
02:20:09.836 [main] DEBUG Initializing MemoryStore...
02:20:09.837 [main] DEBUG Initializing data file...
02:20:09.837 [main] DEBUG Data file initialized
02:20:09.837 [main] DEBUG MemoryStore initialized
02:20:09.838 [main] DEBUG syncing data to file...
02:20:09.839 [main] DEBUG Data synced to file
02:20:09.847 [main] ERROR Duplicate repository id's specified.
[MockitoHint] FederateTest.testDuplicateMembersPrintsError (see javadoc for MockitoHint):
[MockitoHint] 1. Unused -> at org.eclipse.rdf4j.console.command.FederateTest.setUp(FederateTest.java:87)
[MockitoHint] 2. Unused -> at org.eclipse.rdf4j.console.command.FederateTest.setUp(FederateTest.java:88)

02:20:09.853 [main] DEBUG Initializing MemoryStore...
02:20:09.855 [main] DEBUG Initializing data file...
02:20:09.855 [main] DEBUG Data file initialized
02:20:09.855 [main] DEBUG MemoryStore initialized
02:20:09.857 [main] DEBUG syncing data to file...
02:20:09.858 [main] DEBUG Data synced to file
02:20:09.862 [main] DEBUG Initializing MemoryStore...
02:20:09.862 [main] DEBUG Initializing data file...
02:20:09.862 [main] DEBUG Data file initialized
02:20:09.862 [main] DEBUG MemoryStore initialized
02:20:09.864 [main] DEBUG syncing data to file...
02:20:09.864 [main] DEBUG Data synced to file
02:20:09.873 [main] DEBUG Federate called with federation ID = alien, and member ID's = [fedID][scary].
  Distinct set to false, and readonly set to true.

02:20:09.873 [main] ERROR alien already exists.
[MockitoHint] FederateTest.testFedAlreadyExistsPrintsSpecificError (see javadoc for MockitoHint):
[MockitoHint] 1. Unused -> at org.eclipse.rdf4j.console.command.FederateTest.setUp(FederateTest.java:88)

02:20:09.880 [main] DEBUG Initializing MemoryStore...
02:20:09.882 [main] DEBUG Initializing data file...
02:20:09.882 [main] DEBUG Data file initialized
02:20:09.882 [main] DEBUG MemoryStore initialized
02:20:09.884 [main] DEBUG syncing data to file...
02:20:09.885 [main] DEBUG Data synced to file
02:20:09.887 [main] DEBUG Initializing MemoryStore...
02:20:09.888 [main] DEBUG Initializing data file...
02:20:09.888 [main] DEBUG Data file initialized
02:20:09.888 [main] DEBUG MemoryStore initialized
02:20:09.889 [main] DEBUG syncing data to file...
02:20:09.890 [main] DEBUG Data synced to file
02:20:09.898 [main] DEBUG Federate called with federation ID = fedID, and member ID's = [alien][scary].
  Distinct set to true, and readonly set to false.

02:20:09.899 [main] DEBUG Federation repository root node: _:node1dri62d7cx338
02:20:09.899 [main] DEBUG _:node1dri62d7cx338 http://www.w3.org/1999/02/22-rdf-syntax-ns#type http://www.openrdf.org/config/repository#Repository
02:20:09.899 [main] DEBUG _:node1dri62d7cx338 http://www.openrdf.org/config/repository#repositoryID "fedID"
02:20:09.899 [main] DEBUG _:node1dri62d7cx338 http://www.w3.org/2000/01/rdf-schema#label "Test Federation Title"
02:20:09.899 [main] DEBUG _:node1dri62d7cx338 http://www.openrdf.org/config/repository#repositoryImpl _:node1dri62d7cx339
02:20:09.899 [main] DEBUG _:node1dri62d7cx339 http://www.openrdf.org/config/repository#repositoryType "openrdf:SailRepository"
02:20:09.899 [main] DEBUG _:node1dri62d7cx339 http://www.openrdf.org/config/repository/sail#sailImpl _:node1dri62d7cx340
02:20:09.899 [main] DEBUG _:node1dri62d7cx340 http://www.openrdf.org/config/sail#sailType "openrdf:Federation"
02:20:09.899 [main] DEBUG _:node1dri62d7cx340 http://www.openrdf.org/config/sail/federation#readOnly "false"^^<http://www.w3.org/2001/XMLSchema#boolean>
02:20:09.899 [main] DEBUG _:node1dri62d7cx340 http://www.openrdf.org/config/sail/federation#distinct "true"^^<http://www.w3.org/2001/XMLSchema#boolean>
02:20:09.899 [main] DEBUG Adding member: alien
02:20:09.899 [main] DEBUG _:node1dri62d7cx340 http://www.openrdf.org/config/sail/federation#member _:node1dri62d7cx341
02:20:09.900 [main] DEBUG _:node1dri62d7cx341 http://www.openrdf.org/config/repository#repositoryType "openrdf:ProxyRepository"
02:20:09.900 [main] DEBUG _:node1dri62d7cx341 http://www.openrdf.org/config/repository/proxy#proxiedID "alien"
02:20:09.900 [main] DEBUG Added member alien: 
02:20:09.900 [main] DEBUG Adding member: scary
02:20:09.900 [main] DEBUG _:node1dri62d7cx340 http://www.openrdf.org/config/sail/federation#member _:node1dri62d7cx344
02:20:09.901 [main] DEBUG _:node1dri62d7cx344 http://www.openrdf.org/config/repository#repositoryType "openrdf:ProxyRepository"
02:20:09.901 [main] DEBUG _:node1dri62d7cx344 http://www.openrdf.org/config/repository/proxy#proxiedID "scary"
02:20:09.901 [main] DEBUG Added member scary: 
02:20:09.925 [main] DEBUG Initializing MemoryStore...
02:20:09.926 [main] DEBUG Initializing data file...
02:20:09.926 [main] DEBUG Data file initialized
02:20:09.926 [main] DEBUG MemoryStore initialized
02:20:09.928 [main] DEBUG syncing data to file...
02:20:09.929 [main] DEBUG Data synced to file
02:20:09.932 [main] DEBUG Initializing MemoryStore...
02:20:09.933 [main] DEBUG Initializing data file...
02:20:09.933 [main] DEBUG Data file initialized
02:20:09.933 [main] DEBUG MemoryStore initialized
02:20:09.935 [main] DEBUG syncing data to file...
02:20:09.935 [main] DEBUG Data synced to file
02:20:09.943 [main] DEBUG Federate called with federation ID = fedID, and member ID's = [sparql][sparql2].
  Distinct set to false, and readonly set to false.

02:20:09.946 [main] ERROR sparql is read-only.
02:20:09.948 [main] ERROR sparql2 is read-only.
[MockitoHint] FederateTest.testSparqlAndNotReadOnlyPrintsError (see javadoc for MockitoHint):
[MockitoHint] 1. Unused -> at org.eclipse.rdf4j.console.command.FederateTest.setUp(FederateTest.java:88)

02:20:09.955 [main] DEBUG Initializing MemoryStore...
02:20:09.956 [main] DEBUG Initializing data file...
02:20:09.957 [main] DEBUG Data file initialized
02:20:09.957 [main] DEBUG MemoryStore initialized
02:20:09.958 [main] DEBUG syncing data to file...
02:20:09.959 [main] DEBUG Data synced to file
02:20:09.963 [main] DEBUG Initializing MemoryStore...
02:20:09.964 [main] DEBUG Initializing data file...
02:20:09.964 [main] DEBUG Data file initialized
02:20:09.964 [main] DEBUG MemoryStore initialized
02:20:09.966 [main] DEBUG syncing data to file...
02:20:09.967 [main] DEBUG Data synced to file
[MockitoHint] FederateTest.testNoArgumentsPrintsHelp (see javadoc for MockitoHint):
[MockitoHint] 1. Unused -> at org.eclipse.rdf4j.console.command.FederateTest.setUp(FederateTest.java:87)
[MockitoHint] 2. Unused -> at org.eclipse.rdf4j.console.command.FederateTest.setUp(FederateTest.java:88)

02:20:09.983 [main] DEBUG Initializing MemoryStore...
02:20:09.983 [main] DEBUG Initializing data file...
02:20:09.984 [main] DEBUG Data file initialized
02:20:09.984 [main] DEBUG MemoryStore initialized
02:20:09.986 [main] DEBUG syncing data to file...
02:20:09.987 [main] DEBUG Data synced to file
02:20:09.989 [main] DEBUG Initializing MemoryStore...
02:20:09.990 [main] DEBUG Initializing data file...
02:20:09.990 [main] DEBUG Data file initialized
02:20:09.990 [main] DEBUG MemoryStore initialized
02:20:09.991 [main] DEBUG syncing data to file...
02:20:09.992 [main] DEBUG Data synced to file
02:20:09.999 [main] DEBUG Federate called with federation ID = type=memory, and member ID's = [fedID][alien][scary].
  Distinct set to false, and readonly set to true.

02:20:09.999 [main] ERROR fedID does not exist.
[MockitoHint] FederateTest.testInvalidArgumentPrintsError (see javadoc for MockitoHint):
[MockitoHint] 1. Unused -> at org.eclipse.rdf4j.console.command.FederateTest.setUp(FederateTest.java:88)

02:20:10.007 [main] DEBUG Initializing MemoryStore...
02:20:10.008 [main] DEBUG Initializing data file...
02:20:10.008 [main] DEBUG Data file initialized
02:20:10.008 [main] DEBUG MemoryStore initialized
02:20:10.010 [main] DEBUG syncing data to file...
02:20:10.011 [main] DEBUG Data synced to file
02:20:10.014 [main] DEBUG Initializing MemoryStore...
02:20:10.014 [main] DEBUG Initializing data file...
02:20:10.014 [main] DEBUG Data file initialized
02:20:10.014 [main] DEBUG MemoryStore initialized
02:20:10.016 [main] DEBUG syncing data to file...
02:20:10.017 [main] DEBUG Data synced to file
02:20:10.024 [main] DEBUG Federate called with federation ID = fedID, and member ID's = [sparql][sparql2].
  Distinct set to false, and readonly set to true.

02:20:10.025 [main] DEBUG Federation repository root node: _:node1dri62d7cx494
02:20:10.025 [main] DEBUG _:node1dri62d7cx494 http://www.w3.org/1999/02/22-rdf-syntax-ns#type http://www.openrdf.org/config/repository#Repository
02:20:10.025 [main] DEBUG _:node1dri62d7cx494 http://www.openrdf.org/config/repository#repositoryID "fedID"
02:20:10.025 [main] DEBUG _:node1dri62d7cx494 http://www.w3.org/2000/01/rdf-schema#label "Test Federation Title"
02:20:10.026 [main] DEBUG _:node1dri62d7cx494 http://www.openrdf.org/config/repository#repositoryImpl _:node1dri62d7cx495
02:20:10.026 [main] DEBUG _:node1dri62d7cx495 http://www.openrdf.org/config/repository#repositoryType "openrdf:SailRepository"
02:20:10.026 [main] DEBUG _:node1dri62d7cx495 http://www.openrdf.org/config/repository/sail#sailImpl _:node1dri62d7cx496
02:20:10.026 [main] DEBUG _:node1dri62d7cx496 http://www.openrdf.org/config/sail#sailType "openrdf:Federation"
02:20:10.026 [main] DEBUG _:node1dri62d7cx496 http://www.openrdf.org/config/sail/federation#readOnly "true"^^<http://www.w3.org/2001/XMLSchema#boolean>
02:20:10.026 [main] DEBUG _:node1dri62d7cx496 http://www.openrdf.org/config/sail/federation#distinct "false"^^<http://www.w3.org/2001/XMLSchema#boolean>
02:20:10.026 [main] DEBUG Adding member: sparql
02:20:10.026 [main] DEBUG _:node1dri62d7cx496 http://www.openrdf.org/config/sail/federation#member _:node1dri62d7cx497
02:20:10.026 [main] DEBUG _:node1dri62d7cx497 http://www.openrdf.org/config/repository#repositoryType "openrdf:SPARQLRepository"
02:20:10.027 [main] DEBUG _:node1dri62d7cx497 http://www.openrdf.org/config/repository/sparql#query-endpoint http://localhost:8080/openrdf-sesame/repositories/sparql
02:20:10.027 [main] DEBUG Added member sparql: 
02:20:10.027 [main] DEBUG Adding member: sparql2
02:20:10.027 [main] DEBUG _:node1dri62d7cx496 http://www.openrdf.org/config/sail/federation#member _:node1dri62d7cx500
02:20:10.027 [main] DEBUG _:node1dri62d7cx500 http://www.openrdf.org/config/repository#repositoryType "openrdf:SPARQLRepository"
02:20:10.028 [main] DEBUG _:node1dri62d7cx500 http://www.openrdf.org/config/repository/sparql#query-endpoint http://localhost:8080/openrdf-sesame/repositories/sparql
02:20:10.028 [main] DEBUG Added member sparql2: 
02:20:10.039 [main] DEBUG Initializing MemoryStore...
02:20:10.040 [main] DEBUG Initializing data file...
02:20:10.040 [main] DEBUG Data file initialized
02:20:10.040 [main] DEBUG MemoryStore initialized
02:20:10.042 [main] DEBUG syncing data to file...
02:20:10.042 [main] DEBUG Data synced to file
02:20:10.045 [main] DEBUG Initializing MemoryStore...
02:20:10.046 [main] DEBUG Initializing data file...
02:20:10.046 [main] DEBUG Data file initialized
02:20:10.046 [main] DEBUG MemoryStore initialized
02:20:10.048 [main] DEBUG syncing data to file...
02:20:10.048 [main] DEBUG Data synced to file
02:20:10.055 [main] DEBUG Federate called with federation ID = fedID, and member ID's = [http][sparql].
  Distinct set to false, and readonly set to true.

02:20:10.056 [main] DEBUG Federation repository root node: _:node1dri62d7cx549
02:20:10.056 [main] DEBUG _:node1dri62d7cx549 http://www.w3.org/1999/02/22-rdf-syntax-ns#type http://www.openrdf.org/config/repository#Repository
02:20:10.056 [main] DEBUG _:node1dri62d7cx549 http://www.openrdf.org/config/repository#repositoryID "fedID"
02:20:10.056 [main] DEBUG _:node1dri62d7cx549 http://www.w3.org/2000/01/rdf-schema#label "Test Federation Title"
02:20:10.056 [main] DEBUG _:node1dri62d7cx549 http://www.openrdf.org/config/repository#repositoryImpl _:node1dri62d7cx550
02:20:10.056 [main] DEBUG _:node1dri62d7cx550 http://www.openrdf.org/config/repository#repositoryType "openrdf:SailRepository"
02:20:10.056 [main] DEBUG _:node1dri62d7cx550 http://www.openrdf.org/config/repository/sail#sailImpl _:node1dri62d7cx551
02:20:10.057 [main] DEBUG _:node1dri62d7cx551 http://www.openrdf.org/config/sail#sailType "openrdf:Federation"
02:20:10.057 [main] DEBUG _:node1dri62d7cx551 http://www.openrdf.org/config/sail/federation#readOnly "true"^^<http://www.w3.org/2001/XMLSchema#boolean>
02:20:10.057 [main] DEBUG _:node1dri62d7cx551 http://www.openrdf.org/config/sail/federation#distinct "false"^^<http://www.w3.org/2001/XMLSchema#boolean>
02:20:10.057 [main] DEBUG Adding member: http
02:20:10.057 [main] DEBUG _:node1dri62d7cx551 http://www.openrdf.org/config/sail/federation#member _:node1dri62d7cx552
02:20:10.057 [main] DEBUG _:node1dri62d7cx552 http://www.openrdf.org/config/repository#repositoryType "openrdf:HTTPRepository"
02:20:10.058 [main] DEBUG _:node1dri62d7cx552 http://www.openrdf.org/config/repository/http#repositoryURL http://localhost:8080/openrdf-sesame/repositories/http
02:20:10.058 [main] DEBUG Added member http: 
02:20:10.058 [main] DEBUG Adding member: sparql
02:20:10.058 [main] DEBUG _:node1dri62d7cx551 http://www.openrdf.org/config/sail/federation#member _:node1dri62d7cx555
02:20:10.059 [main] DEBUG _:node1dri62d7cx555 http://www.openrdf.org/config/repository#repositoryType "openrdf:SPARQLRepository"
02:20:10.060 [main] DEBUG _:node1dri62d7cx555 http://www.openrdf.org/config/repository/sparql#query-endpoint http://localhost:8080/openrdf-sesame/repositories/sparql
02:20:10.060 [main] DEBUG Added member sparql: 
02:20:10.075 [main] DEBUG Initializing MemoryStore...
02:20:10.075 [main] DEBUG Initializing data file...
02:20:10.076 [main] DEBUG Data file initialized
02:20:10.076 [main] DEBUG MemoryStore initialized
02:20:10.077 [main] DEBUG syncing data to file...
02:20:10.078 [main] DEBUG Data synced to file
02:20:10.081 [main] DEBUG Initializing MemoryStore...
02:20:10.081 [main] DEBUG Initializing data file...
02:20:10.082 [main] DEBUG Data file initialized
02:20:10.082 [main] DEBUG MemoryStore initialized
02:20:10.083 [main] DEBUG syncing data to file...
02:20:10.084 [main] DEBUG Data synced to file
02:20:10.091 [main] DEBUG Federate called with federation ID = fedID, and member ID's = [alien][FreeLunch].
  Distinct set to false, and readonly set to true.

02:20:10.092 [main] ERROR FreeLunch does not exist.
[MockitoHint] FederateTest.testNonexistentMemberPrintsSpecificError (see javadoc for MockitoHint):
[MockitoHint] 1. Unused -> at org.eclipse.rdf4j.console.command.FederateTest.setUp(FederateTest.java:88)

02:20:10.098 [main] DEBUG Initializing MemoryStore...
02:20:10.099 [main] DEBUG Initializing data file...
02:20:10.099 [main] DEBUG Data file initialized
02:20:10.099 [main] DEBUG MemoryStore initialized
02:20:10.101 [main] DEBUG syncing data to file...
02:20:10.101 [main] DEBUG Data synced to file
02:20:10.104 [main] DEBUG Initializing MemoryStore...
02:20:10.105 [main] DEBUG Initializing data file...
02:20:10.106 [main] DEBUG Data file initialized
02:20:10.106 [main] DEBUG MemoryStore initialized
02:20:10.107 [main] DEBUG syncing data to file...
02:20:10.108 [main] DEBUG Data synced to file
02:20:10.114 [main] ERROR Duplicate repository id's specified.
[MockitoHint] FederateTest.testFedSameAsMemberPrintsError (see javadoc for MockitoHint):
[MockitoHint] 1. Unused -> at org.eclipse.rdf4j.console.command.FederateTest.setUp(FederateTest.java:87)
[MockitoHint] 2. Unused -> at org.eclipse.rdf4j.console.command.FederateTest.setUp(FederateTest.java:88)

02:20:10.120 [main] DEBUG Initializing MemoryStore...
02:20:10.121 [main] DEBUG Initializing data file...
02:20:10.121 [main] DEBUG Data file initialized
02:20:10.121 [main] DEBUG MemoryStore initialized
02:20:10.122 [main] DEBUG syncing data to file...
02:20:10.123 [main] DEBUG Data synced to file
02:20:10.126 [main] DEBUG Initializing MemoryStore...
02:20:10.126 [main] DEBUG Initializing data file...
02:20:10.127 [main] DEBUG Data file initialized
02:20:10.127 [main] DEBUG MemoryStore initialized
02:20:10.128 [main] DEBUG syncing data to file...
02:20:10.129 [main] DEBUG Data synced to file
[MockitoHint] FederateTest.testTwoArgumentsPrintsHelp (see javadoc for MockitoHint):
[MockitoHint] 1. Unused -> at org.eclipse.rdf4j.console.command.FederateTest.setUp(FederateTest.java:87)
[MockitoHint] 2. Unused -> at org.eclipse.rdf4j.console.command.FederateTest.setUp(FederateTest.java:88)

02:20:10.141 [main] DEBUG Initializing MemoryStore...
02:20:10.142 [main] DEBUG Initializing data file...
02:20:10.142 [main] DEBUG Data file initialized
02:20:10.142 [main] DEBUG MemoryStore initialized
02:20:10.143 [main] DEBUG syncing data to file...
02:20:10.144 [main] DEBUG Data synced to file
02:20:10.147 [main] DEBUG Initializing MemoryStore...
02:20:10.147 [main] DEBUG Initializing data file...
02:20:10.148 [main] DEBUG Data file initialized
02:20:10.148 [main] DEBUG MemoryStore initialized
02:20:10.149 [main] DEBUG syncing data to file...
02:20:10.150 [main] DEBUG Data synced to file
02:20:10.156 [main] DEBUG Federate called with federation ID = fedID, and member ID's = [alien][scary].
  Distinct set to false, and readonly set to true.

02:20:10.157 [main] DEBUG Federation repository root node: _:node1dri62d7cx692
02:20:10.157 [main] DEBUG _:node1dri62d7cx692 http://www.w3.org/1999/02/22-rdf-syntax-ns#type http://www.openrdf.org/config/repository#Repository
02:20:10.157 [main] DEBUG _:node1dri62d7cx692 http://www.openrdf.org/config/repository#repositoryID "fedID"
02:20:10.157 [main] DEBUG _:node1dri62d7cx692 http://www.w3.org/2000/01/rdf-schema#label "Test Federation Title"
02:20:10.157 [main] DEBUG _:node1dri62d7cx692 http://www.openrdf.org/config/repository#repositoryImpl _:node1dri62d7cx693
02:20:10.157 [main] DEBUG _:node1dri62d7cx693 http://www.openrdf.org/config/repository#repositoryType "openrdf:SailRepository"
02:20:10.157 [main] DEBUG _:node1dri62d7cx693 http://www.openrdf.org/config/repository/sail#sailImpl _:node1dri62d7cx694
02:20:10.157 [main] DEBUG _:node1dri62d7cx694 http://www.openrdf.org/config/sail#sailType "openrdf:Federation"
02:20:10.157 [main] DEBUG _:node1dri62d7cx694 http://www.openrdf.org/config/sail/federation#readOnly "true"^^<http://www.w3.org/2001/XMLSchema#boolean>
02:20:10.157 [main] DEBUG _:node1dri62d7cx694 http://www.openrdf.org/config/sail/federation#distinct "false"^^<http://www.w3.org/2001/XMLSchema#boolean>
02:20:10.157 [main] DEBUG Adding member: alien
02:20:10.157 [main] DEBUG _:node1dri62d7cx694 http://www.openrdf.org/config/sail/federation#member _:node1dri62d7cx695
02:20:10.157 [main] DEBUG _:node1dri62d7cx695 http://www.openrdf.org/config/repository#repositoryType "openrdf:ProxyRepository"
02:20:10.157 [main] DEBUG _:node1dri62d7cx695 http://www.openrdf.org/config/repository/proxy#proxiedID "alien"
02:20:10.157 [main] DEBUG Added member alien: 
02:20:10.157 [main] DEBUG Adding member: scary
02:20:10.157 [main] DEBUG _:node1dri62d7cx694 http://www.openrdf.org/config/sail/federation#member _:node1dri62d7cx698
02:20:10.158 [main] DEBUG _:node1dri62d7cx698 http://www.openrdf.org/config/repository#repositoryType "openrdf:ProxyRepository"
02:20:10.158 [main] DEBUG _:node1dri62d7cx698 http://www.openrdf.org/config/repository/proxy#proxiedID "scary"
02:20:10.158 [main] DEBUG Added member scary: 
02:20:10.170 [main] DEBUG Initializing MemoryStore...
02:20:10.171 [main] DEBUG Initializing data file...
02:20:10.171 [main] DEBUG Data file initialized
02:20:10.171 [main] DEBUG MemoryStore initialized
02:20:10.172 [main] DEBUG syncing data to file...
02:20:10.173 [main] DEBUG Data synced to file
02:20:10.174 [main] DEBUG Initializing MemoryStore...
02:20:10.175 [main] DEBUG Initializing data file...
02:20:10.175 [main] DEBUG Data file initialized
02:20:10.175 [main] DEBUG MemoryStore initialized
02:20:10.176 [main] DEBUG syncing data to file...
02:20:10.176 [main] DEBUG Data synced to file
[MockitoHint] FederateTest.testOneArgumentPrintsHelp (see javadoc for MockitoHint):
[MockitoHint] 1. Unused -> at org.eclipse.rdf4j.console.command.FederateTest.setUp(FederateTest.java:87)
[MockitoHint] 2. Unused -> at org.eclipse.rdf4j.console.command.FederateTest.setUp(FederateTest.java:88)

02:20:10.187 [main] DEBUG Initializing MemoryStore...
02:20:10.188 [main] DEBUG Initializing data file...
02:20:10.188 [main] DEBUG Data file initialized
02:20:10.189 [main] DEBUG MemoryStore initialized
02:20:10.190 [main] DEBUG syncing data to file...
02:20:10.190 [main] DEBUG Data synced to file
02:20:10.191 [main] DEBUG Initializing MemoryStore...
02:20:10.192 [main] DEBUG Initializing data file...
02:20:10.192 [main] DEBUG Data file initialized
02:20:10.192 [main] DEBUG MemoryStore initialized
02:20:10.193 [main] DEBUG syncing data to file...
02:20:10.193 [main] DEBUG Data synced to file
02:20:10.198 [main] DEBUG Federate called with federation ID = fedID, and member ID's = [http][http2].
  Distinct set to false, and readonly set to true.

02:20:10.198 [main] DEBUG Federation repository root node: _:node1dri62d7cx784
02:20:10.198 [main] DEBUG _:node1dri62d7cx784 http://www.w3.org/1999/02/22-rdf-syntax-ns#type http://www.openrdf.org/config/repository#Repository
02:20:10.198 [main] DEBUG _:node1dri62d7cx784 http://www.openrdf.org/config/repository#repositoryID "fedID"
02:20:10.199 [main] DEBUG _:node1dri62d7cx784 http://www.w3.org/2000/01/rdf-schema#label "Test Federation Title"
02:20:10.199 [main] DEBUG _:node1dri62d7cx784 http://www.openrdf.org/config/repository#repositoryImpl _:node1dri62d7cx785
02:20:10.199 [main] DEBUG _:node1dri62d7cx785 http://www.openrdf.org/config/repository#repositoryType "openrdf:SailRepository"
02:20:10.199 [main] DEBUG _:node1dri62d7cx785 http://www.openrdf.org/config/repository/sail#sailImpl _:node1dri62d7cx786
02:20:10.199 [main] DEBUG _:node1dri62d7cx786 http://www.openrdf.org/config/sail#sailType "openrdf:Federation"
02:20:10.199 [main] DEBUG _:node1dri62d7cx786 http://www.openrdf.org/config/sail/federation#readOnly "true"^^<http://www.w3.org/2001/XMLSchema#boolean>
02:20:10.199 [main] DEBUG _:node1dri62d7cx786 http://www.openrdf.org/config/sail/federation#distinct "false"^^<http://www.w3.org/2001/XMLSchema#boolean>
02:20:10.199 [main] DEBUG Adding member: http
02:20:10.199 [main] DEBUG _:node1dri62d7cx786 http://www.openrdf.org/config/sail/federation#member _:node1dri62d7cx787
02:20:10.199 [main] DEBUG _:node1dri62d7cx787 http://www.openrdf.org/config/repository#repositoryType "openrdf:HTTPRepository"
02:20:10.199 [main] DEBUG _:node1dri62d7cx787 http://www.openrdf.org/config/repository/http#repositoryURL http://localhost:8080/openrdf-sesame/repositories/http
02:20:10.199 [main] DEBUG Added member http: 
02:20:10.199 [main] DEBUG Adding member: http2
02:20:10.199 [main] DEBUG _:node1dri62d7cx786 http://www.openrdf.org/config/sail/federation#member _:node1dri62d7cx790
02:20:10.200 [main] DEBUG _:node1dri62d7cx790 http://www.openrdf.org/config/repository#repositoryType "openrdf:HTTPRepository"
02:20:10.200 [main] DEBUG _:node1dri62d7cx790 http://www.openrdf.org/config/repository/http#repositoryURL http://localhost:8080/openrdf-sesame/repositories/http
02:20:10.200 [main] DEBUG Added member http2: 
[INFO] Tests run: 15, Failures: 0, Errors: 0, Skipped: 0, Time elapsed: 0.464 s - in org.eclipse.rdf4j.console.command.FederateTest
[INFO] Running org.eclipse.rdf4j.console.command.SparqlTest
[MockitoHint] SparqlTest.testInputFile (see javadoc for MockitoHint):
[MockitoHint] 1. Unused -> at org.eclipse.rdf4j.console.command.SparqlTest.setUp(SparqlTest.java:49)

02:20:10.232 [main] ERROR No suitable result writer found
[MockitoHint] SparqlTest.testSelectError (see javadoc for MockitoHint):
[MockitoHint] 1. Unused -> at org.eclipse.rdf4j.console.command.SparqlTest.setUp(SparqlTest.java:49)

[MockitoHint] SparqlTest.testSelectMissingBindings (see javadoc for MockitoHint):
[MockitoHint] 1. Unused -> at org.eclipse.rdf4j.console.command.SparqlTest.setUp(SparqlTest.java:49)

[MockitoHint] SparqlTest.testInputFileWorkdir (see javadoc for MockitoHint):
[MockitoHint] 1. Unused -> at org.eclipse.rdf4j.console.command.SparqlTest.setUp(SparqlTest.java:49)

[INFO] Tests run: 9, Failures: 0, Errors: 0, Skipped: 0, Time elapsed: 0.103 s - in org.eclipse.rdf4j.console.command.SparqlTest
[INFO] Running org.eclipse.rdf4j.console.UtilTest
 one, two
 three
 four
 five, six
 seven
 eight
[INFO] Tests run: 4, Failures: 0, Errors: 0, Skipped: 0, Time elapsed: 0 s - in org.eclipse.rdf4j.console.UtilTest
[INFO] Running org.eclipse.rdf4j.console.ConsoleIOTest
[INFO] Tests run: 3, Failures: 0, Errors: 0, Skipped: 0, Time elapsed: 0.048 s - in org.eclipse.rdf4j.console.ConsoleIOTest
[INFO] 
[INFO] Results:
[INFO] 
[INFO] Tests run: 64, Failures: 0, Errors: 0, Skipped: 0
[INFO] 
[JENKINS] Recording test results
[INFO] 
[INFO] --- animal-sniffer-maven-plugin:1.16:check (default) @ rdf4j-console ---
[INFO] Checking unresolved references to org.codehaus.mojo.signature:java18:1.0
[INFO] 
[INFO] --- maven-jar-plugin:2.3.1:jar (default-jar) @ rdf4j-console ---
[INFO] Building jar: /home/hudson/genie.rdf4j/.jenkins/jobs/rdf4j-pr-verify/workspace/tools/console/target/rdf4j-console-3.1.0-SNAPSHOT.jar