SuccessConsole Output

Started calculate disk usage of build
Finished Calculation of disk usage of build in 0 seconds
Started calculate disk usage of workspace
Finished Calculation of disk usage of workspace in 0 seconds
[INFO] 
[INFO] ------------------< org.eclipse.rdf4j:rdf4j-console >-------------------
[INFO] Building RDF4J: Console 3.1.0-SNAPSHOT                           [70/85]
[INFO] --------------------------------[ jar ]---------------------------------
[INFO] 
[INFO] --- buildnumber-maven-plugin:1.4:create (default) @ rdf4j-console ---
[INFO] ShortRevision tag detected. The value is '7'.
[INFO] Executing: /bin/sh -c cd '/home/hudson/genie.rdf4j/.jenkins/jobs/rdf4j-pr-verify/workspace/tools/console' && 'git' 'rev-parse' '--verify' '--short=7' 'HEAD'
[INFO] Working directory: /home/hudson/genie.rdf4j/.jenkins/jobs/rdf4j-pr-verify/workspace/tools/console
[INFO] Storing buildNumber: 6e2f176 at timestamp: 1575757403791
[WARNING] Cannot get the branch information from the git repository: 
Detecting the current branch failed: fatal: ref HEAD is not a symbolic ref

[INFO] ShortRevision tag detected. The value is '7'.
[INFO] Executing: /bin/sh -c cd '/home/hudson/genie.rdf4j/.jenkins/jobs/rdf4j-pr-verify/workspace/tools/console' && 'git' 'rev-parse' '--verify' '--short=7' 'HEAD'
[INFO] Working directory: /home/hudson/genie.rdf4j/.jenkins/jobs/rdf4j-pr-verify/workspace/tools/console
[INFO] Storing buildScmBranch: UNKNOWN
[INFO] 
[INFO] --- maven-enforcer-plugin:1.4.1:enforce (enforce-bytecode-version) @ rdf4j-console ---
[INFO] Adding ignore: META-INF/**/module-info
[INFO] 
[INFO] --- formatter-maven-plugin:2.8.1:validate (default) @ rdf4j-console ---
[INFO] Using 'UTF-8' encoding to format source files.
[INFO] Number of files to be formatted: 61
[INFO] Html formatting is skipped
[INFO] Successfully formatted:          0 file(s)
[INFO] Fail to format:                  0 file(s)
[INFO] Skipped:                         61 file(s)
[INFO] Read only skipped:               0 file(s)
[INFO] Approximate time taken:          0s
[INFO] 
[INFO] --- maven-resources-plugin:3.0.2:resources (default-resources) @ rdf4j-console ---
[INFO] Using 'UTF-8' encoding to copy filtered resources.
[INFO] skip non existing resourceDirectory /home/hudson/genie.rdf4j/.jenkins/jobs/rdf4j-pr-verify/workspace/tools/console/src/main/resources
[INFO] 
[INFO] --- maven-compiler-plugin:3.7.0:compile (default-compile) @ rdf4j-console ---
[INFO] Changes detected - recompiling the module!
[INFO] Compiling 42 source files to /home/hudson/genie.rdf4j/.jenkins/jobs/rdf4j-pr-verify/workspace/tools/console/target/classes
[INFO] 
[INFO] --- maven-resources-plugin:3.0.2:testResources (default-testResources) @ rdf4j-console ---
[INFO] Using 'UTF-8' encoding to copy filtered resources.
[INFO] Copying 29 resources
[INFO] 
[INFO] --- maven-compiler-plugin:3.7.0:testCompile (default-testCompile) @ rdf4j-console ---
[INFO] Changes detected - recompiling the module!
[INFO] Compiling 18 source files to /home/hudson/genie.rdf4j/.jenkins/jobs/rdf4j-pr-verify/workspace/tools/console/target/test-classes
[INFO] 
[INFO] --- maven-surefire-plugin:2.22.2:test (default-test) @ rdf4j-console ---
[INFO] 
[INFO] -------------------------------------------------------
[INFO]  T E S T S
[INFO] -------------------------------------------------------
[INFO] Running org.eclipse.rdf4j.console.setting.PrefixesTest
[INFO] Tests run: 3, Failures: 0, Errors: 0, Skipped: 0, Time elapsed: 0.692 s - in org.eclipse.rdf4j.console.setting.PrefixesTest
[INFO] Running org.eclipse.rdf4j.console.setting.LogLevelTest
17:23:30.109 [main] ERROR unknown logging level: chatty
[INFO] Tests run: 4, Failures: 0, Errors: 0, Skipped: 0, Time elapsed: 0.016 s - in org.eclipse.rdf4j.console.setting.LogLevelTest
[INFO] Running org.eclipse.rdf4j.console.setting.QueryPrefixTest
[INFO] Tests run: 1, Failures: 0, Errors: 0, Skipped: 0, Time elapsed: 0 s - in org.eclipse.rdf4j.console.setting.QueryPrefixTest
[INFO] Running org.eclipse.rdf4j.console.setting.ShowPrefixTest
[INFO] Tests run: 1, Failures: 0, Errors: 0, Skipped: 0, Time elapsed: 0 s - in org.eclipse.rdf4j.console.setting.ShowPrefixTest
[INFO] Running org.eclipse.rdf4j.console.setting.ConsoleWidthTest
[INFO] Tests run: 1, Failures: 0, Errors: 0, Skipped: 0, Time elapsed: 0 s - in org.eclipse.rdf4j.console.setting.ConsoleWidthTest
[INFO] Running org.eclipse.rdf4j.console.command.SetParametersTest
17:23:30.142 [main] ERROR Unknown parameter: unknown
[INFO] Tests run: 1, Failures: 0, Errors: 0, Skipped: 0, Time elapsed: 0.023 s - in org.eclipse.rdf4j.console.command.SetParametersTest
[INFO] Running org.eclipse.rdf4j.console.command.LoadTest
[MockitoHint] LoadTest.testLoad (see javadoc for MockitoHint):
[MockitoHint] 1. Unused -> at org.eclipse.rdf4j.console.command.LoadTest.setUp(LoadTest.java:49)

[MockitoHint] LoadTest.testLoadWorkDir (see javadoc for MockitoHint):
[MockitoHint] 1. Unused -> at org.eclipse.rdf4j.console.command.LoadTest.setUp(LoadTest.java:49)

[INFO] Tests run: 2, Failures: 0, Errors: 0, Skipped: 0, Time elapsed: 0.171 s - in org.eclipse.rdf4j.console.command.LoadTest
[INFO] Running org.eclipse.rdf4j.console.command.ConvertTest
17:23:30.543 [main] ERROR No RDF writer for /tmp/genie.rdf4j/junit2475980511812179008/alien.qyx
[MockitoHint] ConvertTest.testConvertInvalidFormat (see javadoc for MockitoHint):
[MockitoHint] 1. Unused -> at org.eclipse.rdf4j.console.command.ConvertTest.setup(ConvertTest.java:39)

17:23:30.549 [main] ERROR Failed to convert data
org.eclipse.rdf4j.rio.RDFParseException: Expected '<' or '_', found: e [line 1, column 101]
	at org.eclipse.rdf4j.rio.ntriples.NTriplesParser.parseSubject(NTriplesParser.java:313)
	at org.eclipse.rdf4j.rio.ntriples.NTriplesParser.parseTriple(NTriplesParser.java:252)
	at org.eclipse.rdf4j.rio.ntriples.NTriplesParser.parse(NTriplesParser.java:160)
	at org.eclipse.rdf4j.rio.ntriples.NTriplesParser.parse(NTriplesParser.java:109)
	at org.eclipse.rdf4j.console.command.Convert.convert(Convert.java:139)
	at org.eclipse.rdf4j.console.command.Convert.execute(Convert.java:74)
	at org.eclipse.rdf4j.console.command.ConvertTest.testConvertParseError(ConvertTest.java:92)
	at sun.reflect.NativeMethodAccessorImpl.invoke0(Native Method)
	at sun.reflect.NativeMethodAccessorImpl.invoke(NativeMethodAccessorImpl.java:62)
	at sun.reflect.DelegatingMethodAccessorImpl.invoke(DelegatingMethodAccessorImpl.java:43)
	at java.lang.reflect.Method.invoke(Method.java:498)
	at org.junit.runners.model.FrameworkMethod$1.runReflectiveCall(FrameworkMethod.java:50)
	at org.junit.internal.runners.model.ReflectiveCallable.run(ReflectiveCallable.java:12)
	at org.junit.runners.model.FrameworkMethod.invokeExplosively(FrameworkMethod.java:47)
	at org.junit.internal.runners.statements.InvokeMethod.evaluate(InvokeMethod.java:17)
	at org.junit.internal.runners.statements.RunBefores.evaluate(RunBefores.java:26)
	at org.junit.internal.runners.statements.RunAfters.evaluate(RunAfters.java:27)
	at org.mockito.internal.junit.JUnitRule$1.evaluateSafely(JUnitRule.java:52)
	at org.mockito.internal.junit.JUnitRule$1.evaluate(JUnitRule.java:43)
	at org.junit.rules.ExternalResource$1.evaluate(ExternalResource.java:48)
	at org.junit.rules.RunRules.evaluate(RunRules.java:20)
	at org.junit.runners.ParentRunner.runLeaf(ParentRunner.java:325)
	at org.junit.runners.BlockJUnit4ClassRunner.runChild(BlockJUnit4ClassRunner.java:78)
	at org.junit.runners.BlockJUnit4ClassRunner.runChild(BlockJUnit4ClassRunner.java:57)
	at org.junit.runners.ParentRunner$3.run(ParentRunner.java:290)
	at org.junit.runners.ParentRunner$1.schedule(ParentRunner.java:71)
	at org.junit.runners.ParentRunner.runChildren(ParentRunner.java:288)
	at org.junit.runners.ParentRunner.access$000(ParentRunner.java:58)
	at org.junit.runners.ParentRunner$2.evaluate(ParentRunner.java:268)
	at org.junit.runners.ParentRunner.run(ParentRunner.java:363)
	at org.apache.maven.surefire.junit4.JUnit4Provider.execute(JUnit4Provider.java:365)
	at org.apache.maven.surefire.junit4.JUnit4Provider.executeWithRerun(JUnit4Provider.java:273)
	at org.apache.maven.surefire.junit4.JUnit4Provider.executeTestSet(JUnit4Provider.java:238)
	at org.apache.maven.surefire.junit4.JUnit4Provider.invoke(JUnit4Provider.java:159)
	at org.apache.maven.surefire.booter.ForkedBooter.invokeProviderInSameClassLoader(ForkedBooter.java:384)
	at org.apache.maven.surefire.booter.ForkedBooter.runSuitesInProcess(ForkedBooter.java:345)
	at org.apache.maven.surefire.booter.ForkedBooter.execute(ForkedBooter.java:126)
	at org.apache.maven.surefire.booter.ForkedBooter.main(ForkedBooter.java:418)
[INFO] Tests run: 4, Failures: 0, Errors: 0, Skipped: 0, Time elapsed: 0.229 s - in org.eclipse.rdf4j.console.command.ConvertTest
[INFO] Running org.eclipse.rdf4j.console.command.ExportTest
[MockitoHint] ExportTest.testExportWorkDir (see javadoc for MockitoHint):
[MockitoHint] 1. Unused -> at org.eclipse.rdf4j.console.command.ExportTest.setUp(ExportTest.java:46)

[MockitoHint] ExportTest.testExportAll (see javadoc for MockitoHint):
[MockitoHint] 1. Unused -> at org.eclipse.rdf4j.console.command.ExportTest.setUp(ExportTest.java:46)

[MockitoHint] ExportTest.testExportContexts (see javadoc for MockitoHint):
[MockitoHint] 1. Unused -> at org.eclipse.rdf4j.console.command.ExportTest.setUp(ExportTest.java:46)

[INFO] Tests run: 3, Failures: 0, Errors: 0, Skipped: 0, Time elapsed: 0.046 s - in org.eclipse.rdf4j.console.command.ExportTest
[INFO] Running org.eclipse.rdf4j.console.command.VerifyTest
17:23:30.901 [main] ERROR Unexpected RDFParseException
org.eclipse.rdf4j.rio.RDFParseException: 'missing type' was not recognised, and could not be verified, with datatype http://example.rdf4j.org/type/wrong [line 1]
	at org.eclipse.rdf4j.rio.helpers.RDFParserHelper.reportError(RDFParserHelper.java:265)
	at org.eclipse.rdf4j.rio.helpers.RDFParserHelper.createLiteral(RDFParserHelper.java:180)
	at org.eclipse.rdf4j.rio.helpers.AbstractRDFParser.createLiteral(AbstractRDFParser.java:530)
	at org.eclipse.rdf4j.rio.turtle.TurtleParser.parseQuotedLiteral(TurtleParser.java:665)
	at org.eclipse.rdf4j.rio.turtle.TurtleParser.parseValue(TurtleParser.java:584)
	at org.eclipse.rdf4j.rio.turtle.TurtleParser.parseObject(TurtleParser.java:461)
	at org.eclipse.rdf4j.rio.turtle.TurtleParser.parseObjectList(TurtleParser.java:389)
	at org.eclipse.rdf4j.rio.turtle.TurtleParser.parsePredicateObjectList(TurtleParser.java:362)
	at org.eclipse.rdf4j.rio.turtle.TurtleParser.parseTriples(TurtleParser.java:349)
	at org.eclipse.rdf4j.rio.turtle.TurtleParser.parseStatement(TurtleParser.java:216)
	at org.eclipse.rdf4j.rio.turtle.TurtleParser.parse(TurtleParser.java:178)
	at org.eclipse.rdf4j.rio.turtle.TurtleParser.parse(TurtleParser.java:130)
	at org.eclipse.rdf4j.console.command.Verify.verify(Verify.java:145)
	at org.eclipse.rdf4j.console.command.Verify.execute(Verify.java:97)
	at org.eclipse.rdf4j.console.command.VerifyTest.testVerifyMissingType(VerifyTest.java:97)
	at sun.reflect.NativeMethodAccessorImpl.invoke0(Native Method)
	at sun.reflect.NativeMethodAccessorImpl.invoke(NativeMethodAccessorImpl.java:62)
	at sun.reflect.DelegatingMethodAccessorImpl.invoke(DelegatingMethodAccessorImpl.java:43)
	at java.lang.reflect.Method.invoke(Method.java:498)
	at org.junit.runners.model.FrameworkMethod$1.runReflectiveCall(FrameworkMethod.java:50)
	at org.junit.internal.runners.model.ReflectiveCallable.run(ReflectiveCallable.java:12)
	at org.junit.runners.model.FrameworkMethod.invokeExplosively(FrameworkMethod.java:47)
	at org.junit.internal.runners.statements.InvokeMethod.evaluate(InvokeMethod.java:17)
	at org.junit.internal.runners.statements.RunBefores.evaluate(RunBefores.java:26)
	at org.junit.internal.runners.statements.RunAfters.evaluate(RunAfters.java:27)
	at org.mockito.internal.junit.JUnitRule$1.evaluateSafely(JUnitRule.java:52)
	at org.mockito.internal.junit.JUnitRule$1.evaluate(JUnitRule.java:43)
	at org.junit.rules.ExternalResource$1.evaluate(ExternalResource.java:48)
	at org.junit.rules.RunRules.evaluate(RunRules.java:20)
	at org.junit.runners.ParentRunner.runLeaf(ParentRunner.java:325)
	at org.junit.runners.BlockJUnit4ClassRunner.runChild(BlockJUnit4ClassRunner.java:78)
	at org.junit.runners.BlockJUnit4ClassRunner.runChild(BlockJUnit4ClassRunner.java:57)
	at org.junit.runners.ParentRunner$3.run(ParentRunner.java:290)
	at org.junit.runners.ParentRunner$1.schedule(ParentRunner.java:71)
	at org.junit.runners.ParentRunner.runChildren(ParentRunner.java:288)
	at org.junit.runners.ParentRunner.access$000(ParentRunner.java:58)
	at org.junit.runners.ParentRunner$2.evaluate(ParentRunner.java:268)
	at org.junit.runners.ParentRunner.run(ParentRunner.java:363)
	at org.apache.maven.surefire.junit4.JUnit4Provider.execute(JUnit4Provider.java:365)
	at org.apache.maven.surefire.junit4.JUnit4Provider.executeWithRerun(JUnit4Provider.java:273)
	at org.apache.maven.surefire.junit4.JUnit4Provider.executeTestSet(JUnit4Provider.java:238)
	at org.apache.maven.surefire.junit4.JUnit4Provider.invoke(JUnit4Provider.java:159)
	at org.apache.maven.surefire.booter.ForkedBooter.invokeProviderInSameClassLoader(ForkedBooter.java:384)
	at org.apache.maven.surefire.booter.ForkedBooter.runSuitesInProcess(ForkedBooter.java:345)
	at org.apache.maven.surefire.booter.ForkedBooter.execute(ForkedBooter.java:126)
	at org.apache.maven.surefire.booter.ForkedBooter.main(ForkedBooter.java:418)
17:23:30.946 [main] ERROR SHACL validation failed, writing report to /tmp/genie.rdf4j/junit5996826789009754846/junit4644144782929144637.tmp
17:23:30.962 [main] ERROR Unexpected RDFParseException
org.eclipse.rdf4j.rio.RDFParseException: Unexpected end of file
	at org.eclipse.rdf4j.rio.turtle.TurtleParser.throwEOFException(TurtleParser.java:1317)
	at org.eclipse.rdf4j.rio.turtle.TurtleParser.parseValue(TurtleParser.java:589)
	at org.eclipse.rdf4j.rio.turtle.TurtleParser.parsePredicate(TurtleParser.java:434)
	at org.eclipse.rdf4j.rio.turtle.TurtleParser.parsePredicateObjectList(TurtleParser.java:358)
	at org.eclipse.rdf4j.rio.turtle.TurtleParser.parseTriples(TurtleParser.java:349)
	at org.eclipse.rdf4j.rio.turtle.TurtleParser.parseStatement(TurtleParser.java:216)
	at org.eclipse.rdf4j.rio.turtle.TurtleParser.parse(TurtleParser.java:178)
	at org.eclipse.rdf4j.rio.turtle.TurtleParser.parse(TurtleParser.java:130)
	at org.eclipse.rdf4j.console.command.Verify.verify(Verify.java:145)
	at org.eclipse.rdf4j.console.command.Verify.execute(Verify.java:97)
	at org.eclipse.rdf4j.console.command.VerifyTest.testVerifyBrokenFile(VerifyTest.java:91)
	at sun.reflect.NativeMethodAccessorImpl.invoke0(Native Method)
	at sun.reflect.NativeMethodAccessorImpl.invoke(NativeMethodAccessorImpl.java:62)
	at sun.reflect.DelegatingMethodAccessorImpl.invoke(DelegatingMethodAccessorImpl.java:43)
	at java.lang.reflect.Method.invoke(Method.java:498)
	at org.junit.runners.model.FrameworkMethod$1.runReflectiveCall(FrameworkMethod.java:50)
	at org.junit.internal.runners.model.ReflectiveCallable.run(ReflectiveCallable.java:12)
	at org.junit.runners.model.FrameworkMethod.invokeExplosively(FrameworkMethod.java:47)
	at org.junit.internal.runners.statements.InvokeMethod.evaluate(InvokeMethod.java:17)
	at org.junit.internal.runners.statements.RunBefores.evaluate(RunBefores.java:26)
	at org.junit.internal.runners.statements.RunAfters.evaluate(RunAfters.java:27)
	at org.mockito.internal.junit.JUnitRule$1.evaluateSafely(JUnitRule.java:52)
	at org.mockito.internal.junit.JUnitRule$1.evaluate(JUnitRule.java:43)
	at org.junit.rules.ExternalResource$1.evaluate(ExternalResource.java:48)
	at org.junit.rules.RunRules.evaluate(RunRules.java:20)
	at org.junit.runners.ParentRunner.runLeaf(ParentRunner.java:325)
	at org.junit.runners.BlockJUnit4ClassRunner.runChild(BlockJUnit4ClassRunner.java:78)
	at org.junit.runners.BlockJUnit4ClassRunner.runChild(BlockJUnit4ClassRunner.java:57)
	at org.junit.runners.ParentRunner$3.run(ParentRunner.java:290)
	at org.junit.runners.ParentRunner$1.schedule(ParentRunner.java:71)
	at org.junit.runners.ParentRunner.runChildren(ParentRunner.java:288)
	at org.junit.runners.ParentRunner.access$000(ParentRunner.java:58)
	at org.junit.runners.ParentRunner$2.evaluate(ParentRunner.java:268)
	at org.junit.runners.ParentRunner.run(ParentRunner.java:363)
	at org.apache.maven.surefire.junit4.JUnit4Provider.execute(JUnit4Provider.java:365)
	at org.apache.maven.surefire.junit4.JUnit4Provider.executeWithRerun(JUnit4Provider.java:273)
	at org.apache.maven.surefire.junit4.JUnit4Provider.executeTestSet(JUnit4Provider.java:238)
	at org.apache.maven.surefire.junit4.JUnit4Provider.invoke(JUnit4Provider.java:159)
	at org.apache.maven.surefire.booter.ForkedBooter.invokeProviderInSameClassLoader(ForkedBooter.java:384)
	at org.apache.maven.surefire.booter.ForkedBooter.runSuitesInProcess(ForkedBooter.java:345)
	at org.apache.maven.surefire.booter.ForkedBooter.execute(ForkedBooter.java:126)
	at org.apache.maven.surefire.booter.ForkedBooter.main(ForkedBooter.java:418)
17:23:30.972 [main] ERROR Unexpected RDFParseException
org.eclipse.rdf4j.rio.RDFParseException: Expected a letter, found '1' [line 1]
	at org.eclipse.rdf4j.rio.helpers.RDFParserHelper.reportError(RDFParserHelper.java:265)
	at org.eclipse.rdf4j.rio.helpers.AbstractRDFParser.reportError(AbstractRDFParser.java:628)
	at org.eclipse.rdf4j.rio.turtle.TurtleParser.reportError(TurtleParser.java:1297)
	at org.eclipse.rdf4j.rio.turtle.TurtleParser.parseQuotedLiteral(TurtleParser.java:619)
	at org.eclipse.rdf4j.rio.turtle.TurtleParser.parseValue(TurtleParser.java:584)
	at org.eclipse.rdf4j.rio.turtle.TurtleParser.parseObject(TurtleParser.java:461)
	at org.eclipse.rdf4j.rio.turtle.TurtleParser.parseObjectList(TurtleParser.java:389)
	at org.eclipse.rdf4j.rio.turtle.TurtleParser.parsePredicateObjectList(TurtleParser.java:362)
	at org.eclipse.rdf4j.rio.turtle.TurtleParser.parseTriples(TurtleParser.java:349)
	at org.eclipse.rdf4j.rio.turtle.TurtleParser.parseStatement(TurtleParser.java:216)
	at org.eclipse.rdf4j.rio.turtle.TurtleParser.parse(TurtleParser.java:178)
	at org.eclipse.rdf4j.rio.turtle.TurtleParser.parse(TurtleParser.java:130)
	at org.eclipse.rdf4j.console.command.Verify.verify(Verify.java:145)
	at org.eclipse.rdf4j.console.command.Verify.execute(Verify.java:97)
	at org.eclipse.rdf4j.console.command.VerifyTest.testVerifyWrongLang(VerifyTest.java:109)
	at sun.reflect.NativeMethodAccessorImpl.invoke0(Native Method)
	at sun.reflect.NativeMethodAccessorImpl.invoke(NativeMethodAccessorImpl.java:62)
	at sun.reflect.DelegatingMethodAccessorImpl.invoke(DelegatingMethodAccessorImpl.java:43)
	at java.lang.reflect.Method.invoke(Method.java:498)
	at org.junit.runners.model.FrameworkMethod$1.runReflectiveCall(FrameworkMethod.java:50)
	at org.junit.internal.runners.model.ReflectiveCallable.run(ReflectiveCallable.java:12)
	at org.junit.runners.model.FrameworkMethod.invokeExplosively(FrameworkMethod.java:47)
	at org.junit.internal.runners.statements.InvokeMethod.evaluate(InvokeMethod.java:17)
	at org.junit.internal.runners.statements.RunBefores.evaluate(RunBefores.java:26)
	at org.junit.internal.runners.statements.RunAfters.evaluate(RunAfters.java:27)
	at org.mockito.internal.junit.JUnitRule$1.evaluateSafely(JUnitRule.java:52)
	at org.mockito.internal.junit.JUnitRule$1.evaluate(JUnitRule.java:43)
	at org.junit.rules.ExternalResource$1.evaluate(ExternalResource.java:48)
	at org.junit.rules.RunRules.evaluate(RunRules.java:20)
	at org.junit.runners.ParentRunner.runLeaf(ParentRunner.java:325)
	at org.junit.runners.BlockJUnit4ClassRunner.runChild(BlockJUnit4ClassRunner.java:78)
	at org.junit.runners.BlockJUnit4ClassRunner.runChild(BlockJUnit4ClassRunner.java:57)
	at org.junit.runners.ParentRunner$3.run(ParentRunner.java:290)
	at org.junit.runners.ParentRunner$1.schedule(ParentRunner.java:71)
	at org.junit.runners.ParentRunner.runChildren(ParentRunner.java:288)
	at org.junit.runners.ParentRunner.access$000(ParentRunner.java:58)
	at org.junit.runners.ParentRunner$2.evaluate(ParentRunner.java:268)
	at org.junit.runners.ParentRunner.run(ParentRunner.java:363)
	at org.apache.maven.surefire.junit4.JUnit4Provider.execute(JUnit4Provider.java:365)
	at org.apache.maven.surefire.junit4.JUnit4Provider.executeWithRerun(JUnit4Provider.java:273)
	at org.apache.maven.surefire.junit4.JUnit4Provider.executeTestSet(JUnit4Provider.java:238)
	at org.apache.maven.surefire.junit4.JUnit4Provider.invoke(JUnit4Provider.java:159)
	at org.apache.maven.surefire.booter.ForkedBooter.invokeProviderInSameClassLoader(ForkedBooter.java:384)
	at org.apache.maven.surefire.booter.ForkedBooter.runSuitesInProcess(ForkedBooter.java:345)
	at org.apache.maven.surefire.booter.ForkedBooter.execute(ForkedBooter.java:126)
	at org.apache.maven.surefire.booter.ForkedBooter.main(ForkedBooter.java:418)
17:23:30.982 [main] ERROR No parser available for this RDF format
org.eclipse.rdf4j.rio.UnsupportedRDFormatException: Did not recognise RDF format string file:/home/hudson/genie.rdf4j/.jenkins/jobs/rdf4j-pr-verify/workspace/tools/console/does-not-exist.docx
	at org.eclipse.rdf4j.rio.Rio.lambda$unsupportedFormat$1(Rio.java:577)
	at java.util.Optional.orElseThrow(Optional.java:290)
	at org.eclipse.rdf4j.console.command.Verify.verify(Verify.java:124)
	at org.eclipse.rdf4j.console.command.Verify.execute(Verify.java:97)
	at org.eclipse.rdf4j.console.command.VerifyTest.testVerifyWrongFormat(VerifyTest.java:69)
	at sun.reflect.NativeMethodAccessorImpl.invoke0(Native Method)
	at sun.reflect.NativeMethodAccessorImpl.invoke(NativeMethodAccessorImpl.java:62)
	at sun.reflect.DelegatingMethodAccessorImpl.invoke(DelegatingMethodAccessorImpl.java:43)
	at java.lang.reflect.Method.invoke(Method.java:498)
	at org.junit.runners.model.FrameworkMethod$1.runReflectiveCall(FrameworkMethod.java:50)
	at org.junit.internal.runners.model.ReflectiveCallable.run(ReflectiveCallable.java:12)
	at org.junit.runners.model.FrameworkMethod.invokeExplosively(FrameworkMethod.java:47)
	at org.junit.internal.runners.statements.InvokeMethod.evaluate(InvokeMethod.java:17)
	at org.junit.internal.runners.statements.RunBefores.evaluate(RunBefores.java:26)
	at org.junit.internal.runners.statements.RunAfters.evaluate(RunAfters.java:27)
	at org.mockito.internal.junit.JUnitRule$1.evaluateSafely(JUnitRule.java:52)
	at org.mockito.internal.junit.JUnitRule$1.evaluate(JUnitRule.java:43)
	at org.junit.rules.ExternalResource$1.evaluate(ExternalResource.java:48)
	at org.junit.rules.RunRules.evaluate(RunRules.java:20)
	at org.junit.runners.ParentRunner.runLeaf(ParentRunner.java:325)
	at org.junit.runners.BlockJUnit4ClassRunner.runChild(BlockJUnit4ClassRunner.java:78)
	at org.junit.runners.BlockJUnit4ClassRunner.runChild(BlockJUnit4ClassRunner.java:57)
	at org.junit.runners.ParentRunner$3.run(ParentRunner.java:290)
	at org.junit.runners.ParentRunner$1.schedule(ParentRunner.java:71)
	at org.junit.runners.ParentRunner.runChildren(ParentRunner.java:288)
	at org.junit.runners.ParentRunner.access$000(ParentRunner.java:58)
	at org.junit.runners.ParentRunner$2.evaluate(ParentRunner.java:268)
	at org.junit.runners.ParentRunner.run(ParentRunner.java:363)
	at org.apache.maven.surefire.junit4.JUnit4Provider.execute(JUnit4Provider.java:365)
	at org.apache.maven.surefire.junit4.JUnit4Provider.executeWithRerun(JUnit4Provider.java:273)
	at org.apache.maven.surefire.junit4.JUnit4Provider.executeTestSet(JUnit4Provider.java:238)
	at org.apache.maven.surefire.junit4.JUnit4Provider.invoke(JUnit4Provider.java:159)
	at org.apache.maven.surefire.booter.ForkedBooter.invokeProviderInSameClassLoader(ForkedBooter.java:384)
	at org.apache.maven.surefire.booter.ForkedBooter.runSuitesInProcess(ForkedBooter.java:345)
	at org.apache.maven.surefire.booter.ForkedBooter.execute(ForkedBooter.java:126)
	at org.apache.maven.surefire.booter.ForkedBooter.main(ForkedBooter.java:418)
17:23:30.992 [main] ERROR Unexpected RDFParseException
org.eclipse.rdf4j.rio.RDFParseException: IRI included an unencoded space: '32' [line 1]
	at org.eclipse.rdf4j.rio.helpers.RDFParserHelper.reportError(RDFParserHelper.java:265)
	at org.eclipse.rdf4j.rio.helpers.AbstractRDFParser.reportError(AbstractRDFParser.java:628)
	at org.eclipse.rdf4j.rio.turtle.TurtleParser.reportError(TurtleParser.java:1297)
	at org.eclipse.rdf4j.rio.turtle.TurtleParser.parseURI(TurtleParser.java:902)
	at org.eclipse.rdf4j.rio.turtle.TurtleParser.parseValue(TurtleParser.java:575)
	at org.eclipse.rdf4j.rio.turtle.TurtleParser.parseSubject(TurtleParser.java:406)
	at org.eclipse.rdf4j.rio.turtle.TurtleParser.parseTriples(TurtleParser.java:347)
	at org.eclipse.rdf4j.rio.turtle.TurtleParser.parseStatement(TurtleParser.java:216)
	at org.eclipse.rdf4j.rio.turtle.TurtleParser.parse(TurtleParser.java:178)
	at org.eclipse.rdf4j.rio.turtle.TurtleParser.parse(TurtleParser.java:130)
	at org.eclipse.rdf4j.console.command.Verify.verify(Verify.java:145)
	at org.eclipse.rdf4j.console.command.Verify.execute(Verify.java:97)
	at org.eclipse.rdf4j.console.command.VerifyTest.testVerifySpaceIRI(VerifyTest.java:103)
	at sun.reflect.NativeMethodAccessorImpl.invoke0(Native Method)
	at sun.reflect.NativeMethodAccessorImpl.invoke(NativeMethodAccessorImpl.java:62)
	at sun.reflect.DelegatingMethodAccessorImpl.invoke(DelegatingMethodAccessorImpl.java:43)
	at java.lang.reflect.Method.invoke(Method.java:498)
	at org.junit.runners.model.FrameworkMethod$1.runReflectiveCall(FrameworkMethod.java:50)
	at org.junit.internal.runners.model.ReflectiveCallable.run(ReflectiveCallable.java:12)
	at org.junit.runners.model.FrameworkMethod.invokeExplosively(FrameworkMethod.java:47)
	at org.junit.internal.runners.statements.InvokeMethod.evaluate(InvokeMethod.java:17)
	at org.junit.internal.runners.statements.RunBefores.evaluate(RunBefores.java:26)
	at org.junit.internal.runners.statements.RunAfters.evaluate(RunAfters.java:27)
	at org.mockito.internal.junit.JUnitRule$1.evaluateSafely(JUnitRule.java:52)
	at org.mockito.internal.junit.JUnitRule$1.evaluate(JUnitRule.java:43)
	at org.junit.rules.ExternalResource$1.evaluate(ExternalResource.java:48)
	at org.junit.rules.RunRules.evaluate(RunRules.java:20)
	at org.junit.runners.ParentRunner.runLeaf(ParentRunner.java:325)
	at org.junit.runners.BlockJUnit4ClassRunner.runChild(BlockJUnit4ClassRunner.java:78)
	at org.junit.runners.BlockJUnit4ClassRunner.runChild(BlockJUnit4ClassRunner.java:57)
	at org.junit.runners.ParentRunner$3.run(ParentRunner.java:290)
	at org.junit.runners.ParentRunner$1.schedule(ParentRunner.java:71)
	at org.junit.runners.ParentRunner.runChildren(ParentRunner.java:288)
	at org.junit.runners.ParentRunner.access$000(ParentRunner.java:58)
	at org.junit.runners.ParentRunner$2.evaluate(ParentRunner.java:268)
	at org.junit.runners.ParentRunner.run(ParentRunner.java:363)
	at org.apache.maven.surefire.junit4.JUnit4Provider.execute(JUnit4Provider.java:365)
	at org.apache.maven.surefire.junit4.JUnit4Provider.executeWithRerun(JUnit4Provider.java:273)
	at org.apache.maven.surefire.junit4.JUnit4Provider.executeTestSet(JUnit4Provider.java:238)
	at org.apache.maven.surefire.junit4.JUnit4Provider.invoke(JUnit4Provider.java:159)
	at org.apache.maven.surefire.booter.ForkedBooter.invokeProviderInSameClassLoader(ForkedBooter.java:384)
	at org.apache.maven.surefire.booter.ForkedBooter.runSuitesInProcess(ForkedBooter.java:345)
	at org.apache.maven.surefire.booter.ForkedBooter.execute(ForkedBooter.java:126)
	at org.apache.maven.surefire.booter.ForkedBooter.main(ForkedBooter.java:418)
[INFO] Tests run: 10, Failures: 0, Errors: 0, Skipped: 0, Time elapsed: 0.419 s - in org.eclipse.rdf4j.console.command.VerifyTest
[INFO] Running org.eclipse.rdf4j.console.command.DropTest
[MockitoHint] DropTest.testUserAbortedUnsafeDropBeforeWarning (see javadoc for MockitoHint):
[MockitoHint] 1. Unused -> at org.eclipse.rdf4j.console.command.DropTest.setUp(DropTest.java:50)

[INFO] Tests run: 3, Failures: 0, Errors: 0, Skipped: 0, Time elapsed: 0.082 s - in org.eclipse.rdf4j.console.command.DropTest
[INFO] Running org.eclipse.rdf4j.console.command.FederateTest
17:23:31.116 [main] DEBUG Initializing MemoryStore...
17:23:31.117 [main] DEBUG Initializing data file...
17:23:31.118 [main] DEBUG Data file initialized
17:23:31.118 [main] DEBUG MemoryStore initialized
17:23:31.119 [main] DEBUG syncing data to file...
17:23:31.120 [main] DEBUG Data synced to file
17:23:31.123 [main] DEBUG Initializing MemoryStore...
17:23:31.124 [main] DEBUG Initializing data file...
17:23:31.124 [main] DEBUG Data file initialized
17:23:31.124 [main] DEBUG MemoryStore initialized
17:23:31.126 [main] DEBUG syncing data to file...
17:23:31.127 [main] DEBUG Data synced to file
17:23:31.140 [main] DEBUG Federate called with federation ID = fedID, and member ID's = [sparql][alien][http].
  Distinct set to false, and readonly set to true.

17:23:31.143 [main] DEBUG Federation repository root node: _:node1drh7br5ex216
17:23:31.145 [main] DEBUG _:node1drh7br5ex216 http://www.w3.org/1999/02/22-rdf-syntax-ns#type http://www.openrdf.org/config/repository#Repository
17:23:31.145 [main] DEBUG _:node1drh7br5ex216 http://www.openrdf.org/config/repository#repositoryID "fedID"
17:23:31.145 [main] DEBUG _:node1drh7br5ex216 http://www.w3.org/2000/01/rdf-schema#label "Test Federation Title"
17:23:31.145 [main] DEBUG _:node1drh7br5ex216 http://www.openrdf.org/config/repository#repositoryImpl _:node1drh7br5ex217
17:23:31.145 [main] DEBUG _:node1drh7br5ex217 http://www.openrdf.org/config/repository#repositoryType "openrdf:SailRepository"
17:23:31.145 [main] DEBUG _:node1drh7br5ex217 http://www.openrdf.org/config/repository/sail#sailImpl _:node1drh7br5ex218
17:23:31.145 [main] DEBUG _:node1drh7br5ex218 http://www.openrdf.org/config/sail#sailType "openrdf:Federation"
17:23:31.146 [main] DEBUG _:node1drh7br5ex218 http://www.openrdf.org/config/sail/federation#readOnly "true"^^<http://www.w3.org/2001/XMLSchema#boolean>
17:23:31.146 [main] DEBUG _:node1drh7br5ex218 http://www.openrdf.org/config/sail/federation#distinct "false"^^<http://www.w3.org/2001/XMLSchema#boolean>
17:23:31.146 [main] DEBUG Adding member: sparql
17:23:31.146 [main] DEBUG _:node1drh7br5ex218 http://www.openrdf.org/config/sail/federation#member _:node1drh7br5ex219
17:23:31.146 [main] DEBUG _:node1drh7br5ex219 http://www.openrdf.org/config/repository#repositoryType "openrdf:SPARQLRepository"
17:23:31.147 [main] DEBUG _:node1drh7br5ex219 http://www.openrdf.org/config/repository/sparql#query-endpoint http://localhost:8080/openrdf-sesame/repositories/sparql
17:23:31.147 [main] DEBUG Added member sparql: 
17:23:31.147 [main] DEBUG Adding member: alien
17:23:31.147 [main] DEBUG _:node1drh7br5ex218 http://www.openrdf.org/config/sail/federation#member _:node1drh7br5ex222
17:23:31.148 [main] DEBUG _:node1drh7br5ex222 http://www.openrdf.org/config/repository#repositoryType "openrdf:ProxyRepository"
17:23:31.148 [main] DEBUG _:node1drh7br5ex222 http://www.openrdf.org/config/repository/proxy#proxiedID "alien"
17:23:31.148 [main] DEBUG Added member alien: 
17:23:31.148 [main] DEBUG Adding member: http
17:23:31.148 [main] DEBUG _:node1drh7br5ex218 http://www.openrdf.org/config/sail/federation#member _:node1drh7br5ex225
17:23:31.153 [main] DEBUG _:node1drh7br5ex225 http://www.openrdf.org/config/repository#repositoryType "openrdf:HTTPRepository"
17:23:31.154 [main] DEBUG _:node1drh7br5ex225 http://www.openrdf.org/config/repository/http#repositoryURL http://localhost:8080/openrdf-sesame/repositories/http
17:23:31.154 [main] DEBUG Added member http: 
17:23:31.182 [main] DEBUG Initializing MemoryStore...
17:23:31.183 [main] DEBUG Initializing data file...
17:23:31.183 [main] DEBUG Data file initialized
17:23:31.183 [main] DEBUG MemoryStore initialized
17:23:31.185 [main] DEBUG syncing data to file...
17:23:31.186 [main] DEBUG Data synced to file
17:23:31.190 [main] DEBUG Initializing MemoryStore...
17:23:31.191 [main] DEBUG Initializing data file...
17:23:31.192 [main] DEBUG Data file initialized
17:23:31.192 [main] DEBUG MemoryStore initialized
17:23:31.194 [main] DEBUG syncing data to file...
17:23:31.194 [main] DEBUG Data synced to file
17:23:31.203 [main] ERROR Duplicate repository id's specified.
[MockitoHint] FederateTest.testDuplicateMembersPrintsError (see javadoc for MockitoHint):
[MockitoHint] 1. Unused -> at org.eclipse.rdf4j.console.command.FederateTest.setUp(FederateTest.java:87)
[MockitoHint] 2. Unused -> at org.eclipse.rdf4j.console.command.FederateTest.setUp(FederateTest.java:88)

17:23:31.210 [main] DEBUG Initializing MemoryStore...
17:23:31.211 [main] DEBUG Initializing data file...
17:23:31.211 [main] DEBUG Data file initialized
17:23:31.211 [main] DEBUG MemoryStore initialized
17:23:31.212 [main] DEBUG syncing data to file...
17:23:31.213 [main] DEBUG Data synced to file
17:23:31.216 [main] DEBUG Initializing MemoryStore...
17:23:31.216 [main] DEBUG Initializing data file...
17:23:31.217 [main] DEBUG Data file initialized
17:23:31.217 [main] DEBUG MemoryStore initialized
17:23:31.218 [main] DEBUG syncing data to file...
17:23:31.218 [main] DEBUG Data synced to file
17:23:31.227 [main] DEBUG Federate called with federation ID = alien, and member ID's = [fedID][scary].
  Distinct set to false, and readonly set to true.

17:23:31.228 [main] ERROR alien already exists.
[MockitoHint] FederateTest.testFedAlreadyExistsPrintsSpecificError (see javadoc for MockitoHint):
[MockitoHint] 1. Unused -> at org.eclipse.rdf4j.console.command.FederateTest.setUp(FederateTest.java:88)

17:23:31.235 [main] DEBUG Initializing MemoryStore...
17:23:31.236 [main] DEBUG Initializing data file...
17:23:31.236 [main] DEBUG Data file initialized
17:23:31.236 [main] DEBUG MemoryStore initialized
17:23:31.239 [main] DEBUG syncing data to file...
17:23:31.239 [main] DEBUG Data synced to file
17:23:31.243 [main] DEBUG Initializing MemoryStore...
17:23:31.243 [main] DEBUG Initializing data file...
17:23:31.243 [main] DEBUG Data file initialized
17:23:31.243 [main] DEBUG MemoryStore initialized
17:23:31.245 [main] DEBUG syncing data to file...
17:23:31.246 [main] DEBUG Data synced to file
17:23:31.255 [main] DEBUG Federate called with federation ID = fedID, and member ID's = [alien][scary].
  Distinct set to true, and readonly set to false.

17:23:31.256 [main] DEBUG Federation repository root node: _:node1drh7br5ex338
17:23:31.257 [main] DEBUG _:node1drh7br5ex338 http://www.w3.org/1999/02/22-rdf-syntax-ns#type http://www.openrdf.org/config/repository#Repository
17:23:31.257 [main] DEBUG _:node1drh7br5ex338 http://www.openrdf.org/config/repository#repositoryID "fedID"
17:23:31.257 [main] DEBUG _:node1drh7br5ex338 http://www.w3.org/2000/01/rdf-schema#label "Test Federation Title"
17:23:31.257 [main] DEBUG _:node1drh7br5ex338 http://www.openrdf.org/config/repository#repositoryImpl _:node1drh7br5ex339
17:23:31.257 [main] DEBUG _:node1drh7br5ex339 http://www.openrdf.org/config/repository#repositoryType "openrdf:SailRepository"
17:23:31.257 [main] DEBUG _:node1drh7br5ex339 http://www.openrdf.org/config/repository/sail#sailImpl _:node1drh7br5ex340
17:23:31.257 [main] DEBUG _:node1drh7br5ex340 http://www.openrdf.org/config/sail#sailType "openrdf:Federation"
17:23:31.257 [main] DEBUG _:node1drh7br5ex340 http://www.openrdf.org/config/sail/federation#readOnly "false"^^<http://www.w3.org/2001/XMLSchema#boolean>
17:23:31.257 [main] DEBUG _:node1drh7br5ex340 http://www.openrdf.org/config/sail/federation#distinct "true"^^<http://www.w3.org/2001/XMLSchema#boolean>
17:23:31.257 [main] DEBUG Adding member: alien
17:23:31.257 [main] DEBUG _:node1drh7br5ex340 http://www.openrdf.org/config/sail/federation#member _:node1drh7br5ex341
17:23:31.257 [main] DEBUG _:node1drh7br5ex341 http://www.openrdf.org/config/repository#repositoryType "openrdf:ProxyRepository"
17:23:31.257 [main] DEBUG _:node1drh7br5ex341 http://www.openrdf.org/config/repository/proxy#proxiedID "alien"
17:23:31.257 [main] DEBUG Added member alien: 
17:23:31.258 [main] DEBUG Adding member: scary
17:23:31.258 [main] DEBUG _:node1drh7br5ex340 http://www.openrdf.org/config/sail/federation#member _:node1drh7br5ex344
17:23:31.258 [main] DEBUG _:node1drh7br5ex344 http://www.openrdf.org/config/repository#repositoryType "openrdf:ProxyRepository"
17:23:31.258 [main] DEBUG _:node1drh7br5ex344 http://www.openrdf.org/config/repository/proxy#proxiedID "scary"
17:23:31.258 [main] DEBUG Added member scary: 
17:23:31.277 [main] DEBUG Initializing MemoryStore...
17:23:31.277 [main] DEBUG Initializing data file...
17:23:31.278 [main] DEBUG Data file initialized
17:23:31.278 [main] DEBUG MemoryStore initialized
17:23:31.279 [main] DEBUG syncing data to file...
17:23:31.279 [main] DEBUG Data synced to file
17:23:31.281 [main] DEBUG Initializing MemoryStore...
17:23:31.282 [main] DEBUG Initializing data file...
17:23:31.282 [main] DEBUG Data file initialized
17:23:31.282 [main] DEBUG MemoryStore initialized
17:23:31.283 [main] DEBUG syncing data to file...
17:23:31.284 [main] DEBUG Data synced to file
17:23:31.289 [main] DEBUG Federate called with federation ID = fedID, and member ID's = [sparql][sparql2].
  Distinct set to false, and readonly set to false.

17:23:31.291 [main] ERROR sparql is read-only.
17:23:31.292 [main] ERROR sparql2 is read-only.
[MockitoHint] FederateTest.testSparqlAndNotReadOnlyPrintsError (see javadoc for MockitoHint):
[MockitoHint] 1. Unused -> at org.eclipse.rdf4j.console.command.FederateTest.setUp(FederateTest.java:88)

17:23:31.301 [main] DEBUG Initializing MemoryStore...
17:23:31.302 [main] DEBUG Initializing data file...
17:23:31.303 [main] DEBUG Data file initialized
17:23:31.303 [main] DEBUG MemoryStore initialized
17:23:31.304 [main] DEBUG syncing data to file...
17:23:31.305 [main] DEBUG Data synced to file
17:23:31.308 [main] DEBUG Initializing MemoryStore...
17:23:31.309 [main] DEBUG Initializing data file...
17:23:31.309 [main] DEBUG Data file initialized
17:23:31.309 [main] DEBUG MemoryStore initialized
17:23:31.310 [main] DEBUG syncing data to file...
17:23:31.311 [main] DEBUG Data synced to file
[MockitoHint] FederateTest.testNoArgumentsPrintsHelp (see javadoc for MockitoHint):
[MockitoHint] 1. Unused -> at org.eclipse.rdf4j.console.command.FederateTest.setUp(FederateTest.java:87)
[MockitoHint] 2. Unused -> at org.eclipse.rdf4j.console.command.FederateTest.setUp(FederateTest.java:88)

17:23:31.329 [main] DEBUG Initializing MemoryStore...
17:23:31.330 [main] DEBUG Initializing data file...
17:23:31.331 [main] DEBUG Data file initialized
17:23:31.331 [main] DEBUG MemoryStore initialized
17:23:31.333 [main] DEBUG syncing data to file...
17:23:31.333 [main] DEBUG Data synced to file
17:23:31.336 [main] DEBUG Initializing MemoryStore...
17:23:31.337 [main] DEBUG Initializing data file...
17:23:31.337 [main] DEBUG Data file initialized
17:23:31.337 [main] DEBUG MemoryStore initialized
17:23:31.338 [main] DEBUG syncing data to file...
17:23:31.338 [main] DEBUG Data synced to file
17:23:31.344 [main] DEBUG Federate called with federation ID = type=memory, and member ID's = [fedID][alien][scary].
  Distinct set to false, and readonly set to true.

17:23:31.344 [main] ERROR fedID does not exist.
[MockitoHint] FederateTest.testInvalidArgumentPrintsError (see javadoc for MockitoHint):
[MockitoHint] 1. Unused -> at org.eclipse.rdf4j.console.command.FederateTest.setUp(FederateTest.java:88)

17:23:31.351 [main] DEBUG Initializing MemoryStore...
17:23:31.351 [main] DEBUG Initializing data file...
17:23:31.352 [main] DEBUG Data file initialized
17:23:31.352 [main] DEBUG MemoryStore initialized
17:23:31.353 [main] DEBUG syncing data to file...
17:23:31.354 [main] DEBUG Data synced to file
17:23:31.355 [main] DEBUG Initializing MemoryStore...
17:23:31.356 [main] DEBUG Initializing data file...
17:23:31.356 [main] DEBUG Data file initialized
17:23:31.356 [main] DEBUG MemoryStore initialized
17:23:31.358 [main] DEBUG syncing data to file...
17:23:31.358 [main] DEBUG Data synced to file
17:23:31.366 [main] DEBUG Federate called with federation ID = fedID, and member ID's = [sparql][sparql2].
  Distinct set to false, and readonly set to true.

17:23:31.367 [main] DEBUG Federation repository root node: _:node1drh7br5ex494
17:23:31.367 [main] DEBUG _:node1drh7br5ex494 http://www.w3.org/1999/02/22-rdf-syntax-ns#type http://www.openrdf.org/config/repository#Repository
17:23:31.367 [main] DEBUG _:node1drh7br5ex494 http://www.openrdf.org/config/repository#repositoryID "fedID"
17:23:31.367 [main] DEBUG _:node1drh7br5ex494 http://www.w3.org/2000/01/rdf-schema#label "Test Federation Title"
17:23:31.368 [main] DEBUG _:node1drh7br5ex494 http://www.openrdf.org/config/repository#repositoryImpl _:node1drh7br5ex495
17:23:31.368 [main] DEBUG _:node1drh7br5ex495 http://www.openrdf.org/config/repository#repositoryType "openrdf:SailRepository"
17:23:31.368 [main] DEBUG _:node1drh7br5ex495 http://www.openrdf.org/config/repository/sail#sailImpl _:node1drh7br5ex496
17:23:31.368 [main] DEBUG _:node1drh7br5ex496 http://www.openrdf.org/config/sail#sailType "openrdf:Federation"
17:23:31.368 [main] DEBUG _:node1drh7br5ex496 http://www.openrdf.org/config/sail/federation#readOnly "true"^^<http://www.w3.org/2001/XMLSchema#boolean>
17:23:31.368 [main] DEBUG _:node1drh7br5ex496 http://www.openrdf.org/config/sail/federation#distinct "false"^^<http://www.w3.org/2001/XMLSchema#boolean>
17:23:31.368 [main] DEBUG Adding member: sparql
17:23:31.368 [main] DEBUG _:node1drh7br5ex496 http://www.openrdf.org/config/sail/federation#member _:node1drh7br5ex497
17:23:31.368 [main] DEBUG _:node1drh7br5ex497 http://www.openrdf.org/config/repository#repositoryType "openrdf:SPARQLRepository"
17:23:31.369 [main] DEBUG _:node1drh7br5ex497 http://www.openrdf.org/config/repository/sparql#query-endpoint http://localhost:8080/openrdf-sesame/repositories/sparql
17:23:31.369 [main] DEBUG Added member sparql: 
17:23:31.369 [main] DEBUG Adding member: sparql2
17:23:31.369 [main] DEBUG _:node1drh7br5ex496 http://www.openrdf.org/config/sail/federation#member _:node1drh7br5ex500
17:23:31.369 [main] DEBUG _:node1drh7br5ex500 http://www.openrdf.org/config/repository#repositoryType "openrdf:SPARQLRepository"
17:23:31.369 [main] DEBUG _:node1drh7br5ex500 http://www.openrdf.org/config/repository/sparql#query-endpoint http://localhost:8080/openrdf-sesame/repositories/sparql
17:23:31.369 [main] DEBUG Added member sparql2: 
17:23:31.381 [main] DEBUG Initializing MemoryStore...
17:23:31.381 [main] DEBUG Initializing data file...
17:23:31.382 [main] DEBUG Data file initialized
17:23:31.382 [main] DEBUG MemoryStore initialized
17:23:31.383 [main] DEBUG syncing data to file...
17:23:31.384 [main] DEBUG Data synced to file
17:23:31.386 [main] DEBUG Initializing MemoryStore...
17:23:31.387 [main] DEBUG Initializing data file...
17:23:31.387 [main] DEBUG Data file initialized
17:23:31.387 [main] DEBUG MemoryStore initialized
17:23:31.389 [main] DEBUG syncing data to file...
17:23:31.389 [main] DEBUG Data synced to file
17:23:31.397 [main] DEBUG Federate called with federation ID = fedID, and member ID's = [http][sparql].
  Distinct set to false, and readonly set to true.

17:23:31.399 [main] DEBUG Federation repository root node: _:node1drh7br5ex549
17:23:31.399 [main] DEBUG _:node1drh7br5ex549 http://www.w3.org/1999/02/22-rdf-syntax-ns#type http://www.openrdf.org/config/repository#Repository
17:23:31.399 [main] DEBUG _:node1drh7br5ex549 http://www.openrdf.org/config/repository#repositoryID "fedID"
17:23:31.399 [main] DEBUG _:node1drh7br5ex549 http://www.w3.org/2000/01/rdf-schema#label "Test Federation Title"
17:23:31.399 [main] DEBUG _:node1drh7br5ex549 http://www.openrdf.org/config/repository#repositoryImpl _:node1drh7br5ex550
17:23:31.399 [main] DEBUG _:node1drh7br5ex550 http://www.openrdf.org/config/repository#repositoryType "openrdf:SailRepository"
17:23:31.399 [main] DEBUG _:node1drh7br5ex550 http://www.openrdf.org/config/repository/sail#sailImpl _:node1drh7br5ex551
17:23:31.399 [main] DEBUG _:node1drh7br5ex551 http://www.openrdf.org/config/sail#sailType "openrdf:Federation"
17:23:31.399 [main] DEBUG _:node1drh7br5ex551 http://www.openrdf.org/config/sail/federation#readOnly "true"^^<http://www.w3.org/2001/XMLSchema#boolean>
17:23:31.399 [main] DEBUG _:node1drh7br5ex551 http://www.openrdf.org/config/sail/federation#distinct "false"^^<http://www.w3.org/2001/XMLSchema#boolean>
17:23:31.399 [main] DEBUG Adding member: http
17:23:31.399 [main] DEBUG _:node1drh7br5ex551 http://www.openrdf.org/config/sail/federation#member _:node1drh7br5ex552
17:23:31.400 [main] DEBUG _:node1drh7br5ex552 http://www.openrdf.org/config/repository#repositoryType "openrdf:HTTPRepository"
17:23:31.400 [main] DEBUG _:node1drh7br5ex552 http://www.openrdf.org/config/repository/http#repositoryURL http://localhost:8080/openrdf-sesame/repositories/http
17:23:31.400 [main] DEBUG Added member http: 
17:23:31.400 [main] DEBUG Adding member: sparql
17:23:31.400 [main] DEBUG _:node1drh7br5ex551 http://www.openrdf.org/config/sail/federation#member _:node1drh7br5ex555
17:23:31.401 [main] DEBUG _:node1drh7br5ex555 http://www.openrdf.org/config/repository#repositoryType "openrdf:SPARQLRepository"
17:23:31.401 [main] DEBUG _:node1drh7br5ex555 http://www.openrdf.org/config/repository/sparql#query-endpoint http://localhost:8080/openrdf-sesame/repositories/sparql
17:23:31.401 [main] DEBUG Added member sparql: 
17:23:31.413 [main] DEBUG Initializing MemoryStore...
17:23:31.414 [main] DEBUG Initializing data file...
17:23:31.414 [main] DEBUG Data file initialized
17:23:31.414 [main] DEBUG MemoryStore initialized
17:23:31.416 [main] DEBUG syncing data to file...
17:23:31.416 [main] DEBUG Data synced to file
17:23:31.419 [main] DEBUG Initializing MemoryStore...
17:23:31.420 [main] DEBUG Initializing data file...
17:23:31.420 [main] DEBUG Data file initialized
17:23:31.420 [main] DEBUG MemoryStore initialized
17:23:31.421 [main] DEBUG syncing data to file...
17:23:31.422 [main] DEBUG Data synced to file
17:23:31.429 [main] DEBUG Federate called with federation ID = fedID, and member ID's = [alien][FreeLunch].
  Distinct set to false, and readonly set to true.

17:23:31.430 [main] ERROR FreeLunch does not exist.
[MockitoHint] FederateTest.testNonexistentMemberPrintsSpecificError (see javadoc for MockitoHint):
[MockitoHint] 1. Unused -> at org.eclipse.rdf4j.console.command.FederateTest.setUp(FederateTest.java:88)

17:23:31.437 [main] DEBUG Initializing MemoryStore...
17:23:31.437 [main] DEBUG Initializing data file...
17:23:31.438 [main] DEBUG Data file initialized
17:23:31.438 [main] DEBUG MemoryStore initialized
17:23:31.439 [main] DEBUG syncing data to file...
17:23:31.440 [main] DEBUG Data synced to file
17:23:31.443 [main] DEBUG Initializing MemoryStore...
17:23:31.444 [main] DEBUG Initializing data file...
17:23:31.444 [main] DEBUG Data file initialized
17:23:31.444 [main] DEBUG MemoryStore initialized
17:23:31.445 [main] DEBUG syncing data to file...
17:23:31.446 [main] DEBUG Data synced to file
17:23:31.452 [main] ERROR Duplicate repository id's specified.
[MockitoHint] FederateTest.testFedSameAsMemberPrintsError (see javadoc for MockitoHint):
[MockitoHint] 1. Unused -> at org.eclipse.rdf4j.console.command.FederateTest.setUp(FederateTest.java:87)
[MockitoHint] 2. Unused -> at org.eclipse.rdf4j.console.command.FederateTest.setUp(FederateTest.java:88)

17:23:31.459 [main] DEBUG Initializing MemoryStore...
17:23:31.459 [main] DEBUG Initializing data file...
17:23:31.460 [main] DEBUG Data file initialized
17:23:31.460 [main] DEBUG MemoryStore initialized
17:23:31.461 [main] DEBUG syncing data to file...
17:23:31.462 [main] DEBUG Data synced to file
17:23:31.464 [main] DEBUG Initializing MemoryStore...
17:23:31.465 [main] DEBUG Initializing data file...
17:23:31.465 [main] DEBUG Data file initialized
17:23:31.465 [main] DEBUG MemoryStore initialized
17:23:31.467 [main] DEBUG syncing data to file...
17:23:31.468 [main] DEBUG Data synced to file
[MockitoHint] FederateTest.testTwoArgumentsPrintsHelp (see javadoc for MockitoHint):
[MockitoHint] 1. Unused -> at org.eclipse.rdf4j.console.command.FederateTest.setUp(FederateTest.java:87)
[MockitoHint] 2. Unused -> at org.eclipse.rdf4j.console.command.FederateTest.setUp(FederateTest.java:88)

17:23:31.480 [main] DEBUG Initializing MemoryStore...
17:23:31.481 [main] DEBUG Initializing data file...
17:23:31.482 [main] DEBUG Data file initialized
17:23:31.482 [main] DEBUG MemoryStore initialized
17:23:31.483 [main] DEBUG syncing data to file...
17:23:31.484 [main] DEBUG Data synced to file
17:23:31.486 [main] DEBUG Initializing MemoryStore...
17:23:31.487 [main] DEBUG Initializing data file...
17:23:31.487 [main] DEBUG Data file initialized
17:23:31.487 [main] DEBUG MemoryStore initialized
17:23:31.488 [main] DEBUG syncing data to file...
17:23:31.489 [main] DEBUG Data synced to file
17:23:31.494 [main] DEBUG Federate called with federation ID = fedID, and member ID's = [alien][scary].
  Distinct set to false, and readonly set to true.

17:23:31.496 [main] DEBUG Federation repository root node: _:node1drh7br5ex692
17:23:31.496 [main] DEBUG _:node1drh7br5ex692 http://www.w3.org/1999/02/22-rdf-syntax-ns#type http://www.openrdf.org/config/repository#Repository
17:23:31.496 [main] DEBUG _:node1drh7br5ex692 http://www.openrdf.org/config/repository#repositoryID "fedID"
17:23:31.496 [main] DEBUG _:node1drh7br5ex692 http://www.w3.org/2000/01/rdf-schema#label "Test Federation Title"
17:23:31.496 [main] DEBUG _:node1drh7br5ex692 http://www.openrdf.org/config/repository#repositoryImpl _:node1drh7br5ex693
17:23:31.496 [main] DEBUG _:node1drh7br5ex693 http://www.openrdf.org/config/repository#repositoryType "openrdf:SailRepository"
17:23:31.496 [main] DEBUG _:node1drh7br5ex693 http://www.openrdf.org/config/repository/sail#sailImpl _:node1drh7br5ex694
17:23:31.496 [main] DEBUG _:node1drh7br5ex694 http://www.openrdf.org/config/sail#sailType "openrdf:Federation"
17:23:31.496 [main] DEBUG _:node1drh7br5ex694 http://www.openrdf.org/config/sail/federation#readOnly "true"^^<http://www.w3.org/2001/XMLSchema#boolean>
17:23:31.496 [main] DEBUG _:node1drh7br5ex694 http://www.openrdf.org/config/sail/federation#distinct "false"^^<http://www.w3.org/2001/XMLSchema#boolean>
17:23:31.496 [main] DEBUG Adding member: alien
17:23:31.496 [main] DEBUG _:node1drh7br5ex694 http://www.openrdf.org/config/sail/federation#member _:node1drh7br5ex695
17:23:31.497 [main] DEBUG _:node1drh7br5ex695 http://www.openrdf.org/config/repository#repositoryType "openrdf:ProxyRepository"
17:23:31.497 [main] DEBUG _:node1drh7br5ex695 http://www.openrdf.org/config/repository/proxy#proxiedID "alien"
17:23:31.497 [main] DEBUG Added member alien: 
17:23:31.497 [main] DEBUG Adding member: scary
17:23:31.497 [main] DEBUG _:node1drh7br5ex694 http://www.openrdf.org/config/sail/federation#member _:node1drh7br5ex698
17:23:31.497 [main] DEBUG _:node1drh7br5ex698 http://www.openrdf.org/config/repository#repositoryType "openrdf:ProxyRepository"
17:23:31.497 [main] DEBUG _:node1drh7br5ex698 http://www.openrdf.org/config/repository/proxy#proxiedID "scary"
17:23:31.497 [main] DEBUG Added member scary: 
17:23:31.512 [main] DEBUG Initializing MemoryStore...
17:23:31.513 [main] DEBUG Initializing data file...
17:23:31.513 [main] DEBUG Data file initialized
17:23:31.513 [main] DEBUG MemoryStore initialized
17:23:31.515 [main] DEBUG syncing data to file...
17:23:31.515 [main] DEBUG Data synced to file
17:23:31.518 [main] DEBUG Initializing MemoryStore...
17:23:31.518 [main] DEBUG Initializing data file...
17:23:31.519 [main] DEBUG Data file initialized
17:23:31.519 [main] DEBUG MemoryStore initialized
17:23:31.520 [main] DEBUG syncing data to file...
17:23:31.520 [main] DEBUG Data synced to file
[MockitoHint] FederateTest.testOneArgumentPrintsHelp (see javadoc for MockitoHint):
[MockitoHint] 1. Unused -> at org.eclipse.rdf4j.console.command.FederateTest.setUp(FederateTest.java:87)
[MockitoHint] 2. Unused -> at org.eclipse.rdf4j.console.command.FederateTest.setUp(FederateTest.java:88)

17:23:31.532 [main] DEBUG Initializing MemoryStore...
17:23:31.533 [main] DEBUG Initializing data file...
17:23:31.533 [main] DEBUG Data file initialized
17:23:31.533 [main] DEBUG MemoryStore initialized
17:23:31.534 [main] DEBUG syncing data to file...
17:23:31.535 [main] DEBUG Data synced to file
17:23:31.537 [main] DEBUG Initializing MemoryStore...
17:23:31.537 [main] DEBUG Initializing data file...
17:23:31.537 [main] DEBUG Data file initialized
17:23:31.537 [main] DEBUG MemoryStore initialized
17:23:31.538 [main] DEBUG syncing data to file...
17:23:31.538 [main] DEBUG Data synced to file
17:23:31.546 [main] DEBUG Federate called with federation ID = fedID, and member ID's = [http][http2].
  Distinct set to false, and readonly set to true.

17:23:31.547 [main] DEBUG Federation repository root node: _:node1drh7br5ex784
17:23:31.547 [main] DEBUG _:node1drh7br5ex784 http://www.w3.org/1999/02/22-rdf-syntax-ns#type http://www.openrdf.org/config/repository#Repository
17:23:31.547 [main] DEBUG _:node1drh7br5ex784 http://www.openrdf.org/config/repository#repositoryID "fedID"
17:23:31.547 [main] DEBUG _:node1drh7br5ex784 http://www.w3.org/2000/01/rdf-schema#label "Test Federation Title"
17:23:31.547 [main] DEBUG _:node1drh7br5ex784 http://www.openrdf.org/config/repository#repositoryImpl _:node1drh7br5ex785
17:23:31.547 [main] DEBUG _:node1drh7br5ex785 http://www.openrdf.org/config/repository#repositoryType "openrdf:SailRepository"
17:23:31.547 [main] DEBUG _:node1drh7br5ex785 http://www.openrdf.org/config/repository/sail#sailImpl _:node1drh7br5ex786
17:23:31.547 [main] DEBUG _:node1drh7br5ex786 http://www.openrdf.org/config/sail#sailType "openrdf:Federation"
17:23:31.547 [main] DEBUG _:node1drh7br5ex786 http://www.openrdf.org/config/sail/federation#readOnly "true"^^<http://www.w3.org/2001/XMLSchema#boolean>
17:23:31.547 [main] DEBUG _:node1drh7br5ex786 http://www.openrdf.org/config/sail/federation#distinct "false"^^<http://www.w3.org/2001/XMLSchema#boolean>
17:23:31.548 [main] DEBUG Adding member: http
17:23:31.548 [main] DEBUG _:node1drh7br5ex786 http://www.openrdf.org/config/sail/federation#member _:node1drh7br5ex787
17:23:31.548 [main] DEBUG _:node1drh7br5ex787 http://www.openrdf.org/config/repository#repositoryType "openrdf:HTTPRepository"
17:23:31.549 [main] DEBUG _:node1drh7br5ex787 http://www.openrdf.org/config/repository/http#repositoryURL http://localhost:8080/openrdf-sesame/repositories/http
17:23:31.549 [main] DEBUG Added member http: 
17:23:31.549 [main] DEBUG Adding member: http2
17:23:31.549 [main] DEBUG _:node1drh7br5ex786 http://www.openrdf.org/config/sail/federation#member _:node1drh7br5ex790
17:23:31.549 [main] DEBUG _:node1drh7br5ex790 http://www.openrdf.org/config/repository#repositoryType "openrdf:HTTPRepository"
17:23:31.549 [main] DEBUG _:node1drh7br5ex790 http://www.openrdf.org/config/repository/http#repositoryURL http://localhost:8080/openrdf-sesame/repositories/http
17:23:31.550 [main] DEBUG Added member http2: 
[INFO] Tests run: 15, Failures: 0, Errors: 0, Skipped: 0, Time elapsed: 0.446 s - in org.eclipse.rdf4j.console.command.FederateTest
[INFO] Running org.eclipse.rdf4j.console.command.SparqlTest
[MockitoHint] SparqlTest.testInputFile (see javadoc for MockitoHint):
[MockitoHint] 1. Unused -> at org.eclipse.rdf4j.console.command.SparqlTest.setUp(SparqlTest.java:49)

17:23:31.596 [main] ERROR No suitable result writer found
[MockitoHint] SparqlTest.testSelectError (see javadoc for MockitoHint):
[MockitoHint] 1. Unused -> at org.eclipse.rdf4j.console.command.SparqlTest.setUp(SparqlTest.java:49)

[MockitoHint] SparqlTest.testSelectMissingBindings (see javadoc for MockitoHint):
[MockitoHint] 1. Unused -> at org.eclipse.rdf4j.console.command.SparqlTest.setUp(SparqlTest.java:49)

[MockitoHint] SparqlTest.testInputFileWorkdir (see javadoc for MockitoHint):
[MockitoHint] 1. Unused -> at org.eclipse.rdf4j.console.command.SparqlTest.setUp(SparqlTest.java:49)

[INFO] Tests run: 9, Failures: 0, Errors: 0, Skipped: 0, Time elapsed: 0.138 s - in org.eclipse.rdf4j.console.command.SparqlTest
[INFO] Running org.eclipse.rdf4j.console.UtilTest
 one, two
 three
 four
 five, six
 seven
 eight
[INFO] Tests run: 4, Failures: 0, Errors: 0, Skipped: 0, Time elapsed: 0.001 s - in org.eclipse.rdf4j.console.UtilTest
[INFO] Running org.eclipse.rdf4j.console.ConsoleIOTest
[INFO] Tests run: 3, Failures: 0, Errors: 0, Skipped: 0, Time elapsed: 0.041 s - in org.eclipse.rdf4j.console.ConsoleIOTest
[INFO] 
[INFO] Results:
[INFO] 
[INFO] Tests run: 64, Failures: 0, Errors: 0, Skipped: 0
[INFO] 
[JENKINS] Recording test results
[INFO] 
[INFO] --- animal-sniffer-maven-plugin:1.16:check (default) @ rdf4j-console ---
[INFO] Checking unresolved references to org.codehaus.mojo.signature:java18:1.0
[INFO] 
[INFO] --- maven-jar-plugin:2.3.1:jar (default-jar) @ rdf4j-console ---
[INFO] Building jar: /home/hudson/genie.rdf4j/.jenkins/jobs/rdf4j-pr-verify/workspace/tools/console/target/rdf4j-console-3.1.0-SNAPSHOT.jar