SuccessConsole Output

Started calculate disk usage of build
Finished Calculation of disk usage of build in 0 seconds
Started calculate disk usage of workspace
Finished Calculation of disk usage of workspace in 0 seconds
[INFO] 
[INFO] ------------------< org.eclipse.rdf4j:rdf4j-console >-------------------
[INFO] Building RDF4J: Console 3.1.0-SNAPSHOT                           [70/85]
[INFO] --------------------------------[ jar ]---------------------------------
[INFO] 
[INFO] --- buildnumber-maven-plugin:1.4:create (default) @ rdf4j-console ---
[INFO] ShortRevision tag detected. The value is '7'.
[INFO] Executing: /bin/sh -c cd '/home/hudson/genie.rdf4j/.jenkins/jobs/rdf4j-pr-verify/workspace/tools/console' && 'git' 'rev-parse' '--verify' '--short=7' 'HEAD'
[INFO] Working directory: /home/hudson/genie.rdf4j/.jenkins/jobs/rdf4j-pr-verify/workspace/tools/console
[INFO] Storing buildNumber: 6e2f176 at timestamp: 1575754116889
[WARNING] Cannot get the branch information from the git repository: 
Detecting the current branch failed: fatal: ref HEAD is not a symbolic ref

[INFO] ShortRevision tag detected. The value is '7'.
[INFO] Executing: /bin/sh -c cd '/home/hudson/genie.rdf4j/.jenkins/jobs/rdf4j-pr-verify/workspace/tools/console' && 'git' 'rev-parse' '--verify' '--short=7' 'HEAD'
[INFO] Working directory: /home/hudson/genie.rdf4j/.jenkins/jobs/rdf4j-pr-verify/workspace/tools/console
[INFO] Storing buildScmBranch: UNKNOWN
[INFO] 
[INFO] --- maven-enforcer-plugin:1.4.1:enforce (enforce-bytecode-version) @ rdf4j-console ---
[INFO] Adding ignore: META-INF/**/module-info
[INFO] 
[INFO] --- formatter-maven-plugin:2.8.1:validate (default) @ rdf4j-console ---
[INFO] Using 'UTF-8' encoding to format source files.
[INFO] Number of files to be formatted: 61
[INFO] Html formatting is skipped
[INFO] Successfully formatted:          0 file(s)
[INFO] Fail to format:                  0 file(s)
[INFO] Skipped:                         61 file(s)
[INFO] Read only skipped:               0 file(s)
[INFO] Approximate time taken:          0s
[INFO] 
[INFO] --- maven-resources-plugin:3.0.2:resources (default-resources) @ rdf4j-console ---
[INFO] Using 'UTF-8' encoding to copy filtered resources.
[INFO] skip non existing resourceDirectory /home/hudson/genie.rdf4j/.jenkins/jobs/rdf4j-pr-verify/workspace/tools/console/src/main/resources
[INFO] 
[INFO] --- maven-compiler-plugin:3.7.0:compile (default-compile) @ rdf4j-console ---
[INFO] Changes detected - recompiling the module!
[INFO] Compiling 42 source files to /home/hudson/genie.rdf4j/.jenkins/jobs/rdf4j-pr-verify/workspace/tools/console/target/classes
[INFO] 
[INFO] --- maven-resources-plugin:3.0.2:testResources (default-testResources) @ rdf4j-console ---
[INFO] Using 'UTF-8' encoding to copy filtered resources.
[INFO] Copying 29 resources
[INFO] 
[INFO] --- maven-compiler-plugin:3.7.0:testCompile (default-testCompile) @ rdf4j-console ---
[INFO] Changes detected - recompiling the module!
[INFO] Compiling 18 source files to /home/hudson/genie.rdf4j/.jenkins/jobs/rdf4j-pr-verify/workspace/tools/console/target/test-classes
[INFO] 
[INFO] --- maven-surefire-plugin:2.22.2:test (default-test) @ rdf4j-console ---
[INFO] 
[INFO] -------------------------------------------------------
[INFO]  T E S T S
[INFO] -------------------------------------------------------
[INFO] Running org.eclipse.rdf4j.console.setting.PrefixesTest
[INFO] Tests run: 3, Failures: 0, Errors: 0, Skipped: 0, Time elapsed: 0.67 s - in org.eclipse.rdf4j.console.setting.PrefixesTest
[INFO] Running org.eclipse.rdf4j.console.setting.LogLevelTest
16:28:41.810 [main] ERROR unknown logging level: chatty
[INFO] Tests run: 4, Failures: 0, Errors: 0, Skipped: 0, Time elapsed: 0.018 s - in org.eclipse.rdf4j.console.setting.LogLevelTest
[INFO] Running org.eclipse.rdf4j.console.setting.QueryPrefixTest
[INFO] Tests run: 1, Failures: 0, Errors: 0, Skipped: 0, Time elapsed: 0 s - in org.eclipse.rdf4j.console.setting.QueryPrefixTest
[INFO] Running org.eclipse.rdf4j.console.setting.ShowPrefixTest
[INFO] Tests run: 1, Failures: 0, Errors: 0, Skipped: 0, Time elapsed: 0 s - in org.eclipse.rdf4j.console.setting.ShowPrefixTest
[INFO] Running org.eclipse.rdf4j.console.setting.ConsoleWidthTest
[INFO] Tests run: 1, Failures: 0, Errors: 0, Skipped: 0, Time elapsed: 0 s - in org.eclipse.rdf4j.console.setting.ConsoleWidthTest
[INFO] Running org.eclipse.rdf4j.console.command.SetParametersTest
16:28:41.845 [main] ERROR Unknown parameter: unknown
[INFO] Tests run: 1, Failures: 0, Errors: 0, Skipped: 0, Time elapsed: 0.017 s - in org.eclipse.rdf4j.console.command.SetParametersTest
[INFO] Running org.eclipse.rdf4j.console.command.LoadTest
[MockitoHint] LoadTest.testLoad (see javadoc for MockitoHint):
[MockitoHint] 1. Unused -> at org.eclipse.rdf4j.console.command.LoadTest.setUp(LoadTest.java:49)

[MockitoHint] LoadTest.testLoadWorkDir (see javadoc for MockitoHint):
[MockitoHint] 1. Unused -> at org.eclipse.rdf4j.console.command.LoadTest.setUp(LoadTest.java:49)

[INFO] Tests run: 2, Failures: 0, Errors: 0, Skipped: 0, Time elapsed: 0.173 s - in org.eclipse.rdf4j.console.command.LoadTest
[INFO] Running org.eclipse.rdf4j.console.command.ConvertTest
16:28:42.260 [main] ERROR No RDF writer for /tmp/genie.rdf4j/junit7307281412765187535/alien.qyx
[MockitoHint] ConvertTest.testConvertInvalidFormat (see javadoc for MockitoHint):
[MockitoHint] 1. Unused -> at org.eclipse.rdf4j.console.command.ConvertTest.setup(ConvertTest.java:39)

16:28:42.268 [main] ERROR Failed to convert data
org.eclipse.rdf4j.rio.RDFParseException: Expected '<' or '_', found: e [line 1, column 101]
	at org.eclipse.rdf4j.rio.ntriples.NTriplesParser.parseSubject(NTriplesParser.java:313)
	at org.eclipse.rdf4j.rio.ntriples.NTriplesParser.parseTriple(NTriplesParser.java:252)
	at org.eclipse.rdf4j.rio.ntriples.NTriplesParser.parse(NTriplesParser.java:160)
	at org.eclipse.rdf4j.rio.ntriples.NTriplesParser.parse(NTriplesParser.java:109)
	at org.eclipse.rdf4j.console.command.Convert.convert(Convert.java:139)
	at org.eclipse.rdf4j.console.command.Convert.execute(Convert.java:74)
	at org.eclipse.rdf4j.console.command.ConvertTest.testConvertParseError(ConvertTest.java:92)
	at sun.reflect.NativeMethodAccessorImpl.invoke0(Native Method)
	at sun.reflect.NativeMethodAccessorImpl.invoke(NativeMethodAccessorImpl.java:62)
	at sun.reflect.DelegatingMethodAccessorImpl.invoke(DelegatingMethodAccessorImpl.java:43)
	at java.lang.reflect.Method.invoke(Method.java:498)
	at org.junit.runners.model.FrameworkMethod$1.runReflectiveCall(FrameworkMethod.java:50)
	at org.junit.internal.runners.model.ReflectiveCallable.run(ReflectiveCallable.java:12)
	at org.junit.runners.model.FrameworkMethod.invokeExplosively(FrameworkMethod.java:47)
	at org.junit.internal.runners.statements.InvokeMethod.evaluate(InvokeMethod.java:17)
	at org.junit.internal.runners.statements.RunBefores.evaluate(RunBefores.java:26)
	at org.junit.internal.runners.statements.RunAfters.evaluate(RunAfters.java:27)
	at org.mockito.internal.junit.JUnitRule$1.evaluateSafely(JUnitRule.java:52)
	at org.mockito.internal.junit.JUnitRule$1.evaluate(JUnitRule.java:43)
	at org.junit.rules.ExternalResource$1.evaluate(ExternalResource.java:48)
	at org.junit.rules.RunRules.evaluate(RunRules.java:20)
	at org.junit.runners.ParentRunner.runLeaf(ParentRunner.java:325)
	at org.junit.runners.BlockJUnit4ClassRunner.runChild(BlockJUnit4ClassRunner.java:78)
	at org.junit.runners.BlockJUnit4ClassRunner.runChild(BlockJUnit4ClassRunner.java:57)
	at org.junit.runners.ParentRunner$3.run(ParentRunner.java:290)
	at org.junit.runners.ParentRunner$1.schedule(ParentRunner.java:71)
	at org.junit.runners.ParentRunner.runChildren(ParentRunner.java:288)
	at org.junit.runners.ParentRunner.access$000(ParentRunner.java:58)
	at org.junit.runners.ParentRunner$2.evaluate(ParentRunner.java:268)
	at org.junit.runners.ParentRunner.run(ParentRunner.java:363)
	at org.apache.maven.surefire.junit4.JUnit4Provider.execute(JUnit4Provider.java:365)
	at org.apache.maven.surefire.junit4.JUnit4Provider.executeWithRerun(JUnit4Provider.java:273)
	at org.apache.maven.surefire.junit4.JUnit4Provider.executeTestSet(JUnit4Provider.java:238)
	at org.apache.maven.surefire.junit4.JUnit4Provider.invoke(JUnit4Provider.java:159)
	at org.apache.maven.surefire.booter.ForkedBooter.invokeProviderInSameClassLoader(ForkedBooter.java:384)
	at org.apache.maven.surefire.booter.ForkedBooter.runSuitesInProcess(ForkedBooter.java:345)
	at org.apache.maven.surefire.booter.ForkedBooter.execute(ForkedBooter.java:126)
	at org.apache.maven.surefire.booter.ForkedBooter.main(ForkedBooter.java:418)
[INFO] Tests run: 4, Failures: 0, Errors: 0, Skipped: 0, Time elapsed: 0.24 s - in org.eclipse.rdf4j.console.command.ConvertTest
[INFO] Running org.eclipse.rdf4j.console.command.ExportTest
[MockitoHint] ExportTest.testExportWorkDir (see javadoc for MockitoHint):
[MockitoHint] 1. Unused -> at org.eclipse.rdf4j.console.command.ExportTest.setUp(ExportTest.java:46)

[MockitoHint] ExportTest.testExportAll (see javadoc for MockitoHint):
[MockitoHint] 1. Unused -> at org.eclipse.rdf4j.console.command.ExportTest.setUp(ExportTest.java:46)

[MockitoHint] ExportTest.testExportContexts (see javadoc for MockitoHint):
[MockitoHint] 1. Unused -> at org.eclipse.rdf4j.console.command.ExportTest.setUp(ExportTest.java:46)

[INFO] Tests run: 3, Failures: 0, Errors: 0, Skipped: 0, Time elapsed: 0.058 s - in org.eclipse.rdf4j.console.command.ExportTest
[INFO] Running org.eclipse.rdf4j.console.command.VerifyTest
16:28:42.639 [main] ERROR Unexpected RDFParseException
org.eclipse.rdf4j.rio.RDFParseException: 'missing type' was not recognised, and could not be verified, with datatype http://example.rdf4j.org/type/wrong [line 1]
	at org.eclipse.rdf4j.rio.helpers.RDFParserHelper.reportError(RDFParserHelper.java:265)
	at org.eclipse.rdf4j.rio.helpers.RDFParserHelper.createLiteral(RDFParserHelper.java:180)
	at org.eclipse.rdf4j.rio.helpers.AbstractRDFParser.createLiteral(AbstractRDFParser.java:530)
	at org.eclipse.rdf4j.rio.turtle.TurtleParser.parseQuotedLiteral(TurtleParser.java:665)
	at org.eclipse.rdf4j.rio.turtle.TurtleParser.parseValue(TurtleParser.java:584)
	at org.eclipse.rdf4j.rio.turtle.TurtleParser.parseObject(TurtleParser.java:461)
	at org.eclipse.rdf4j.rio.turtle.TurtleParser.parseObjectList(TurtleParser.java:389)
	at org.eclipse.rdf4j.rio.turtle.TurtleParser.parsePredicateObjectList(TurtleParser.java:362)
	at org.eclipse.rdf4j.rio.turtle.TurtleParser.parseTriples(TurtleParser.java:349)
	at org.eclipse.rdf4j.rio.turtle.TurtleParser.parseStatement(TurtleParser.java:216)
	at org.eclipse.rdf4j.rio.turtle.TurtleParser.parse(TurtleParser.java:178)
	at org.eclipse.rdf4j.rio.turtle.TurtleParser.parse(TurtleParser.java:130)
	at org.eclipse.rdf4j.console.command.Verify.verify(Verify.java:145)
	at org.eclipse.rdf4j.console.command.Verify.execute(Verify.java:97)
	at org.eclipse.rdf4j.console.command.VerifyTest.testVerifyMissingType(VerifyTest.java:97)
	at sun.reflect.NativeMethodAccessorImpl.invoke0(Native Method)
	at sun.reflect.NativeMethodAccessorImpl.invoke(NativeMethodAccessorImpl.java:62)
	at sun.reflect.DelegatingMethodAccessorImpl.invoke(DelegatingMethodAccessorImpl.java:43)
	at java.lang.reflect.Method.invoke(Method.java:498)
	at org.junit.runners.model.FrameworkMethod$1.runReflectiveCall(FrameworkMethod.java:50)
	at org.junit.internal.runners.model.ReflectiveCallable.run(ReflectiveCallable.java:12)
	at org.junit.runners.model.FrameworkMethod.invokeExplosively(FrameworkMethod.java:47)
	at org.junit.internal.runners.statements.InvokeMethod.evaluate(InvokeMethod.java:17)
	at org.junit.internal.runners.statements.RunBefores.evaluate(RunBefores.java:26)
	at org.junit.internal.runners.statements.RunAfters.evaluate(RunAfters.java:27)
	at org.mockito.internal.junit.JUnitRule$1.evaluateSafely(JUnitRule.java:52)
	at org.mockito.internal.junit.JUnitRule$1.evaluate(JUnitRule.java:43)
	at org.junit.rules.ExternalResource$1.evaluate(ExternalResource.java:48)
	at org.junit.rules.RunRules.evaluate(RunRules.java:20)
	at org.junit.runners.ParentRunner.runLeaf(ParentRunner.java:325)
	at org.junit.runners.BlockJUnit4ClassRunner.runChild(BlockJUnit4ClassRunner.java:78)
	at org.junit.runners.BlockJUnit4ClassRunner.runChild(BlockJUnit4ClassRunner.java:57)
	at org.junit.runners.ParentRunner$3.run(ParentRunner.java:290)
	at org.junit.runners.ParentRunner$1.schedule(ParentRunner.java:71)
	at org.junit.runners.ParentRunner.runChildren(ParentRunner.java:288)
	at org.junit.runners.ParentRunner.access$000(ParentRunner.java:58)
	at org.junit.runners.ParentRunner$2.evaluate(ParentRunner.java:268)
	at org.junit.runners.ParentRunner.run(ParentRunner.java:363)
	at org.apache.maven.surefire.junit4.JUnit4Provider.execute(JUnit4Provider.java:365)
	at org.apache.maven.surefire.junit4.JUnit4Provider.executeWithRerun(JUnit4Provider.java:273)
	at org.apache.maven.surefire.junit4.JUnit4Provider.executeTestSet(JUnit4Provider.java:238)
	at org.apache.maven.surefire.junit4.JUnit4Provider.invoke(JUnit4Provider.java:159)
	at org.apache.maven.surefire.booter.ForkedBooter.invokeProviderInSameClassLoader(ForkedBooter.java:384)
	at org.apache.maven.surefire.booter.ForkedBooter.runSuitesInProcess(ForkedBooter.java:345)
	at org.apache.maven.surefire.booter.ForkedBooter.execute(ForkedBooter.java:126)
	at org.apache.maven.surefire.booter.ForkedBooter.main(ForkedBooter.java:418)
16:28:42.677 [main] ERROR SHACL validation failed, writing report to /tmp/genie.rdf4j/junit7342380760460538925/junit3839062149407424526.tmp
16:28:42.691 [main] ERROR Unexpected RDFParseException
org.eclipse.rdf4j.rio.RDFParseException: Unexpected end of file
	at org.eclipse.rdf4j.rio.turtle.TurtleParser.throwEOFException(TurtleParser.java:1317)
	at org.eclipse.rdf4j.rio.turtle.TurtleParser.parseValue(TurtleParser.java:589)
	at org.eclipse.rdf4j.rio.turtle.TurtleParser.parsePredicate(TurtleParser.java:434)
	at org.eclipse.rdf4j.rio.turtle.TurtleParser.parsePredicateObjectList(TurtleParser.java:358)
	at org.eclipse.rdf4j.rio.turtle.TurtleParser.parseTriples(TurtleParser.java:349)
	at org.eclipse.rdf4j.rio.turtle.TurtleParser.parseStatement(TurtleParser.java:216)
	at org.eclipse.rdf4j.rio.turtle.TurtleParser.parse(TurtleParser.java:178)
	at org.eclipse.rdf4j.rio.turtle.TurtleParser.parse(TurtleParser.java:130)
	at org.eclipse.rdf4j.console.command.Verify.verify(Verify.java:145)
	at org.eclipse.rdf4j.console.command.Verify.execute(Verify.java:97)
	at org.eclipse.rdf4j.console.command.VerifyTest.testVerifyBrokenFile(VerifyTest.java:91)
	at sun.reflect.NativeMethodAccessorImpl.invoke0(Native Method)
	at sun.reflect.NativeMethodAccessorImpl.invoke(NativeMethodAccessorImpl.java:62)
	at sun.reflect.DelegatingMethodAccessorImpl.invoke(DelegatingMethodAccessorImpl.java:43)
	at java.lang.reflect.Method.invoke(Method.java:498)
	at org.junit.runners.model.FrameworkMethod$1.runReflectiveCall(FrameworkMethod.java:50)
	at org.junit.internal.runners.model.ReflectiveCallable.run(ReflectiveCallable.java:12)
	at org.junit.runners.model.FrameworkMethod.invokeExplosively(FrameworkMethod.java:47)
	at org.junit.internal.runners.statements.InvokeMethod.evaluate(InvokeMethod.java:17)
	at org.junit.internal.runners.statements.RunBefores.evaluate(RunBefores.java:26)
	at org.junit.internal.runners.statements.RunAfters.evaluate(RunAfters.java:27)
	at org.mockito.internal.junit.JUnitRule$1.evaluateSafely(JUnitRule.java:52)
	at org.mockito.internal.junit.JUnitRule$1.evaluate(JUnitRule.java:43)
	at org.junit.rules.ExternalResource$1.evaluate(ExternalResource.java:48)
	at org.junit.rules.RunRules.evaluate(RunRules.java:20)
	at org.junit.runners.ParentRunner.runLeaf(ParentRunner.java:325)
	at org.junit.runners.BlockJUnit4ClassRunner.runChild(BlockJUnit4ClassRunner.java:78)
	at org.junit.runners.BlockJUnit4ClassRunner.runChild(BlockJUnit4ClassRunner.java:57)
	at org.junit.runners.ParentRunner$3.run(ParentRunner.java:290)
	at org.junit.runners.ParentRunner$1.schedule(ParentRunner.java:71)
	at org.junit.runners.ParentRunner.runChildren(ParentRunner.java:288)
	at org.junit.runners.ParentRunner.access$000(ParentRunner.java:58)
	at org.junit.runners.ParentRunner$2.evaluate(ParentRunner.java:268)
	at org.junit.runners.ParentRunner.run(ParentRunner.java:363)
	at org.apache.maven.surefire.junit4.JUnit4Provider.execute(JUnit4Provider.java:365)
	at org.apache.maven.surefire.junit4.JUnit4Provider.executeWithRerun(JUnit4Provider.java:273)
	at org.apache.maven.surefire.junit4.JUnit4Provider.executeTestSet(JUnit4Provider.java:238)
	at org.apache.maven.surefire.junit4.JUnit4Provider.invoke(JUnit4Provider.java:159)
	at org.apache.maven.surefire.booter.ForkedBooter.invokeProviderInSameClassLoader(ForkedBooter.java:384)
	at org.apache.maven.surefire.booter.ForkedBooter.runSuitesInProcess(ForkedBooter.java:345)
	at org.apache.maven.surefire.booter.ForkedBooter.execute(ForkedBooter.java:126)
	at org.apache.maven.surefire.booter.ForkedBooter.main(ForkedBooter.java:418)
16:28:42.702 [main] ERROR Unexpected RDFParseException
org.eclipse.rdf4j.rio.RDFParseException: Expected a letter, found '1' [line 1]
	at org.eclipse.rdf4j.rio.helpers.RDFParserHelper.reportError(RDFParserHelper.java:265)
	at org.eclipse.rdf4j.rio.helpers.AbstractRDFParser.reportError(AbstractRDFParser.java:628)
	at org.eclipse.rdf4j.rio.turtle.TurtleParser.reportError(TurtleParser.java:1297)
	at org.eclipse.rdf4j.rio.turtle.TurtleParser.parseQuotedLiteral(TurtleParser.java:619)
	at org.eclipse.rdf4j.rio.turtle.TurtleParser.parseValue(TurtleParser.java:584)
	at org.eclipse.rdf4j.rio.turtle.TurtleParser.parseObject(TurtleParser.java:461)
	at org.eclipse.rdf4j.rio.turtle.TurtleParser.parseObjectList(TurtleParser.java:389)
	at org.eclipse.rdf4j.rio.turtle.TurtleParser.parsePredicateObjectList(TurtleParser.java:362)
	at org.eclipse.rdf4j.rio.turtle.TurtleParser.parseTriples(TurtleParser.java:349)
	at org.eclipse.rdf4j.rio.turtle.TurtleParser.parseStatement(TurtleParser.java:216)
	at org.eclipse.rdf4j.rio.turtle.TurtleParser.parse(TurtleParser.java:178)
	at org.eclipse.rdf4j.rio.turtle.TurtleParser.parse(TurtleParser.java:130)
	at org.eclipse.rdf4j.console.command.Verify.verify(Verify.java:145)
	at org.eclipse.rdf4j.console.command.Verify.execute(Verify.java:97)
	at org.eclipse.rdf4j.console.command.VerifyTest.testVerifyWrongLang(VerifyTest.java:109)
	at sun.reflect.NativeMethodAccessorImpl.invoke0(Native Method)
	at sun.reflect.NativeMethodAccessorImpl.invoke(NativeMethodAccessorImpl.java:62)
	at sun.reflect.DelegatingMethodAccessorImpl.invoke(DelegatingMethodAccessorImpl.java:43)
	at java.lang.reflect.Method.invoke(Method.java:498)
	at org.junit.runners.model.FrameworkMethod$1.runReflectiveCall(FrameworkMethod.java:50)
	at org.junit.internal.runners.model.ReflectiveCallable.run(ReflectiveCallable.java:12)
	at org.junit.runners.model.FrameworkMethod.invokeExplosively(FrameworkMethod.java:47)
	at org.junit.internal.runners.statements.InvokeMethod.evaluate(InvokeMethod.java:17)
	at org.junit.internal.runners.statements.RunBefores.evaluate(RunBefores.java:26)
	at org.junit.internal.runners.statements.RunAfters.evaluate(RunAfters.java:27)
	at org.mockito.internal.junit.JUnitRule$1.evaluateSafely(JUnitRule.java:52)
	at org.mockito.internal.junit.JUnitRule$1.evaluate(JUnitRule.java:43)
	at org.junit.rules.ExternalResource$1.evaluate(ExternalResource.java:48)
	at org.junit.rules.RunRules.evaluate(RunRules.java:20)
	at org.junit.runners.ParentRunner.runLeaf(ParentRunner.java:325)
	at org.junit.runners.BlockJUnit4ClassRunner.runChild(BlockJUnit4ClassRunner.java:78)
	at org.junit.runners.BlockJUnit4ClassRunner.runChild(BlockJUnit4ClassRunner.java:57)
	at org.junit.runners.ParentRunner$3.run(ParentRunner.java:290)
	at org.junit.runners.ParentRunner$1.schedule(ParentRunner.java:71)
	at org.junit.runners.ParentRunner.runChildren(ParentRunner.java:288)
	at org.junit.runners.ParentRunner.access$000(ParentRunner.java:58)
	at org.junit.runners.ParentRunner$2.evaluate(ParentRunner.java:268)
	at org.junit.runners.ParentRunner.run(ParentRunner.java:363)
	at org.apache.maven.surefire.junit4.JUnit4Provider.execute(JUnit4Provider.java:365)
	at org.apache.maven.surefire.junit4.JUnit4Provider.executeWithRerun(JUnit4Provider.java:273)
	at org.apache.maven.surefire.junit4.JUnit4Provider.executeTestSet(JUnit4Provider.java:238)
	at org.apache.maven.surefire.junit4.JUnit4Provider.invoke(JUnit4Provider.java:159)
	at org.apache.maven.surefire.booter.ForkedBooter.invokeProviderInSameClassLoader(ForkedBooter.java:384)
	at org.apache.maven.surefire.booter.ForkedBooter.runSuitesInProcess(ForkedBooter.java:345)
	at org.apache.maven.surefire.booter.ForkedBooter.execute(ForkedBooter.java:126)
	at org.apache.maven.surefire.booter.ForkedBooter.main(ForkedBooter.java:418)
16:28:42.715 [main] ERROR No parser available for this RDF format
org.eclipse.rdf4j.rio.UnsupportedRDFormatException: Did not recognise RDF format string file:/home/hudson/genie.rdf4j/.jenkins/jobs/rdf4j-pr-verify/workspace/tools/console/does-not-exist.docx
	at org.eclipse.rdf4j.rio.Rio.lambda$unsupportedFormat$1(Rio.java:577)
	at java.util.Optional.orElseThrow(Optional.java:290)
	at org.eclipse.rdf4j.console.command.Verify.verify(Verify.java:124)
	at org.eclipse.rdf4j.console.command.Verify.execute(Verify.java:97)
	at org.eclipse.rdf4j.console.command.VerifyTest.testVerifyWrongFormat(VerifyTest.java:69)
	at sun.reflect.NativeMethodAccessorImpl.invoke0(Native Method)
	at sun.reflect.NativeMethodAccessorImpl.invoke(NativeMethodAccessorImpl.java:62)
	at sun.reflect.DelegatingMethodAccessorImpl.invoke(DelegatingMethodAccessorImpl.java:43)
	at java.lang.reflect.Method.invoke(Method.java:498)
	at org.junit.runners.model.FrameworkMethod$1.runReflectiveCall(FrameworkMethod.java:50)
	at org.junit.internal.runners.model.ReflectiveCallable.run(ReflectiveCallable.java:12)
	at org.junit.runners.model.FrameworkMethod.invokeExplosively(FrameworkMethod.java:47)
	at org.junit.internal.runners.statements.InvokeMethod.evaluate(InvokeMethod.java:17)
	at org.junit.internal.runners.statements.RunBefores.evaluate(RunBefores.java:26)
	at org.junit.internal.runners.statements.RunAfters.evaluate(RunAfters.java:27)
	at org.mockito.internal.junit.JUnitRule$1.evaluateSafely(JUnitRule.java:52)
	at org.mockito.internal.junit.JUnitRule$1.evaluate(JUnitRule.java:43)
	at org.junit.rules.ExternalResource$1.evaluate(ExternalResource.java:48)
	at org.junit.rules.RunRules.evaluate(RunRules.java:20)
	at org.junit.runners.ParentRunner.runLeaf(ParentRunner.java:325)
	at org.junit.runners.BlockJUnit4ClassRunner.runChild(BlockJUnit4ClassRunner.java:78)
	at org.junit.runners.BlockJUnit4ClassRunner.runChild(BlockJUnit4ClassRunner.java:57)
	at org.junit.runners.ParentRunner$3.run(ParentRunner.java:290)
	at org.junit.runners.ParentRunner$1.schedule(ParentRunner.java:71)
	at org.junit.runners.ParentRunner.runChildren(ParentRunner.java:288)
	at org.junit.runners.ParentRunner.access$000(ParentRunner.java:58)
	at org.junit.runners.ParentRunner$2.evaluate(ParentRunner.java:268)
	at org.junit.runners.ParentRunner.run(ParentRunner.java:363)
	at org.apache.maven.surefire.junit4.JUnit4Provider.execute(JUnit4Provider.java:365)
	at org.apache.maven.surefire.junit4.JUnit4Provider.executeWithRerun(JUnit4Provider.java:273)
	at org.apache.maven.surefire.junit4.JUnit4Provider.executeTestSet(JUnit4Provider.java:238)
	at org.apache.maven.surefire.junit4.JUnit4Provider.invoke(JUnit4Provider.java:159)
	at org.apache.maven.surefire.booter.ForkedBooter.invokeProviderInSameClassLoader(ForkedBooter.java:384)
	at org.apache.maven.surefire.booter.ForkedBooter.runSuitesInProcess(ForkedBooter.java:345)
	at org.apache.maven.surefire.booter.ForkedBooter.execute(ForkedBooter.java:126)
	at org.apache.maven.surefire.booter.ForkedBooter.main(ForkedBooter.java:418)
16:28:42.726 [main] ERROR Unexpected RDFParseException
org.eclipse.rdf4j.rio.RDFParseException: IRI included an unencoded space: '32' [line 1]
	at org.eclipse.rdf4j.rio.helpers.RDFParserHelper.reportError(RDFParserHelper.java:265)
	at org.eclipse.rdf4j.rio.helpers.AbstractRDFParser.reportError(AbstractRDFParser.java:628)
	at org.eclipse.rdf4j.rio.turtle.TurtleParser.reportError(TurtleParser.java:1297)
	at org.eclipse.rdf4j.rio.turtle.TurtleParser.parseURI(TurtleParser.java:902)
	at org.eclipse.rdf4j.rio.turtle.TurtleParser.parseValue(TurtleParser.java:575)
	at org.eclipse.rdf4j.rio.turtle.TurtleParser.parseSubject(TurtleParser.java:406)
	at org.eclipse.rdf4j.rio.turtle.TurtleParser.parseTriples(TurtleParser.java:347)
	at org.eclipse.rdf4j.rio.turtle.TurtleParser.parseStatement(TurtleParser.java:216)
	at org.eclipse.rdf4j.rio.turtle.TurtleParser.parse(TurtleParser.java:178)
	at org.eclipse.rdf4j.rio.turtle.TurtleParser.parse(TurtleParser.java:130)
	at org.eclipse.rdf4j.console.command.Verify.verify(Verify.java:145)
	at org.eclipse.rdf4j.console.command.Verify.execute(Verify.java:97)
	at org.eclipse.rdf4j.console.command.VerifyTest.testVerifySpaceIRI(VerifyTest.java:103)
	at sun.reflect.NativeMethodAccessorImpl.invoke0(Native Method)
	at sun.reflect.NativeMethodAccessorImpl.invoke(NativeMethodAccessorImpl.java:62)
	at sun.reflect.DelegatingMethodAccessorImpl.invoke(DelegatingMethodAccessorImpl.java:43)
	at java.lang.reflect.Method.invoke(Method.java:498)
	at org.junit.runners.model.FrameworkMethod$1.runReflectiveCall(FrameworkMethod.java:50)
	at org.junit.internal.runners.model.ReflectiveCallable.run(ReflectiveCallable.java:12)
	at org.junit.runners.model.FrameworkMethod.invokeExplosively(FrameworkMethod.java:47)
	at org.junit.internal.runners.statements.InvokeMethod.evaluate(InvokeMethod.java:17)
	at org.junit.internal.runners.statements.RunBefores.evaluate(RunBefores.java:26)
	at org.junit.internal.runners.statements.RunAfters.evaluate(RunAfters.java:27)
	at org.mockito.internal.junit.JUnitRule$1.evaluateSafely(JUnitRule.java:52)
	at org.mockito.internal.junit.JUnitRule$1.evaluate(JUnitRule.java:43)
	at org.junit.rules.ExternalResource$1.evaluate(ExternalResource.java:48)
	at org.junit.rules.RunRules.evaluate(RunRules.java:20)
	at org.junit.runners.ParentRunner.runLeaf(ParentRunner.java:325)
	at org.junit.runners.BlockJUnit4ClassRunner.runChild(BlockJUnit4ClassRunner.java:78)
	at org.junit.runners.BlockJUnit4ClassRunner.runChild(BlockJUnit4ClassRunner.java:57)
	at org.junit.runners.ParentRunner$3.run(ParentRunner.java:290)
	at org.junit.runners.ParentRunner$1.schedule(ParentRunner.java:71)
	at org.junit.runners.ParentRunner.runChildren(ParentRunner.java:288)
	at org.junit.runners.ParentRunner.access$000(ParentRunner.java:58)
	at org.junit.runners.ParentRunner$2.evaluate(ParentRunner.java:268)
	at org.junit.runners.ParentRunner.run(ParentRunner.java:363)
	at org.apache.maven.surefire.junit4.JUnit4Provider.execute(JUnit4Provider.java:365)
	at org.apache.maven.surefire.junit4.JUnit4Provider.executeWithRerun(JUnit4Provider.java:273)
	at org.apache.maven.surefire.junit4.JUnit4Provider.executeTestSet(JUnit4Provider.java:238)
	at org.apache.maven.surefire.junit4.JUnit4Provider.invoke(JUnit4Provider.java:159)
	at org.apache.maven.surefire.booter.ForkedBooter.invokeProviderInSameClassLoader(ForkedBooter.java:384)
	at org.apache.maven.surefire.booter.ForkedBooter.runSuitesInProcess(ForkedBooter.java:345)
	at org.apache.maven.surefire.booter.ForkedBooter.execute(ForkedBooter.java:126)
	at org.apache.maven.surefire.booter.ForkedBooter.main(ForkedBooter.java:418)
[INFO] Tests run: 10, Failures: 0, Errors: 0, Skipped: 0, Time elapsed: 0.412 s - in org.eclipse.rdf4j.console.command.VerifyTest
[INFO] Running org.eclipse.rdf4j.console.command.DropTest
[MockitoHint] DropTest.testUserAbortedUnsafeDropBeforeWarning (see javadoc for MockitoHint):
[MockitoHint] 1. Unused -> at org.eclipse.rdf4j.console.command.DropTest.setUp(DropTest.java:50)

[INFO] Tests run: 3, Failures: 0, Errors: 0, Skipped: 0, Time elapsed: 0.082 s - in org.eclipse.rdf4j.console.command.DropTest
[INFO] Running org.eclipse.rdf4j.console.command.FederateTest
16:28:42.849 [main] DEBUG Initializing MemoryStore...
16:28:42.853 [main] DEBUG Initializing data file...
16:28:42.853 [main] DEBUG Data file initialized
16:28:42.853 [main] DEBUG MemoryStore initialized
16:28:42.855 [main] DEBUG syncing data to file...
16:28:42.856 [main] DEBUG Data synced to file
16:28:42.859 [main] DEBUG Initializing MemoryStore...
16:28:42.860 [main] DEBUG Initializing data file...
16:28:42.860 [main] DEBUG Data file initialized
16:28:42.860 [main] DEBUG MemoryStore initialized
16:28:42.862 [main] DEBUG syncing data to file...
16:28:42.862 [main] DEBUG Data synced to file
16:28:42.875 [main] DEBUG Federate called with federation ID = fedID, and member ID's = [sparql][alien][http].
  Distinct set to false, and readonly set to true.

16:28:42.878 [main] DEBUG Federation repository root node: _:node1drh47fuix216
16:28:42.879 [main] DEBUG _:node1drh47fuix216 http://www.w3.org/1999/02/22-rdf-syntax-ns#type http://www.openrdf.org/config/repository#Repository
16:28:42.880 [main] DEBUG _:node1drh47fuix216 http://www.openrdf.org/config/repository#repositoryID "fedID"
16:28:42.880 [main] DEBUG _:node1drh47fuix216 http://www.w3.org/2000/01/rdf-schema#label "Test Federation Title"
16:28:42.880 [main] DEBUG _:node1drh47fuix216 http://www.openrdf.org/config/repository#repositoryImpl _:node1drh47fuix217
16:28:42.880 [main] DEBUG _:node1drh47fuix217 http://www.openrdf.org/config/repository#repositoryType "openrdf:SailRepository"
16:28:42.880 [main] DEBUG _:node1drh47fuix217 http://www.openrdf.org/config/repository/sail#sailImpl _:node1drh47fuix218
16:28:42.880 [main] DEBUG _:node1drh47fuix218 http://www.openrdf.org/config/sail#sailType "openrdf:Federation"
16:28:42.880 [main] DEBUG _:node1drh47fuix218 http://www.openrdf.org/config/sail/federation#readOnly "true"^^<http://www.w3.org/2001/XMLSchema#boolean>
16:28:42.880 [main] DEBUG _:node1drh47fuix218 http://www.openrdf.org/config/sail/federation#distinct "false"^^<http://www.w3.org/2001/XMLSchema#boolean>
16:28:42.881 [main] DEBUG Adding member: sparql
16:28:42.881 [main] DEBUG _:node1drh47fuix218 http://www.openrdf.org/config/sail/federation#member _:node1drh47fuix219
16:28:42.881 [main] DEBUG _:node1drh47fuix219 http://www.openrdf.org/config/repository#repositoryType "openrdf:SPARQLRepository"
16:28:42.882 [main] DEBUG _:node1drh47fuix219 http://www.openrdf.org/config/repository/sparql#query-endpoint http://localhost:8080/openrdf-sesame/repositories/sparql
16:28:42.882 [main] DEBUG Added member sparql: 
16:28:42.882 [main] DEBUG Adding member: alien
16:28:42.882 [main] DEBUG _:node1drh47fuix218 http://www.openrdf.org/config/sail/federation#member _:node1drh47fuix222
16:28:42.883 [main] DEBUG _:node1drh47fuix222 http://www.openrdf.org/config/repository#repositoryType "openrdf:ProxyRepository"
16:28:42.883 [main] DEBUG _:node1drh47fuix222 http://www.openrdf.org/config/repository/proxy#proxiedID "alien"
16:28:42.883 [main] DEBUG Added member alien: 
16:28:42.883 [main] DEBUG Adding member: http
16:28:42.883 [main] DEBUG _:node1drh47fuix218 http://www.openrdf.org/config/sail/federation#member _:node1drh47fuix225
16:28:42.884 [main] DEBUG _:node1drh47fuix225 http://www.openrdf.org/config/repository#repositoryType "openrdf:HTTPRepository"
16:28:42.885 [main] DEBUG _:node1drh47fuix225 http://www.openrdf.org/config/repository/http#repositoryURL http://localhost:8080/openrdf-sesame/repositories/http
16:28:42.885 [main] DEBUG Added member http: 
16:28:42.912 [main] DEBUG Initializing MemoryStore...
16:28:42.913 [main] DEBUG Initializing data file...
16:28:42.914 [main] DEBUG Data file initialized
16:28:42.914 [main] DEBUG MemoryStore initialized
16:28:42.915 [main] DEBUG syncing data to file...
16:28:42.916 [main] DEBUG Data synced to file
16:28:42.920 [main] DEBUG Initializing MemoryStore...
16:28:42.921 [main] DEBUG Initializing data file...
16:28:42.921 [main] DEBUG Data file initialized
16:28:42.921 [main] DEBUG MemoryStore initialized
16:28:42.923 [main] DEBUG syncing data to file...
16:28:42.923 [main] DEBUG Data synced to file
16:28:42.931 [main] ERROR Duplicate repository id's specified.
[MockitoHint] FederateTest.testDuplicateMembersPrintsError (see javadoc for MockitoHint):
[MockitoHint] 1. Unused -> at org.eclipse.rdf4j.console.command.FederateTest.setUp(FederateTest.java:87)
[MockitoHint] 2. Unused -> at org.eclipse.rdf4j.console.command.FederateTest.setUp(FederateTest.java:88)

16:28:42.938 [main] DEBUG Initializing MemoryStore...
16:28:42.939 [main] DEBUG Initializing data file...
16:28:42.939 [main] DEBUG Data file initialized
16:28:42.939 [main] DEBUG MemoryStore initialized
16:28:42.941 [main] DEBUG syncing data to file...
16:28:42.941 [main] DEBUG Data synced to file
16:28:42.944 [main] DEBUG Initializing MemoryStore...
16:28:42.945 [main] DEBUG Initializing data file...
16:28:42.945 [main] DEBUG Data file initialized
16:28:42.945 [main] DEBUG MemoryStore initialized
16:28:42.947 [main] DEBUG syncing data to file...
16:28:42.947 [main] DEBUG Data synced to file
16:28:42.957 [main] DEBUG Federate called with federation ID = alien, and member ID's = [fedID][scary].
  Distinct set to false, and readonly set to true.

16:28:42.958 [main] ERROR alien already exists.
[MockitoHint] FederateTest.testFedAlreadyExistsPrintsSpecificError (see javadoc for MockitoHint):
[MockitoHint] 1. Unused -> at org.eclipse.rdf4j.console.command.FederateTest.setUp(FederateTest.java:88)

16:28:42.967 [main] DEBUG Initializing MemoryStore...
16:28:42.967 [main] DEBUG Initializing data file...
16:28:42.968 [main] DEBUG Data file initialized
16:28:42.968 [main] DEBUG MemoryStore initialized
16:28:42.970 [main] DEBUG syncing data to file...
16:28:42.970 [main] DEBUG Data synced to file
16:28:42.974 [main] DEBUG Initializing MemoryStore...
16:28:42.975 [main] DEBUG Initializing data file...
16:28:42.975 [main] DEBUG Data file initialized
16:28:42.975 [main] DEBUG MemoryStore initialized
16:28:42.977 [main] DEBUG syncing data to file...
16:28:42.978 [main] DEBUG Data synced to file
16:28:42.988 [main] DEBUG Federate called with federation ID = fedID, and member ID's = [alien][scary].
  Distinct set to true, and readonly set to false.

16:28:42.990 [main] DEBUG Federation repository root node: _:node1drh47fuix338
16:28:42.990 [main] DEBUG _:node1drh47fuix338 http://www.w3.org/1999/02/22-rdf-syntax-ns#type http://www.openrdf.org/config/repository#Repository
16:28:42.990 [main] DEBUG _:node1drh47fuix338 http://www.openrdf.org/config/repository#repositoryID "fedID"
16:28:42.990 [main] DEBUG _:node1drh47fuix338 http://www.w3.org/2000/01/rdf-schema#label "Test Federation Title"
16:28:42.990 [main] DEBUG _:node1drh47fuix338 http://www.openrdf.org/config/repository#repositoryImpl _:node1drh47fuix339
16:28:42.990 [main] DEBUG _:node1drh47fuix339 http://www.openrdf.org/config/repository#repositoryType "openrdf:SailRepository"
16:28:42.990 [main] DEBUG _:node1drh47fuix339 http://www.openrdf.org/config/repository/sail#sailImpl _:node1drh47fuix340
16:28:42.991 [main] DEBUG _:node1drh47fuix340 http://www.openrdf.org/config/sail#sailType "openrdf:Federation"
16:28:42.991 [main] DEBUG _:node1drh47fuix340 http://www.openrdf.org/config/sail/federation#readOnly "false"^^<http://www.w3.org/2001/XMLSchema#boolean>
16:28:42.991 [main] DEBUG _:node1drh47fuix340 http://www.openrdf.org/config/sail/federation#distinct "true"^^<http://www.w3.org/2001/XMLSchema#boolean>
16:28:42.991 [main] DEBUG Adding member: alien
16:28:42.991 [main] DEBUG _:node1drh47fuix340 http://www.openrdf.org/config/sail/federation#member _:node1drh47fuix341
16:28:42.991 [main] DEBUG _:node1drh47fuix341 http://www.openrdf.org/config/repository#repositoryType "openrdf:ProxyRepository"
16:28:42.991 [main] DEBUG _:node1drh47fuix341 http://www.openrdf.org/config/repository/proxy#proxiedID "alien"
16:28:42.991 [main] DEBUG Added member alien: 
16:28:42.992 [main] DEBUG Adding member: scary
16:28:42.992 [main] DEBUG _:node1drh47fuix340 http://www.openrdf.org/config/sail/federation#member _:node1drh47fuix344
16:28:42.992 [main] DEBUG _:node1drh47fuix344 http://www.openrdf.org/config/repository#repositoryType "openrdf:ProxyRepository"
16:28:42.992 [main] DEBUG _:node1drh47fuix344 http://www.openrdf.org/config/repository/proxy#proxiedID "scary"
16:28:42.992 [main] DEBUG Added member scary: 
16:28:43.016 [main] DEBUG Initializing MemoryStore...
16:28:43.017 [main] DEBUG Initializing data file...
16:28:43.017 [main] DEBUG Data file initialized
16:28:43.017 [main] DEBUG MemoryStore initialized
16:28:43.018 [main] DEBUG syncing data to file...
16:28:43.019 [main] DEBUG Data synced to file
16:28:43.022 [main] DEBUG Initializing MemoryStore...
16:28:43.022 [main] DEBUG Initializing data file...
16:28:43.023 [main] DEBUG Data file initialized
16:28:43.023 [main] DEBUG MemoryStore initialized
16:28:43.024 [main] DEBUG syncing data to file...
16:28:43.025 [main] DEBUG Data synced to file
16:28:43.034 [main] DEBUG Federate called with federation ID = fedID, and member ID's = [sparql][sparql2].
  Distinct set to false, and readonly set to false.

16:28:43.036 [main] ERROR sparql is read-only.
16:28:43.038 [main] ERROR sparql2 is read-only.
[MockitoHint] FederateTest.testSparqlAndNotReadOnlyPrintsError (see javadoc for MockitoHint):
[MockitoHint] 1. Unused -> at org.eclipse.rdf4j.console.command.FederateTest.setUp(FederateTest.java:88)

16:28:43.049 [main] DEBUG Initializing MemoryStore...
16:28:43.050 [main] DEBUG Initializing data file...
16:28:43.050 [main] DEBUG Data file initialized
16:28:43.050 [main] DEBUG MemoryStore initialized
16:28:43.052 [main] DEBUG syncing data to file...
16:28:43.053 [main] DEBUG Data synced to file
16:28:43.056 [main] DEBUG Initializing MemoryStore...
16:28:43.057 [main] DEBUG Initializing data file...
16:28:43.057 [main] DEBUG Data file initialized
16:28:43.057 [main] DEBUG MemoryStore initialized
16:28:43.059 [main] DEBUG syncing data to file...
16:28:43.060 [main] DEBUG Data synced to file
[MockitoHint] FederateTest.testNoArgumentsPrintsHelp (see javadoc for MockitoHint):
[MockitoHint] 1. Unused -> at org.eclipse.rdf4j.console.command.FederateTest.setUp(FederateTest.java:87)
[MockitoHint] 2. Unused -> at org.eclipse.rdf4j.console.command.FederateTest.setUp(FederateTest.java:88)

16:28:43.082 [main] DEBUG Initializing MemoryStore...
16:28:43.082 [main] DEBUG Initializing data file...
16:28:43.083 [main] DEBUG Data file initialized
16:28:43.083 [main] DEBUG MemoryStore initialized
16:28:43.084 [main] DEBUG syncing data to file...
16:28:43.085 [main] DEBUG Data synced to file
16:28:43.087 [main] DEBUG Initializing MemoryStore...
16:28:43.088 [main] DEBUG Initializing data file...
16:28:43.088 [main] DEBUG Data file initialized
16:28:43.088 [main] DEBUG MemoryStore initialized
16:28:43.089 [main] DEBUG syncing data to file...
16:28:43.090 [main] DEBUG Data synced to file
16:28:43.096 [main] DEBUG Federate called with federation ID = type=memory, and member ID's = [fedID][alien][scary].
  Distinct set to false, and readonly set to true.

16:28:43.096 [main] ERROR fedID does not exist.
[MockitoHint] FederateTest.testInvalidArgumentPrintsError (see javadoc for MockitoHint):
[MockitoHint] 1. Unused -> at org.eclipse.rdf4j.console.command.FederateTest.setUp(FederateTest.java:88)

16:28:43.105 [main] DEBUG Initializing MemoryStore...
16:28:43.106 [main] DEBUG Initializing data file...
16:28:43.106 [main] DEBUG Data file initialized
16:28:43.106 [main] DEBUG MemoryStore initialized
16:28:43.108 [main] DEBUG syncing data to file...
16:28:43.108 [main] DEBUG Data synced to file
16:28:43.111 [main] DEBUG Initializing MemoryStore...
16:28:43.112 [main] DEBUG Initializing data file...
16:28:43.112 [main] DEBUG Data file initialized
16:28:43.112 [main] DEBUG MemoryStore initialized
16:28:43.114 [main] DEBUG syncing data to file...
16:28:43.115 [main] DEBUG Data synced to file
16:28:43.122 [main] DEBUG Federate called with federation ID = fedID, and member ID's = [sparql][sparql2].
  Distinct set to false, and readonly set to true.

16:28:43.123 [main] DEBUG Federation repository root node: _:node1drh47fuix494
16:28:43.123 [main] DEBUG _:node1drh47fuix494 http://www.w3.org/1999/02/22-rdf-syntax-ns#type http://www.openrdf.org/config/repository#Repository
16:28:43.123 [main] DEBUG _:node1drh47fuix494 http://www.openrdf.org/config/repository#repositoryID "fedID"
16:28:43.123 [main] DEBUG _:node1drh47fuix494 http://www.w3.org/2000/01/rdf-schema#label "Test Federation Title"
16:28:43.123 [main] DEBUG _:node1drh47fuix494 http://www.openrdf.org/config/repository#repositoryImpl _:node1drh47fuix495
16:28:43.123 [main] DEBUG _:node1drh47fuix495 http://www.openrdf.org/config/repository#repositoryType "openrdf:SailRepository"
16:28:43.123 [main] DEBUG _:node1drh47fuix495 http://www.openrdf.org/config/repository/sail#sailImpl _:node1drh47fuix496
16:28:43.123 [main] DEBUG _:node1drh47fuix496 http://www.openrdf.org/config/sail#sailType "openrdf:Federation"
16:28:43.123 [main] DEBUG _:node1drh47fuix496 http://www.openrdf.org/config/sail/federation#readOnly "true"^^<http://www.w3.org/2001/XMLSchema#boolean>
16:28:43.123 [main] DEBUG _:node1drh47fuix496 http://www.openrdf.org/config/sail/federation#distinct "false"^^<http://www.w3.org/2001/XMLSchema#boolean>
16:28:43.123 [main] DEBUG Adding member: sparql
16:28:43.123 [main] DEBUG _:node1drh47fuix496 http://www.openrdf.org/config/sail/federation#member _:node1drh47fuix497
16:28:43.124 [main] DEBUG _:node1drh47fuix497 http://www.openrdf.org/config/repository#repositoryType "openrdf:SPARQLRepository"
16:28:43.124 [main] DEBUG _:node1drh47fuix497 http://www.openrdf.org/config/repository/sparql#query-endpoint http://localhost:8080/openrdf-sesame/repositories/sparql
16:28:43.124 [main] DEBUG Added member sparql: 
16:28:43.124 [main] DEBUG Adding member: sparql2
16:28:43.124 [main] DEBUG _:node1drh47fuix496 http://www.openrdf.org/config/sail/federation#member _:node1drh47fuix500
16:28:43.125 [main] DEBUG _:node1drh47fuix500 http://www.openrdf.org/config/repository#repositoryType "openrdf:SPARQLRepository"
16:28:43.125 [main] DEBUG _:node1drh47fuix500 http://www.openrdf.org/config/repository/sparql#query-endpoint http://localhost:8080/openrdf-sesame/repositories/sparql
16:28:43.125 [main] DEBUG Added member sparql2: 
16:28:43.136 [main] DEBUG Initializing MemoryStore...
16:28:43.137 [main] DEBUG Initializing data file...
16:28:43.137 [main] DEBUG Data file initialized
16:28:43.137 [main] DEBUG MemoryStore initialized
16:28:43.139 [main] DEBUG syncing data to file...
16:28:43.139 [main] DEBUG Data synced to file
16:28:43.142 [main] DEBUG Initializing MemoryStore...
16:28:43.142 [main] DEBUG Initializing data file...
16:28:43.143 [main] DEBUG Data file initialized
16:28:43.143 [main] DEBUG MemoryStore initialized
16:28:43.144 [main] DEBUG syncing data to file...
16:28:43.144 [main] DEBUG Data synced to file
16:28:43.151 [main] DEBUG Federate called with federation ID = fedID, and member ID's = [http][sparql].
  Distinct set to false, and readonly set to true.

16:28:43.152 [main] DEBUG Federation repository root node: _:node1drh47fuix549
16:28:43.152 [main] DEBUG _:node1drh47fuix549 http://www.w3.org/1999/02/22-rdf-syntax-ns#type http://www.openrdf.org/config/repository#Repository
16:28:43.152 [main] DEBUG _:node1drh47fuix549 http://www.openrdf.org/config/repository#repositoryID "fedID"
16:28:43.152 [main] DEBUG _:node1drh47fuix549 http://www.w3.org/2000/01/rdf-schema#label "Test Federation Title"
16:28:43.152 [main] DEBUG _:node1drh47fuix549 http://www.openrdf.org/config/repository#repositoryImpl _:node1drh47fuix550
16:28:43.152 [main] DEBUG _:node1drh47fuix550 http://www.openrdf.org/config/repository#repositoryType "openrdf:SailRepository"
16:28:43.152 [main] DEBUG _:node1drh47fuix550 http://www.openrdf.org/config/repository/sail#sailImpl _:node1drh47fuix551
16:28:43.152 [main] DEBUG _:node1drh47fuix551 http://www.openrdf.org/config/sail#sailType "openrdf:Federation"
16:28:43.152 [main] DEBUG _:node1drh47fuix551 http://www.openrdf.org/config/sail/federation#readOnly "true"^^<http://www.w3.org/2001/XMLSchema#boolean>
16:28:43.152 [main] DEBUG _:node1drh47fuix551 http://www.openrdf.org/config/sail/federation#distinct "false"^^<http://www.w3.org/2001/XMLSchema#boolean>
16:28:43.152 [main] DEBUG Adding member: http
16:28:43.152 [main] DEBUG _:node1drh47fuix551 http://www.openrdf.org/config/sail/federation#member _:node1drh47fuix552
16:28:43.153 [main] DEBUG _:node1drh47fuix552 http://www.openrdf.org/config/repository#repositoryType "openrdf:HTTPRepository"
16:28:43.153 [main] DEBUG _:node1drh47fuix552 http://www.openrdf.org/config/repository/http#repositoryURL http://localhost:8080/openrdf-sesame/repositories/http
16:28:43.153 [main] DEBUG Added member http: 
16:28:43.153 [main] DEBUG Adding member: sparql
16:28:43.153 [main] DEBUG _:node1drh47fuix551 http://www.openrdf.org/config/sail/federation#member _:node1drh47fuix555
16:28:43.154 [main] DEBUG _:node1drh47fuix555 http://www.openrdf.org/config/repository#repositoryType "openrdf:SPARQLRepository"
16:28:43.154 [main] DEBUG _:node1drh47fuix555 http://www.openrdf.org/config/repository/sparql#query-endpoint http://localhost:8080/openrdf-sesame/repositories/sparql
16:28:43.154 [main] DEBUG Added member sparql: 
16:28:43.165 [main] DEBUG Initializing MemoryStore...
16:28:43.166 [main] DEBUG Initializing data file...
16:28:43.166 [main] DEBUG Data file initialized
16:28:43.166 [main] DEBUG MemoryStore initialized
16:28:43.168 [main] DEBUG syncing data to file...
16:28:43.169 [main] DEBUG Data synced to file
16:28:43.171 [main] DEBUG Initializing MemoryStore...
16:28:43.172 [main] DEBUG Initializing data file...
16:28:43.172 [main] DEBUG Data file initialized
16:28:43.172 [main] DEBUG MemoryStore initialized
16:28:43.173 [main] DEBUG syncing data to file...
16:28:43.174 [main] DEBUG Data synced to file
16:28:43.180 [main] DEBUG Federate called with federation ID = fedID, and member ID's = [alien][FreeLunch].
  Distinct set to false, and readonly set to true.

16:28:43.181 [main] ERROR FreeLunch does not exist.
[MockitoHint] FederateTest.testNonexistentMemberPrintsSpecificError (see javadoc for MockitoHint):
[MockitoHint] 1. Unused -> at org.eclipse.rdf4j.console.command.FederateTest.setUp(FederateTest.java:88)

16:28:43.188 [main] DEBUG Initializing MemoryStore...
16:28:43.188 [main] DEBUG Initializing data file...
16:28:43.189 [main] DEBUG Data file initialized
16:28:43.189 [main] DEBUG MemoryStore initialized
16:28:43.190 [main] DEBUG syncing data to file...
16:28:43.190 [main] DEBUG Data synced to file
16:28:43.193 [main] DEBUG Initializing MemoryStore...
16:28:43.194 [main] DEBUG Initializing data file...
16:28:43.194 [main] DEBUG Data file initialized
16:28:43.194 [main] DEBUG MemoryStore initialized
16:28:43.195 [main] DEBUG syncing data to file...
16:28:43.195 [main] DEBUG Data synced to file
16:28:43.201 [main] ERROR Duplicate repository id's specified.
[MockitoHint] FederateTest.testFedSameAsMemberPrintsError (see javadoc for MockitoHint):
[MockitoHint] 1. Unused -> at org.eclipse.rdf4j.console.command.FederateTest.setUp(FederateTest.java:87)
[MockitoHint] 2. Unused -> at org.eclipse.rdf4j.console.command.FederateTest.setUp(FederateTest.java:88)

16:28:43.208 [main] DEBUG Initializing MemoryStore...
16:28:43.209 [main] DEBUG Initializing data file...
16:28:43.209 [main] DEBUG Data file initialized
16:28:43.209 [main] DEBUG MemoryStore initialized
16:28:43.210 [main] DEBUG syncing data to file...
16:28:43.210 [main] DEBUG Data synced to file
16:28:43.213 [main] DEBUG Initializing MemoryStore...
16:28:43.214 [main] DEBUG Initializing data file...
16:28:43.214 [main] DEBUG Data file initialized
16:28:43.214 [main] DEBUG MemoryStore initialized
16:28:43.215 [main] DEBUG syncing data to file...
16:28:43.215 [main] DEBUG Data synced to file
[MockitoHint] FederateTest.testTwoArgumentsPrintsHelp (see javadoc for MockitoHint):
[MockitoHint] 1. Unused -> at org.eclipse.rdf4j.console.command.FederateTest.setUp(FederateTest.java:87)
[MockitoHint] 2. Unused -> at org.eclipse.rdf4j.console.command.FederateTest.setUp(FederateTest.java:88)

16:28:43.228 [main] DEBUG Initializing MemoryStore...
16:28:43.229 [main] DEBUG Initializing data file...
16:28:43.229 [main] DEBUG Data file initialized
16:28:43.229 [main] DEBUG MemoryStore initialized
16:28:43.230 [main] DEBUG syncing data to file...
16:28:43.231 [main] DEBUG Data synced to file
16:28:43.233 [main] DEBUG Initializing MemoryStore...
16:28:43.234 [main] DEBUG Initializing data file...
16:28:43.234 [main] DEBUG Data file initialized
16:28:43.234 [main] DEBUG MemoryStore initialized
16:28:43.236 [main] DEBUG syncing data to file...
16:28:43.236 [main] DEBUG Data synced to file
16:28:43.242 [main] DEBUG Federate called with federation ID = fedID, and member ID's = [alien][scary].
  Distinct set to false, and readonly set to true.

16:28:43.243 [main] DEBUG Federation repository root node: _:node1drh47fuix692
16:28:43.243 [main] DEBUG _:node1drh47fuix692 http://www.w3.org/1999/02/22-rdf-syntax-ns#type http://www.openrdf.org/config/repository#Repository
16:28:43.243 [main] DEBUG _:node1drh47fuix692 http://www.openrdf.org/config/repository#repositoryID "fedID"
16:28:43.243 [main] DEBUG _:node1drh47fuix692 http://www.w3.org/2000/01/rdf-schema#label "Test Federation Title"
16:28:43.243 [main] DEBUG _:node1drh47fuix692 http://www.openrdf.org/config/repository#repositoryImpl _:node1drh47fuix693
16:28:43.243 [main] DEBUG _:node1drh47fuix693 http://www.openrdf.org/config/repository#repositoryType "openrdf:SailRepository"
16:28:43.243 [main] DEBUG _:node1drh47fuix693 http://www.openrdf.org/config/repository/sail#sailImpl _:node1drh47fuix694
16:28:43.243 [main] DEBUG _:node1drh47fuix694 http://www.openrdf.org/config/sail#sailType "openrdf:Federation"
16:28:43.243 [main] DEBUG _:node1drh47fuix694 http://www.openrdf.org/config/sail/federation#readOnly "true"^^<http://www.w3.org/2001/XMLSchema#boolean>
16:28:43.243 [main] DEBUG _:node1drh47fuix694 http://www.openrdf.org/config/sail/federation#distinct "false"^^<http://www.w3.org/2001/XMLSchema#boolean>
16:28:43.243 [main] DEBUG Adding member: alien
16:28:43.243 [main] DEBUG _:node1drh47fuix694 http://www.openrdf.org/config/sail/federation#member _:node1drh47fuix695
16:28:43.244 [main] DEBUG _:node1drh47fuix695 http://www.openrdf.org/config/repository#repositoryType "openrdf:ProxyRepository"
16:28:43.244 [main] DEBUG _:node1drh47fuix695 http://www.openrdf.org/config/repository/proxy#proxiedID "alien"
16:28:43.244 [main] DEBUG Added member alien: 
16:28:43.244 [main] DEBUG Adding member: scary
16:28:43.244 [main] DEBUG _:node1drh47fuix694 http://www.openrdf.org/config/sail/federation#member _:node1drh47fuix698
16:28:43.244 [main] DEBUG _:node1drh47fuix698 http://www.openrdf.org/config/repository#repositoryType "openrdf:ProxyRepository"
16:28:43.244 [main] DEBUG _:node1drh47fuix698 http://www.openrdf.org/config/repository/proxy#proxiedID "scary"
16:28:43.244 [main] DEBUG Added member scary: 
16:28:43.259 [main] DEBUG Initializing MemoryStore...
16:28:43.260 [main] DEBUG Initializing data file...
16:28:43.260 [main] DEBUG Data file initialized
16:28:43.260 [main] DEBUG MemoryStore initialized
16:28:43.261 [main] DEBUG syncing data to file...
16:28:43.262 [main] DEBUG Data synced to file
16:28:43.264 [main] DEBUG Initializing MemoryStore...
16:28:43.265 [main] DEBUG Initializing data file...
16:28:43.265 [main] DEBUG Data file initialized
16:28:43.265 [main] DEBUG MemoryStore initialized
16:28:43.266 [main] DEBUG syncing data to file...
16:28:43.267 [main] DEBUG Data synced to file
[MockitoHint] FederateTest.testOneArgumentPrintsHelp (see javadoc for MockitoHint):
[MockitoHint] 1. Unused -> at org.eclipse.rdf4j.console.command.FederateTest.setUp(FederateTest.java:87)
[MockitoHint] 2. Unused -> at org.eclipse.rdf4j.console.command.FederateTest.setUp(FederateTest.java:88)

16:28:43.279 [main] DEBUG Initializing MemoryStore...
16:28:43.279 [main] DEBUG Initializing data file...
16:28:43.279 [main] DEBUG Data file initialized
16:28:43.279 [main] DEBUG MemoryStore initialized
16:28:43.281 [main] DEBUG syncing data to file...
16:28:43.281 [main] DEBUG Data synced to file
16:28:43.283 [main] DEBUG Initializing MemoryStore...
16:28:43.283 [main] DEBUG Initializing data file...
16:28:43.284 [main] DEBUG Data file initialized
16:28:43.284 [main] DEBUG MemoryStore initialized
16:28:43.284 [main] DEBUG syncing data to file...
16:28:43.285 [main] DEBUG Data synced to file
16:28:43.292 [main] DEBUG Federate called with federation ID = fedID, and member ID's = [http][http2].
  Distinct set to false, and readonly set to true.

16:28:43.293 [main] DEBUG Federation repository root node: _:node1drh47fuix784
16:28:43.293 [main] DEBUG _:node1drh47fuix784 http://www.w3.org/1999/02/22-rdf-syntax-ns#type http://www.openrdf.org/config/repository#Repository
16:28:43.293 [main] DEBUG _:node1drh47fuix784 http://www.openrdf.org/config/repository#repositoryID "fedID"
16:28:43.293 [main] DEBUG _:node1drh47fuix784 http://www.w3.org/2000/01/rdf-schema#label "Test Federation Title"
16:28:43.293 [main] DEBUG _:node1drh47fuix784 http://www.openrdf.org/config/repository#repositoryImpl _:node1drh47fuix785
16:28:43.293 [main] DEBUG _:node1drh47fuix785 http://www.openrdf.org/config/repository#repositoryType "openrdf:SailRepository"
16:28:43.293 [main] DEBUG _:node1drh47fuix785 http://www.openrdf.org/config/repository/sail#sailImpl _:node1drh47fuix786
16:28:43.293 [main] DEBUG _:node1drh47fuix786 http://www.openrdf.org/config/sail#sailType "openrdf:Federation"
16:28:43.293 [main] DEBUG _:node1drh47fuix786 http://www.openrdf.org/config/sail/federation#readOnly "true"^^<http://www.w3.org/2001/XMLSchema#boolean>
16:28:43.293 [main] DEBUG _:node1drh47fuix786 http://www.openrdf.org/config/sail/federation#distinct "false"^^<http://www.w3.org/2001/XMLSchema#boolean>
16:28:43.293 [main] DEBUG Adding member: http
16:28:43.293 [main] DEBUG _:node1drh47fuix786 http://www.openrdf.org/config/sail/federation#member _:node1drh47fuix787
16:28:43.293 [main] DEBUG _:node1drh47fuix787 http://www.openrdf.org/config/repository#repositoryType "openrdf:HTTPRepository"
16:28:43.294 [main] DEBUG _:node1drh47fuix787 http://www.openrdf.org/config/repository/http#repositoryURL http://localhost:8080/openrdf-sesame/repositories/http
16:28:43.294 [main] DEBUG Added member http: 
16:28:43.294 [main] DEBUG Adding member: http2
16:28:43.294 [main] DEBUG _:node1drh47fuix786 http://www.openrdf.org/config/sail/federation#member _:node1drh47fuix790
16:28:43.294 [main] DEBUG _:node1drh47fuix790 http://www.openrdf.org/config/repository#repositoryType "openrdf:HTTPRepository"
16:28:43.294 [main] DEBUG _:node1drh47fuix790 http://www.openrdf.org/config/repository/http#repositoryURL http://localhost:8080/openrdf-sesame/repositories/http
16:28:43.294 [main] DEBUG Added member http2: 
[INFO] Tests run: 15, Failures: 0, Errors: 0, Skipped: 0, Time elapsed: 0.457 s - in org.eclipse.rdf4j.console.command.FederateTest
[INFO] Running org.eclipse.rdf4j.console.command.SparqlTest
[MockitoHint] SparqlTest.testInputFile (see javadoc for MockitoHint):
[MockitoHint] 1. Unused -> at org.eclipse.rdf4j.console.command.SparqlTest.setUp(SparqlTest.java:49)

16:28:43.337 [main] ERROR No suitable result writer found
[MockitoHint] SparqlTest.testSelectError (see javadoc for MockitoHint):
[MockitoHint] 1. Unused -> at org.eclipse.rdf4j.console.command.SparqlTest.setUp(SparqlTest.java:49)

[MockitoHint] SparqlTest.testSelectMissingBindings (see javadoc for MockitoHint):
[MockitoHint] 1. Unused -> at org.eclipse.rdf4j.console.command.SparqlTest.setUp(SparqlTest.java:49)

[MockitoHint] SparqlTest.testInputFileWorkdir (see javadoc for MockitoHint):
[MockitoHint] 1. Unused -> at org.eclipse.rdf4j.console.command.SparqlTest.setUp(SparqlTest.java:49)

[INFO] Tests run: 9, Failures: 0, Errors: 0, Skipped: 0, Time elapsed: 0.127 s - in org.eclipse.rdf4j.console.command.SparqlTest
[INFO] Running org.eclipse.rdf4j.console.UtilTest
 one, two
 three
 four
 five, six
 seven
 eight
[INFO] Tests run: 4, Failures: 0, Errors: 0, Skipped: 0, Time elapsed: 0 s - in org.eclipse.rdf4j.console.UtilTest
[INFO] Running org.eclipse.rdf4j.console.ConsoleIOTest
[INFO] Tests run: 3, Failures: 0, Errors: 0, Skipped: 0, Time elapsed: 0.046 s - in org.eclipse.rdf4j.console.ConsoleIOTest
[INFO] 
[INFO] Results:
[INFO] 
[INFO] Tests run: 64, Failures: 0, Errors: 0, Skipped: 0
[INFO] 
[JENKINS] Recording test results
[INFO] 
[INFO] --- animal-sniffer-maven-plugin:1.16:check (default) @ rdf4j-console ---
[INFO] Checking unresolved references to org.codehaus.mojo.signature:java18:1.0
[INFO] 
[INFO] --- maven-jar-plugin:2.3.1:jar (default-jar) @ rdf4j-console ---
[INFO] Building jar: /home/hudson/genie.rdf4j/.jenkins/jobs/rdf4j-pr-verify/workspace/tools/console/target/rdf4j-console-3.1.0-SNAPSHOT.jar