SuccessConsole Output

Started calculate disk usage of build
Finished Calculation of disk usage of build in 0 seconds
Started calculate disk usage of workspace
Finished Calculation of disk usage of workspace in 0 seconds
[INFO] 
[INFO] ------------------< org.eclipse.rdf4j:rdf4j-console >-------------------
[INFO] Building RDF4J: Console 3.1.0-SNAPSHOT                            [3/10]
[INFO] --------------------------------[ jar ]---------------------------------
[INFO] 
[INFO] --- buildnumber-maven-plugin:1.4:create (default) @ rdf4j-console ---
[INFO] ShortRevision tag detected. The value is '7'.
[INFO] Executing: /bin/sh -c cd '/home/hudson/genie.rdf4j/.jenkins/jobs/rdf4j-pr-verify/workspace/tools/console' && 'git' 'rev-parse' '--verify' '--short=7' 'HEAD'
[INFO] Working directory: /home/hudson/genie.rdf4j/.jenkins/jobs/rdf4j-pr-verify/workspace/tools/console
[INFO] Storing buildNumber: 6e2f176 at timestamp: 1575751030028
[WARNING] Cannot get the branch information from the git repository: 
Detecting the current branch failed: fatal: ref HEAD is not a symbolic ref

[INFO] ShortRevision tag detected. The value is '7'.
[INFO] Executing: /bin/sh -c cd '/home/hudson/genie.rdf4j/.jenkins/jobs/rdf4j-pr-verify/workspace/tools/console' && 'git' 'rev-parse' '--verify' '--short=7' 'HEAD'
[INFO] Working directory: /home/hudson/genie.rdf4j/.jenkins/jobs/rdf4j-pr-verify/workspace/tools/console
[INFO] Storing buildScmBranch: UNKNOWN
[INFO] 
[INFO] --- maven-enforcer-plugin:1.4.1:enforce (enforce-bytecode-version) @ rdf4j-console ---
[INFO] Adding ignore: META-INF/**/module-info
[INFO] 
[INFO] --- formatter-maven-plugin:2.8.1:validate (default) @ rdf4j-console ---
[INFO] Using 'UTF-8' encoding to format source files.
[INFO] Number of files to be formatted: 61
[INFO] Html formatting is skipped
[INFO] Successfully formatted:          0 file(s)
[INFO] Fail to format:                  0 file(s)
[INFO] Skipped:                         61 file(s)
[INFO] Read only skipped:               0 file(s)
[INFO] Approximate time taken:          0s
[INFO] 
[INFO] --- maven-resources-plugin:3.0.2:resources (default-resources) @ rdf4j-console ---
[INFO] Using 'UTF-8' encoding to copy filtered resources.
[INFO] skip non existing resourceDirectory /home/hudson/genie.rdf4j/.jenkins/jobs/rdf4j-pr-verify/workspace/tools/console/src/main/resources
[INFO] 
[INFO] --- maven-compiler-plugin:3.7.0:compile (default-compile) @ rdf4j-console ---
[INFO] Changes detected - recompiling the module!
[INFO] Compiling 42 source files to /home/hudson/genie.rdf4j/.jenkins/jobs/rdf4j-pr-verify/workspace/tools/console/target/classes
[INFO] 
[INFO] --- maven-resources-plugin:3.0.2:testResources (default-testResources) @ rdf4j-console ---
[INFO] Using 'UTF-8' encoding to copy filtered resources.
[INFO] Copying 29 resources
[INFO] 
[INFO] --- maven-compiler-plugin:3.7.0:testCompile (default-testCompile) @ rdf4j-console ---
[INFO] Changes detected - recompiling the module!
[INFO] Compiling 18 source files to /home/hudson/genie.rdf4j/.jenkins/jobs/rdf4j-pr-verify/workspace/tools/console/target/test-classes
[INFO] 
[INFO] --- maven-surefire-plugin:2.22.2:test (default-test) @ rdf4j-console ---
[INFO] 
[INFO] -------------------------------------------------------
[INFO]  T E S T S
[INFO] -------------------------------------------------------
[INFO] Running org.eclipse.rdf4j.console.setting.PrefixesTest
[INFO] Tests run: 3, Failures: 0, Errors: 0, Skipped: 0, Time elapsed: 0.718 s - in org.eclipse.rdf4j.console.setting.PrefixesTest
[INFO] Running org.eclipse.rdf4j.console.setting.LogLevelTest
15:37:15.003 [main] ERROR unknown logging level: chatty
[INFO] Tests run: 4, Failures: 0, Errors: 0, Skipped: 0, Time elapsed: 0.019 s - in org.eclipse.rdf4j.console.setting.LogLevelTest
[INFO] Running org.eclipse.rdf4j.console.setting.QueryPrefixTest
[INFO] Tests run: 1, Failures: 0, Errors: 0, Skipped: 0, Time elapsed: 0 s - in org.eclipse.rdf4j.console.setting.QueryPrefixTest
[INFO] Running org.eclipse.rdf4j.console.setting.ShowPrefixTest
[INFO] Tests run: 1, Failures: 0, Errors: 0, Skipped: 0, Time elapsed: 0 s - in org.eclipse.rdf4j.console.setting.ShowPrefixTest
[INFO] Running org.eclipse.rdf4j.console.setting.ConsoleWidthTest
[INFO] Tests run: 1, Failures: 0, Errors: 0, Skipped: 0, Time elapsed: 0 s - in org.eclipse.rdf4j.console.setting.ConsoleWidthTest
[INFO] Running org.eclipse.rdf4j.console.command.SetParametersTest
15:37:15.046 [main] ERROR Unknown parameter: unknown
[INFO] Tests run: 1, Failures: 0, Errors: 0, Skipped: 0, Time elapsed: 0.019 s - in org.eclipse.rdf4j.console.command.SetParametersTest
[INFO] Running org.eclipse.rdf4j.console.command.LoadTest
[MockitoHint] LoadTest.testLoad (see javadoc for MockitoHint):
[MockitoHint] 1. Unused -> at org.eclipse.rdf4j.console.command.LoadTest.setUp(LoadTest.java:49)

[MockitoHint] LoadTest.testLoadWorkDir (see javadoc for MockitoHint):
[MockitoHint] 1. Unused -> at org.eclipse.rdf4j.console.command.LoadTest.setUp(LoadTest.java:49)

[INFO] Tests run: 2, Failures: 0, Errors: 0, Skipped: 0, Time elapsed: 0.201 s - in org.eclipse.rdf4j.console.command.LoadTest
[INFO] Running org.eclipse.rdf4j.console.command.ConvertTest
15:37:15.541 [main] ERROR No RDF writer for /tmp/genie.rdf4j/junit7342690196504440357/alien.qyx
[MockitoHint] ConvertTest.testConvertInvalidFormat (see javadoc for MockitoHint):
[MockitoHint] 1. Unused -> at org.eclipse.rdf4j.console.command.ConvertTest.setup(ConvertTest.java:39)

15:37:15.550 [main] ERROR Failed to convert data
org.eclipse.rdf4j.rio.RDFParseException: Expected '<' or '_', found: e [line 1, column 101]
	at org.eclipse.rdf4j.rio.ntriples.NTriplesParser.parseSubject(NTriplesParser.java:313)
	at org.eclipse.rdf4j.rio.ntriples.NTriplesParser.parseTriple(NTriplesParser.java:252)
	at org.eclipse.rdf4j.rio.ntriples.NTriplesParser.parse(NTriplesParser.java:160)
	at org.eclipse.rdf4j.rio.ntriples.NTriplesParser.parse(NTriplesParser.java:109)
	at org.eclipse.rdf4j.console.command.Convert.convert(Convert.java:139)
	at org.eclipse.rdf4j.console.command.Convert.execute(Convert.java:74)
	at org.eclipse.rdf4j.console.command.ConvertTest.testConvertParseError(ConvertTest.java:92)
	at sun.reflect.NativeMethodAccessorImpl.invoke0(Native Method)
	at sun.reflect.NativeMethodAccessorImpl.invoke(NativeMethodAccessorImpl.java:62)
	at sun.reflect.DelegatingMethodAccessorImpl.invoke(DelegatingMethodAccessorImpl.java:43)
	at java.lang.reflect.Method.invoke(Method.java:498)
	at org.junit.runners.model.FrameworkMethod$1.runReflectiveCall(FrameworkMethod.java:50)
	at org.junit.internal.runners.model.ReflectiveCallable.run(ReflectiveCallable.java:12)
	at org.junit.runners.model.FrameworkMethod.invokeExplosively(FrameworkMethod.java:47)
	at org.junit.internal.runners.statements.InvokeMethod.evaluate(InvokeMethod.java:17)
	at org.junit.internal.runners.statements.RunBefores.evaluate(RunBefores.java:26)
	at org.junit.internal.runners.statements.RunAfters.evaluate(RunAfters.java:27)
	at org.mockito.internal.junit.JUnitRule$1.evaluateSafely(JUnitRule.java:52)
	at org.mockito.internal.junit.JUnitRule$1.evaluate(JUnitRule.java:43)
	at org.junit.rules.ExternalResource$1.evaluate(ExternalResource.java:48)
	at org.junit.rules.RunRules.evaluate(RunRules.java:20)
	at org.junit.runners.ParentRunner.runLeaf(ParentRunner.java:325)
	at org.junit.runners.BlockJUnit4ClassRunner.runChild(BlockJUnit4ClassRunner.java:78)
	at org.junit.runners.BlockJUnit4ClassRunner.runChild(BlockJUnit4ClassRunner.java:57)
	at org.junit.runners.ParentRunner$3.run(ParentRunner.java:290)
	at org.junit.runners.ParentRunner$1.schedule(ParentRunner.java:71)
	at org.junit.runners.ParentRunner.runChildren(ParentRunner.java:288)
	at org.junit.runners.ParentRunner.access$000(ParentRunner.java:58)
	at org.junit.runners.ParentRunner$2.evaluate(ParentRunner.java:268)
	at org.junit.runners.ParentRunner.run(ParentRunner.java:363)
	at org.apache.maven.surefire.junit4.JUnit4Provider.execute(JUnit4Provider.java:365)
	at org.apache.maven.surefire.junit4.JUnit4Provider.executeWithRerun(JUnit4Provider.java:273)
	at org.apache.maven.surefire.junit4.JUnit4Provider.executeTestSet(JUnit4Provider.java:238)
	at org.apache.maven.surefire.junit4.JUnit4Provider.invoke(JUnit4Provider.java:159)
	at org.apache.maven.surefire.booter.ForkedBooter.invokeProviderInSameClassLoader(ForkedBooter.java:384)
	at org.apache.maven.surefire.booter.ForkedBooter.runSuitesInProcess(ForkedBooter.java:345)
	at org.apache.maven.surefire.booter.ForkedBooter.execute(ForkedBooter.java:126)
	at org.apache.maven.surefire.booter.ForkedBooter.main(ForkedBooter.java:418)
[INFO] Tests run: 4, Failures: 0, Errors: 0, Skipped: 0, Time elapsed: 0.293 s - in org.eclipse.rdf4j.console.command.ConvertTest
[INFO] Running org.eclipse.rdf4j.console.command.ExportTest
[MockitoHint] ExportTest.testExportWorkDir (see javadoc for MockitoHint):
[MockitoHint] 1. Unused -> at org.eclipse.rdf4j.console.command.ExportTest.setUp(ExportTest.java:46)

[MockitoHint] ExportTest.testExportAll (see javadoc for MockitoHint):
[MockitoHint] 1. Unused -> at org.eclipse.rdf4j.console.command.ExportTest.setUp(ExportTest.java:46)

[MockitoHint] ExportTest.testExportContexts (see javadoc for MockitoHint):
[MockitoHint] 1. Unused -> at org.eclipse.rdf4j.console.command.ExportTest.setUp(ExportTest.java:46)

[INFO] Tests run: 3, Failures: 0, Errors: 0, Skipped: 0, Time elapsed: 0.063 s - in org.eclipse.rdf4j.console.command.ExportTest
[INFO] Running org.eclipse.rdf4j.console.command.VerifyTest
15:37:15.974 [main] ERROR Unexpected RDFParseException
org.eclipse.rdf4j.rio.RDFParseException: 'missing type' was not recognised, and could not be verified, with datatype http://example.rdf4j.org/type/wrong [line 1]
	at org.eclipse.rdf4j.rio.helpers.RDFParserHelper.reportError(RDFParserHelper.java:265)
	at org.eclipse.rdf4j.rio.helpers.RDFParserHelper.createLiteral(RDFParserHelper.java:180)
	at org.eclipse.rdf4j.rio.helpers.AbstractRDFParser.createLiteral(AbstractRDFParser.java:530)
	at org.eclipse.rdf4j.rio.turtle.TurtleParser.parseQuotedLiteral(TurtleParser.java:665)
	at org.eclipse.rdf4j.rio.turtle.TurtleParser.parseValue(TurtleParser.java:584)
	at org.eclipse.rdf4j.rio.turtle.TurtleParser.parseObject(TurtleParser.java:461)
	at org.eclipse.rdf4j.rio.turtle.TurtleParser.parseObjectList(TurtleParser.java:389)
	at org.eclipse.rdf4j.rio.turtle.TurtleParser.parsePredicateObjectList(TurtleParser.java:362)
	at org.eclipse.rdf4j.rio.turtle.TurtleParser.parseTriples(TurtleParser.java:349)
	at org.eclipse.rdf4j.rio.turtle.TurtleParser.parseStatement(TurtleParser.java:216)
	at org.eclipse.rdf4j.rio.turtle.TurtleParser.parse(TurtleParser.java:178)
	at org.eclipse.rdf4j.rio.turtle.TurtleParser.parse(TurtleParser.java:130)
	at org.eclipse.rdf4j.console.command.Verify.verify(Verify.java:145)
	at org.eclipse.rdf4j.console.command.Verify.execute(Verify.java:97)
	at org.eclipse.rdf4j.console.command.VerifyTest.testVerifyMissingType(VerifyTest.java:97)
	at sun.reflect.NativeMethodAccessorImpl.invoke0(Native Method)
	at sun.reflect.NativeMethodAccessorImpl.invoke(NativeMethodAccessorImpl.java:62)
	at sun.reflect.DelegatingMethodAccessorImpl.invoke(DelegatingMethodAccessorImpl.java:43)
	at java.lang.reflect.Method.invoke(Method.java:498)
	at org.junit.runners.model.FrameworkMethod$1.runReflectiveCall(FrameworkMethod.java:50)
	at org.junit.internal.runners.model.ReflectiveCallable.run(ReflectiveCallable.java:12)
	at org.junit.runners.model.FrameworkMethod.invokeExplosively(FrameworkMethod.java:47)
	at org.junit.internal.runners.statements.InvokeMethod.evaluate(InvokeMethod.java:17)
	at org.junit.internal.runners.statements.RunBefores.evaluate(RunBefores.java:26)
	at org.junit.internal.runners.statements.RunAfters.evaluate(RunAfters.java:27)
	at org.mockito.internal.junit.JUnitRule$1.evaluateSafely(JUnitRule.java:52)
	at org.mockito.internal.junit.JUnitRule$1.evaluate(JUnitRule.java:43)
	at org.junit.rules.ExternalResource$1.evaluate(ExternalResource.java:48)
	at org.junit.rules.RunRules.evaluate(RunRules.java:20)
	at org.junit.runners.ParentRunner.runLeaf(ParentRunner.java:325)
	at org.junit.runners.BlockJUnit4ClassRunner.runChild(BlockJUnit4ClassRunner.java:78)
	at org.junit.runners.BlockJUnit4ClassRunner.runChild(BlockJUnit4ClassRunner.java:57)
	at org.junit.runners.ParentRunner$3.run(ParentRunner.java:290)
	at org.junit.runners.ParentRunner$1.schedule(ParentRunner.java:71)
	at org.junit.runners.ParentRunner.runChildren(ParentRunner.java:288)
	at org.junit.runners.ParentRunner.access$000(ParentRunner.java:58)
	at org.junit.runners.ParentRunner$2.evaluate(ParentRunner.java:268)
	at org.junit.runners.ParentRunner.run(ParentRunner.java:363)
	at org.apache.maven.surefire.junit4.JUnit4Provider.execute(JUnit4Provider.java:365)
	at org.apache.maven.surefire.junit4.JUnit4Provider.executeWithRerun(JUnit4Provider.java:273)
	at org.apache.maven.surefire.junit4.JUnit4Provider.executeTestSet(JUnit4Provider.java:238)
	at org.apache.maven.surefire.junit4.JUnit4Provider.invoke(JUnit4Provider.java:159)
	at org.apache.maven.surefire.booter.ForkedBooter.invokeProviderInSameClassLoader(ForkedBooter.java:384)
	at org.apache.maven.surefire.booter.ForkedBooter.runSuitesInProcess(ForkedBooter.java:345)
	at org.apache.maven.surefire.booter.ForkedBooter.execute(ForkedBooter.java:126)
	at org.apache.maven.surefire.booter.ForkedBooter.main(ForkedBooter.java:418)
15:37:16.023 [main] ERROR SHACL validation failed, writing report to /tmp/genie.rdf4j/junit7823167951329697989/junit2486316246278901735.tmp
15:37:16.039 [main] ERROR Unexpected RDFParseException
org.eclipse.rdf4j.rio.RDFParseException: Unexpected end of file
	at org.eclipse.rdf4j.rio.turtle.TurtleParser.throwEOFException(TurtleParser.java:1317)
	at org.eclipse.rdf4j.rio.turtle.TurtleParser.parseValue(TurtleParser.java:589)
	at org.eclipse.rdf4j.rio.turtle.TurtleParser.parsePredicate(TurtleParser.java:434)
	at org.eclipse.rdf4j.rio.turtle.TurtleParser.parsePredicateObjectList(TurtleParser.java:358)
	at org.eclipse.rdf4j.rio.turtle.TurtleParser.parseTriples(TurtleParser.java:349)
	at org.eclipse.rdf4j.rio.turtle.TurtleParser.parseStatement(TurtleParser.java:216)
	at org.eclipse.rdf4j.rio.turtle.TurtleParser.parse(TurtleParser.java:178)
	at org.eclipse.rdf4j.rio.turtle.TurtleParser.parse(TurtleParser.java:130)
	at org.eclipse.rdf4j.console.command.Verify.verify(Verify.java:145)
	at org.eclipse.rdf4j.console.command.Verify.execute(Verify.java:97)
	at org.eclipse.rdf4j.console.command.VerifyTest.testVerifyBrokenFile(VerifyTest.java:91)
	at sun.reflect.NativeMethodAccessorImpl.invoke0(Native Method)
	at sun.reflect.NativeMethodAccessorImpl.invoke(NativeMethodAccessorImpl.java:62)
	at sun.reflect.DelegatingMethodAccessorImpl.invoke(DelegatingMethodAccessorImpl.java:43)
	at java.lang.reflect.Method.invoke(Method.java:498)
	at org.junit.runners.model.FrameworkMethod$1.runReflectiveCall(FrameworkMethod.java:50)
	at org.junit.internal.runners.model.ReflectiveCallable.run(ReflectiveCallable.java:12)
	at org.junit.runners.model.FrameworkMethod.invokeExplosively(FrameworkMethod.java:47)
	at org.junit.internal.runners.statements.InvokeMethod.evaluate(InvokeMethod.java:17)
	at org.junit.internal.runners.statements.RunBefores.evaluate(RunBefores.java:26)
	at org.junit.internal.runners.statements.RunAfters.evaluate(RunAfters.java:27)
	at org.mockito.internal.junit.JUnitRule$1.evaluateSafely(JUnitRule.java:52)
	at org.mockito.internal.junit.JUnitRule$1.evaluate(JUnitRule.java:43)
	at org.junit.rules.ExternalResource$1.evaluate(ExternalResource.java:48)
	at org.junit.rules.RunRules.evaluate(RunRules.java:20)
	at org.junit.runners.ParentRunner.runLeaf(ParentRunner.java:325)
	at org.junit.runners.BlockJUnit4ClassRunner.runChild(BlockJUnit4ClassRunner.java:78)
	at org.junit.runners.BlockJUnit4ClassRunner.runChild(BlockJUnit4ClassRunner.java:57)
	at org.junit.runners.ParentRunner$3.run(ParentRunner.java:290)
	at org.junit.runners.ParentRunner$1.schedule(ParentRunner.java:71)
	at org.junit.runners.ParentRunner.runChildren(ParentRunner.java:288)
	at org.junit.runners.ParentRunner.access$000(ParentRunner.java:58)
	at org.junit.runners.ParentRunner$2.evaluate(ParentRunner.java:268)
	at org.junit.runners.ParentRunner.run(ParentRunner.java:363)
	at org.apache.maven.surefire.junit4.JUnit4Provider.execute(JUnit4Provider.java:365)
	at org.apache.maven.surefire.junit4.JUnit4Provider.executeWithRerun(JUnit4Provider.java:273)
	at org.apache.maven.surefire.junit4.JUnit4Provider.executeTestSet(JUnit4Provider.java:238)
	at org.apache.maven.surefire.junit4.JUnit4Provider.invoke(JUnit4Provider.java:159)
	at org.apache.maven.surefire.booter.ForkedBooter.invokeProviderInSameClassLoader(ForkedBooter.java:384)
	at org.apache.maven.surefire.booter.ForkedBooter.runSuitesInProcess(ForkedBooter.java:345)
	at org.apache.maven.surefire.booter.ForkedBooter.execute(ForkedBooter.java:126)
	at org.apache.maven.surefire.booter.ForkedBooter.main(ForkedBooter.java:418)
15:37:16.050 [main] ERROR Unexpected RDFParseException
org.eclipse.rdf4j.rio.RDFParseException: Expected a letter, found '1' [line 1]
	at org.eclipse.rdf4j.rio.helpers.RDFParserHelper.reportError(RDFParserHelper.java:265)
	at org.eclipse.rdf4j.rio.helpers.AbstractRDFParser.reportError(AbstractRDFParser.java:628)
	at org.eclipse.rdf4j.rio.turtle.TurtleParser.reportError(TurtleParser.java:1297)
	at org.eclipse.rdf4j.rio.turtle.TurtleParser.parseQuotedLiteral(TurtleParser.java:619)
	at org.eclipse.rdf4j.rio.turtle.TurtleParser.parseValue(TurtleParser.java:584)
	at org.eclipse.rdf4j.rio.turtle.TurtleParser.parseObject(TurtleParser.java:461)
	at org.eclipse.rdf4j.rio.turtle.TurtleParser.parseObjectList(TurtleParser.java:389)
	at org.eclipse.rdf4j.rio.turtle.TurtleParser.parsePredicateObjectList(TurtleParser.java:362)
	at org.eclipse.rdf4j.rio.turtle.TurtleParser.parseTriples(TurtleParser.java:349)
	at org.eclipse.rdf4j.rio.turtle.TurtleParser.parseStatement(TurtleParser.java:216)
	at org.eclipse.rdf4j.rio.turtle.TurtleParser.parse(TurtleParser.java:178)
	at org.eclipse.rdf4j.rio.turtle.TurtleParser.parse(TurtleParser.java:130)
	at org.eclipse.rdf4j.console.command.Verify.verify(Verify.java:145)
	at org.eclipse.rdf4j.console.command.Verify.execute(Verify.java:97)
	at org.eclipse.rdf4j.console.command.VerifyTest.testVerifyWrongLang(VerifyTest.java:109)
	at sun.reflect.NativeMethodAccessorImpl.invoke0(Native Method)
	at sun.reflect.NativeMethodAccessorImpl.invoke(NativeMethodAccessorImpl.java:62)
	at sun.reflect.DelegatingMethodAccessorImpl.invoke(DelegatingMethodAccessorImpl.java:43)
	at java.lang.reflect.Method.invoke(Method.java:498)
	at org.junit.runners.model.FrameworkMethod$1.runReflectiveCall(FrameworkMethod.java:50)
	at org.junit.internal.runners.model.ReflectiveCallable.run(ReflectiveCallable.java:12)
	at org.junit.runners.model.FrameworkMethod.invokeExplosively(FrameworkMethod.java:47)
	at org.junit.internal.runners.statements.InvokeMethod.evaluate(InvokeMethod.java:17)
	at org.junit.internal.runners.statements.RunBefores.evaluate(RunBefores.java:26)
	at org.junit.internal.runners.statements.RunAfters.evaluate(RunAfters.java:27)
	at org.mockito.internal.junit.JUnitRule$1.evaluateSafely(JUnitRule.java:52)
	at org.mockito.internal.junit.JUnitRule$1.evaluate(JUnitRule.java:43)
	at org.junit.rules.ExternalResource$1.evaluate(ExternalResource.java:48)
	at org.junit.rules.RunRules.evaluate(RunRules.java:20)
	at org.junit.runners.ParentRunner.runLeaf(ParentRunner.java:325)
	at org.junit.runners.BlockJUnit4ClassRunner.runChild(BlockJUnit4ClassRunner.java:78)
	at org.junit.runners.BlockJUnit4ClassRunner.runChild(BlockJUnit4ClassRunner.java:57)
	at org.junit.runners.ParentRunner$3.run(ParentRunner.java:290)
	at org.junit.runners.ParentRunner$1.schedule(ParentRunner.java:71)
	at org.junit.runners.ParentRunner.runChildren(ParentRunner.java:288)
	at org.junit.runners.ParentRunner.access$000(ParentRunner.java:58)
	at org.junit.runners.ParentRunner$2.evaluate(ParentRunner.java:268)
	at org.junit.runners.ParentRunner.run(ParentRunner.java:363)
	at org.apache.maven.surefire.junit4.JUnit4Provider.execute(JUnit4Provider.java:365)
	at org.apache.maven.surefire.junit4.JUnit4Provider.executeWithRerun(JUnit4Provider.java:273)
	at org.apache.maven.surefire.junit4.JUnit4Provider.executeTestSet(JUnit4Provider.java:238)
	at org.apache.maven.surefire.junit4.JUnit4Provider.invoke(JUnit4Provider.java:159)
	at org.apache.maven.surefire.booter.ForkedBooter.invokeProviderInSameClassLoader(ForkedBooter.java:384)
	at org.apache.maven.surefire.booter.ForkedBooter.runSuitesInProcess(ForkedBooter.java:345)
	at org.apache.maven.surefire.booter.ForkedBooter.execute(ForkedBooter.java:126)
	at org.apache.maven.surefire.booter.ForkedBooter.main(ForkedBooter.java:418)
15:37:16.061 [main] ERROR No parser available for this RDF format
org.eclipse.rdf4j.rio.UnsupportedRDFormatException: Did not recognise RDF format string file:/home/hudson/genie.rdf4j/.jenkins/jobs/rdf4j-pr-verify/workspace/tools/console/does-not-exist.docx
	at org.eclipse.rdf4j.rio.Rio.lambda$unsupportedFormat$1(Rio.java:577)
	at java.util.Optional.orElseThrow(Optional.java:290)
	at org.eclipse.rdf4j.console.command.Verify.verify(Verify.java:124)
	at org.eclipse.rdf4j.console.command.Verify.execute(Verify.java:97)
	at org.eclipse.rdf4j.console.command.VerifyTest.testVerifyWrongFormat(VerifyTest.java:69)
	at sun.reflect.NativeMethodAccessorImpl.invoke0(Native Method)
	at sun.reflect.NativeMethodAccessorImpl.invoke(NativeMethodAccessorImpl.java:62)
	at sun.reflect.DelegatingMethodAccessorImpl.invoke(DelegatingMethodAccessorImpl.java:43)
	at java.lang.reflect.Method.invoke(Method.java:498)
	at org.junit.runners.model.FrameworkMethod$1.runReflectiveCall(FrameworkMethod.java:50)
	at org.junit.internal.runners.model.ReflectiveCallable.run(ReflectiveCallable.java:12)
	at org.junit.runners.model.FrameworkMethod.invokeExplosively(FrameworkMethod.java:47)
	at org.junit.internal.runners.statements.InvokeMethod.evaluate(InvokeMethod.java:17)
	at org.junit.internal.runners.statements.RunBefores.evaluate(RunBefores.java:26)
	at org.junit.internal.runners.statements.RunAfters.evaluate(RunAfters.java:27)
	at org.mockito.internal.junit.JUnitRule$1.evaluateSafely(JUnitRule.java:52)
	at org.mockito.internal.junit.JUnitRule$1.evaluate(JUnitRule.java:43)
	at org.junit.rules.ExternalResource$1.evaluate(ExternalResource.java:48)
	at org.junit.rules.RunRules.evaluate(RunRules.java:20)
	at org.junit.runners.ParentRunner.runLeaf(ParentRunner.java:325)
	at org.junit.runners.BlockJUnit4ClassRunner.runChild(BlockJUnit4ClassRunner.java:78)
	at org.junit.runners.BlockJUnit4ClassRunner.runChild(BlockJUnit4ClassRunner.java:57)
	at org.junit.runners.ParentRunner$3.run(ParentRunner.java:290)
	at org.junit.runners.ParentRunner$1.schedule(ParentRunner.java:71)
	at org.junit.runners.ParentRunner.runChildren(ParentRunner.java:288)
	at org.junit.runners.ParentRunner.access$000(ParentRunner.java:58)
	at org.junit.runners.ParentRunner$2.evaluate(ParentRunner.java:268)
	at org.junit.runners.ParentRunner.run(ParentRunner.java:363)
	at org.apache.maven.surefire.junit4.JUnit4Provider.execute(JUnit4Provider.java:365)
	at org.apache.maven.surefire.junit4.JUnit4Provider.executeWithRerun(JUnit4Provider.java:273)
	at org.apache.maven.surefire.junit4.JUnit4Provider.executeTestSet(JUnit4Provider.java:238)
	at org.apache.maven.surefire.junit4.JUnit4Provider.invoke(JUnit4Provider.java:159)
	at org.apache.maven.surefire.booter.ForkedBooter.invokeProviderInSameClassLoader(ForkedBooter.java:384)
	at org.apache.maven.surefire.booter.ForkedBooter.runSuitesInProcess(ForkedBooter.java:345)
	at org.apache.maven.surefire.booter.ForkedBooter.execute(ForkedBooter.java:126)
	at org.apache.maven.surefire.booter.ForkedBooter.main(ForkedBooter.java:418)
15:37:16.072 [main] ERROR Unexpected RDFParseException
org.eclipse.rdf4j.rio.RDFParseException: IRI included an unencoded space: '32' [line 1]
	at org.eclipse.rdf4j.rio.helpers.RDFParserHelper.reportError(RDFParserHelper.java:265)
	at org.eclipse.rdf4j.rio.helpers.AbstractRDFParser.reportError(AbstractRDFParser.java:628)
	at org.eclipse.rdf4j.rio.turtle.TurtleParser.reportError(TurtleParser.java:1297)
	at org.eclipse.rdf4j.rio.turtle.TurtleParser.parseURI(TurtleParser.java:902)
	at org.eclipse.rdf4j.rio.turtle.TurtleParser.parseValue(TurtleParser.java:575)
	at org.eclipse.rdf4j.rio.turtle.TurtleParser.parseSubject(TurtleParser.java:406)
	at org.eclipse.rdf4j.rio.turtle.TurtleParser.parseTriples(TurtleParser.java:347)
	at org.eclipse.rdf4j.rio.turtle.TurtleParser.parseStatement(TurtleParser.java:216)
	at org.eclipse.rdf4j.rio.turtle.TurtleParser.parse(TurtleParser.java:178)
	at org.eclipse.rdf4j.rio.turtle.TurtleParser.parse(TurtleParser.java:130)
	at org.eclipse.rdf4j.console.command.Verify.verify(Verify.java:145)
	at org.eclipse.rdf4j.console.command.Verify.execute(Verify.java:97)
	at org.eclipse.rdf4j.console.command.VerifyTest.testVerifySpaceIRI(VerifyTest.java:103)
	at sun.reflect.NativeMethodAccessorImpl.invoke0(Native Method)
	at sun.reflect.NativeMethodAccessorImpl.invoke(NativeMethodAccessorImpl.java:62)
	at sun.reflect.DelegatingMethodAccessorImpl.invoke(DelegatingMethodAccessorImpl.java:43)
	at java.lang.reflect.Method.invoke(Method.java:498)
	at org.junit.runners.model.FrameworkMethod$1.runReflectiveCall(FrameworkMethod.java:50)
	at org.junit.internal.runners.model.ReflectiveCallable.run(ReflectiveCallable.java:12)
	at org.junit.runners.model.FrameworkMethod.invokeExplosively(FrameworkMethod.java:47)
	at org.junit.internal.runners.statements.InvokeMethod.evaluate(InvokeMethod.java:17)
	at org.junit.internal.runners.statements.RunBefores.evaluate(RunBefores.java:26)
	at org.junit.internal.runners.statements.RunAfters.evaluate(RunAfters.java:27)
	at org.mockito.internal.junit.JUnitRule$1.evaluateSafely(JUnitRule.java:52)
	at org.mockito.internal.junit.JUnitRule$1.evaluate(JUnitRule.java:43)
	at org.junit.rules.ExternalResource$1.evaluate(ExternalResource.java:48)
	at org.junit.rules.RunRules.evaluate(RunRules.java:20)
	at org.junit.runners.ParentRunner.runLeaf(ParentRunner.java:325)
	at org.junit.runners.BlockJUnit4ClassRunner.runChild(BlockJUnit4ClassRunner.java:78)
	at org.junit.runners.BlockJUnit4ClassRunner.runChild(BlockJUnit4ClassRunner.java:57)
	at org.junit.runners.ParentRunner$3.run(ParentRunner.java:290)
	at org.junit.runners.ParentRunner$1.schedule(ParentRunner.java:71)
	at org.junit.runners.ParentRunner.runChildren(ParentRunner.java:288)
	at org.junit.runners.ParentRunner.access$000(ParentRunner.java:58)
	at org.junit.runners.ParentRunner$2.evaluate(ParentRunner.java:268)
	at org.junit.runners.ParentRunner.run(ParentRunner.java:363)
	at org.apache.maven.surefire.junit4.JUnit4Provider.execute(JUnit4Provider.java:365)
	at org.apache.maven.surefire.junit4.JUnit4Provider.executeWithRerun(JUnit4Provider.java:273)
	at org.apache.maven.surefire.junit4.JUnit4Provider.executeTestSet(JUnit4Provider.java:238)
	at org.apache.maven.surefire.junit4.JUnit4Provider.invoke(JUnit4Provider.java:159)
	at org.apache.maven.surefire.booter.ForkedBooter.invokeProviderInSameClassLoader(ForkedBooter.java:384)
	at org.apache.maven.surefire.booter.ForkedBooter.runSuitesInProcess(ForkedBooter.java:345)
	at org.apache.maven.surefire.booter.ForkedBooter.execute(ForkedBooter.java:126)
	at org.apache.maven.surefire.booter.ForkedBooter.main(ForkedBooter.java:418)
[INFO] Tests run: 10, Failures: 0, Errors: 0, Skipped: 0, Time elapsed: 0.476 s - in org.eclipse.rdf4j.console.command.VerifyTest
[INFO] Running org.eclipse.rdf4j.console.command.DropTest
[MockitoHint] DropTest.testUserAbortedUnsafeDropBeforeWarning (see javadoc for MockitoHint):
[MockitoHint] 1. Unused -> at org.eclipse.rdf4j.console.command.DropTest.setUp(DropTest.java:50)

[INFO] Tests run: 3, Failures: 0, Errors: 0, Skipped: 0, Time elapsed: 0.141 s - in org.eclipse.rdf4j.console.command.DropTest
[INFO] Running org.eclipse.rdf4j.console.command.FederateTest
15:37:16.273 [main] DEBUG Initializing MemoryStore...
15:37:16.274 [main] DEBUG Initializing data file...
15:37:16.275 [main] DEBUG Data file initialized
15:37:16.275 [main] DEBUG MemoryStore initialized
15:37:16.278 [main] DEBUG syncing data to file...
15:37:16.279 [main] DEBUG Data synced to file
15:37:16.284 [main] DEBUG Initializing MemoryStore...
15:37:16.285 [main] DEBUG Initializing data file...
15:37:16.285 [main] DEBUG Data file initialized
15:37:16.285 [main] DEBUG MemoryStore initialized
15:37:16.287 [main] DEBUG syncing data to file...
15:37:16.297 [main] DEBUG Data synced to file
15:37:16.312 [main] DEBUG Federate called with federation ID = fedID, and member ID's = [sparql][alien][http].
  Distinct set to false, and readonly set to true.

15:37:16.315 [main] DEBUG Federation repository root node: _:node1drh199e7x216
15:37:16.317 [main] DEBUG _:node1drh199e7x216 http://www.w3.org/1999/02/22-rdf-syntax-ns#type http://www.openrdf.org/config/repository#Repository
15:37:16.317 [main] DEBUG _:node1drh199e7x216 http://www.openrdf.org/config/repository#repositoryID "fedID"
15:37:16.317 [main] DEBUG _:node1drh199e7x216 http://www.w3.org/2000/01/rdf-schema#label "Test Federation Title"
15:37:16.317 [main] DEBUG _:node1drh199e7x216 http://www.openrdf.org/config/repository#repositoryImpl _:node1drh199e7x217
15:37:16.317 [main] DEBUG _:node1drh199e7x217 http://www.openrdf.org/config/repository#repositoryType "openrdf:SailRepository"
15:37:16.317 [main] DEBUG _:node1drh199e7x217 http://www.openrdf.org/config/repository/sail#sailImpl _:node1drh199e7x218
15:37:16.317 [main] DEBUG _:node1drh199e7x218 http://www.openrdf.org/config/sail#sailType "openrdf:Federation"
15:37:16.318 [main] DEBUG _:node1drh199e7x218 http://www.openrdf.org/config/sail/federation#readOnly "true"^^<http://www.w3.org/2001/XMLSchema#boolean>
15:37:16.318 [main] DEBUG _:node1drh199e7x218 http://www.openrdf.org/config/sail/federation#distinct "false"^^<http://www.w3.org/2001/XMLSchema#boolean>
15:37:16.318 [main] DEBUG Adding member: sparql
15:37:16.318 [main] DEBUG _:node1drh199e7x218 http://www.openrdf.org/config/sail/federation#member _:node1drh199e7x219
15:37:16.319 [main] DEBUG _:node1drh199e7x219 http://www.openrdf.org/config/repository#repositoryType "openrdf:SPARQLRepository"
15:37:16.319 [main] DEBUG _:node1drh199e7x219 http://www.openrdf.org/config/repository/sparql#query-endpoint http://localhost:8080/openrdf-sesame/repositories/sparql
15:37:16.319 [main] DEBUG Added member sparql: 
15:37:16.319 [main] DEBUG Adding member: alien
15:37:16.320 [main] DEBUG _:node1drh199e7x218 http://www.openrdf.org/config/sail/federation#member _:node1drh199e7x222
15:37:16.320 [main] DEBUG _:node1drh199e7x222 http://www.openrdf.org/config/repository#repositoryType "openrdf:ProxyRepository"
15:37:16.320 [main] DEBUG _:node1drh199e7x222 http://www.openrdf.org/config/repository/proxy#proxiedID "alien"
15:37:16.320 [main] DEBUG Added member alien: 
15:37:16.320 [main] DEBUG Adding member: http
15:37:16.320 [main] DEBUG _:node1drh199e7x218 http://www.openrdf.org/config/sail/federation#member _:node1drh199e7x225
15:37:16.321 [main] DEBUG _:node1drh199e7x225 http://www.openrdf.org/config/repository#repositoryType "openrdf:HTTPRepository"
15:37:16.322 [main] DEBUG _:node1drh199e7x225 http://www.openrdf.org/config/repository/http#repositoryURL http://localhost:8080/openrdf-sesame/repositories/http
15:37:16.322 [main] DEBUG Added member http: 
15:37:16.350 [main] DEBUG Initializing MemoryStore...
15:37:16.351 [main] DEBUG Initializing data file...
15:37:16.351 [main] DEBUG Data file initialized
15:37:16.351 [main] DEBUG MemoryStore initialized
15:37:16.354 [main] DEBUG syncing data to file...
15:37:16.354 [main] DEBUG Data synced to file
15:37:16.357 [main] DEBUG Initializing MemoryStore...
15:37:16.358 [main] DEBUG Initializing data file...
15:37:16.358 [main] DEBUG Data file initialized
15:37:16.358 [main] DEBUG MemoryStore initialized
15:37:16.359 [main] DEBUG syncing data to file...
15:37:16.360 [main] DEBUG Data synced to file
15:37:16.367 [main] ERROR Duplicate repository id's specified.
[MockitoHint] FederateTest.testDuplicateMembersPrintsError (see javadoc for MockitoHint):
[MockitoHint] 1. Unused -> at org.eclipse.rdf4j.console.command.FederateTest.setUp(FederateTest.java:87)
[MockitoHint] 2. Unused -> at org.eclipse.rdf4j.console.command.FederateTest.setUp(FederateTest.java:88)

15:37:16.374 [main] DEBUG Initializing MemoryStore...
15:37:16.375 [main] DEBUG Initializing data file...
15:37:16.375 [main] DEBUG Data file initialized
15:37:16.375 [main] DEBUG MemoryStore initialized
15:37:16.377 [main] DEBUG syncing data to file...
15:37:16.377 [main] DEBUG Data synced to file
15:37:16.380 [main] DEBUG Initializing MemoryStore...
15:37:16.380 [main] DEBUG Initializing data file...
15:37:16.381 [main] DEBUG Data file initialized
15:37:16.381 [main] DEBUG MemoryStore initialized
15:37:16.382 [main] DEBUG syncing data to file...
15:37:16.383 [main] DEBUG Data synced to file
15:37:16.389 [main] DEBUG Federate called with federation ID = alien, and member ID's = [fedID][scary].
  Distinct set to false, and readonly set to true.

15:37:16.390 [main] ERROR alien already exists.
[MockitoHint] FederateTest.testFedAlreadyExistsPrintsSpecificError (see javadoc for MockitoHint):
[MockitoHint] 1. Unused -> at org.eclipse.rdf4j.console.command.FederateTest.setUp(FederateTest.java:88)

15:37:16.397 [main] DEBUG Initializing MemoryStore...
15:37:16.398 [main] DEBUG Initializing data file...
15:37:16.398 [main] DEBUG Data file initialized
15:37:16.398 [main] DEBUG MemoryStore initialized
15:37:16.399 [main] DEBUG syncing data to file...
15:37:16.400 [main] DEBUG Data synced to file
15:37:16.402 [main] DEBUG Initializing MemoryStore...
15:37:16.403 [main] DEBUG Initializing data file...
15:37:16.403 [main] DEBUG Data file initialized
15:37:16.403 [main] DEBUG MemoryStore initialized
15:37:16.405 [main] DEBUG syncing data to file...
15:37:16.405 [main] DEBUG Data synced to file
15:37:16.412 [main] DEBUG Federate called with federation ID = fedID, and member ID's = [alien][scary].
  Distinct set to true, and readonly set to false.

15:37:16.413 [main] DEBUG Federation repository root node: _:node1drh199e7x338
15:37:16.413 [main] DEBUG _:node1drh199e7x338 http://www.w3.org/1999/02/22-rdf-syntax-ns#type http://www.openrdf.org/config/repository#Repository
15:37:16.413 [main] DEBUG _:node1drh199e7x338 http://www.openrdf.org/config/repository#repositoryID "fedID"
15:37:16.413 [main] DEBUG _:node1drh199e7x338 http://www.w3.org/2000/01/rdf-schema#label "Test Federation Title"
15:37:16.413 [main] DEBUG _:node1drh199e7x338 http://www.openrdf.org/config/repository#repositoryImpl _:node1drh199e7x339
15:37:16.413 [main] DEBUG _:node1drh199e7x339 http://www.openrdf.org/config/repository#repositoryType "openrdf:SailRepository"
15:37:16.413 [main] DEBUG _:node1drh199e7x339 http://www.openrdf.org/config/repository/sail#sailImpl _:node1drh199e7x340
15:37:16.413 [main] DEBUG _:node1drh199e7x340 http://www.openrdf.org/config/sail#sailType "openrdf:Federation"
15:37:16.413 [main] DEBUG _:node1drh199e7x340 http://www.openrdf.org/config/sail/federation#readOnly "false"^^<http://www.w3.org/2001/XMLSchema#boolean>
15:37:16.413 [main] DEBUG _:node1drh199e7x340 http://www.openrdf.org/config/sail/federation#distinct "true"^^<http://www.w3.org/2001/XMLSchema#boolean>
15:37:16.413 [main] DEBUG Adding member: alien
15:37:16.413 [main] DEBUG _:node1drh199e7x340 http://www.openrdf.org/config/sail/federation#member _:node1drh199e7x341
15:37:16.414 [main] DEBUG _:node1drh199e7x341 http://www.openrdf.org/config/repository#repositoryType "openrdf:ProxyRepository"
15:37:16.414 [main] DEBUG _:node1drh199e7x341 http://www.openrdf.org/config/repository/proxy#proxiedID "alien"
15:37:16.414 [main] DEBUG Added member alien: 
15:37:16.414 [main] DEBUG Adding member: scary
15:37:16.414 [main] DEBUG _:node1drh199e7x340 http://www.openrdf.org/config/sail/federation#member _:node1drh199e7x344
15:37:16.414 [main] DEBUG _:node1drh199e7x344 http://www.openrdf.org/config/repository#repositoryType "openrdf:ProxyRepository"
15:37:16.414 [main] DEBUG _:node1drh199e7x344 http://www.openrdf.org/config/repository/proxy#proxiedID "scary"
15:37:16.414 [main] DEBUG Added member scary: 
15:37:16.437 [main] DEBUG Initializing MemoryStore...
15:37:16.438 [main] DEBUG Initializing data file...
15:37:16.439 [main] DEBUG Data file initialized
15:37:16.439 [main] DEBUG MemoryStore initialized
15:37:16.440 [main] DEBUG syncing data to file...
15:37:16.441 [main] DEBUG Data synced to file
15:37:16.444 [main] DEBUG Initializing MemoryStore...
15:37:16.445 [main] DEBUG Initializing data file...
15:37:16.445 [main] DEBUG Data file initialized
15:37:16.445 [main] DEBUG MemoryStore initialized
15:37:16.447 [main] DEBUG syncing data to file...
15:37:16.447 [main] DEBUG Data synced to file
15:37:16.455 [main] DEBUG Federate called with federation ID = fedID, and member ID's = [sparql][sparql2].
  Distinct set to false, and readonly set to false.

15:37:16.458 [main] ERROR sparql is read-only.
15:37:16.459 [main] ERROR sparql2 is read-only.
[MockitoHint] FederateTest.testSparqlAndNotReadOnlyPrintsError (see javadoc for MockitoHint):
[MockitoHint] 1. Unused -> at org.eclipse.rdf4j.console.command.FederateTest.setUp(FederateTest.java:88)

15:37:16.466 [main] DEBUG Initializing MemoryStore...
15:37:16.467 [main] DEBUG Initializing data file...
15:37:16.467 [main] DEBUG Data file initialized
15:37:16.467 [main] DEBUG MemoryStore initialized
15:37:16.468 [main] DEBUG syncing data to file...
15:37:16.469 [main] DEBUG Data synced to file
15:37:16.471 [main] DEBUG Initializing MemoryStore...
15:37:16.472 [main] DEBUG Initializing data file...
15:37:16.472 [main] DEBUG Data file initialized
15:37:16.472 [main] DEBUG MemoryStore initialized
15:37:16.473 [main] DEBUG syncing data to file...
15:37:16.474 [main] DEBUG Data synced to file
[MockitoHint] FederateTest.testNoArgumentsPrintsHelp (see javadoc for MockitoHint):
[MockitoHint] 1. Unused -> at org.eclipse.rdf4j.console.command.FederateTest.setUp(FederateTest.java:87)
[MockitoHint] 2. Unused -> at org.eclipse.rdf4j.console.command.FederateTest.setUp(FederateTest.java:88)

15:37:16.487 [main] DEBUG Initializing MemoryStore...
15:37:16.487 [main] DEBUG Initializing data file...
15:37:16.488 [main] DEBUG Data file initialized
15:37:16.488 [main] DEBUG MemoryStore initialized
15:37:16.489 [main] DEBUG syncing data to file...
15:37:16.489 [main] DEBUG Data synced to file
15:37:16.492 [main] DEBUG Initializing MemoryStore...
15:37:16.492 [main] DEBUG Initializing data file...
15:37:16.493 [main] DEBUG Data file initialized
15:37:16.493 [main] DEBUG MemoryStore initialized
15:37:16.494 [main] DEBUG syncing data to file...
15:37:16.494 [main] DEBUG Data synced to file
15:37:16.500 [main] DEBUG Federate called with federation ID = type=memory, and member ID's = [fedID][alien][scary].
  Distinct set to false, and readonly set to true.

15:37:16.500 [main] ERROR fedID does not exist.
[MockitoHint] FederateTest.testInvalidArgumentPrintsError (see javadoc for MockitoHint):
[MockitoHint] 1. Unused -> at org.eclipse.rdf4j.console.command.FederateTest.setUp(FederateTest.java:88)

15:37:16.508 [main] DEBUG Initializing MemoryStore...
15:37:16.509 [main] DEBUG Initializing data file...
15:37:16.509 [main] DEBUG Data file initialized
15:37:16.509 [main] DEBUG MemoryStore initialized
15:37:16.510 [main] DEBUG syncing data to file...
15:37:16.511 [main] DEBUG Data synced to file
15:37:16.513 [main] DEBUG Initializing MemoryStore...
15:37:16.514 [main] DEBUG Initializing data file...
15:37:16.514 [main] DEBUG Data file initialized
15:37:16.514 [main] DEBUG MemoryStore initialized
15:37:16.515 [main] DEBUG syncing data to file...
15:37:16.515 [main] DEBUG Data synced to file
15:37:16.522 [main] DEBUG Federate called with federation ID = fedID, and member ID's = [sparql][sparql2].
  Distinct set to false, and readonly set to true.

15:37:16.524 [main] DEBUG Federation repository root node: _:node1drh199e7x494
15:37:16.524 [main] DEBUG _:node1drh199e7x494 http://www.w3.org/1999/02/22-rdf-syntax-ns#type http://www.openrdf.org/config/repository#Repository
15:37:16.524 [main] DEBUG _:node1drh199e7x494 http://www.openrdf.org/config/repository#repositoryID "fedID"
15:37:16.524 [main] DEBUG _:node1drh199e7x494 http://www.w3.org/2000/01/rdf-schema#label "Test Federation Title"
15:37:16.524 [main] DEBUG _:node1drh199e7x494 http://www.openrdf.org/config/repository#repositoryImpl _:node1drh199e7x495
15:37:16.524 [main] DEBUG _:node1drh199e7x495 http://www.openrdf.org/config/repository#repositoryType "openrdf:SailRepository"
15:37:16.524 [main] DEBUG _:node1drh199e7x495 http://www.openrdf.org/config/repository/sail#sailImpl _:node1drh199e7x496
15:37:16.524 [main] DEBUG _:node1drh199e7x496 http://www.openrdf.org/config/sail#sailType "openrdf:Federation"
15:37:16.524 [main] DEBUG _:node1drh199e7x496 http://www.openrdf.org/config/sail/federation#readOnly "true"^^<http://www.w3.org/2001/XMLSchema#boolean>
15:37:16.524 [main] DEBUG _:node1drh199e7x496 http://www.openrdf.org/config/sail/federation#distinct "false"^^<http://www.w3.org/2001/XMLSchema#boolean>
15:37:16.524 [main] DEBUG Adding member: sparql
15:37:16.524 [main] DEBUG _:node1drh199e7x496 http://www.openrdf.org/config/sail/federation#member _:node1drh199e7x497
15:37:16.525 [main] DEBUG _:node1drh199e7x497 http://www.openrdf.org/config/repository#repositoryType "openrdf:SPARQLRepository"
15:37:16.525 [main] DEBUG _:node1drh199e7x497 http://www.openrdf.org/config/repository/sparql#query-endpoint http://localhost:8080/openrdf-sesame/repositories/sparql
15:37:16.525 [main] DEBUG Added member sparql: 
15:37:16.525 [main] DEBUG Adding member: sparql2
15:37:16.525 [main] DEBUG _:node1drh199e7x496 http://www.openrdf.org/config/sail/federation#member _:node1drh199e7x500
15:37:16.526 [main] DEBUG _:node1drh199e7x500 http://www.openrdf.org/config/repository#repositoryType "openrdf:SPARQLRepository"
15:37:16.526 [main] DEBUG _:node1drh199e7x500 http://www.openrdf.org/config/repository/sparql#query-endpoint http://localhost:8080/openrdf-sesame/repositories/sparql
15:37:16.526 [main] DEBUG Added member sparql2: 
15:37:16.538 [main] DEBUG Initializing MemoryStore...
15:37:16.538 [main] DEBUG Initializing data file...
15:37:16.539 [main] DEBUG Data file initialized
15:37:16.539 [main] DEBUG MemoryStore initialized
15:37:16.540 [main] DEBUG syncing data to file...
15:37:16.541 [main] DEBUG Data synced to file
15:37:16.543 [main] DEBUG Initializing MemoryStore...
15:37:16.543 [main] DEBUG Initializing data file...
15:37:16.544 [main] DEBUG Data file initialized
15:37:16.544 [main] DEBUG MemoryStore initialized
15:37:16.545 [main] DEBUG syncing data to file...
15:37:16.545 [main] DEBUG Data synced to file
15:37:16.552 [main] DEBUG Federate called with federation ID = fedID, and member ID's = [http][sparql].
  Distinct set to false, and readonly set to true.

15:37:16.553 [main] DEBUG Federation repository root node: _:node1drh199e7x549
15:37:16.553 [main] DEBUG _:node1drh199e7x549 http://www.w3.org/1999/02/22-rdf-syntax-ns#type http://www.openrdf.org/config/repository#Repository
15:37:16.553 [main] DEBUG _:node1drh199e7x549 http://www.openrdf.org/config/repository#repositoryID "fedID"
15:37:16.553 [main] DEBUG _:node1drh199e7x549 http://www.w3.org/2000/01/rdf-schema#label "Test Federation Title"
15:37:16.553 [main] DEBUG _:node1drh199e7x549 http://www.openrdf.org/config/repository#repositoryImpl _:node1drh199e7x550
15:37:16.553 [main] DEBUG _:node1drh199e7x550 http://www.openrdf.org/config/repository#repositoryType "openrdf:SailRepository"
15:37:16.553 [main] DEBUG _:node1drh199e7x550 http://www.openrdf.org/config/repository/sail#sailImpl _:node1drh199e7x551
15:37:16.553 [main] DEBUG _:node1drh199e7x551 http://www.openrdf.org/config/sail#sailType "openrdf:Federation"
15:37:16.553 [main] DEBUG _:node1drh199e7x551 http://www.openrdf.org/config/sail/federation#readOnly "true"^^<http://www.w3.org/2001/XMLSchema#boolean>
15:37:16.553 [main] DEBUG _:node1drh199e7x551 http://www.openrdf.org/config/sail/federation#distinct "false"^^<http://www.w3.org/2001/XMLSchema#boolean>
15:37:16.553 [main] DEBUG Adding member: http
15:37:16.553 [main] DEBUG _:node1drh199e7x551 http://www.openrdf.org/config/sail/federation#member _:node1drh199e7x552
15:37:16.554 [main] DEBUG _:node1drh199e7x552 http://www.openrdf.org/config/repository#repositoryType "openrdf:HTTPRepository"
15:37:16.554 [main] DEBUG _:node1drh199e7x552 http://www.openrdf.org/config/repository/http#repositoryURL http://localhost:8080/openrdf-sesame/repositories/http
15:37:16.554 [main] DEBUG Added member http: 
15:37:16.554 [main] DEBUG Adding member: sparql
15:37:16.554 [main] DEBUG _:node1drh199e7x551 http://www.openrdf.org/config/sail/federation#member _:node1drh199e7x555
15:37:16.555 [main] DEBUG _:node1drh199e7x555 http://www.openrdf.org/config/repository#repositoryType "openrdf:SPARQLRepository"
15:37:16.555 [main] DEBUG _:node1drh199e7x555 http://www.openrdf.org/config/repository/sparql#query-endpoint http://localhost:8080/openrdf-sesame/repositories/sparql
15:37:16.555 [main] DEBUG Added member sparql: 
15:37:16.566 [main] DEBUG Initializing MemoryStore...
15:37:16.567 [main] DEBUG Initializing data file...
15:37:16.567 [main] DEBUG Data file initialized
15:37:16.567 [main] DEBUG MemoryStore initialized
15:37:16.568 [main] DEBUG syncing data to file...
15:37:16.569 [main] DEBUG Data synced to file
15:37:16.571 [main] DEBUG Initializing MemoryStore...
15:37:16.572 [main] DEBUG Initializing data file...
15:37:16.572 [main] DEBUG Data file initialized
15:37:16.572 [main] DEBUG MemoryStore initialized
15:37:16.574 [main] DEBUG syncing data to file...
15:37:16.574 [main] DEBUG Data synced to file
15:37:16.581 [main] DEBUG Federate called with federation ID = fedID, and member ID's = [alien][FreeLunch].
  Distinct set to false, and readonly set to true.

15:37:16.582 [main] ERROR FreeLunch does not exist.
[MockitoHint] FederateTest.testNonexistentMemberPrintsSpecificError (see javadoc for MockitoHint):
[MockitoHint] 1. Unused -> at org.eclipse.rdf4j.console.command.FederateTest.setUp(FederateTest.java:88)

15:37:16.588 [main] DEBUG Initializing MemoryStore...
15:37:16.589 [main] DEBUG Initializing data file...
15:37:16.589 [main] DEBUG Data file initialized
15:37:16.589 [main] DEBUG MemoryStore initialized
15:37:16.590 [main] DEBUG syncing data to file...
15:37:16.591 [main] DEBUG Data synced to file
15:37:16.594 [main] DEBUG Initializing MemoryStore...
15:37:16.594 [main] DEBUG Initializing data file...
15:37:16.594 [main] DEBUG Data file initialized
15:37:16.594 [main] DEBUG MemoryStore initialized
15:37:16.596 [main] DEBUG syncing data to file...
15:37:16.596 [main] DEBUG Data synced to file
15:37:16.602 [main] ERROR Duplicate repository id's specified.
[MockitoHint] FederateTest.testFedSameAsMemberPrintsError (see javadoc for MockitoHint):
[MockitoHint] 1. Unused -> at org.eclipse.rdf4j.console.command.FederateTest.setUp(FederateTest.java:87)
[MockitoHint] 2. Unused -> at org.eclipse.rdf4j.console.command.FederateTest.setUp(FederateTest.java:88)

15:37:16.608 [main] DEBUG Initializing MemoryStore...
15:37:16.609 [main] DEBUG Initializing data file...
15:37:16.609 [main] DEBUG Data file initialized
15:37:16.609 [main] DEBUG MemoryStore initialized
15:37:16.610 [main] DEBUG syncing data to file...
15:37:16.610 [main] DEBUG Data synced to file
15:37:16.613 [main] DEBUG Initializing MemoryStore...
15:37:16.613 [main] DEBUG Initializing data file...
15:37:16.614 [main] DEBUG Data file initialized
15:37:16.614 [main] DEBUG MemoryStore initialized
15:37:16.615 [main] DEBUG syncing data to file...
15:37:16.615 [main] DEBUG Data synced to file
[MockitoHint] FederateTest.testTwoArgumentsPrintsHelp (see javadoc for MockitoHint):
[MockitoHint] 1. Unused -> at org.eclipse.rdf4j.console.command.FederateTest.setUp(FederateTest.java:87)
[MockitoHint] 2. Unused -> at org.eclipse.rdf4j.console.command.FederateTest.setUp(FederateTest.java:88)

15:37:16.627 [main] DEBUG Initializing MemoryStore...
15:37:16.628 [main] DEBUG Initializing data file...
15:37:16.628 [main] DEBUG Data file initialized
15:37:16.628 [main] DEBUG MemoryStore initialized
15:37:16.629 [main] DEBUG syncing data to file...
15:37:16.630 [main] DEBUG Data synced to file
15:37:16.632 [main] DEBUG Initializing MemoryStore...
15:37:16.633 [main] DEBUG Initializing data file...
15:37:16.633 [main] DEBUG Data file initialized
15:37:16.633 [main] DEBUG MemoryStore initialized
15:37:16.634 [main] DEBUG syncing data to file...
15:37:16.634 [main] DEBUG Data synced to file
15:37:16.640 [main] DEBUG Federate called with federation ID = fedID, and member ID's = [alien][scary].
  Distinct set to false, and readonly set to true.

15:37:16.642 [main] DEBUG Federation repository root node: _:node1drh199e7x692
15:37:16.642 [main] DEBUG _:node1drh199e7x692 http://www.w3.org/1999/02/22-rdf-syntax-ns#type http://www.openrdf.org/config/repository#Repository
15:37:16.642 [main] DEBUG _:node1drh199e7x692 http://www.openrdf.org/config/repository#repositoryID "fedID"
15:37:16.642 [main] DEBUG _:node1drh199e7x692 http://www.w3.org/2000/01/rdf-schema#label "Test Federation Title"
15:37:16.642 [main] DEBUG _:node1drh199e7x692 http://www.openrdf.org/config/repository#repositoryImpl _:node1drh199e7x693
15:37:16.642 [main] DEBUG _:node1drh199e7x693 http://www.openrdf.org/config/repository#repositoryType "openrdf:SailRepository"
15:37:16.642 [main] DEBUG _:node1drh199e7x693 http://www.openrdf.org/config/repository/sail#sailImpl _:node1drh199e7x694
15:37:16.642 [main] DEBUG _:node1drh199e7x694 http://www.openrdf.org/config/sail#sailType "openrdf:Federation"
15:37:16.642 [main] DEBUG _:node1drh199e7x694 http://www.openrdf.org/config/sail/federation#readOnly "true"^^<http://www.w3.org/2001/XMLSchema#boolean>
15:37:16.642 [main] DEBUG _:node1drh199e7x694 http://www.openrdf.org/config/sail/federation#distinct "false"^^<http://www.w3.org/2001/XMLSchema#boolean>
15:37:16.642 [main] DEBUG Adding member: alien
15:37:16.642 [main] DEBUG _:node1drh199e7x694 http://www.openrdf.org/config/sail/federation#member _:node1drh199e7x695
15:37:16.642 [main] DEBUG _:node1drh199e7x695 http://www.openrdf.org/config/repository#repositoryType "openrdf:ProxyRepository"
15:37:16.642 [main] DEBUG _:node1drh199e7x695 http://www.openrdf.org/config/repository/proxy#proxiedID "alien"
15:37:16.642 [main] DEBUG Added member alien: 
15:37:16.642 [main] DEBUG Adding member: scary
15:37:16.642 [main] DEBUG _:node1drh199e7x694 http://www.openrdf.org/config/sail/federation#member _:node1drh199e7x698
15:37:16.643 [main] DEBUG _:node1drh199e7x698 http://www.openrdf.org/config/repository#repositoryType "openrdf:ProxyRepository"
15:37:16.643 [main] DEBUG _:node1drh199e7x698 http://www.openrdf.org/config/repository/proxy#proxiedID "scary"
15:37:16.643 [main] DEBUG Added member scary: 
15:37:16.657 [main] DEBUG Initializing MemoryStore...
15:37:16.658 [main] DEBUG Initializing data file...
15:37:16.658 [main] DEBUG Data file initialized
15:37:16.658 [main] DEBUG MemoryStore initialized
15:37:16.659 [main] DEBUG syncing data to file...
15:37:16.660 [main] DEBUG Data synced to file
15:37:16.662 [main] DEBUG Initializing MemoryStore...
15:37:16.663 [main] DEBUG Initializing data file...
15:37:16.663 [main] DEBUG Data file initialized
15:37:16.663 [main] DEBUG MemoryStore initialized
15:37:16.665 [main] DEBUG syncing data to file...
15:37:16.665 [main] DEBUG Data synced to file
[MockitoHint] FederateTest.testOneArgumentPrintsHelp (see javadoc for MockitoHint):
[MockitoHint] 1. Unused -> at org.eclipse.rdf4j.console.command.FederateTest.setUp(FederateTest.java:87)
[MockitoHint] 2. Unused -> at org.eclipse.rdf4j.console.command.FederateTest.setUp(FederateTest.java:88)

15:37:16.680 [main] DEBUG Initializing MemoryStore...
15:37:16.681 [main] DEBUG Initializing data file...
15:37:16.681 [main] DEBUG Data file initialized
15:37:16.681 [main] DEBUG MemoryStore initialized
15:37:16.682 [main] DEBUG syncing data to file...
15:37:16.683 [main] DEBUG Data synced to file
15:37:16.685 [main] DEBUG Initializing MemoryStore...
15:37:16.686 [main] DEBUG Initializing data file...
15:37:16.686 [main] DEBUG Data file initialized
15:37:16.686 [main] DEBUG MemoryStore initialized
15:37:16.687 [main] DEBUG syncing data to file...
15:37:16.688 [main] DEBUG Data synced to file
15:37:16.695 [main] DEBUG Federate called with federation ID = fedID, and member ID's = [http][http2].
  Distinct set to false, and readonly set to true.

15:37:16.696 [main] DEBUG Federation repository root node: _:node1drh199e7x784
15:37:16.696 [main] DEBUG _:node1drh199e7x784 http://www.w3.org/1999/02/22-rdf-syntax-ns#type http://www.openrdf.org/config/repository#Repository
15:37:16.696 [main] DEBUG _:node1drh199e7x784 http://www.openrdf.org/config/repository#repositoryID "fedID"
15:37:16.696 [main] DEBUG _:node1drh199e7x784 http://www.w3.org/2000/01/rdf-schema#label "Test Federation Title"
15:37:16.696 [main] DEBUG _:node1drh199e7x784 http://www.openrdf.org/config/repository#repositoryImpl _:node1drh199e7x785
15:37:16.696 [main] DEBUG _:node1drh199e7x785 http://www.openrdf.org/config/repository#repositoryType "openrdf:SailRepository"
15:37:16.696 [main] DEBUG _:node1drh199e7x785 http://www.openrdf.org/config/repository/sail#sailImpl _:node1drh199e7x786
15:37:16.696 [main] DEBUG _:node1drh199e7x786 http://www.openrdf.org/config/sail#sailType "openrdf:Federation"
15:37:16.697 [main] DEBUG _:node1drh199e7x786 http://www.openrdf.org/config/sail/federation#readOnly "true"^^<http://www.w3.org/2001/XMLSchema#boolean>
15:37:16.697 [main] DEBUG _:node1drh199e7x786 http://www.openrdf.org/config/sail/federation#distinct "false"^^<http://www.w3.org/2001/XMLSchema#boolean>
15:37:16.697 [main] DEBUG Adding member: http
15:37:16.697 [main] DEBUG _:node1drh199e7x786 http://www.openrdf.org/config/sail/federation#member _:node1drh199e7x787
15:37:16.697 [main] DEBUG _:node1drh199e7x787 http://www.openrdf.org/config/repository#repositoryType "openrdf:HTTPRepository"
15:37:16.698 [main] DEBUG _:node1drh199e7x787 http://www.openrdf.org/config/repository/http#repositoryURL http://localhost:8080/openrdf-sesame/repositories/http
15:37:16.698 [main] DEBUG Added member http: 
15:37:16.698 [main] DEBUG Adding member: http2
15:37:16.698 [main] DEBUG _:node1drh199e7x786 http://www.openrdf.org/config/sail/federation#member _:node1drh199e7x790
15:37:16.699 [main] DEBUG _:node1drh199e7x790 http://www.openrdf.org/config/repository#repositoryType "openrdf:HTTPRepository"
15:37:16.699 [main] DEBUG _:node1drh199e7x790 http://www.openrdf.org/config/repository/http#repositoryURL http://localhost:8080/openrdf-sesame/repositories/http
15:37:16.699 [main] DEBUG Added member http2: 
[INFO] Tests run: 15, Failures: 0, Errors: 0, Skipped: 0, Time elapsed: 0.454 s - in org.eclipse.rdf4j.console.command.FederateTest
[INFO] Running org.eclipse.rdf4j.console.command.SparqlTest
[MockitoHint] SparqlTest.testInputFile (see javadoc for MockitoHint):
[MockitoHint] 1. Unused -> at org.eclipse.rdf4j.console.command.SparqlTest.setUp(SparqlTest.java:49)

15:37:16.742 [main] ERROR No suitable result writer found
[MockitoHint] SparqlTest.testSelectError (see javadoc for MockitoHint):
[MockitoHint] 1. Unused -> at org.eclipse.rdf4j.console.command.SparqlTest.setUp(SparqlTest.java:49)

[MockitoHint] SparqlTest.testSelectMissingBindings (see javadoc for MockitoHint):
[MockitoHint] 1. Unused -> at org.eclipse.rdf4j.console.command.SparqlTest.setUp(SparqlTest.java:49)

[MockitoHint] SparqlTest.testInputFileWorkdir (see javadoc for MockitoHint):
[MockitoHint] 1. Unused -> at org.eclipse.rdf4j.console.command.SparqlTest.setUp(SparqlTest.java:49)

[INFO] Tests run: 9, Failures: 0, Errors: 0, Skipped: 0, Time elapsed: 0.121 s - in org.eclipse.rdf4j.console.command.SparqlTest
[INFO] Running org.eclipse.rdf4j.console.UtilTest
 one, two
 three
 four
 five, six
 seven
 eight
[INFO] Tests run: 4, Failures: 0, Errors: 0, Skipped: 0, Time elapsed: 0 s - in org.eclipse.rdf4j.console.UtilTest
[INFO] Running org.eclipse.rdf4j.console.ConsoleIOTest
[INFO] Tests run: 3, Failures: 0, Errors: 0, Skipped: 0, Time elapsed: 0.049 s - in org.eclipse.rdf4j.console.ConsoleIOTest
[INFO] 
[INFO] Results:
[INFO] 
[INFO] Tests run: 64, Failures: 0, Errors: 0, Skipped: 0
[INFO] 
[JENKINS] Recording test results
[INFO] 
[INFO] --- animal-sniffer-maven-plugin:1.16:check (default) @ rdf4j-console ---
[INFO] Checking unresolved references to org.codehaus.mojo.signature:java18:1.0
[INFO] 
[INFO] --- maven-jar-plugin:2.3.1:jar (default-jar) @ rdf4j-console ---
[INFO] Building jar: /home/hudson/genie.rdf4j/.jenkins/jobs/rdf4j-pr-verify/workspace/tools/console/target/rdf4j-console-3.1.0-SNAPSHOT.jar