SuccessConsole Output

Started calculate disk usage of build
Finished Calculation of disk usage of build in 0 seconds
Started calculate disk usage of workspace
Finished Calculation of disk usage of workspace in 0 seconds
[INFO] 
[INFO] ------------------< org.eclipse.rdf4j:rdf4j-console >-------------------
[INFO] Building RDF4J: Console 3.1.0-SNAPSHOT                            [3/10]
[INFO] --------------------------------[ jar ]---------------------------------
[INFO] 
[INFO] --- buildnumber-maven-plugin:1.4:create (default) @ rdf4j-console ---
[INFO] ShortRevision tag detected. The value is '7'.
[INFO] Executing: /bin/sh -c cd '/home/hudson/genie.rdf4j/.jenkins/jobs/rdf4j-pr-verify/workspace/tools/console' && 'git' 'rev-parse' '--verify' '--short=7' 'HEAD'
[INFO] Working directory: /home/hudson/genie.rdf4j/.jenkins/jobs/rdf4j-pr-verify/workspace/tools/console
[INFO] Storing buildNumber: be9125a at timestamp: 1575750153190
[WARNING] Cannot get the branch information from the git repository: 
Detecting the current branch failed: fatal: ref HEAD is not a symbolic ref

[INFO] ShortRevision tag detected. The value is '7'.
[INFO] Executing: /bin/sh -c cd '/home/hudson/genie.rdf4j/.jenkins/jobs/rdf4j-pr-verify/workspace/tools/console' && 'git' 'rev-parse' '--verify' '--short=7' 'HEAD'
[INFO] Working directory: /home/hudson/genie.rdf4j/.jenkins/jobs/rdf4j-pr-verify/workspace/tools/console
[INFO] Storing buildScmBranch: UNKNOWN
[INFO] 
[INFO] --- maven-enforcer-plugin:1.4.1:enforce (enforce-bytecode-version) @ rdf4j-console ---
[INFO] Adding ignore: META-INF/**/module-info
[INFO] 
[INFO] --- formatter-maven-plugin:2.8.1:validate (default) @ rdf4j-console ---
[INFO] Using 'UTF-8' encoding to format source files.
[INFO] Number of files to be formatted: 61
[INFO] Html formatting is skipped
[INFO] Successfully formatted:          0 file(s)
[INFO] Fail to format:                  0 file(s)
[INFO] Skipped:                         61 file(s)
[INFO] Read only skipped:               0 file(s)
[INFO] Approximate time taken:          0s
[INFO] 
[INFO] --- maven-resources-plugin:3.0.2:resources (default-resources) @ rdf4j-console ---
[INFO] Using 'UTF-8' encoding to copy filtered resources.
[INFO] skip non existing resourceDirectory /home/hudson/genie.rdf4j/.jenkins/jobs/rdf4j-pr-verify/workspace/tools/console/src/main/resources
[INFO] 
[INFO] --- maven-compiler-plugin:3.7.0:compile (default-compile) @ rdf4j-console ---
[INFO] Changes detected - recompiling the module!
[INFO] Compiling 42 source files to /home/hudson/genie.rdf4j/.jenkins/jobs/rdf4j-pr-verify/workspace/tools/console/target/classes
[INFO] 
[INFO] --- maven-resources-plugin:3.0.2:testResources (default-testResources) @ rdf4j-console ---
[INFO] Using 'UTF-8' encoding to copy filtered resources.
[INFO] Copying 29 resources
[INFO] 
[INFO] --- maven-compiler-plugin:3.7.0:testCompile (default-testCompile) @ rdf4j-console ---
[INFO] Changes detected - recompiling the module!
[INFO] Compiling 18 source files to /home/hudson/genie.rdf4j/.jenkins/jobs/rdf4j-pr-verify/workspace/tools/console/target/test-classes
[INFO] 
[INFO] --- maven-surefire-plugin:2.22.2:test (default-test) @ rdf4j-console ---
[INFO] 
[INFO] -------------------------------------------------------
[INFO]  T E S T S
[INFO] -------------------------------------------------------
[INFO] Running org.eclipse.rdf4j.console.setting.PrefixesTest
[INFO] Tests run: 3, Failures: 0, Errors: 0, Skipped: 0, Time elapsed: 0.703 s - in org.eclipse.rdf4j.console.setting.PrefixesTest
[INFO] Running org.eclipse.rdf4j.console.setting.LogLevelTest
15:22:38.989 [main] ERROR unknown logging level: chatty
[INFO] Tests run: 4, Failures: 0, Errors: 0, Skipped: 0, Time elapsed: 0.014 s - in org.eclipse.rdf4j.console.setting.LogLevelTest
[INFO] Running org.eclipse.rdf4j.console.setting.QueryPrefixTest
[INFO] Tests run: 1, Failures: 0, Errors: 0, Skipped: 0, Time elapsed: 0 s - in org.eclipse.rdf4j.console.setting.QueryPrefixTest
[INFO] Running org.eclipse.rdf4j.console.setting.ShowPrefixTest
[INFO] Tests run: 1, Failures: 0, Errors: 0, Skipped: 0, Time elapsed: 0 s - in org.eclipse.rdf4j.console.setting.ShowPrefixTest
[INFO] Running org.eclipse.rdf4j.console.setting.ConsoleWidthTest
[INFO] Tests run: 1, Failures: 0, Errors: 0, Skipped: 0, Time elapsed: 0 s - in org.eclipse.rdf4j.console.setting.ConsoleWidthTest
[INFO] Running org.eclipse.rdf4j.console.command.SetParametersTest
15:22:39.021 [main] ERROR Unknown parameter: unknown
[INFO] Tests run: 1, Failures: 0, Errors: 0, Skipped: 0, Time elapsed: 0.016 s - in org.eclipse.rdf4j.console.command.SetParametersTest
[INFO] Running org.eclipse.rdf4j.console.command.LoadTest
[MockitoHint] LoadTest.testLoad (see javadoc for MockitoHint):
[MockitoHint] 1. Unused -> at org.eclipse.rdf4j.console.command.LoadTest.setUp(LoadTest.java:49)

[MockitoHint] LoadTest.testLoadWorkDir (see javadoc for MockitoHint):
[MockitoHint] 1. Unused -> at org.eclipse.rdf4j.console.command.LoadTest.setUp(LoadTest.java:49)

[INFO] Tests run: 2, Failures: 0, Errors: 0, Skipped: 0, Time elapsed: 0.194 s - in org.eclipse.rdf4j.console.command.LoadTest
[INFO] Running org.eclipse.rdf4j.console.command.ConvertTest
15:22:39.501 [main] ERROR No RDF writer for /tmp/genie.rdf4j/junit5279643858193464651/alien.qyx
[MockitoHint] ConvertTest.testConvertInvalidFormat (see javadoc for MockitoHint):
[MockitoHint] 1. Unused -> at org.eclipse.rdf4j.console.command.ConvertTest.setup(ConvertTest.java:39)

15:22:39.510 [main] ERROR Failed to convert data
org.eclipse.rdf4j.rio.RDFParseException: Expected '<' or '_', found: e [line 1, column 101]
	at org.eclipse.rdf4j.rio.ntriples.NTriplesParser.parseSubject(NTriplesParser.java:313)
	at org.eclipse.rdf4j.rio.ntriples.NTriplesParser.parseTriple(NTriplesParser.java:252)
	at org.eclipse.rdf4j.rio.ntriples.NTriplesParser.parse(NTriplesParser.java:160)
	at org.eclipse.rdf4j.rio.ntriples.NTriplesParser.parse(NTriplesParser.java:109)
	at org.eclipse.rdf4j.console.command.Convert.convert(Convert.java:139)
	at org.eclipse.rdf4j.console.command.Convert.execute(Convert.java:74)
	at org.eclipse.rdf4j.console.command.ConvertTest.testConvertParseError(ConvertTest.java:92)
	at sun.reflect.NativeMethodAccessorImpl.invoke0(Native Method)
	at sun.reflect.NativeMethodAccessorImpl.invoke(NativeMethodAccessorImpl.java:62)
	at sun.reflect.DelegatingMethodAccessorImpl.invoke(DelegatingMethodAccessorImpl.java:43)
	at java.lang.reflect.Method.invoke(Method.java:498)
	at org.junit.runners.model.FrameworkMethod$1.runReflectiveCall(FrameworkMethod.java:50)
	at org.junit.internal.runners.model.ReflectiveCallable.run(ReflectiveCallable.java:12)
	at org.junit.runners.model.FrameworkMethod.invokeExplosively(FrameworkMethod.java:47)
	at org.junit.internal.runners.statements.InvokeMethod.evaluate(InvokeMethod.java:17)
	at org.junit.internal.runners.statements.RunBefores.evaluate(RunBefores.java:26)
	at org.junit.internal.runners.statements.RunAfters.evaluate(RunAfters.java:27)
	at org.mockito.internal.junit.JUnitRule$1.evaluateSafely(JUnitRule.java:52)
	at org.mockito.internal.junit.JUnitRule$1.evaluate(JUnitRule.java:43)
	at org.junit.rules.ExternalResource$1.evaluate(ExternalResource.java:48)
	at org.junit.rules.RunRules.evaluate(RunRules.java:20)
	at org.junit.runners.ParentRunner.runLeaf(ParentRunner.java:325)
	at org.junit.runners.BlockJUnit4ClassRunner.runChild(BlockJUnit4ClassRunner.java:78)
	at org.junit.runners.BlockJUnit4ClassRunner.runChild(BlockJUnit4ClassRunner.java:57)
	at org.junit.runners.ParentRunner$3.run(ParentRunner.java:290)
	at org.junit.runners.ParentRunner$1.schedule(ParentRunner.java:71)
	at org.junit.runners.ParentRunner.runChildren(ParentRunner.java:288)
	at org.junit.runners.ParentRunner.access$000(ParentRunner.java:58)
	at org.junit.runners.ParentRunner$2.evaluate(ParentRunner.java:268)
	at org.junit.runners.ParentRunner.run(ParentRunner.java:363)
	at org.apache.maven.surefire.junit4.JUnit4Provider.execute(JUnit4Provider.java:365)
	at org.apache.maven.surefire.junit4.JUnit4Provider.executeWithRerun(JUnit4Provider.java:273)
	at org.apache.maven.surefire.junit4.JUnit4Provider.executeTestSet(JUnit4Provider.java:238)
	at org.apache.maven.surefire.junit4.JUnit4Provider.invoke(JUnit4Provider.java:159)
	at org.apache.maven.surefire.booter.ForkedBooter.invokeProviderInSameClassLoader(ForkedBooter.java:384)
	at org.apache.maven.surefire.booter.ForkedBooter.runSuitesInProcess(ForkedBooter.java:345)
	at org.apache.maven.surefire.booter.ForkedBooter.execute(ForkedBooter.java:126)
	at org.apache.maven.surefire.booter.ForkedBooter.main(ForkedBooter.java:418)
[INFO] Tests run: 4, Failures: 0, Errors: 0, Skipped: 0, Time elapsed: 0.282 s - in org.eclipse.rdf4j.console.command.ConvertTest
[INFO] Running org.eclipse.rdf4j.console.command.ExportTest
[MockitoHint] ExportTest.testExportWorkDir (see javadoc for MockitoHint):
[MockitoHint] 1. Unused -> at org.eclipse.rdf4j.console.command.ExportTest.setUp(ExportTest.java:46)

[MockitoHint] ExportTest.testExportAll (see javadoc for MockitoHint):
[MockitoHint] 1. Unused -> at org.eclipse.rdf4j.console.command.ExportTest.setUp(ExportTest.java:46)

[MockitoHint] ExportTest.testExportContexts (see javadoc for MockitoHint):
[MockitoHint] 1. Unused -> at org.eclipse.rdf4j.console.command.ExportTest.setUp(ExportTest.java:46)

[INFO] Tests run: 3, Failures: 0, Errors: 0, Skipped: 0, Time elapsed: 0.068 s - in org.eclipse.rdf4j.console.command.ExportTest
[INFO] Running org.eclipse.rdf4j.console.command.VerifyTest
15:22:40.087 [main] ERROR Unexpected RDFParseException
org.eclipse.rdf4j.rio.RDFParseException: 'missing type' was not recognised, and could not be verified, with datatype http://example.rdf4j.org/type/wrong [line 1]
	at org.eclipse.rdf4j.rio.helpers.RDFParserHelper.reportError(RDFParserHelper.java:265)
	at org.eclipse.rdf4j.rio.helpers.RDFParserHelper.createLiteral(RDFParserHelper.java:180)
	at org.eclipse.rdf4j.rio.helpers.AbstractRDFParser.createLiteral(AbstractRDFParser.java:530)
	at org.eclipse.rdf4j.rio.turtle.TurtleParser.parseQuotedLiteral(TurtleParser.java:665)
	at org.eclipse.rdf4j.rio.turtle.TurtleParser.parseValue(TurtleParser.java:584)
	at org.eclipse.rdf4j.rio.turtle.TurtleParser.parseObject(TurtleParser.java:461)
	at org.eclipse.rdf4j.rio.turtle.TurtleParser.parseObjectList(TurtleParser.java:389)
	at org.eclipse.rdf4j.rio.turtle.TurtleParser.parsePredicateObjectList(TurtleParser.java:362)
	at org.eclipse.rdf4j.rio.turtle.TurtleParser.parseTriples(TurtleParser.java:349)
	at org.eclipse.rdf4j.rio.turtle.TurtleParser.parseStatement(TurtleParser.java:216)
	at org.eclipse.rdf4j.rio.turtle.TurtleParser.parse(TurtleParser.java:178)
	at org.eclipse.rdf4j.rio.turtle.TurtleParser.parse(TurtleParser.java:130)
	at org.eclipse.rdf4j.console.command.Verify.verify(Verify.java:145)
	at org.eclipse.rdf4j.console.command.Verify.execute(Verify.java:97)
	at org.eclipse.rdf4j.console.command.VerifyTest.testVerifyMissingType(VerifyTest.java:97)
	at sun.reflect.NativeMethodAccessorImpl.invoke0(Native Method)
	at sun.reflect.NativeMethodAccessorImpl.invoke(NativeMethodAccessorImpl.java:62)
	at sun.reflect.DelegatingMethodAccessorImpl.invoke(DelegatingMethodAccessorImpl.java:43)
	at java.lang.reflect.Method.invoke(Method.java:498)
	at org.junit.runners.model.FrameworkMethod$1.runReflectiveCall(FrameworkMethod.java:50)
	at org.junit.internal.runners.model.ReflectiveCallable.run(ReflectiveCallable.java:12)
	at org.junit.runners.model.FrameworkMethod.invokeExplosively(FrameworkMethod.java:47)
	at org.junit.internal.runners.statements.InvokeMethod.evaluate(InvokeMethod.java:17)
	at org.junit.internal.runners.statements.RunBefores.evaluate(RunBefores.java:26)
	at org.junit.internal.runners.statements.RunAfters.evaluate(RunAfters.java:27)
	at org.mockito.internal.junit.JUnitRule$1.evaluateSafely(JUnitRule.java:52)
	at org.mockito.internal.junit.JUnitRule$1.evaluate(JUnitRule.java:43)
	at org.junit.rules.ExternalResource$1.evaluate(ExternalResource.java:48)
	at org.junit.rules.RunRules.evaluate(RunRules.java:20)
	at org.junit.runners.ParentRunner.runLeaf(ParentRunner.java:325)
	at org.junit.runners.BlockJUnit4ClassRunner.runChild(BlockJUnit4ClassRunner.java:78)
	at org.junit.runners.BlockJUnit4ClassRunner.runChild(BlockJUnit4ClassRunner.java:57)
	at org.junit.runners.ParentRunner$3.run(ParentRunner.java:290)
	at org.junit.runners.ParentRunner$1.schedule(ParentRunner.java:71)
	at org.junit.runners.ParentRunner.runChildren(ParentRunner.java:288)
	at org.junit.runners.ParentRunner.access$000(ParentRunner.java:58)
	at org.junit.runners.ParentRunner$2.evaluate(ParentRunner.java:268)
	at org.junit.runners.ParentRunner.run(ParentRunner.java:363)
	at org.apache.maven.surefire.junit4.JUnit4Provider.execute(JUnit4Provider.java:365)
	at org.apache.maven.surefire.junit4.JUnit4Provider.executeWithRerun(JUnit4Provider.java:273)
	at org.apache.maven.surefire.junit4.JUnit4Provider.executeTestSet(JUnit4Provider.java:238)
	at org.apache.maven.surefire.junit4.JUnit4Provider.invoke(JUnit4Provider.java:159)
	at org.apache.maven.surefire.booter.ForkedBooter.invokeProviderInSameClassLoader(ForkedBooter.java:384)
	at org.apache.maven.surefire.booter.ForkedBooter.runSuitesInProcess(ForkedBooter.java:345)
	at org.apache.maven.surefire.booter.ForkedBooter.execute(ForkedBooter.java:126)
	at org.apache.maven.surefire.booter.ForkedBooter.main(ForkedBooter.java:418)
15:22:40.151 [main] ERROR SHACL validation failed, writing report to /tmp/genie.rdf4j/junit1339010880123286810/junit5574375249666190644.tmp
15:22:40.170 [main] ERROR Unexpected RDFParseException
org.eclipse.rdf4j.rio.RDFParseException: Unexpected end of file
	at org.eclipse.rdf4j.rio.turtle.TurtleParser.throwEOFException(TurtleParser.java:1317)
	at org.eclipse.rdf4j.rio.turtle.TurtleParser.parseValue(TurtleParser.java:589)
	at org.eclipse.rdf4j.rio.turtle.TurtleParser.parsePredicate(TurtleParser.java:434)
	at org.eclipse.rdf4j.rio.turtle.TurtleParser.parsePredicateObjectList(TurtleParser.java:358)
	at org.eclipse.rdf4j.rio.turtle.TurtleParser.parseTriples(TurtleParser.java:349)
	at org.eclipse.rdf4j.rio.turtle.TurtleParser.parseStatement(TurtleParser.java:216)
	at org.eclipse.rdf4j.rio.turtle.TurtleParser.parse(TurtleParser.java:178)
	at org.eclipse.rdf4j.rio.turtle.TurtleParser.parse(TurtleParser.java:130)
	at org.eclipse.rdf4j.console.command.Verify.verify(Verify.java:145)
	at org.eclipse.rdf4j.console.command.Verify.execute(Verify.java:97)
	at org.eclipse.rdf4j.console.command.VerifyTest.testVerifyBrokenFile(VerifyTest.java:91)
	at sun.reflect.NativeMethodAccessorImpl.invoke0(Native Method)
	at sun.reflect.NativeMethodAccessorImpl.invoke(NativeMethodAccessorImpl.java:62)
	at sun.reflect.DelegatingMethodAccessorImpl.invoke(DelegatingMethodAccessorImpl.java:43)
	at java.lang.reflect.Method.invoke(Method.java:498)
	at org.junit.runners.model.FrameworkMethod$1.runReflectiveCall(FrameworkMethod.java:50)
	at org.junit.internal.runners.model.ReflectiveCallable.run(ReflectiveCallable.java:12)
	at org.junit.runners.model.FrameworkMethod.invokeExplosively(FrameworkMethod.java:47)
	at org.junit.internal.runners.statements.InvokeMethod.evaluate(InvokeMethod.java:17)
	at org.junit.internal.runners.statements.RunBefores.evaluate(RunBefores.java:26)
	at org.junit.internal.runners.statements.RunAfters.evaluate(RunAfters.java:27)
	at org.mockito.internal.junit.JUnitRule$1.evaluateSafely(JUnitRule.java:52)
	at org.mockito.internal.junit.JUnitRule$1.evaluate(JUnitRule.java:43)
	at org.junit.rules.ExternalResource$1.evaluate(ExternalResource.java:48)
	at org.junit.rules.RunRules.evaluate(RunRules.java:20)
	at org.junit.runners.ParentRunner.runLeaf(ParentRunner.java:325)
	at org.junit.runners.BlockJUnit4ClassRunner.runChild(BlockJUnit4ClassRunner.java:78)
	at org.junit.runners.BlockJUnit4ClassRunner.runChild(BlockJUnit4ClassRunner.java:57)
	at org.junit.runners.ParentRunner$3.run(ParentRunner.java:290)
	at org.junit.runners.ParentRunner$1.schedule(ParentRunner.java:71)
	at org.junit.runners.ParentRunner.runChildren(ParentRunner.java:288)
	at org.junit.runners.ParentRunner.access$000(ParentRunner.java:58)
	at org.junit.runners.ParentRunner$2.evaluate(ParentRunner.java:268)
	at org.junit.runners.ParentRunner.run(ParentRunner.java:363)
	at org.apache.maven.surefire.junit4.JUnit4Provider.execute(JUnit4Provider.java:365)
	at org.apache.maven.surefire.junit4.JUnit4Provider.executeWithRerun(JUnit4Provider.java:273)
	at org.apache.maven.surefire.junit4.JUnit4Provider.executeTestSet(JUnit4Provider.java:238)
	at org.apache.maven.surefire.junit4.JUnit4Provider.invoke(JUnit4Provider.java:159)
	at org.apache.maven.surefire.booter.ForkedBooter.invokeProviderInSameClassLoader(ForkedBooter.java:384)
	at org.apache.maven.surefire.booter.ForkedBooter.runSuitesInProcess(ForkedBooter.java:345)
	at org.apache.maven.surefire.booter.ForkedBooter.execute(ForkedBooter.java:126)
	at org.apache.maven.surefire.booter.ForkedBooter.main(ForkedBooter.java:418)
15:22:40.184 [main] ERROR Unexpected RDFParseException
org.eclipse.rdf4j.rio.RDFParseException: Expected a letter, found '1' [line 1]
	at org.eclipse.rdf4j.rio.helpers.RDFParserHelper.reportError(RDFParserHelper.java:265)
	at org.eclipse.rdf4j.rio.helpers.AbstractRDFParser.reportError(AbstractRDFParser.java:628)
	at org.eclipse.rdf4j.rio.turtle.TurtleParser.reportError(TurtleParser.java:1297)
	at org.eclipse.rdf4j.rio.turtle.TurtleParser.parseQuotedLiteral(TurtleParser.java:619)
	at org.eclipse.rdf4j.rio.turtle.TurtleParser.parseValue(TurtleParser.java:584)
	at org.eclipse.rdf4j.rio.turtle.TurtleParser.parseObject(TurtleParser.java:461)
	at org.eclipse.rdf4j.rio.turtle.TurtleParser.parseObjectList(TurtleParser.java:389)
	at org.eclipse.rdf4j.rio.turtle.TurtleParser.parsePredicateObjectList(TurtleParser.java:362)
	at org.eclipse.rdf4j.rio.turtle.TurtleParser.parseTriples(TurtleParser.java:349)
	at org.eclipse.rdf4j.rio.turtle.TurtleParser.parseStatement(TurtleParser.java:216)
	at org.eclipse.rdf4j.rio.turtle.TurtleParser.parse(TurtleParser.java:178)
	at org.eclipse.rdf4j.rio.turtle.TurtleParser.parse(TurtleParser.java:130)
	at org.eclipse.rdf4j.console.command.Verify.verify(Verify.java:145)
	at org.eclipse.rdf4j.console.command.Verify.execute(Verify.java:97)
	at org.eclipse.rdf4j.console.command.VerifyTest.testVerifyWrongLang(VerifyTest.java:109)
	at sun.reflect.NativeMethodAccessorImpl.invoke0(Native Method)
	at sun.reflect.NativeMethodAccessorImpl.invoke(NativeMethodAccessorImpl.java:62)
	at sun.reflect.DelegatingMethodAccessorImpl.invoke(DelegatingMethodAccessorImpl.java:43)
	at java.lang.reflect.Method.invoke(Method.java:498)
	at org.junit.runners.model.FrameworkMethod$1.runReflectiveCall(FrameworkMethod.java:50)
	at org.junit.internal.runners.model.ReflectiveCallable.run(ReflectiveCallable.java:12)
	at org.junit.runners.model.FrameworkMethod.invokeExplosively(FrameworkMethod.java:47)
	at org.junit.internal.runners.statements.InvokeMethod.evaluate(InvokeMethod.java:17)
	at org.junit.internal.runners.statements.RunBefores.evaluate(RunBefores.java:26)
	at org.junit.internal.runners.statements.RunAfters.evaluate(RunAfters.java:27)
	at org.mockito.internal.junit.JUnitRule$1.evaluateSafely(JUnitRule.java:52)
	at org.mockito.internal.junit.JUnitRule$1.evaluate(JUnitRule.java:43)
	at org.junit.rules.ExternalResource$1.evaluate(ExternalResource.java:48)
	at org.junit.rules.RunRules.evaluate(RunRules.java:20)
	at org.junit.runners.ParentRunner.runLeaf(ParentRunner.java:325)
	at org.junit.runners.BlockJUnit4ClassRunner.runChild(BlockJUnit4ClassRunner.java:78)
	at org.junit.runners.BlockJUnit4ClassRunner.runChild(BlockJUnit4ClassRunner.java:57)
	at org.junit.runners.ParentRunner$3.run(ParentRunner.java:290)
	at org.junit.runners.ParentRunner$1.schedule(ParentRunner.java:71)
	at org.junit.runners.ParentRunner.runChildren(ParentRunner.java:288)
	at org.junit.runners.ParentRunner.access$000(ParentRunner.java:58)
	at org.junit.runners.ParentRunner$2.evaluate(ParentRunner.java:268)
	at org.junit.runners.ParentRunner.run(ParentRunner.java:363)
	at org.apache.maven.surefire.junit4.JUnit4Provider.execute(JUnit4Provider.java:365)
	at org.apache.maven.surefire.junit4.JUnit4Provider.executeWithRerun(JUnit4Provider.java:273)
	at org.apache.maven.surefire.junit4.JUnit4Provider.executeTestSet(JUnit4Provider.java:238)
	at org.apache.maven.surefire.junit4.JUnit4Provider.invoke(JUnit4Provider.java:159)
	at org.apache.maven.surefire.booter.ForkedBooter.invokeProviderInSameClassLoader(ForkedBooter.java:384)
	at org.apache.maven.surefire.booter.ForkedBooter.runSuitesInProcess(ForkedBooter.java:345)
	at org.apache.maven.surefire.booter.ForkedBooter.execute(ForkedBooter.java:126)
	at org.apache.maven.surefire.booter.ForkedBooter.main(ForkedBooter.java:418)
15:22:40.197 [main] ERROR No parser available for this RDF format
org.eclipse.rdf4j.rio.UnsupportedRDFormatException: Did not recognise RDF format string file:/home/hudson/genie.rdf4j/.jenkins/jobs/rdf4j-pr-verify/workspace/tools/console/does-not-exist.docx
	at org.eclipse.rdf4j.rio.Rio.lambda$unsupportedFormat$1(Rio.java:577)
	at java.util.Optional.orElseThrow(Optional.java:290)
	at org.eclipse.rdf4j.console.command.Verify.verify(Verify.java:124)
	at org.eclipse.rdf4j.console.command.Verify.execute(Verify.java:97)
	at org.eclipse.rdf4j.console.command.VerifyTest.testVerifyWrongFormat(VerifyTest.java:69)
	at sun.reflect.NativeMethodAccessorImpl.invoke0(Native Method)
	at sun.reflect.NativeMethodAccessorImpl.invoke(NativeMethodAccessorImpl.java:62)
	at sun.reflect.DelegatingMethodAccessorImpl.invoke(DelegatingMethodAccessorImpl.java:43)
	at java.lang.reflect.Method.invoke(Method.java:498)
	at org.junit.runners.model.FrameworkMethod$1.runReflectiveCall(FrameworkMethod.java:50)
	at org.junit.internal.runners.model.ReflectiveCallable.run(ReflectiveCallable.java:12)
	at org.junit.runners.model.FrameworkMethod.invokeExplosively(FrameworkMethod.java:47)
	at org.junit.internal.runners.statements.InvokeMethod.evaluate(InvokeMethod.java:17)
	at org.junit.internal.runners.statements.RunBefores.evaluate(RunBefores.java:26)
	at org.junit.internal.runners.statements.RunAfters.evaluate(RunAfters.java:27)
	at org.mockito.internal.junit.JUnitRule$1.evaluateSafely(JUnitRule.java:52)
	at org.mockito.internal.junit.JUnitRule$1.evaluate(JUnitRule.java:43)
	at org.junit.rules.ExternalResource$1.evaluate(ExternalResource.java:48)
	at org.junit.rules.RunRules.evaluate(RunRules.java:20)
	at org.junit.runners.ParentRunner.runLeaf(ParentRunner.java:325)
	at org.junit.runners.BlockJUnit4ClassRunner.runChild(BlockJUnit4ClassRunner.java:78)
	at org.junit.runners.BlockJUnit4ClassRunner.runChild(BlockJUnit4ClassRunner.java:57)
	at org.junit.runners.ParentRunner$3.run(ParentRunner.java:290)
	at org.junit.runners.ParentRunner$1.schedule(ParentRunner.java:71)
	at org.junit.runners.ParentRunner.runChildren(ParentRunner.java:288)
	at org.junit.runners.ParentRunner.access$000(ParentRunner.java:58)
	at org.junit.runners.ParentRunner$2.evaluate(ParentRunner.java:268)
	at org.junit.runners.ParentRunner.run(ParentRunner.java:363)
	at org.apache.maven.surefire.junit4.JUnit4Provider.execute(JUnit4Provider.java:365)
	at org.apache.maven.surefire.junit4.JUnit4Provider.executeWithRerun(JUnit4Provider.java:273)
	at org.apache.maven.surefire.junit4.JUnit4Provider.executeTestSet(JUnit4Provider.java:238)
	at org.apache.maven.surefire.junit4.JUnit4Provider.invoke(JUnit4Provider.java:159)
	at org.apache.maven.surefire.booter.ForkedBooter.invokeProviderInSameClassLoader(ForkedBooter.java:384)
	at org.apache.maven.surefire.booter.ForkedBooter.runSuitesInProcess(ForkedBooter.java:345)
	at org.apache.maven.surefire.booter.ForkedBooter.execute(ForkedBooter.java:126)
	at org.apache.maven.surefire.booter.ForkedBooter.main(ForkedBooter.java:418)
15:22:40.212 [main] ERROR Unexpected RDFParseException
org.eclipse.rdf4j.rio.RDFParseException: IRI included an unencoded space: '32' [line 1]
	at org.eclipse.rdf4j.rio.helpers.RDFParserHelper.reportError(RDFParserHelper.java:265)
	at org.eclipse.rdf4j.rio.helpers.AbstractRDFParser.reportError(AbstractRDFParser.java:628)
	at org.eclipse.rdf4j.rio.turtle.TurtleParser.reportError(TurtleParser.java:1297)
	at org.eclipse.rdf4j.rio.turtle.TurtleParser.parseURI(TurtleParser.java:902)
	at org.eclipse.rdf4j.rio.turtle.TurtleParser.parseValue(TurtleParser.java:575)
	at org.eclipse.rdf4j.rio.turtle.TurtleParser.parseSubject(TurtleParser.java:406)
	at org.eclipse.rdf4j.rio.turtle.TurtleParser.parseTriples(TurtleParser.java:347)
	at org.eclipse.rdf4j.rio.turtle.TurtleParser.parseStatement(TurtleParser.java:216)
	at org.eclipse.rdf4j.rio.turtle.TurtleParser.parse(TurtleParser.java:178)
	at org.eclipse.rdf4j.rio.turtle.TurtleParser.parse(TurtleParser.java:130)
	at org.eclipse.rdf4j.console.command.Verify.verify(Verify.java:145)
	at org.eclipse.rdf4j.console.command.Verify.execute(Verify.java:97)
	at org.eclipse.rdf4j.console.command.VerifyTest.testVerifySpaceIRI(VerifyTest.java:103)
	at sun.reflect.NativeMethodAccessorImpl.invoke0(Native Method)
	at sun.reflect.NativeMethodAccessorImpl.invoke(NativeMethodAccessorImpl.java:62)
	at sun.reflect.DelegatingMethodAccessorImpl.invoke(DelegatingMethodAccessorImpl.java:43)
	at java.lang.reflect.Method.invoke(Method.java:498)
	at org.junit.runners.model.FrameworkMethod$1.runReflectiveCall(FrameworkMethod.java:50)
	at org.junit.internal.runners.model.ReflectiveCallable.run(ReflectiveCallable.java:12)
	at org.junit.runners.model.FrameworkMethod.invokeExplosively(FrameworkMethod.java:47)
	at org.junit.internal.runners.statements.InvokeMethod.evaluate(InvokeMethod.java:17)
	at org.junit.internal.runners.statements.RunBefores.evaluate(RunBefores.java:26)
	at org.junit.internal.runners.statements.RunAfters.evaluate(RunAfters.java:27)
	at org.mockito.internal.junit.JUnitRule$1.evaluateSafely(JUnitRule.java:52)
	at org.mockito.internal.junit.JUnitRule$1.evaluate(JUnitRule.java:43)
	at org.junit.rules.ExternalResource$1.evaluate(ExternalResource.java:48)
	at org.junit.rules.RunRules.evaluate(RunRules.java:20)
	at org.junit.runners.ParentRunner.runLeaf(ParentRunner.java:325)
	at org.junit.runners.BlockJUnit4ClassRunner.runChild(BlockJUnit4ClassRunner.java:78)
	at org.junit.runners.BlockJUnit4ClassRunner.runChild(BlockJUnit4ClassRunner.java:57)
	at org.junit.runners.ParentRunner$3.run(ParentRunner.java:290)
	at org.junit.runners.ParentRunner$1.schedule(ParentRunner.java:71)
	at org.junit.runners.ParentRunner.runChildren(ParentRunner.java:288)
	at org.junit.runners.ParentRunner.access$000(ParentRunner.java:58)
	at org.junit.runners.ParentRunner$2.evaluate(ParentRunner.java:268)
	at org.junit.runners.ParentRunner.run(ParentRunner.java:363)
	at org.apache.maven.surefire.junit4.JUnit4Provider.execute(JUnit4Provider.java:365)
	at org.apache.maven.surefire.junit4.JUnit4Provider.executeWithRerun(JUnit4Provider.java:273)
	at org.apache.maven.surefire.junit4.JUnit4Provider.executeTestSet(JUnit4Provider.java:238)
	at org.apache.maven.surefire.junit4.JUnit4Provider.invoke(JUnit4Provider.java:159)
	at org.apache.maven.surefire.booter.ForkedBooter.invokeProviderInSameClassLoader(ForkedBooter.java:384)
	at org.apache.maven.surefire.booter.ForkedBooter.runSuitesInProcess(ForkedBooter.java:345)
	at org.apache.maven.surefire.booter.ForkedBooter.execute(ForkedBooter.java:126)
	at org.apache.maven.surefire.booter.ForkedBooter.main(ForkedBooter.java:418)
[INFO] Tests run: 10, Failures: 0, Errors: 0, Skipped: 0, Time elapsed: 0.659 s - in org.eclipse.rdf4j.console.command.VerifyTest
[INFO] Running org.eclipse.rdf4j.console.command.DropTest
[MockitoHint] DropTest.testUserAbortedUnsafeDropBeforeWarning (see javadoc for MockitoHint):
[MockitoHint] 1. Unused -> at org.eclipse.rdf4j.console.command.DropTest.setUp(DropTest.java:50)

[INFO] Tests run: 3, Failures: 0, Errors: 0, Skipped: 0, Time elapsed: 0.152 s - in org.eclipse.rdf4j.console.command.DropTest
[INFO] Running org.eclipse.rdf4j.console.command.FederateTest
15:22:40.432 [main] DEBUG Initializing MemoryStore...
15:22:40.435 [main] DEBUG Initializing data file...
15:22:40.435 [main] DEBUG Data file initialized
15:22:40.435 [main] DEBUG MemoryStore initialized
15:22:40.438 [main] DEBUG syncing data to file...
15:22:40.439 [main] DEBUG Data synced to file
15:22:40.452 [main] DEBUG Initializing MemoryStore...
15:22:40.454 [main] DEBUG Initializing data file...
15:22:40.455 [main] DEBUG Data file initialized
15:22:40.455 [main] DEBUG MemoryStore initialized
15:22:40.462 [main] DEBUG syncing data to file...
15:22:40.463 [main] DEBUG Data synced to file
15:22:40.496 [main] DEBUG Federate called with federation ID = fedID, and member ID's = [sparql][alien][http].
  Distinct set to false, and readonly set to true.

15:22:40.500 [main] DEBUG Federation repository root node: _:node1drh0ehvlx216
15:22:40.502 [main] DEBUG _:node1drh0ehvlx216 http://www.w3.org/1999/02/22-rdf-syntax-ns#type http://www.openrdf.org/config/repository#Repository
15:22:40.502 [main] DEBUG _:node1drh0ehvlx216 http://www.openrdf.org/config/repository#repositoryID "fedID"
15:22:40.502 [main] DEBUG _:node1drh0ehvlx216 http://www.w3.org/2000/01/rdf-schema#label "Test Federation Title"
15:22:40.502 [main] DEBUG _:node1drh0ehvlx216 http://www.openrdf.org/config/repository#repositoryImpl _:node1drh0ehvlx217
15:22:40.502 [main] DEBUG _:node1drh0ehvlx217 http://www.openrdf.org/config/repository#repositoryType "openrdf:SailRepository"
15:22:40.502 [main] DEBUG _:node1drh0ehvlx217 http://www.openrdf.org/config/repository/sail#sailImpl _:node1drh0ehvlx218
15:22:40.502 [main] DEBUG _:node1drh0ehvlx218 http://www.openrdf.org/config/sail#sailType "openrdf:Federation"
15:22:40.503 [main] DEBUG _:node1drh0ehvlx218 http://www.openrdf.org/config/sail/federation#readOnly "true"^^<http://www.w3.org/2001/XMLSchema#boolean>
15:22:40.503 [main] DEBUG _:node1drh0ehvlx218 http://www.openrdf.org/config/sail/federation#distinct "false"^^<http://www.w3.org/2001/XMLSchema#boolean>
15:22:40.503 [main] DEBUG Adding member: sparql
15:22:40.503 [main] DEBUG _:node1drh0ehvlx218 http://www.openrdf.org/config/sail/federation#member _:node1drh0ehvlx219
15:22:40.504 [main] DEBUG _:node1drh0ehvlx219 http://www.openrdf.org/config/repository#repositoryType "openrdf:SPARQLRepository"
15:22:40.504 [main] DEBUG _:node1drh0ehvlx219 http://www.openrdf.org/config/repository/sparql#query-endpoint http://localhost:8080/openrdf-sesame/repositories/sparql
15:22:40.504 [main] DEBUG Added member sparql: 
15:22:40.504 [main] DEBUG Adding member: alien
15:22:40.504 [main] DEBUG _:node1drh0ehvlx218 http://www.openrdf.org/config/sail/federation#member _:node1drh0ehvlx222
15:22:40.505 [main] DEBUG _:node1drh0ehvlx222 http://www.openrdf.org/config/repository#repositoryType "openrdf:ProxyRepository"
15:22:40.505 [main] DEBUG _:node1drh0ehvlx222 http://www.openrdf.org/config/repository/proxy#proxiedID "alien"
15:22:40.505 [main] DEBUG Added member alien: 
15:22:40.505 [main] DEBUG Adding member: http
15:22:40.505 [main] DEBUG _:node1drh0ehvlx218 http://www.openrdf.org/config/sail/federation#member _:node1drh0ehvlx225
15:22:40.506 [main] DEBUG _:node1drh0ehvlx225 http://www.openrdf.org/config/repository#repositoryType "openrdf:HTTPRepository"
15:22:40.506 [main] DEBUG _:node1drh0ehvlx225 http://www.openrdf.org/config/repository/http#repositoryURL http://localhost:8080/openrdf-sesame/repositories/http
15:22:40.507 [main] DEBUG Added member http: 
15:22:40.550 [main] DEBUG Initializing MemoryStore...
15:22:40.551 [main] DEBUG Initializing data file...
15:22:40.552 [main] DEBUG Data file initialized
15:22:40.552 [main] DEBUG MemoryStore initialized
15:22:40.554 [main] DEBUG syncing data to file...
15:22:40.555 [main] DEBUG Data synced to file
15:22:40.558 [main] DEBUG Initializing MemoryStore...
15:22:40.558 [main] DEBUG Initializing data file...
15:22:40.558 [main] DEBUG Data file initialized
15:22:40.558 [main] DEBUG MemoryStore initialized
15:22:40.560 [main] DEBUG syncing data to file...
15:22:40.560 [main] DEBUG Data synced to file
15:22:40.567 [main] ERROR Duplicate repository id's specified.
[MockitoHint] FederateTest.testDuplicateMembersPrintsError (see javadoc for MockitoHint):
[MockitoHint] 1. Unused -> at org.eclipse.rdf4j.console.command.FederateTest.setUp(FederateTest.java:87)
[MockitoHint] 2. Unused -> at org.eclipse.rdf4j.console.command.FederateTest.setUp(FederateTest.java:88)

15:22:40.574 [main] DEBUG Initializing MemoryStore...
15:22:40.575 [main] DEBUG Initializing data file...
15:22:40.575 [main] DEBUG Data file initialized
15:22:40.575 [main] DEBUG MemoryStore initialized
15:22:40.577 [main] DEBUG syncing data to file...
15:22:40.578 [main] DEBUG Data synced to file
15:22:40.581 [main] DEBUG Initializing MemoryStore...
15:22:40.581 [main] DEBUG Initializing data file...
15:22:40.581 [main] DEBUG Data file initialized
15:22:40.581 [main] DEBUG MemoryStore initialized
15:22:40.583 [main] DEBUG syncing data to file...
15:22:40.583 [main] DEBUG Data synced to file
15:22:40.591 [main] DEBUG Federate called with federation ID = alien, and member ID's = [fedID][scary].
  Distinct set to false, and readonly set to true.

15:22:40.592 [main] ERROR alien already exists.
[MockitoHint] FederateTest.testFedAlreadyExistsPrintsSpecificError (see javadoc for MockitoHint):
[MockitoHint] 1. Unused -> at org.eclipse.rdf4j.console.command.FederateTest.setUp(FederateTest.java:88)

15:22:40.598 [main] DEBUG Initializing MemoryStore...
15:22:40.599 [main] DEBUG Initializing data file...
15:22:40.600 [main] DEBUG Data file initialized
15:22:40.600 [main] DEBUG MemoryStore initialized
15:22:40.602 [main] DEBUG syncing data to file...
15:22:40.602 [main] DEBUG Data synced to file
15:22:40.605 [main] DEBUG Initializing MemoryStore...
15:22:40.605 [main] DEBUG Initializing data file...
15:22:40.605 [main] DEBUG Data file initialized
15:22:40.605 [main] DEBUG MemoryStore initialized
15:22:40.606 [main] DEBUG syncing data to file...
15:22:40.607 [main] DEBUG Data synced to file
15:22:40.614 [main] DEBUG Federate called with federation ID = fedID, and member ID's = [alien][scary].
  Distinct set to true, and readonly set to false.

15:22:40.615 [main] DEBUG Federation repository root node: _:node1drh0ehvlx338
15:22:40.615 [main] DEBUG _:node1drh0ehvlx338 http://www.w3.org/1999/02/22-rdf-syntax-ns#type http://www.openrdf.org/config/repository#Repository
15:22:40.615 [main] DEBUG _:node1drh0ehvlx338 http://www.openrdf.org/config/repository#repositoryID "fedID"
15:22:40.615 [main] DEBUG _:node1drh0ehvlx338 http://www.w3.org/2000/01/rdf-schema#label "Test Federation Title"
15:22:40.615 [main] DEBUG _:node1drh0ehvlx338 http://www.openrdf.org/config/repository#repositoryImpl _:node1drh0ehvlx339
15:22:40.615 [main] DEBUG _:node1drh0ehvlx339 http://www.openrdf.org/config/repository#repositoryType "openrdf:SailRepository"
15:22:40.615 [main] DEBUG _:node1drh0ehvlx339 http://www.openrdf.org/config/repository/sail#sailImpl _:node1drh0ehvlx340
15:22:40.615 [main] DEBUG _:node1drh0ehvlx340 http://www.openrdf.org/config/sail#sailType "openrdf:Federation"
15:22:40.615 [main] DEBUG _:node1drh0ehvlx340 http://www.openrdf.org/config/sail/federation#readOnly "false"^^<http://www.w3.org/2001/XMLSchema#boolean>
15:22:40.615 [main] DEBUG _:node1drh0ehvlx340 http://www.openrdf.org/config/sail/federation#distinct "true"^^<http://www.w3.org/2001/XMLSchema#boolean>
15:22:40.615 [main] DEBUG Adding member: alien
15:22:40.615 [main] DEBUG _:node1drh0ehvlx340 http://www.openrdf.org/config/sail/federation#member _:node1drh0ehvlx341
15:22:40.616 [main] DEBUG _:node1drh0ehvlx341 http://www.openrdf.org/config/repository#repositoryType "openrdf:ProxyRepository"
15:22:40.616 [main] DEBUG _:node1drh0ehvlx341 http://www.openrdf.org/config/repository/proxy#proxiedID "alien"
15:22:40.616 [main] DEBUG Added member alien: 
15:22:40.616 [main] DEBUG Adding member: scary
15:22:40.616 [main] DEBUG _:node1drh0ehvlx340 http://www.openrdf.org/config/sail/federation#member _:node1drh0ehvlx344
15:22:40.616 [main] DEBUG _:node1drh0ehvlx344 http://www.openrdf.org/config/repository#repositoryType "openrdf:ProxyRepository"
15:22:40.616 [main] DEBUG _:node1drh0ehvlx344 http://www.openrdf.org/config/repository/proxy#proxiedID "scary"
15:22:40.617 [main] DEBUG Added member scary: 
15:22:40.637 [main] DEBUG Initializing MemoryStore...
15:22:40.638 [main] DEBUG Initializing data file...
15:22:40.638 [main] DEBUG Data file initialized
15:22:40.638 [main] DEBUG MemoryStore initialized
15:22:40.640 [main] DEBUG syncing data to file...
15:22:40.641 [main] DEBUG Data synced to file
15:22:40.644 [main] DEBUG Initializing MemoryStore...
15:22:40.646 [main] DEBUG Initializing data file...
15:22:40.646 [main] DEBUG Data file initialized
15:22:40.646 [main] DEBUG MemoryStore initialized
15:22:40.648 [main] DEBUG syncing data to file...
15:22:40.649 [main] DEBUG Data synced to file
15:22:40.657 [main] DEBUG Federate called with federation ID = fedID, and member ID's = [sparql][sparql2].
  Distinct set to false, and readonly set to false.

15:22:40.659 [main] ERROR sparql is read-only.
15:22:40.661 [main] ERROR sparql2 is read-only.
[MockitoHint] FederateTest.testSparqlAndNotReadOnlyPrintsError (see javadoc for MockitoHint):
[MockitoHint] 1. Unused -> at org.eclipse.rdf4j.console.command.FederateTest.setUp(FederateTest.java:88)

15:22:40.669 [main] DEBUG Initializing MemoryStore...
15:22:40.670 [main] DEBUG Initializing data file...
15:22:40.671 [main] DEBUG Data file initialized
15:22:40.671 [main] DEBUG MemoryStore initialized
15:22:40.673 [main] DEBUG syncing data to file...
15:22:40.674 [main] DEBUG Data synced to file
15:22:40.677 [main] DEBUG Initializing MemoryStore...
15:22:40.678 [main] DEBUG Initializing data file...
15:22:40.678 [main] DEBUG Data file initialized
15:22:40.678 [main] DEBUG MemoryStore initialized
15:22:40.680 [main] DEBUG syncing data to file...
15:22:40.680 [main] DEBUG Data synced to file
[MockitoHint] FederateTest.testNoArgumentsPrintsHelp (see javadoc for MockitoHint):
[MockitoHint] 1. Unused -> at org.eclipse.rdf4j.console.command.FederateTest.setUp(FederateTest.java:87)
[MockitoHint] 2. Unused -> at org.eclipse.rdf4j.console.command.FederateTest.setUp(FederateTest.java:88)

15:22:40.694 [main] DEBUG Initializing MemoryStore...
15:22:40.694 [main] DEBUG Initializing data file...
15:22:40.695 [main] DEBUG Data file initialized
15:22:40.695 [main] DEBUG MemoryStore initialized
15:22:40.696 [main] DEBUG syncing data to file...
15:22:40.697 [main] DEBUG Data synced to file
15:22:40.699 [main] DEBUG Initializing MemoryStore...
15:22:40.700 [main] DEBUG Initializing data file...
15:22:40.700 [main] DEBUG Data file initialized
15:22:40.700 [main] DEBUG MemoryStore initialized
15:22:40.702 [main] DEBUG syncing data to file...
15:22:40.702 [main] DEBUG Data synced to file
15:22:40.709 [main] DEBUG Federate called with federation ID = type=memory, and member ID's = [fedID][alien][scary].
  Distinct set to false, and readonly set to true.

15:22:40.709 [main] ERROR fedID does not exist.
[MockitoHint] FederateTest.testInvalidArgumentPrintsError (see javadoc for MockitoHint):
[MockitoHint] 1. Unused -> at org.eclipse.rdf4j.console.command.FederateTest.setUp(FederateTest.java:88)

15:22:40.717 [main] DEBUG Initializing MemoryStore...
15:22:40.718 [main] DEBUG Initializing data file...
15:22:40.719 [main] DEBUG Data file initialized
15:22:40.719 [main] DEBUG MemoryStore initialized
15:22:40.720 [main] DEBUG syncing data to file...
15:22:40.721 [main] DEBUG Data synced to file
15:22:40.724 [main] DEBUG Initializing MemoryStore...
15:22:40.725 [main] DEBUG Initializing data file...
15:22:40.725 [main] DEBUG Data file initialized
15:22:40.725 [main] DEBUG MemoryStore initialized
15:22:40.726 [main] DEBUG syncing data to file...
15:22:40.727 [main] DEBUG Data synced to file
15:22:40.733 [main] DEBUG Federate called with federation ID = fedID, and member ID's = [sparql][sparql2].
  Distinct set to false, and readonly set to true.

15:22:40.734 [main] DEBUG Federation repository root node: _:node1drh0ehvlx494
15:22:40.735 [main] DEBUG _:node1drh0ehvlx494 http://www.w3.org/1999/02/22-rdf-syntax-ns#type http://www.openrdf.org/config/repository#Repository
15:22:40.735 [main] DEBUG _:node1drh0ehvlx494 http://www.openrdf.org/config/repository#repositoryID "fedID"
15:22:40.735 [main] DEBUG _:node1drh0ehvlx494 http://www.w3.org/2000/01/rdf-schema#label "Test Federation Title"
15:22:40.735 [main] DEBUG _:node1drh0ehvlx494 http://www.openrdf.org/config/repository#repositoryImpl _:node1drh0ehvlx495
15:22:40.735 [main] DEBUG _:node1drh0ehvlx495 http://www.openrdf.org/config/repository#repositoryType "openrdf:SailRepository"
15:22:40.735 [main] DEBUG _:node1drh0ehvlx495 http://www.openrdf.org/config/repository/sail#sailImpl _:node1drh0ehvlx496
15:22:40.735 [main] DEBUG _:node1drh0ehvlx496 http://www.openrdf.org/config/sail#sailType "openrdf:Federation"
15:22:40.735 [main] DEBUG _:node1drh0ehvlx496 http://www.openrdf.org/config/sail/federation#readOnly "true"^^<http://www.w3.org/2001/XMLSchema#boolean>
15:22:40.735 [main] DEBUG _:node1drh0ehvlx496 http://www.openrdf.org/config/sail/federation#distinct "false"^^<http://www.w3.org/2001/XMLSchema#boolean>
15:22:40.735 [main] DEBUG Adding member: sparql
15:22:40.735 [main] DEBUG _:node1drh0ehvlx496 http://www.openrdf.org/config/sail/federation#member _:node1drh0ehvlx497
15:22:40.735 [main] DEBUG _:node1drh0ehvlx497 http://www.openrdf.org/config/repository#repositoryType "openrdf:SPARQLRepository"
15:22:40.736 [main] DEBUG _:node1drh0ehvlx497 http://www.openrdf.org/config/repository/sparql#query-endpoint http://localhost:8080/openrdf-sesame/repositories/sparql
15:22:40.736 [main] DEBUG Added member sparql: 
15:22:40.736 [main] DEBUG Adding member: sparql2
15:22:40.736 [main] DEBUG _:node1drh0ehvlx496 http://www.openrdf.org/config/sail/federation#member _:node1drh0ehvlx500
15:22:40.736 [main] DEBUG _:node1drh0ehvlx500 http://www.openrdf.org/config/repository#repositoryType "openrdf:SPARQLRepository"
15:22:40.737 [main] DEBUG _:node1drh0ehvlx500 http://www.openrdf.org/config/repository/sparql#query-endpoint http://localhost:8080/openrdf-sesame/repositories/sparql
15:22:40.737 [main] DEBUG Added member sparql2: 
15:22:40.750 [main] DEBUG Initializing MemoryStore...
15:22:40.750 [main] DEBUG Initializing data file...
15:22:40.751 [main] DEBUG Data file initialized
15:22:40.751 [main] DEBUG MemoryStore initialized
15:22:40.753 [main] DEBUG syncing data to file...
15:22:40.753 [main] DEBUG Data synced to file
15:22:40.756 [main] DEBUG Initializing MemoryStore...
15:22:40.758 [main] DEBUG Initializing data file...
15:22:40.758 [main] DEBUG Data file initialized
15:22:40.758 [main] DEBUG MemoryStore initialized
15:22:40.760 [main] DEBUG syncing data to file...
15:22:40.761 [main] DEBUG Data synced to file
15:22:40.768 [main] DEBUG Federate called with federation ID = fedID, and member ID's = [http][sparql].
  Distinct set to false, and readonly set to true.

15:22:40.770 [main] DEBUG Federation repository root node: _:node1drh0ehvlx549
15:22:40.770 [main] DEBUG _:node1drh0ehvlx549 http://www.w3.org/1999/02/22-rdf-syntax-ns#type http://www.openrdf.org/config/repository#Repository
15:22:40.770 [main] DEBUG _:node1drh0ehvlx549 http://www.openrdf.org/config/repository#repositoryID "fedID"
15:22:40.770 [main] DEBUG _:node1drh0ehvlx549 http://www.w3.org/2000/01/rdf-schema#label "Test Federation Title"
15:22:40.770 [main] DEBUG _:node1drh0ehvlx549 http://www.openrdf.org/config/repository#repositoryImpl _:node1drh0ehvlx550
15:22:40.770 [main] DEBUG _:node1drh0ehvlx550 http://www.openrdf.org/config/repository#repositoryType "openrdf:SailRepository"
15:22:40.770 [main] DEBUG _:node1drh0ehvlx550 http://www.openrdf.org/config/repository/sail#sailImpl _:node1drh0ehvlx551
15:22:40.770 [main] DEBUG _:node1drh0ehvlx551 http://www.openrdf.org/config/sail#sailType "openrdf:Federation"
15:22:40.770 [main] DEBUG _:node1drh0ehvlx551 http://www.openrdf.org/config/sail/federation#readOnly "true"^^<http://www.w3.org/2001/XMLSchema#boolean>
15:22:40.770 [main] DEBUG _:node1drh0ehvlx551 http://www.openrdf.org/config/sail/federation#distinct "false"^^<http://www.w3.org/2001/XMLSchema#boolean>
15:22:40.770 [main] DEBUG Adding member: http
15:22:40.771 [main] DEBUG _:node1drh0ehvlx551 http://www.openrdf.org/config/sail/federation#member _:node1drh0ehvlx552
15:22:40.772 [main] DEBUG _:node1drh0ehvlx552 http://www.openrdf.org/config/repository#repositoryType "openrdf:HTTPRepository"
15:22:40.772 [main] DEBUG _:node1drh0ehvlx552 http://www.openrdf.org/config/repository/http#repositoryURL http://localhost:8080/openrdf-sesame/repositories/http
15:22:40.772 [main] DEBUG Added member http: 
15:22:40.772 [main] DEBUG Adding member: sparql
15:22:40.772 [main] DEBUG _:node1drh0ehvlx551 http://www.openrdf.org/config/sail/federation#member _:node1drh0ehvlx555
15:22:40.773 [main] DEBUG _:node1drh0ehvlx555 http://www.openrdf.org/config/repository#repositoryType "openrdf:SPARQLRepository"
15:22:40.774 [main] DEBUG _:node1drh0ehvlx555 http://www.openrdf.org/config/repository/sparql#query-endpoint http://localhost:8080/openrdf-sesame/repositories/sparql
15:22:40.774 [main] DEBUG Added member sparql: 
15:22:40.784 [main] DEBUG Initializing MemoryStore...
15:22:40.786 [main] DEBUG Initializing data file...
15:22:40.786 [main] DEBUG Data file initialized
15:22:40.786 [main] DEBUG MemoryStore initialized
15:22:40.787 [main] DEBUG syncing data to file...
15:22:40.788 [main] DEBUG Data synced to file
15:22:40.791 [main] DEBUG Initializing MemoryStore...
15:22:40.792 [main] DEBUG Initializing data file...
15:22:40.792 [main] DEBUG Data file initialized
15:22:40.792 [main] DEBUG MemoryStore initialized
15:22:40.793 [main] DEBUG syncing data to file...
15:22:40.794 [main] DEBUG Data synced to file
15:22:40.800 [main] DEBUG Federate called with federation ID = fedID, and member ID's = [alien][FreeLunch].
  Distinct set to false, and readonly set to true.

15:22:40.801 [main] ERROR FreeLunch does not exist.
[MockitoHint] FederateTest.testNonexistentMemberPrintsSpecificError (see javadoc for MockitoHint):
[MockitoHint] 1. Unused -> at org.eclipse.rdf4j.console.command.FederateTest.setUp(FederateTest.java:88)

15:22:40.807 [main] DEBUG Initializing MemoryStore...
15:22:40.808 [main] DEBUG Initializing data file...
15:22:40.809 [main] DEBUG Data file initialized
15:22:40.809 [main] DEBUG MemoryStore initialized
15:22:40.810 [main] DEBUG syncing data to file...
15:22:40.811 [main] DEBUG Data synced to file
15:22:40.814 [main] DEBUG Initializing MemoryStore...
15:22:40.814 [main] DEBUG Initializing data file...
15:22:40.815 [main] DEBUG Data file initialized
15:22:40.815 [main] DEBUG MemoryStore initialized
15:22:40.816 [main] DEBUG syncing data to file...
15:22:40.817 [main] DEBUG Data synced to file
15:22:40.822 [main] ERROR Duplicate repository id's specified.
[MockitoHint] FederateTest.testFedSameAsMemberPrintsError (see javadoc for MockitoHint):
[MockitoHint] 1. Unused -> at org.eclipse.rdf4j.console.command.FederateTest.setUp(FederateTest.java:87)
[MockitoHint] 2. Unused -> at org.eclipse.rdf4j.console.command.FederateTest.setUp(FederateTest.java:88)

15:22:40.828 [main] DEBUG Initializing MemoryStore...
15:22:40.829 [main] DEBUG Initializing data file...
15:22:40.829 [main] DEBUG Data file initialized
15:22:40.829 [main] DEBUG MemoryStore initialized
15:22:40.830 [main] DEBUG syncing data to file...
15:22:40.831 [main] DEBUG Data synced to file
15:22:40.833 [main] DEBUG Initializing MemoryStore...
15:22:40.834 [main] DEBUG Initializing data file...
15:22:40.834 [main] DEBUG Data file initialized
15:22:40.834 [main] DEBUG MemoryStore initialized
15:22:40.835 [main] DEBUG syncing data to file...
15:22:40.836 [main] DEBUG Data synced to file
[MockitoHint] FederateTest.testTwoArgumentsPrintsHelp (see javadoc for MockitoHint):
[MockitoHint] 1. Unused -> at org.eclipse.rdf4j.console.command.FederateTest.setUp(FederateTest.java:87)
[MockitoHint] 2. Unused -> at org.eclipse.rdf4j.console.command.FederateTest.setUp(FederateTest.java:88)

15:22:40.847 [main] DEBUG Initializing MemoryStore...
15:22:40.848 [main] DEBUG Initializing data file...
15:22:40.848 [main] DEBUG Data file initialized
15:22:40.849 [main] DEBUG MemoryStore initialized
15:22:40.850 [main] DEBUG syncing data to file...
15:22:40.851 [main] DEBUG Data synced to file
15:22:40.853 [main] DEBUG Initializing MemoryStore...
15:22:40.854 [main] DEBUG Initializing data file...
15:22:40.855 [main] DEBUG Data file initialized
15:22:40.855 [main] DEBUG MemoryStore initialized
15:22:40.856 [main] DEBUG syncing data to file...
15:22:40.857 [main] DEBUG Data synced to file
15:22:40.863 [main] DEBUG Federate called with federation ID = fedID, and member ID's = [alien][scary].
  Distinct set to false, and readonly set to true.

15:22:40.864 [main] DEBUG Federation repository root node: _:node1drh0ehvlx692
15:22:40.864 [main] DEBUG _:node1drh0ehvlx692 http://www.w3.org/1999/02/22-rdf-syntax-ns#type http://www.openrdf.org/config/repository#Repository
15:22:40.864 [main] DEBUG _:node1drh0ehvlx692 http://www.openrdf.org/config/repository#repositoryID "fedID"
15:22:40.864 [main] DEBUG _:node1drh0ehvlx692 http://www.w3.org/2000/01/rdf-schema#label "Test Federation Title"
15:22:40.864 [main] DEBUG _:node1drh0ehvlx692 http://www.openrdf.org/config/repository#repositoryImpl _:node1drh0ehvlx693
15:22:40.864 [main] DEBUG _:node1drh0ehvlx693 http://www.openrdf.org/config/repository#repositoryType "openrdf:SailRepository"
15:22:40.864 [main] DEBUG _:node1drh0ehvlx693 http://www.openrdf.org/config/repository/sail#sailImpl _:node1drh0ehvlx694
15:22:40.864 [main] DEBUG _:node1drh0ehvlx694 http://www.openrdf.org/config/sail#sailType "openrdf:Federation"
15:22:40.864 [main] DEBUG _:node1drh0ehvlx694 http://www.openrdf.org/config/sail/federation#readOnly "true"^^<http://www.w3.org/2001/XMLSchema#boolean>
15:22:40.864 [main] DEBUG _:node1drh0ehvlx694 http://www.openrdf.org/config/sail/federation#distinct "false"^^<http://www.w3.org/2001/XMLSchema#boolean>
15:22:40.864 [main] DEBUG Adding member: alien
15:22:40.864 [main] DEBUG _:node1drh0ehvlx694 http://www.openrdf.org/config/sail/federation#member _:node1drh0ehvlx695
15:22:40.865 [main] DEBUG _:node1drh0ehvlx695 http://www.openrdf.org/config/repository#repositoryType "openrdf:ProxyRepository"
15:22:40.865 [main] DEBUG _:node1drh0ehvlx695 http://www.openrdf.org/config/repository/proxy#proxiedID "alien"
15:22:40.865 [main] DEBUG Added member alien: 
15:22:40.865 [main] DEBUG Adding member: scary
15:22:40.865 [main] DEBUG _:node1drh0ehvlx694 http://www.openrdf.org/config/sail/federation#member _:node1drh0ehvlx698
15:22:40.866 [main] DEBUG _:node1drh0ehvlx698 http://www.openrdf.org/config/repository#repositoryType "openrdf:ProxyRepository"
15:22:40.866 [main] DEBUG _:node1drh0ehvlx698 http://www.openrdf.org/config/repository/proxy#proxiedID "scary"
15:22:40.866 [main] DEBUG Added member scary: 
15:22:40.882 [main] DEBUG Initializing MemoryStore...
15:22:40.883 [main] DEBUG Initializing data file...
15:22:40.883 [main] DEBUG Data file initialized
15:22:40.883 [main] DEBUG MemoryStore initialized
15:22:40.885 [main] DEBUG syncing data to file...
15:22:40.886 [main] DEBUG Data synced to file
15:22:40.890 [main] DEBUG Initializing MemoryStore...
15:22:40.890 [main] DEBUG Initializing data file...
15:22:40.891 [main] DEBUG Data file initialized
15:22:40.891 [main] DEBUG MemoryStore initialized
15:22:40.892 [main] DEBUG syncing data to file...
15:22:40.893 [main] DEBUG Data synced to file
[MockitoHint] FederateTest.testOneArgumentPrintsHelp (see javadoc for MockitoHint):
[MockitoHint] 1. Unused -> at org.eclipse.rdf4j.console.command.FederateTest.setUp(FederateTest.java:87)
[MockitoHint] 2. Unused -> at org.eclipse.rdf4j.console.command.FederateTest.setUp(FederateTest.java:88)

15:22:40.907 [main] DEBUG Initializing MemoryStore...
15:22:40.908 [main] DEBUG Initializing data file...
15:22:40.908 [main] DEBUG Data file initialized
15:22:40.908 [main] DEBUG MemoryStore initialized
15:22:40.910 [main] DEBUG syncing data to file...
15:22:40.910 [main] DEBUG Data synced to file
15:22:40.913 [main] DEBUG Initializing MemoryStore...
15:22:40.913 [main] DEBUG Initializing data file...
15:22:40.913 [main] DEBUG Data file initialized
15:22:40.913 [main] DEBUG MemoryStore initialized
15:22:40.914 [main] DEBUG syncing data to file...
15:22:40.915 [main] DEBUG Data synced to file
15:22:40.921 [main] DEBUG Federate called with federation ID = fedID, and member ID's = [http][http2].
  Distinct set to false, and readonly set to true.

15:22:40.922 [main] DEBUG Federation repository root node: _:node1drh0ehvlx784
15:22:40.923 [main] DEBUG _:node1drh0ehvlx784 http://www.w3.org/1999/02/22-rdf-syntax-ns#type http://www.openrdf.org/config/repository#Repository
15:22:40.923 [main] DEBUG _:node1drh0ehvlx784 http://www.openrdf.org/config/repository#repositoryID "fedID"
15:22:40.923 [main] DEBUG _:node1drh0ehvlx784 http://www.w3.org/2000/01/rdf-schema#label "Test Federation Title"
15:22:40.923 [main] DEBUG _:node1drh0ehvlx784 http://www.openrdf.org/config/repository#repositoryImpl _:node1drh0ehvlx785
15:22:40.923 [main] DEBUG _:node1drh0ehvlx785 http://www.openrdf.org/config/repository#repositoryType "openrdf:SailRepository"
15:22:40.923 [main] DEBUG _:node1drh0ehvlx785 http://www.openrdf.org/config/repository/sail#sailImpl _:node1drh0ehvlx786
15:22:40.923 [main] DEBUG _:node1drh0ehvlx786 http://www.openrdf.org/config/sail#sailType "openrdf:Federation"
15:22:40.923 [main] DEBUG _:node1drh0ehvlx786 http://www.openrdf.org/config/sail/federation#readOnly "true"^^<http://www.w3.org/2001/XMLSchema#boolean>
15:22:40.923 [main] DEBUG _:node1drh0ehvlx786 http://www.openrdf.org/config/sail/federation#distinct "false"^^<http://www.w3.org/2001/XMLSchema#boolean>
15:22:40.923 [main] DEBUG Adding member: http
15:22:40.923 [main] DEBUG _:node1drh0ehvlx786 http://www.openrdf.org/config/sail/federation#member _:node1drh0ehvlx787
15:22:40.923 [main] DEBUG _:node1drh0ehvlx787 http://www.openrdf.org/config/repository#repositoryType "openrdf:HTTPRepository"
15:22:40.924 [main] DEBUG _:node1drh0ehvlx787 http://www.openrdf.org/config/repository/http#repositoryURL http://localhost:8080/openrdf-sesame/repositories/http
15:22:40.924 [main] DEBUG Added member http: 
15:22:40.924 [main] DEBUG Adding member: http2
15:22:40.924 [main] DEBUG _:node1drh0ehvlx786 http://www.openrdf.org/config/sail/federation#member _:node1drh0ehvlx790
15:22:40.924 [main] DEBUG _:node1drh0ehvlx790 http://www.openrdf.org/config/repository#repositoryType "openrdf:HTTPRepository"
15:22:40.924 [main] DEBUG _:node1drh0ehvlx790 http://www.openrdf.org/config/repository/http#repositoryURL http://localhost:8080/openrdf-sesame/repositories/http
15:22:40.925 [main] DEBUG Added member http2: 
[INFO] Tests run: 15, Failures: 0, Errors: 0, Skipped: 0, Time elapsed: 0.526 s - in org.eclipse.rdf4j.console.command.FederateTest
[INFO] Running org.eclipse.rdf4j.console.command.SparqlTest
[MockitoHint] SparqlTest.testInputFile (see javadoc for MockitoHint):
[MockitoHint] 1. Unused -> at org.eclipse.rdf4j.console.command.SparqlTest.setUp(SparqlTest.java:49)

15:22:40.986 [main] ERROR No suitable result writer found
[MockitoHint] SparqlTest.testSelectError (see javadoc for MockitoHint):
[MockitoHint] 1. Unused -> at org.eclipse.rdf4j.console.command.SparqlTest.setUp(SparqlTest.java:49)

[MockitoHint] SparqlTest.testSelectMissingBindings (see javadoc for MockitoHint):
[MockitoHint] 1. Unused -> at org.eclipse.rdf4j.console.command.SparqlTest.setUp(SparqlTest.java:49)

[MockitoHint] SparqlTest.testInputFileWorkdir (see javadoc for MockitoHint):
[MockitoHint] 1. Unused -> at org.eclipse.rdf4j.console.command.SparqlTest.setUp(SparqlTest.java:49)

[INFO] Tests run: 9, Failures: 0, Errors: 0, Skipped: 0, Time elapsed: 0.008 s - in org.eclipse.rdf4j.console.command.SparqlTest
[INFO] Running org.eclipse.rdf4j.console.UtilTest
 one, two
 three
 four
 five, six
 seven
 eight
[INFO] Tests run: 4, Failures: 0, Errors: 0, Skipped: 0, Time elapsed: 0 s - in org.eclipse.rdf4j.console.UtilTest
[INFO] Running org.eclipse.rdf4j.console.ConsoleIOTest
[INFO] Tests run: 3, Failures: 0, Errors: 0, Skipped: 0, Time elapsed: 0.048 s - in org.eclipse.rdf4j.console.ConsoleIOTest
[INFO] 
[INFO] Results:
[INFO] 
[INFO] Tests run: 64, Failures: 0, Errors: 0, Skipped: 0
[INFO] 
[JENKINS] Recording test results
[INFO] 
[INFO] --- animal-sniffer-maven-plugin:1.16:check (default) @ rdf4j-console ---
[INFO] Checking unresolved references to org.codehaus.mojo.signature:java18:1.0
[INFO] 
[INFO] --- maven-jar-plugin:2.3.1:jar (default-jar) @ rdf4j-console ---
[INFO] Building jar: /home/hudson/genie.rdf4j/.jenkins/jobs/rdf4j-pr-verify/workspace/tools/console/target/rdf4j-console-3.1.0-SNAPSHOT.jar