SuccessConsole Output

Started calculate disk usage of build
Finished Calculation of disk usage of build in 0 seconds
Started calculate disk usage of workspace
Finished Calculation of disk usage of workspace in 0 seconds
[INFO] 
[INFO] ------------------< org.eclipse.rdf4j:rdf4j-console >-------------------
[INFO] Building RDF4J: Console 3.1.0-SNAPSHOT                           [70/85]
[INFO] --------------------------------[ jar ]---------------------------------
[INFO] 
[INFO] --- buildnumber-maven-plugin:1.4:create (default) @ rdf4j-console ---
[INFO] ShortRevision tag detected. The value is '7'.
[INFO] Executing: /bin/sh -c cd '/home/hudson/genie.rdf4j/.jenkins/jobs/rdf4j-pr-verify/workspace/tools/console' && 'git' 'rev-parse' '--verify' '--short=7' 'HEAD'
[INFO] Working directory: /home/hudson/genie.rdf4j/.jenkins/jobs/rdf4j-pr-verify/workspace/tools/console
[INFO] Storing buildNumber: 419fced at timestamp: 1575729953046
[WARNING] Cannot get the branch information from the git repository: 
Detecting the current branch failed: fatal: ref HEAD is not a symbolic ref

[INFO] ShortRevision tag detected. The value is '7'.
[INFO] Executing: /bin/sh -c cd '/home/hudson/genie.rdf4j/.jenkins/jobs/rdf4j-pr-verify/workspace/tools/console' && 'git' 'rev-parse' '--verify' '--short=7' 'HEAD'
[INFO] Working directory: /home/hudson/genie.rdf4j/.jenkins/jobs/rdf4j-pr-verify/workspace/tools/console
[INFO] Storing buildScmBranch: UNKNOWN
[INFO] 
[INFO] --- maven-enforcer-plugin:1.4.1:enforce (enforce-bytecode-version) @ rdf4j-console ---
[INFO] Adding ignore: META-INF/**/module-info
[INFO] 
[INFO] --- formatter-maven-plugin:2.8.1:validate (default) @ rdf4j-console ---
[INFO] Using 'UTF-8' encoding to format source files.
[INFO] Number of files to be formatted: 61
[INFO] Html formatting is skipped
[INFO] Successfully formatted:          0 file(s)
[INFO] Fail to format:                  0 file(s)
[INFO] Skipped:                         61 file(s)
[INFO] Read only skipped:               0 file(s)
[INFO] Approximate time taken:          0s
[INFO] 
[INFO] --- maven-resources-plugin:3.0.2:resources (default-resources) @ rdf4j-console ---
[INFO] Using 'UTF-8' encoding to copy filtered resources.
[INFO] skip non existing resourceDirectory /home/hudson/genie.rdf4j/.jenkins/jobs/rdf4j-pr-verify/workspace/tools/console/src/main/resources
[INFO] 
[INFO] --- maven-compiler-plugin:3.7.0:compile (default-compile) @ rdf4j-console ---
[INFO] Changes detected - recompiling the module!
[INFO] Compiling 42 source files to /home/hudson/genie.rdf4j/.jenkins/jobs/rdf4j-pr-verify/workspace/tools/console/target/classes
[INFO] 
[INFO] --- maven-resources-plugin:3.0.2:testResources (default-testResources) @ rdf4j-console ---
[INFO] Using 'UTF-8' encoding to copy filtered resources.
[INFO] Copying 29 resources
[INFO] 
[INFO] --- maven-compiler-plugin:3.7.0:testCompile (default-testCompile) @ rdf4j-console ---
[INFO] Changes detected - recompiling the module!
[INFO] Compiling 18 source files to /home/hudson/genie.rdf4j/.jenkins/jobs/rdf4j-pr-verify/workspace/tools/console/target/test-classes
[INFO] 
[INFO] --- maven-surefire-plugin:2.22.2:test (default-test) @ rdf4j-console ---
[INFO] 
[INFO] -------------------------------------------------------
[INFO]  T E S T S
[INFO] -------------------------------------------------------
[INFO] Running org.eclipse.rdf4j.console.setting.PrefixesTest
[INFO] Tests run: 3, Failures: 0, Errors: 0, Skipped: 0, Time elapsed: 0.669 s - in org.eclipse.rdf4j.console.setting.PrefixesTest
[INFO] Running org.eclipse.rdf4j.console.setting.LogLevelTest
09:45:57.762 [main] ERROR unknown logging level: chatty
[INFO] Tests run: 4, Failures: 0, Errors: 0, Skipped: 0, Time elapsed: 0.018 s - in org.eclipse.rdf4j.console.setting.LogLevelTest
[INFO] Running org.eclipse.rdf4j.console.setting.QueryPrefixTest
[INFO] Tests run: 1, Failures: 0, Errors: 0, Skipped: 0, Time elapsed: 0 s - in org.eclipse.rdf4j.console.setting.QueryPrefixTest
[INFO] Running org.eclipse.rdf4j.console.setting.ShowPrefixTest
[INFO] Tests run: 1, Failures: 0, Errors: 0, Skipped: 0, Time elapsed: 0 s - in org.eclipse.rdf4j.console.setting.ShowPrefixTest
[INFO] Running org.eclipse.rdf4j.console.setting.ConsoleWidthTest
[INFO] Tests run: 1, Failures: 0, Errors: 0, Skipped: 0, Time elapsed: 0 s - in org.eclipse.rdf4j.console.setting.ConsoleWidthTest
[INFO] Running org.eclipse.rdf4j.console.command.SetParametersTest
09:45:57.799 [main] ERROR Unknown parameter: unknown
[INFO] Tests run: 1, Failures: 0, Errors: 0, Skipped: 0, Time elapsed: 0.024 s - in org.eclipse.rdf4j.console.command.SetParametersTest
[INFO] Running org.eclipse.rdf4j.console.command.LoadTest
[MockitoHint] LoadTest.testLoad (see javadoc for MockitoHint):
[MockitoHint] 1. Unused -> at org.eclipse.rdf4j.console.command.LoadTest.setUp(LoadTest.java:49)

[MockitoHint] LoadTest.testLoadWorkDir (see javadoc for MockitoHint):
[MockitoHint] 1. Unused -> at org.eclipse.rdf4j.console.command.LoadTest.setUp(LoadTest.java:49)

[INFO] Tests run: 2, Failures: 0, Errors: 0, Skipped: 0, Time elapsed: 0.196 s - in org.eclipse.rdf4j.console.command.LoadTest
[INFO] Running org.eclipse.rdf4j.console.command.ConvertTest
09:45:58.279 [main] ERROR No RDF writer for /tmp/genie.rdf4j/junit8531516126996237500/alien.qyx
[MockitoHint] ConvertTest.testConvertInvalidFormat (see javadoc for MockitoHint):
[MockitoHint] 1. Unused -> at org.eclipse.rdf4j.console.command.ConvertTest.setup(ConvertTest.java:39)

09:45:58.286 [main] ERROR Failed to convert data
org.eclipse.rdf4j.rio.RDFParseException: Expected '<' or '_', found: e [line 1, column 101]
	at org.eclipse.rdf4j.rio.ntriples.NTriplesParser.parseSubject(NTriplesParser.java:313)
	at org.eclipse.rdf4j.rio.ntriples.NTriplesParser.parseTriple(NTriplesParser.java:252)
	at org.eclipse.rdf4j.rio.ntriples.NTriplesParser.parse(NTriplesParser.java:160)
	at org.eclipse.rdf4j.rio.ntriples.NTriplesParser.parse(NTriplesParser.java:109)
	at org.eclipse.rdf4j.console.command.Convert.convert(Convert.java:139)
	at org.eclipse.rdf4j.console.command.Convert.execute(Convert.java:74)
	at org.eclipse.rdf4j.console.command.ConvertTest.testConvertParseError(ConvertTest.java:92)
	at sun.reflect.NativeMethodAccessorImpl.invoke0(Native Method)
	at sun.reflect.NativeMethodAccessorImpl.invoke(NativeMethodAccessorImpl.java:62)
	at sun.reflect.DelegatingMethodAccessorImpl.invoke(DelegatingMethodAccessorImpl.java:43)
	at java.lang.reflect.Method.invoke(Method.java:498)
	at org.junit.runners.model.FrameworkMethod$1.runReflectiveCall(FrameworkMethod.java:50)
	at org.junit.internal.runners.model.ReflectiveCallable.run(ReflectiveCallable.java:12)
	at org.junit.runners.model.FrameworkMethod.invokeExplosively(FrameworkMethod.java:47)
	at org.junit.internal.runners.statements.InvokeMethod.evaluate(InvokeMethod.java:17)
	at org.junit.internal.runners.statements.RunBefores.evaluate(RunBefores.java:26)
	at org.junit.internal.runners.statements.RunAfters.evaluate(RunAfters.java:27)
	at org.mockito.internal.junit.JUnitRule$1.evaluateSafely(JUnitRule.java:52)
	at org.mockito.internal.junit.JUnitRule$1.evaluate(JUnitRule.java:43)
	at org.junit.rules.ExternalResource$1.evaluate(ExternalResource.java:48)
	at org.junit.rules.RunRules.evaluate(RunRules.java:20)
	at org.junit.runners.ParentRunner.runLeaf(ParentRunner.java:325)
	at org.junit.runners.BlockJUnit4ClassRunner.runChild(BlockJUnit4ClassRunner.java:78)
	at org.junit.runners.BlockJUnit4ClassRunner.runChild(BlockJUnit4ClassRunner.java:57)
	at org.junit.runners.ParentRunner$3.run(ParentRunner.java:290)
	at org.junit.runners.ParentRunner$1.schedule(ParentRunner.java:71)
	at org.junit.runners.ParentRunner.runChildren(ParentRunner.java:288)
	at org.junit.runners.ParentRunner.access$000(ParentRunner.java:58)
	at org.junit.runners.ParentRunner$2.evaluate(ParentRunner.java:268)
	at org.junit.runners.ParentRunner.run(ParentRunner.java:363)
	at org.apache.maven.surefire.junit4.JUnit4Provider.execute(JUnit4Provider.java:365)
	at org.apache.maven.surefire.junit4.JUnit4Provider.executeWithRerun(JUnit4Provider.java:273)
	at org.apache.maven.surefire.junit4.JUnit4Provider.executeTestSet(JUnit4Provider.java:238)
	at org.apache.maven.surefire.junit4.JUnit4Provider.invoke(JUnit4Provider.java:159)
	at org.apache.maven.surefire.booter.ForkedBooter.invokeProviderInSameClassLoader(ForkedBooter.java:384)
	at org.apache.maven.surefire.booter.ForkedBooter.runSuitesInProcess(ForkedBooter.java:345)
	at org.apache.maven.surefire.booter.ForkedBooter.execute(ForkedBooter.java:126)
	at org.apache.maven.surefire.booter.ForkedBooter.main(ForkedBooter.java:418)
[INFO] Tests run: 4, Failures: 0, Errors: 0, Skipped: 0, Time elapsed: 0.282 s - in org.eclipse.rdf4j.console.command.ConvertTest
[INFO] Running org.eclipse.rdf4j.console.command.ExportTest
[MockitoHint] ExportTest.testExportWorkDir (see javadoc for MockitoHint):
[MockitoHint] 1. Unused -> at org.eclipse.rdf4j.console.command.ExportTest.setUp(ExportTest.java:46)

[MockitoHint] ExportTest.testExportAll (see javadoc for MockitoHint):
[MockitoHint] 1. Unused -> at org.eclipse.rdf4j.console.command.ExportTest.setUp(ExportTest.java:46)

[MockitoHint] ExportTest.testExportContexts (see javadoc for MockitoHint):
[MockitoHint] 1. Unused -> at org.eclipse.rdf4j.console.command.ExportTest.setUp(ExportTest.java:46)

[INFO] Tests run: 3, Failures: 0, Errors: 0, Skipped: 0, Time elapsed: 0.048 s - in org.eclipse.rdf4j.console.command.ExportTest
[INFO] Running org.eclipse.rdf4j.console.command.VerifyTest
09:45:58.742 [main] ERROR Unexpected RDFParseException
org.eclipse.rdf4j.rio.RDFParseException: 'missing type' was not recognised, and could not be verified, with datatype http://example.rdf4j.org/type/wrong [line 1]
	at org.eclipse.rdf4j.rio.helpers.RDFParserHelper.reportError(RDFParserHelper.java:265)
	at org.eclipse.rdf4j.rio.helpers.RDFParserHelper.createLiteral(RDFParserHelper.java:180)
	at org.eclipse.rdf4j.rio.helpers.AbstractRDFParser.createLiteral(AbstractRDFParser.java:530)
	at org.eclipse.rdf4j.rio.turtle.TurtleParser.parseQuotedLiteral(TurtleParser.java:665)
	at org.eclipse.rdf4j.rio.turtle.TurtleParser.parseValue(TurtleParser.java:584)
	at org.eclipse.rdf4j.rio.turtle.TurtleParser.parseObject(TurtleParser.java:461)
	at org.eclipse.rdf4j.rio.turtle.TurtleParser.parseObjectList(TurtleParser.java:389)
	at org.eclipse.rdf4j.rio.turtle.TurtleParser.parsePredicateObjectList(TurtleParser.java:362)
	at org.eclipse.rdf4j.rio.turtle.TurtleParser.parseTriples(TurtleParser.java:349)
	at org.eclipse.rdf4j.rio.turtle.TurtleParser.parseStatement(TurtleParser.java:216)
	at org.eclipse.rdf4j.rio.turtle.TurtleParser.parse(TurtleParser.java:178)
	at org.eclipse.rdf4j.rio.turtle.TurtleParser.parse(TurtleParser.java:130)
	at org.eclipse.rdf4j.console.command.Verify.verify(Verify.java:145)
	at org.eclipse.rdf4j.console.command.Verify.execute(Verify.java:97)
	at org.eclipse.rdf4j.console.command.VerifyTest.testVerifyMissingType(VerifyTest.java:97)
	at sun.reflect.NativeMethodAccessorImpl.invoke0(Native Method)
	at sun.reflect.NativeMethodAccessorImpl.invoke(NativeMethodAccessorImpl.java:62)
	at sun.reflect.DelegatingMethodAccessorImpl.invoke(DelegatingMethodAccessorImpl.java:43)
	at java.lang.reflect.Method.invoke(Method.java:498)
	at org.junit.runners.model.FrameworkMethod$1.runReflectiveCall(FrameworkMethod.java:50)
	at org.junit.internal.runners.model.ReflectiveCallable.run(ReflectiveCallable.java:12)
	at org.junit.runners.model.FrameworkMethod.invokeExplosively(FrameworkMethod.java:47)
	at org.junit.internal.runners.statements.InvokeMethod.evaluate(InvokeMethod.java:17)
	at org.junit.internal.runners.statements.RunBefores.evaluate(RunBefores.java:26)
	at org.junit.internal.runners.statements.RunAfters.evaluate(RunAfters.java:27)
	at org.mockito.internal.junit.JUnitRule$1.evaluateSafely(JUnitRule.java:52)
	at org.mockito.internal.junit.JUnitRule$1.evaluate(JUnitRule.java:43)
	at org.junit.rules.ExternalResource$1.evaluate(ExternalResource.java:48)
	at org.junit.rules.RunRules.evaluate(RunRules.java:20)
	at org.junit.runners.ParentRunner.runLeaf(ParentRunner.java:325)
	at org.junit.runners.BlockJUnit4ClassRunner.runChild(BlockJUnit4ClassRunner.java:78)
	at org.junit.runners.BlockJUnit4ClassRunner.runChild(BlockJUnit4ClassRunner.java:57)
	at org.junit.runners.ParentRunner$3.run(ParentRunner.java:290)
	at org.junit.runners.ParentRunner$1.schedule(ParentRunner.java:71)
	at org.junit.runners.ParentRunner.runChildren(ParentRunner.java:288)
	at org.junit.runners.ParentRunner.access$000(ParentRunner.java:58)
	at org.junit.runners.ParentRunner$2.evaluate(ParentRunner.java:268)
	at org.junit.runners.ParentRunner.run(ParentRunner.java:363)
	at org.apache.maven.surefire.junit4.JUnit4Provider.execute(JUnit4Provider.java:365)
	at org.apache.maven.surefire.junit4.JUnit4Provider.executeWithRerun(JUnit4Provider.java:273)
	at org.apache.maven.surefire.junit4.JUnit4Provider.executeTestSet(JUnit4Provider.java:238)
	at org.apache.maven.surefire.junit4.JUnit4Provider.invoke(JUnit4Provider.java:159)
	at org.apache.maven.surefire.booter.ForkedBooter.invokeProviderInSameClassLoader(ForkedBooter.java:384)
	at org.apache.maven.surefire.booter.ForkedBooter.runSuitesInProcess(ForkedBooter.java:345)
	at org.apache.maven.surefire.booter.ForkedBooter.execute(ForkedBooter.java:126)
	at org.apache.maven.surefire.booter.ForkedBooter.main(ForkedBooter.java:418)
09:45:58.811 [main] ERROR SHACL validation failed, writing report to /tmp/genie.rdf4j/junit1410329683386463654/junit6604830288626278751.tmp
09:45:58.842 [main] ERROR Unexpected RDFParseException
org.eclipse.rdf4j.rio.RDFParseException: Unexpected end of file
	at org.eclipse.rdf4j.rio.turtle.TurtleParser.throwEOFException(TurtleParser.java:1317)
	at org.eclipse.rdf4j.rio.turtle.TurtleParser.parseValue(TurtleParser.java:589)
	at org.eclipse.rdf4j.rio.turtle.TurtleParser.parsePredicate(TurtleParser.java:434)
	at org.eclipse.rdf4j.rio.turtle.TurtleParser.parsePredicateObjectList(TurtleParser.java:358)
	at org.eclipse.rdf4j.rio.turtle.TurtleParser.parseTriples(TurtleParser.java:349)
	at org.eclipse.rdf4j.rio.turtle.TurtleParser.parseStatement(TurtleParser.java:216)
	at org.eclipse.rdf4j.rio.turtle.TurtleParser.parse(TurtleParser.java:178)
	at org.eclipse.rdf4j.rio.turtle.TurtleParser.parse(TurtleParser.java:130)
	at org.eclipse.rdf4j.console.command.Verify.verify(Verify.java:145)
	at org.eclipse.rdf4j.console.command.Verify.execute(Verify.java:97)
	at org.eclipse.rdf4j.console.command.VerifyTest.testVerifyBrokenFile(VerifyTest.java:91)
	at sun.reflect.NativeMethodAccessorImpl.invoke0(Native Method)
	at sun.reflect.NativeMethodAccessorImpl.invoke(NativeMethodAccessorImpl.java:62)
	at sun.reflect.DelegatingMethodAccessorImpl.invoke(DelegatingMethodAccessorImpl.java:43)
	at java.lang.reflect.Method.invoke(Method.java:498)
	at org.junit.runners.model.FrameworkMethod$1.runReflectiveCall(FrameworkMethod.java:50)
	at org.junit.internal.runners.model.ReflectiveCallable.run(ReflectiveCallable.java:12)
	at org.junit.runners.model.FrameworkMethod.invokeExplosively(FrameworkMethod.java:47)
	at org.junit.internal.runners.statements.InvokeMethod.evaluate(InvokeMethod.java:17)
	at org.junit.internal.runners.statements.RunBefores.evaluate(RunBefores.java:26)
	at org.junit.internal.runners.statements.RunAfters.evaluate(RunAfters.java:27)
	at org.mockito.internal.junit.JUnitRule$1.evaluateSafely(JUnitRule.java:52)
	at org.mockito.internal.junit.JUnitRule$1.evaluate(JUnitRule.java:43)
	at org.junit.rules.ExternalResource$1.evaluate(ExternalResource.java:48)
	at org.junit.rules.RunRules.evaluate(RunRules.java:20)
	at org.junit.runners.ParentRunner.runLeaf(ParentRunner.java:325)
	at org.junit.runners.BlockJUnit4ClassRunner.runChild(BlockJUnit4ClassRunner.java:78)
	at org.junit.runners.BlockJUnit4ClassRunner.runChild(BlockJUnit4ClassRunner.java:57)
	at org.junit.runners.ParentRunner$3.run(ParentRunner.java:290)
	at org.junit.runners.ParentRunner$1.schedule(ParentRunner.java:71)
	at org.junit.runners.ParentRunner.runChildren(ParentRunner.java:288)
	at org.junit.runners.ParentRunner.access$000(ParentRunner.java:58)
	at org.junit.runners.ParentRunner$2.evaluate(ParentRunner.java:268)
	at org.junit.runners.ParentRunner.run(ParentRunner.java:363)
	at org.apache.maven.surefire.junit4.JUnit4Provider.execute(JUnit4Provider.java:365)
	at org.apache.maven.surefire.junit4.JUnit4Provider.executeWithRerun(JUnit4Provider.java:273)
	at org.apache.maven.surefire.junit4.JUnit4Provider.executeTestSet(JUnit4Provider.java:238)
	at org.apache.maven.surefire.junit4.JUnit4Provider.invoke(JUnit4Provider.java:159)
	at org.apache.maven.surefire.booter.ForkedBooter.invokeProviderInSameClassLoader(ForkedBooter.java:384)
	at org.apache.maven.surefire.booter.ForkedBooter.runSuitesInProcess(ForkedBooter.java:345)
	at org.apache.maven.surefire.booter.ForkedBooter.execute(ForkedBooter.java:126)
	at org.apache.maven.surefire.booter.ForkedBooter.main(ForkedBooter.java:418)
09:45:58.863 [main] ERROR Unexpected RDFParseException
org.eclipse.rdf4j.rio.RDFParseException: Expected a letter, found '1' [line 1]
	at org.eclipse.rdf4j.rio.helpers.RDFParserHelper.reportError(RDFParserHelper.java:265)
	at org.eclipse.rdf4j.rio.helpers.AbstractRDFParser.reportError(AbstractRDFParser.java:628)
	at org.eclipse.rdf4j.rio.turtle.TurtleParser.reportError(TurtleParser.java:1297)
	at org.eclipse.rdf4j.rio.turtle.TurtleParser.parseQuotedLiteral(TurtleParser.java:619)
	at org.eclipse.rdf4j.rio.turtle.TurtleParser.parseValue(TurtleParser.java:584)
	at org.eclipse.rdf4j.rio.turtle.TurtleParser.parseObject(TurtleParser.java:461)
	at org.eclipse.rdf4j.rio.turtle.TurtleParser.parseObjectList(TurtleParser.java:389)
	at org.eclipse.rdf4j.rio.turtle.TurtleParser.parsePredicateObjectList(TurtleParser.java:362)
	at org.eclipse.rdf4j.rio.turtle.TurtleParser.parseTriples(TurtleParser.java:349)
	at org.eclipse.rdf4j.rio.turtle.TurtleParser.parseStatement(TurtleParser.java:216)
	at org.eclipse.rdf4j.rio.turtle.TurtleParser.parse(TurtleParser.java:178)
	at org.eclipse.rdf4j.rio.turtle.TurtleParser.parse(TurtleParser.java:130)
	at org.eclipse.rdf4j.console.command.Verify.verify(Verify.java:145)
	at org.eclipse.rdf4j.console.command.Verify.execute(Verify.java:97)
	at org.eclipse.rdf4j.console.command.VerifyTest.testVerifyWrongLang(VerifyTest.java:109)
	at sun.reflect.NativeMethodAccessorImpl.invoke0(Native Method)
	at sun.reflect.NativeMethodAccessorImpl.invoke(NativeMethodAccessorImpl.java:62)
	at sun.reflect.DelegatingMethodAccessorImpl.invoke(DelegatingMethodAccessorImpl.java:43)
	at java.lang.reflect.Method.invoke(Method.java:498)
	at org.junit.runners.model.FrameworkMethod$1.runReflectiveCall(FrameworkMethod.java:50)
	at org.junit.internal.runners.model.ReflectiveCallable.run(ReflectiveCallable.java:12)
	at org.junit.runners.model.FrameworkMethod.invokeExplosively(FrameworkMethod.java:47)
	at org.junit.internal.runners.statements.InvokeMethod.evaluate(InvokeMethod.java:17)
	at org.junit.internal.runners.statements.RunBefores.evaluate(RunBefores.java:26)
	at org.junit.internal.runners.statements.RunAfters.evaluate(RunAfters.java:27)
	at org.mockito.internal.junit.JUnitRule$1.evaluateSafely(JUnitRule.java:52)
	at org.mockito.internal.junit.JUnitRule$1.evaluate(JUnitRule.java:43)
	at org.junit.rules.ExternalResource$1.evaluate(ExternalResource.java:48)
	at org.junit.rules.RunRules.evaluate(RunRules.java:20)
	at org.junit.runners.ParentRunner.runLeaf(ParentRunner.java:325)
	at org.junit.runners.BlockJUnit4ClassRunner.runChild(BlockJUnit4ClassRunner.java:78)
	at org.junit.runners.BlockJUnit4ClassRunner.runChild(BlockJUnit4ClassRunner.java:57)
	at org.junit.runners.ParentRunner$3.run(ParentRunner.java:290)
	at org.junit.runners.ParentRunner$1.schedule(ParentRunner.java:71)
	at org.junit.runners.ParentRunner.runChildren(ParentRunner.java:288)
	at org.junit.runners.ParentRunner.access$000(ParentRunner.java:58)
	at org.junit.runners.ParentRunner$2.evaluate(ParentRunner.java:268)
	at org.junit.runners.ParentRunner.run(ParentRunner.java:363)
	at org.apache.maven.surefire.junit4.JUnit4Provider.execute(JUnit4Provider.java:365)
	at org.apache.maven.surefire.junit4.JUnit4Provider.executeWithRerun(JUnit4Provider.java:273)
	at org.apache.maven.surefire.junit4.JUnit4Provider.executeTestSet(JUnit4Provider.java:238)
	at org.apache.maven.surefire.junit4.JUnit4Provider.invoke(JUnit4Provider.java:159)
	at org.apache.maven.surefire.booter.ForkedBooter.invokeProviderInSameClassLoader(ForkedBooter.java:384)
	at org.apache.maven.surefire.booter.ForkedBooter.runSuitesInProcess(ForkedBooter.java:345)
	at org.apache.maven.surefire.booter.ForkedBooter.execute(ForkedBooter.java:126)
	at org.apache.maven.surefire.booter.ForkedBooter.main(ForkedBooter.java:418)
09:45:58.882 [main] ERROR No parser available for this RDF format
org.eclipse.rdf4j.rio.UnsupportedRDFormatException: Did not recognise RDF format string file:/home/hudson/genie.rdf4j/.jenkins/jobs/rdf4j-pr-verify/workspace/tools/console/does-not-exist.docx
	at org.eclipse.rdf4j.rio.Rio.lambda$unsupportedFormat$1(Rio.java:577)
	at java.util.Optional.orElseThrow(Optional.java:290)
	at org.eclipse.rdf4j.console.command.Verify.verify(Verify.java:124)
	at org.eclipse.rdf4j.console.command.Verify.execute(Verify.java:97)
	at org.eclipse.rdf4j.console.command.VerifyTest.testVerifyWrongFormat(VerifyTest.java:69)
	at sun.reflect.NativeMethodAccessorImpl.invoke0(Native Method)
	at sun.reflect.NativeMethodAccessorImpl.invoke(NativeMethodAccessorImpl.java:62)
	at sun.reflect.DelegatingMethodAccessorImpl.invoke(DelegatingMethodAccessorImpl.java:43)
	at java.lang.reflect.Method.invoke(Method.java:498)
	at org.junit.runners.model.FrameworkMethod$1.runReflectiveCall(FrameworkMethod.java:50)
	at org.junit.internal.runners.model.ReflectiveCallable.run(ReflectiveCallable.java:12)
	at org.junit.runners.model.FrameworkMethod.invokeExplosively(FrameworkMethod.java:47)
	at org.junit.internal.runners.statements.InvokeMethod.evaluate(InvokeMethod.java:17)
	at org.junit.internal.runners.statements.RunBefores.evaluate(RunBefores.java:26)
	at org.junit.internal.runners.statements.RunAfters.evaluate(RunAfters.java:27)
	at org.mockito.internal.junit.JUnitRule$1.evaluateSafely(JUnitRule.java:52)
	at org.mockito.internal.junit.JUnitRule$1.evaluate(JUnitRule.java:43)
	at org.junit.rules.ExternalResource$1.evaluate(ExternalResource.java:48)
	at org.junit.rules.RunRules.evaluate(RunRules.java:20)
	at org.junit.runners.ParentRunner.runLeaf(ParentRunner.java:325)
	at org.junit.runners.BlockJUnit4ClassRunner.runChild(BlockJUnit4ClassRunner.java:78)
	at org.junit.runners.BlockJUnit4ClassRunner.runChild(BlockJUnit4ClassRunner.java:57)
	at org.junit.runners.ParentRunner$3.run(ParentRunner.java:290)
	at org.junit.runners.ParentRunner$1.schedule(ParentRunner.java:71)
	at org.junit.runners.ParentRunner.runChildren(ParentRunner.java:288)
	at org.junit.runners.ParentRunner.access$000(ParentRunner.java:58)
	at org.junit.runners.ParentRunner$2.evaluate(ParentRunner.java:268)
	at org.junit.runners.ParentRunner.run(ParentRunner.java:363)
	at org.apache.maven.surefire.junit4.JUnit4Provider.execute(JUnit4Provider.java:365)
	at org.apache.maven.surefire.junit4.JUnit4Provider.executeWithRerun(JUnit4Provider.java:273)
	at org.apache.maven.surefire.junit4.JUnit4Provider.executeTestSet(JUnit4Provider.java:238)
	at org.apache.maven.surefire.junit4.JUnit4Provider.invoke(JUnit4Provider.java:159)
	at org.apache.maven.surefire.booter.ForkedBooter.invokeProviderInSameClassLoader(ForkedBooter.java:384)
	at org.apache.maven.surefire.booter.ForkedBooter.runSuitesInProcess(ForkedBooter.java:345)
	at org.apache.maven.surefire.booter.ForkedBooter.execute(ForkedBooter.java:126)
	at org.apache.maven.surefire.booter.ForkedBooter.main(ForkedBooter.java:418)
09:45:58.903 [main] ERROR Unexpected RDFParseException
org.eclipse.rdf4j.rio.RDFParseException: IRI included an unencoded space: '32' [line 1]
	at org.eclipse.rdf4j.rio.helpers.RDFParserHelper.reportError(RDFParserHelper.java:265)
	at org.eclipse.rdf4j.rio.helpers.AbstractRDFParser.reportError(AbstractRDFParser.java:628)
	at org.eclipse.rdf4j.rio.turtle.TurtleParser.reportError(TurtleParser.java:1297)
	at org.eclipse.rdf4j.rio.turtle.TurtleParser.parseURI(TurtleParser.java:902)
	at org.eclipse.rdf4j.rio.turtle.TurtleParser.parseValue(TurtleParser.java:575)
	at org.eclipse.rdf4j.rio.turtle.TurtleParser.parseSubject(TurtleParser.java:406)
	at org.eclipse.rdf4j.rio.turtle.TurtleParser.parseTriples(TurtleParser.java:347)
	at org.eclipse.rdf4j.rio.turtle.TurtleParser.parseStatement(TurtleParser.java:216)
	at org.eclipse.rdf4j.rio.turtle.TurtleParser.parse(TurtleParser.java:178)
	at org.eclipse.rdf4j.rio.turtle.TurtleParser.parse(TurtleParser.java:130)
	at org.eclipse.rdf4j.console.command.Verify.verify(Verify.java:145)
	at org.eclipse.rdf4j.console.command.Verify.execute(Verify.java:97)
	at org.eclipse.rdf4j.console.command.VerifyTest.testVerifySpaceIRI(VerifyTest.java:103)
	at sun.reflect.NativeMethodAccessorImpl.invoke0(Native Method)
	at sun.reflect.NativeMethodAccessorImpl.invoke(NativeMethodAccessorImpl.java:62)
	at sun.reflect.DelegatingMethodAccessorImpl.invoke(DelegatingMethodAccessorImpl.java:43)
	at java.lang.reflect.Method.invoke(Method.java:498)
	at org.junit.runners.model.FrameworkMethod$1.runReflectiveCall(FrameworkMethod.java:50)
	at org.junit.internal.runners.model.ReflectiveCallable.run(ReflectiveCallable.java:12)
	at org.junit.runners.model.FrameworkMethod.invokeExplosively(FrameworkMethod.java:47)
	at org.junit.internal.runners.statements.InvokeMethod.evaluate(InvokeMethod.java:17)
	at org.junit.internal.runners.statements.RunBefores.evaluate(RunBefores.java:26)
	at org.junit.internal.runners.statements.RunAfters.evaluate(RunAfters.java:27)
	at org.mockito.internal.junit.JUnitRule$1.evaluateSafely(JUnitRule.java:52)
	at org.mockito.internal.junit.JUnitRule$1.evaluate(JUnitRule.java:43)
	at org.junit.rules.ExternalResource$1.evaluate(ExternalResource.java:48)
	at org.junit.rules.RunRules.evaluate(RunRules.java:20)
	at org.junit.runners.ParentRunner.runLeaf(ParentRunner.java:325)
	at org.junit.runners.BlockJUnit4ClassRunner.runChild(BlockJUnit4ClassRunner.java:78)
	at org.junit.runners.BlockJUnit4ClassRunner.runChild(BlockJUnit4ClassRunner.java:57)
	at org.junit.runners.ParentRunner$3.run(ParentRunner.java:290)
	at org.junit.runners.ParentRunner$1.schedule(ParentRunner.java:71)
	at org.junit.runners.ParentRunner.runChildren(ParentRunner.java:288)
	at org.junit.runners.ParentRunner.access$000(ParentRunner.java:58)
	at org.junit.runners.ParentRunner$2.evaluate(ParentRunner.java:268)
	at org.junit.runners.ParentRunner.run(ParentRunner.java:363)
	at org.apache.maven.surefire.junit4.JUnit4Provider.execute(JUnit4Provider.java:365)
	at org.apache.maven.surefire.junit4.JUnit4Provider.executeWithRerun(JUnit4Provider.java:273)
	at org.apache.maven.surefire.junit4.JUnit4Provider.executeTestSet(JUnit4Provider.java:238)
	at org.apache.maven.surefire.junit4.JUnit4Provider.invoke(JUnit4Provider.java:159)
	at org.apache.maven.surefire.booter.ForkedBooter.invokeProviderInSameClassLoader(ForkedBooter.java:384)
	at org.apache.maven.surefire.booter.ForkedBooter.runSuitesInProcess(ForkedBooter.java:345)
	at org.apache.maven.surefire.booter.ForkedBooter.execute(ForkedBooter.java:126)
	at org.apache.maven.surefire.booter.ForkedBooter.main(ForkedBooter.java:418)
[INFO] Tests run: 10, Failures: 0, Errors: 0, Skipped: 0, Time elapsed: 0.606 s - in org.eclipse.rdf4j.console.command.VerifyTest
[INFO] Running org.eclipse.rdf4j.console.command.DropTest
[MockitoHint] DropTest.testUserAbortedUnsafeDropBeforeWarning (see javadoc for MockitoHint):
[MockitoHint] 1. Unused -> at org.eclipse.rdf4j.console.command.DropTest.setUp(DropTest.java:50)

[INFO] Tests run: 3, Failures: 0, Errors: 0, Skipped: 0, Time elapsed: 0.146 s - in org.eclipse.rdf4j.console.command.DropTest
[INFO] Running org.eclipse.rdf4j.console.command.FederateTest
09:45:59.116 [main] DEBUG Initializing MemoryStore...
09:45:59.117 [main] DEBUG Initializing data file...
09:45:59.117 [main] DEBUG Data file initialized
09:45:59.117 [main] DEBUG MemoryStore initialized
09:45:59.119 [main] DEBUG syncing data to file...
09:45:59.119 [main] DEBUG Data synced to file
09:45:59.123 [main] DEBUG Initializing MemoryStore...
09:45:59.124 [main] DEBUG Initializing data file...
09:45:59.125 [main] DEBUG Data file initialized
09:45:59.125 [main] DEBUG MemoryStore initialized
09:45:59.127 [main] DEBUG syncing data to file...
09:45:59.128 [main] DEBUG Data synced to file
09:45:59.140 [main] DEBUG Federate called with federation ID = fedID, and member ID's = [sparql][alien][http].
  Distinct set to false, and readonly set to true.

09:45:59.142 [main] DEBUG Federation repository root node: _:node1drgd6286x216
09:45:59.143 [main] DEBUG _:node1drgd6286x216 http://www.w3.org/1999/02/22-rdf-syntax-ns#type http://www.openrdf.org/config/repository#Repository
09:45:59.143 [main] DEBUG _:node1drgd6286x216 http://www.openrdf.org/config/repository#repositoryID "fedID"
09:45:59.144 [main] DEBUG _:node1drgd6286x216 http://www.w3.org/2000/01/rdf-schema#label "Test Federation Title"
09:45:59.144 [main] DEBUG _:node1drgd6286x216 http://www.openrdf.org/config/repository#repositoryImpl _:node1drgd6286x217
09:45:59.144 [main] DEBUG _:node1drgd6286x217 http://www.openrdf.org/config/repository#repositoryType "openrdf:SailRepository"
09:45:59.144 [main] DEBUG _:node1drgd6286x217 http://www.openrdf.org/config/repository/sail#sailImpl _:node1drgd6286x218
09:45:59.144 [main] DEBUG _:node1drgd6286x218 http://www.openrdf.org/config/sail#sailType "openrdf:Federation"
09:45:59.144 [main] DEBUG _:node1drgd6286x218 http://www.openrdf.org/config/sail/federation#readOnly "true"^^<http://www.w3.org/2001/XMLSchema#boolean>
09:45:59.144 [main] DEBUG _:node1drgd6286x218 http://www.openrdf.org/config/sail/federation#distinct "false"^^<http://www.w3.org/2001/XMLSchema#boolean>
09:45:59.144 [main] DEBUG Adding member: sparql
09:45:59.144 [main] DEBUG _:node1drgd6286x218 http://www.openrdf.org/config/sail/federation#member _:node1drgd6286x219
09:45:59.145 [main] DEBUG _:node1drgd6286x219 http://www.openrdf.org/config/repository#repositoryType "openrdf:SPARQLRepository"
09:45:59.145 [main] DEBUG _:node1drgd6286x219 http://www.openrdf.org/config/repository/sparql#query-endpoint http://localhost:8080/openrdf-sesame/repositories/sparql
09:45:59.145 [main] DEBUG Added member sparql: 
09:45:59.145 [main] DEBUG Adding member: alien
09:45:59.146 [main] DEBUG _:node1drgd6286x218 http://www.openrdf.org/config/sail/federation#member _:node1drgd6286x222
09:45:59.146 [main] DEBUG _:node1drgd6286x222 http://www.openrdf.org/config/repository#repositoryType "openrdf:ProxyRepository"
09:45:59.146 [main] DEBUG _:node1drgd6286x222 http://www.openrdf.org/config/repository/proxy#proxiedID "alien"
09:45:59.146 [main] DEBUG Added member alien: 
09:45:59.146 [main] DEBUG Adding member: http
09:45:59.146 [main] DEBUG _:node1drgd6286x218 http://www.openrdf.org/config/sail/federation#member _:node1drgd6286x225
09:45:59.147 [main] DEBUG _:node1drgd6286x225 http://www.openrdf.org/config/repository#repositoryType "openrdf:HTTPRepository"
09:45:59.147 [main] DEBUG _:node1drgd6286x225 http://www.openrdf.org/config/repository/http#repositoryURL http://localhost:8080/openrdf-sesame/repositories/http
09:45:59.147 [main] DEBUG Added member http: 
09:45:59.172 [main] DEBUG Initializing MemoryStore...
09:45:59.173 [main] DEBUG Initializing data file...
09:45:59.173 [main] DEBUG Data file initialized
09:45:59.174 [main] DEBUG MemoryStore initialized
09:45:59.175 [main] DEBUG syncing data to file...
09:45:59.176 [main] DEBUG Data synced to file
09:45:59.178 [main] DEBUG Initializing MemoryStore...
09:45:59.179 [main] DEBUG Initializing data file...
09:45:59.179 [main] DEBUG Data file initialized
09:45:59.179 [main] DEBUG MemoryStore initialized
09:45:59.180 [main] DEBUG syncing data to file...
09:45:59.181 [main] DEBUG Data synced to file
09:45:59.188 [main] ERROR Duplicate repository id's specified.
[MockitoHint] FederateTest.testDuplicateMembersPrintsError (see javadoc for MockitoHint):
[MockitoHint] 1. Unused -> at org.eclipse.rdf4j.console.command.FederateTest.setUp(FederateTest.java:87)
[MockitoHint] 2. Unused -> at org.eclipse.rdf4j.console.command.FederateTest.setUp(FederateTest.java:88)

09:45:59.195 [main] DEBUG Initializing MemoryStore...
09:45:59.196 [main] DEBUG Initializing data file...
09:45:59.196 [main] DEBUG Data file initialized
09:45:59.196 [main] DEBUG MemoryStore initialized
09:45:59.197 [main] DEBUG syncing data to file...
09:45:59.198 [main] DEBUG Data synced to file
09:45:59.200 [main] DEBUG Initializing MemoryStore...
09:45:59.201 [main] DEBUG Initializing data file...
09:45:59.201 [main] DEBUG Data file initialized
09:45:59.201 [main] DEBUG MemoryStore initialized
09:45:59.202 [main] DEBUG syncing data to file...
09:45:59.203 [main] DEBUG Data synced to file
09:45:59.209 [main] DEBUG Federate called with federation ID = alien, and member ID's = [fedID][scary].
  Distinct set to false, and readonly set to true.

09:45:59.209 [main] ERROR alien already exists.
[MockitoHint] FederateTest.testFedAlreadyExistsPrintsSpecificError (see javadoc for MockitoHint):
[MockitoHint] 1. Unused -> at org.eclipse.rdf4j.console.command.FederateTest.setUp(FederateTest.java:88)

09:45:59.217 [main] DEBUG Initializing MemoryStore...
09:45:59.218 [main] DEBUG Initializing data file...
09:45:59.218 [main] DEBUG Data file initialized
09:45:59.218 [main] DEBUG MemoryStore initialized
09:45:59.220 [main] DEBUG syncing data to file...
09:45:59.220 [main] DEBUG Data synced to file
09:45:59.222 [main] DEBUG Initializing MemoryStore...
09:45:59.223 [main] DEBUG Initializing data file...
09:45:59.223 [main] DEBUG Data file initialized
09:45:59.223 [main] DEBUG MemoryStore initialized
09:45:59.224 [main] DEBUG syncing data to file...
09:45:59.225 [main] DEBUG Data synced to file
09:45:59.231 [main] DEBUG Federate called with federation ID = fedID, and member ID's = [alien][scary].
  Distinct set to true, and readonly set to false.

09:45:59.232 [main] DEBUG Federation repository root node: _:node1drgd6286x338
09:45:59.232 [main] DEBUG _:node1drgd6286x338 http://www.w3.org/1999/02/22-rdf-syntax-ns#type http://www.openrdf.org/config/repository#Repository
09:45:59.232 [main] DEBUG _:node1drgd6286x338 http://www.openrdf.org/config/repository#repositoryID "fedID"
09:45:59.232 [main] DEBUG _:node1drgd6286x338 http://www.w3.org/2000/01/rdf-schema#label "Test Federation Title"
09:45:59.232 [main] DEBUG _:node1drgd6286x338 http://www.openrdf.org/config/repository#repositoryImpl _:node1drgd6286x339
09:45:59.232 [main] DEBUG _:node1drgd6286x339 http://www.openrdf.org/config/repository#repositoryType "openrdf:SailRepository"
09:45:59.232 [main] DEBUG _:node1drgd6286x339 http://www.openrdf.org/config/repository/sail#sailImpl _:node1drgd6286x340
09:45:59.232 [main] DEBUG _:node1drgd6286x340 http://www.openrdf.org/config/sail#sailType "openrdf:Federation"
09:45:59.232 [main] DEBUG _:node1drgd6286x340 http://www.openrdf.org/config/sail/federation#readOnly "false"^^<http://www.w3.org/2001/XMLSchema#boolean>
09:45:59.232 [main] DEBUG _:node1drgd6286x340 http://www.openrdf.org/config/sail/federation#distinct "true"^^<http://www.w3.org/2001/XMLSchema#boolean>
09:45:59.232 [main] DEBUG Adding member: alien
09:45:59.232 [main] DEBUG _:node1drgd6286x340 http://www.openrdf.org/config/sail/federation#member _:node1drgd6286x341
09:45:59.233 [main] DEBUG _:node1drgd6286x341 http://www.openrdf.org/config/repository#repositoryType "openrdf:ProxyRepository"
09:45:59.233 [main] DEBUG _:node1drgd6286x341 http://www.openrdf.org/config/repository/proxy#proxiedID "alien"
09:45:59.233 [main] DEBUG Added member alien: 
09:45:59.233 [main] DEBUG Adding member: scary
09:45:59.233 [main] DEBUG _:node1drgd6286x340 http://www.openrdf.org/config/sail/federation#member _:node1drgd6286x344
09:45:59.233 [main] DEBUG _:node1drgd6286x344 http://www.openrdf.org/config/repository#repositoryType "openrdf:ProxyRepository"
09:45:59.233 [main] DEBUG _:node1drgd6286x344 http://www.openrdf.org/config/repository/proxy#proxiedID "scary"
09:45:59.233 [main] DEBUG Added member scary: 
09:45:59.252 [main] DEBUG Initializing MemoryStore...
09:45:59.253 [main] DEBUG Initializing data file...
09:45:59.254 [main] DEBUG Data file initialized
09:45:59.254 [main] DEBUG MemoryStore initialized
09:45:59.255 [main] DEBUG syncing data to file...
09:45:59.256 [main] DEBUG Data synced to file
09:45:59.259 [main] DEBUG Initializing MemoryStore...
09:45:59.260 [main] DEBUG Initializing data file...
09:45:59.260 [main] DEBUG Data file initialized
09:45:59.260 [main] DEBUG MemoryStore initialized
09:45:59.261 [main] DEBUG syncing data to file...
09:45:59.262 [main] DEBUG Data synced to file
09:45:59.269 [main] DEBUG Federate called with federation ID = fedID, and member ID's = [sparql][sparql2].
  Distinct set to false, and readonly set to false.

09:45:59.271 [main] ERROR sparql is read-only.
09:45:59.272 [main] ERROR sparql2 is read-only.
[MockitoHint] FederateTest.testSparqlAndNotReadOnlyPrintsError (see javadoc for MockitoHint):
[MockitoHint] 1. Unused -> at org.eclipse.rdf4j.console.command.FederateTest.setUp(FederateTest.java:88)

09:45:59.280 [main] DEBUG Initializing MemoryStore...
09:45:59.280 [main] DEBUG Initializing data file...
09:45:59.281 [main] DEBUG Data file initialized
09:45:59.281 [main] DEBUG MemoryStore initialized
09:45:59.282 [main] DEBUG syncing data to file...
09:45:59.283 [main] DEBUG Data synced to file
09:45:59.286 [main] DEBUG Initializing MemoryStore...
09:45:59.286 [main] DEBUG Initializing data file...
09:45:59.286 [main] DEBUG Data file initialized
09:45:59.286 [main] DEBUG MemoryStore initialized
09:45:59.288 [main] DEBUG syncing data to file...
09:45:59.288 [main] DEBUG Data synced to file
[MockitoHint] FederateTest.testNoArgumentsPrintsHelp (see javadoc for MockitoHint):
[MockitoHint] 1. Unused -> at org.eclipse.rdf4j.console.command.FederateTest.setUp(FederateTest.java:87)
[MockitoHint] 2. Unused -> at org.eclipse.rdf4j.console.command.FederateTest.setUp(FederateTest.java:88)

09:45:59.306 [main] DEBUG Initializing MemoryStore...
09:45:59.306 [main] DEBUG Initializing data file...
09:45:59.307 [main] DEBUG Data file initialized
09:45:59.307 [main] DEBUG MemoryStore initialized
09:45:59.308 [main] DEBUG syncing data to file...
09:45:59.309 [main] DEBUG Data synced to file
09:45:59.312 [main] DEBUG Initializing MemoryStore...
09:45:59.313 [main] DEBUG Initializing data file...
09:45:59.313 [main] DEBUG Data file initialized
09:45:59.313 [main] DEBUG MemoryStore initialized
09:45:59.314 [main] DEBUG syncing data to file...
09:45:59.315 [main] DEBUG Data synced to file
09:45:59.321 [main] DEBUG Federate called with federation ID = type=memory, and member ID's = [fedID][alien][scary].
  Distinct set to false, and readonly set to true.

09:45:59.321 [main] ERROR fedID does not exist.
[MockitoHint] FederateTest.testInvalidArgumentPrintsError (see javadoc for MockitoHint):
[MockitoHint] 1. Unused -> at org.eclipse.rdf4j.console.command.FederateTest.setUp(FederateTest.java:88)

09:45:59.331 [main] DEBUG Initializing MemoryStore...
09:45:59.332 [main] DEBUG Initializing data file...
09:45:59.332 [main] DEBUG Data file initialized
09:45:59.332 [main] DEBUG MemoryStore initialized
09:45:59.334 [main] DEBUG syncing data to file...
09:45:59.334 [main] DEBUG Data synced to file
09:45:59.337 [main] DEBUG Initializing MemoryStore...
09:45:59.338 [main] DEBUG Initializing data file...
09:45:59.338 [main] DEBUG Data file initialized
09:45:59.338 [main] DEBUG MemoryStore initialized
09:45:59.339 [main] DEBUG syncing data to file...
09:45:59.340 [main] DEBUG Data synced to file
09:45:59.346 [main] DEBUG Federate called with federation ID = fedID, and member ID's = [sparql][sparql2].
  Distinct set to false, and readonly set to true.

09:45:59.348 [main] DEBUG Federation repository root node: _:node1drgd6286x494
09:45:59.348 [main] DEBUG _:node1drgd6286x494 http://www.w3.org/1999/02/22-rdf-syntax-ns#type http://www.openrdf.org/config/repository#Repository
09:45:59.348 [main] DEBUG _:node1drgd6286x494 http://www.openrdf.org/config/repository#repositoryID "fedID"
09:45:59.348 [main] DEBUG _:node1drgd6286x494 http://www.w3.org/2000/01/rdf-schema#label "Test Federation Title"
09:45:59.348 [main] DEBUG _:node1drgd6286x494 http://www.openrdf.org/config/repository#repositoryImpl _:node1drgd6286x495
09:45:59.348 [main] DEBUG _:node1drgd6286x495 http://www.openrdf.org/config/repository#repositoryType "openrdf:SailRepository"
09:45:59.348 [main] DEBUG _:node1drgd6286x495 http://www.openrdf.org/config/repository/sail#sailImpl _:node1drgd6286x496
09:45:59.348 [main] DEBUG _:node1drgd6286x496 http://www.openrdf.org/config/sail#sailType "openrdf:Federation"
09:45:59.348 [main] DEBUG _:node1drgd6286x496 http://www.openrdf.org/config/sail/federation#readOnly "true"^^<http://www.w3.org/2001/XMLSchema#boolean>
09:45:59.348 [main] DEBUG _:node1drgd6286x496 http://www.openrdf.org/config/sail/federation#distinct "false"^^<http://www.w3.org/2001/XMLSchema#boolean>
09:45:59.348 [main] DEBUG Adding member: sparql
09:45:59.348 [main] DEBUG _:node1drgd6286x496 http://www.openrdf.org/config/sail/federation#member _:node1drgd6286x497
09:45:59.348 [main] DEBUG _:node1drgd6286x497 http://www.openrdf.org/config/repository#repositoryType "openrdf:SPARQLRepository"
09:45:59.349 [main] DEBUG _:node1drgd6286x497 http://www.openrdf.org/config/repository/sparql#query-endpoint http://localhost:8080/openrdf-sesame/repositories/sparql
09:45:59.349 [main] DEBUG Added member sparql: 
09:45:59.349 [main] DEBUG Adding member: sparql2
09:45:59.349 [main] DEBUG _:node1drgd6286x496 http://www.openrdf.org/config/sail/federation#member _:node1drgd6286x500
09:45:59.349 [main] DEBUG _:node1drgd6286x500 http://www.openrdf.org/config/repository#repositoryType "openrdf:SPARQLRepository"
09:45:59.350 [main] DEBUG _:node1drgd6286x500 http://www.openrdf.org/config/repository/sparql#query-endpoint http://localhost:8080/openrdf-sesame/repositories/sparql
09:45:59.350 [main] DEBUG Added member sparql2: 
09:45:59.362 [main] DEBUG Initializing MemoryStore...
09:45:59.362 [main] DEBUG Initializing data file...
09:45:59.363 [main] DEBUG Data file initialized
09:45:59.363 [main] DEBUG MemoryStore initialized
09:45:59.364 [main] DEBUG syncing data to file...
09:45:59.365 [main] DEBUG Data synced to file
09:45:59.367 [main] DEBUG Initializing MemoryStore...
09:45:59.368 [main] DEBUG Initializing data file...
09:45:59.368 [main] DEBUG Data file initialized
09:45:59.368 [main] DEBUG MemoryStore initialized
09:45:59.370 [main] DEBUG syncing data to file...
09:45:59.370 [main] DEBUG Data synced to file
09:45:59.377 [main] DEBUG Federate called with federation ID = fedID, and member ID's = [http][sparql].
  Distinct set to false, and readonly set to true.

09:45:59.379 [main] DEBUG Federation repository root node: _:node1drgd6286x549
09:45:59.379 [main] DEBUG _:node1drgd6286x549 http://www.w3.org/1999/02/22-rdf-syntax-ns#type http://www.openrdf.org/config/repository#Repository
09:45:59.379 [main] DEBUG _:node1drgd6286x549 http://www.openrdf.org/config/repository#repositoryID "fedID"
09:45:59.379 [main] DEBUG _:node1drgd6286x549 http://www.w3.org/2000/01/rdf-schema#label "Test Federation Title"
09:45:59.379 [main] DEBUG _:node1drgd6286x549 http://www.openrdf.org/config/repository#repositoryImpl _:node1drgd6286x550
09:45:59.379 [main] DEBUG _:node1drgd6286x550 http://www.openrdf.org/config/repository#repositoryType "openrdf:SailRepository"
09:45:59.379 [main] DEBUG _:node1drgd6286x550 http://www.openrdf.org/config/repository/sail#sailImpl _:node1drgd6286x551
09:45:59.379 [main] DEBUG _:node1drgd6286x551 http://www.openrdf.org/config/sail#sailType "openrdf:Federation"
09:45:59.379 [main] DEBUG _:node1drgd6286x551 http://www.openrdf.org/config/sail/federation#readOnly "true"^^<http://www.w3.org/2001/XMLSchema#boolean>
09:45:59.379 [main] DEBUG _:node1drgd6286x551 http://www.openrdf.org/config/sail/federation#distinct "false"^^<http://www.w3.org/2001/XMLSchema#boolean>
09:45:59.379 [main] DEBUG Adding member: http
09:45:59.379 [main] DEBUG _:node1drgd6286x551 http://www.openrdf.org/config/sail/federation#member _:node1drgd6286x552
09:45:59.379 [main] DEBUG _:node1drgd6286x552 http://www.openrdf.org/config/repository#repositoryType "openrdf:HTTPRepository"
09:45:59.380 [main] DEBUG _:node1drgd6286x552 http://www.openrdf.org/config/repository/http#repositoryURL http://localhost:8080/openrdf-sesame/repositories/http
09:45:59.380 [main] DEBUG Added member http: 
09:45:59.380 [main] DEBUG Adding member: sparql
09:45:59.380 [main] DEBUG _:node1drgd6286x551 http://www.openrdf.org/config/sail/federation#member _:node1drgd6286x555
09:45:59.381 [main] DEBUG _:node1drgd6286x555 http://www.openrdf.org/config/repository#repositoryType "openrdf:SPARQLRepository"
09:45:59.381 [main] DEBUG _:node1drgd6286x555 http://www.openrdf.org/config/repository/sparql#query-endpoint http://localhost:8080/openrdf-sesame/repositories/sparql
09:45:59.381 [main] DEBUG Added member sparql: 
09:45:59.393 [main] DEBUG Initializing MemoryStore...
09:45:59.394 [main] DEBUG Initializing data file...
09:45:59.394 [main] DEBUG Data file initialized
09:45:59.394 [main] DEBUG MemoryStore initialized
09:45:59.395 [main] DEBUG syncing data to file...
09:45:59.396 [main] DEBUG Data synced to file
09:45:59.399 [main] DEBUG Initializing MemoryStore...
09:45:59.400 [main] DEBUG Initializing data file...
09:45:59.401 [main] DEBUG Data file initialized
09:45:59.401 [main] DEBUG MemoryStore initialized
09:45:59.403 [main] DEBUG syncing data to file...
09:45:59.404 [main] DEBUG Data synced to file
09:45:59.411 [main] DEBUG Federate called with federation ID = fedID, and member ID's = [alien][FreeLunch].
  Distinct set to false, and readonly set to true.

09:45:59.412 [main] ERROR FreeLunch does not exist.
[MockitoHint] FederateTest.testNonexistentMemberPrintsSpecificError (see javadoc for MockitoHint):
[MockitoHint] 1. Unused -> at org.eclipse.rdf4j.console.command.FederateTest.setUp(FederateTest.java:88)

09:45:59.419 [main] DEBUG Initializing MemoryStore...
09:45:59.420 [main] DEBUG Initializing data file...
09:45:59.420 [main] DEBUG Data file initialized
09:45:59.420 [main] DEBUG MemoryStore initialized
09:45:59.422 [main] DEBUG syncing data to file...
09:45:59.422 [main] DEBUG Data synced to file
09:45:59.425 [main] DEBUG Initializing MemoryStore...
09:45:59.425 [main] DEBUG Initializing data file...
09:45:59.426 [main] DEBUG Data file initialized
09:45:59.426 [main] DEBUG MemoryStore initialized
09:45:59.427 [main] DEBUG syncing data to file...
09:45:59.428 [main] DEBUG Data synced to file
09:45:59.434 [main] ERROR Duplicate repository id's specified.
[MockitoHint] FederateTest.testFedSameAsMemberPrintsError (see javadoc for MockitoHint):
[MockitoHint] 1. Unused -> at org.eclipse.rdf4j.console.command.FederateTest.setUp(FederateTest.java:87)
[MockitoHint] 2. Unused -> at org.eclipse.rdf4j.console.command.FederateTest.setUp(FederateTest.java:88)

09:45:59.441 [main] DEBUG Initializing MemoryStore...
09:45:59.442 [main] DEBUG Initializing data file...
09:45:59.442 [main] DEBUG Data file initialized
09:45:59.442 [main] DEBUG MemoryStore initialized
09:45:59.443 [main] DEBUG syncing data to file...
09:45:59.443 [main] DEBUG Data synced to file
09:45:59.446 [main] DEBUG Initializing MemoryStore...
09:45:59.446 [main] DEBUG Initializing data file...
09:45:59.447 [main] DEBUG Data file initialized
09:45:59.447 [main] DEBUG MemoryStore initialized
09:45:59.448 [main] DEBUG syncing data to file...
09:45:59.449 [main] DEBUG Data synced to file
[MockitoHint] FederateTest.testTwoArgumentsPrintsHelp (see javadoc for MockitoHint):
[MockitoHint] 1. Unused -> at org.eclipse.rdf4j.console.command.FederateTest.setUp(FederateTest.java:87)
[MockitoHint] 2. Unused -> at org.eclipse.rdf4j.console.command.FederateTest.setUp(FederateTest.java:88)

09:45:59.460 [main] DEBUG Initializing MemoryStore...
09:45:59.461 [main] DEBUG Initializing data file...
09:45:59.461 [main] DEBUG Data file initialized
09:45:59.461 [main] DEBUG MemoryStore initialized
09:45:59.463 [main] DEBUG syncing data to file...
09:45:59.463 [main] DEBUG Data synced to file
09:45:59.465 [main] DEBUG Initializing MemoryStore...
09:45:59.466 [main] DEBUG Initializing data file...
09:45:59.466 [main] DEBUG Data file initialized
09:45:59.466 [main] DEBUG MemoryStore initialized
09:45:59.467 [main] DEBUG syncing data to file...
09:45:59.468 [main] DEBUG Data synced to file
09:45:59.474 [main] DEBUG Federate called with federation ID = fedID, and member ID's = [alien][scary].
  Distinct set to false, and readonly set to true.

09:45:59.475 [main] DEBUG Federation repository root node: _:node1drgd6286x692
09:45:59.475 [main] DEBUG _:node1drgd6286x692 http://www.w3.org/1999/02/22-rdf-syntax-ns#type http://www.openrdf.org/config/repository#Repository
09:45:59.475 [main] DEBUG _:node1drgd6286x692 http://www.openrdf.org/config/repository#repositoryID "fedID"
09:45:59.475 [main] DEBUG _:node1drgd6286x692 http://www.w3.org/2000/01/rdf-schema#label "Test Federation Title"
09:45:59.475 [main] DEBUG _:node1drgd6286x692 http://www.openrdf.org/config/repository#repositoryImpl _:node1drgd6286x693
09:45:59.475 [main] DEBUG _:node1drgd6286x693 http://www.openrdf.org/config/repository#repositoryType "openrdf:SailRepository"
09:45:59.475 [main] DEBUG _:node1drgd6286x693 http://www.openrdf.org/config/repository/sail#sailImpl _:node1drgd6286x694
09:45:59.475 [main] DEBUG _:node1drgd6286x694 http://www.openrdf.org/config/sail#sailType "openrdf:Federation"
09:45:59.475 [main] DEBUG _:node1drgd6286x694 http://www.openrdf.org/config/sail/federation#readOnly "true"^^<http://www.w3.org/2001/XMLSchema#boolean>
09:45:59.475 [main] DEBUG _:node1drgd6286x694 http://www.openrdf.org/config/sail/federation#distinct "false"^^<http://www.w3.org/2001/XMLSchema#boolean>
09:45:59.475 [main] DEBUG Adding member: alien
09:45:59.475 [main] DEBUG _:node1drgd6286x694 http://www.openrdf.org/config/sail/federation#member _:node1drgd6286x695
09:45:59.476 [main] DEBUG _:node1drgd6286x695 http://www.openrdf.org/config/repository#repositoryType "openrdf:ProxyRepository"
09:45:59.476 [main] DEBUG _:node1drgd6286x695 http://www.openrdf.org/config/repository/proxy#proxiedID "alien"
09:45:59.476 [main] DEBUG Added member alien: 
09:45:59.476 [main] DEBUG Adding member: scary
09:45:59.476 [main] DEBUG _:node1drgd6286x694 http://www.openrdf.org/config/sail/federation#member _:node1drgd6286x698
09:45:59.476 [main] DEBUG _:node1drgd6286x698 http://www.openrdf.org/config/repository#repositoryType "openrdf:ProxyRepository"
09:45:59.476 [main] DEBUG _:node1drgd6286x698 http://www.openrdf.org/config/repository/proxy#proxiedID "scary"
09:45:59.476 [main] DEBUG Added member scary: 
09:45:59.491 [main] DEBUG Initializing MemoryStore...
09:45:59.492 [main] DEBUG Initializing data file...
09:45:59.492 [main] DEBUG Data file initialized
09:45:59.492 [main] DEBUG MemoryStore initialized
09:45:59.494 [main] DEBUG syncing data to file...
09:45:59.494 [main] DEBUG Data synced to file
09:45:59.497 [main] DEBUG Initializing MemoryStore...
09:45:59.497 [main] DEBUG Initializing data file...
09:45:59.497 [main] DEBUG Data file initialized
09:45:59.497 [main] DEBUG MemoryStore initialized
09:45:59.499 [main] DEBUG syncing data to file...
09:45:59.499 [main] DEBUG Data synced to file
[MockitoHint] FederateTest.testOneArgumentPrintsHelp (see javadoc for MockitoHint):
[MockitoHint] 1. Unused -> at org.eclipse.rdf4j.console.command.FederateTest.setUp(FederateTest.java:87)
[MockitoHint] 2. Unused -> at org.eclipse.rdf4j.console.command.FederateTest.setUp(FederateTest.java:88)

09:45:59.511 [main] DEBUG Initializing MemoryStore...
09:45:59.512 [main] DEBUG Initializing data file...
09:45:59.513 [main] DEBUG Data file initialized
09:45:59.513 [main] DEBUG MemoryStore initialized
09:45:59.514 [main] DEBUG syncing data to file...
09:45:59.514 [main] DEBUG Data synced to file
09:45:59.516 [main] DEBUG Initializing MemoryStore...
09:45:59.517 [main] DEBUG Initializing data file...
09:45:59.517 [main] DEBUG Data file initialized
09:45:59.517 [main] DEBUG MemoryStore initialized
09:45:59.518 [main] DEBUG syncing data to file...
09:45:59.519 [main] DEBUG Data synced to file
09:45:59.525 [main] DEBUG Federate called with federation ID = fedID, and member ID's = [http][http2].
  Distinct set to false, and readonly set to true.

09:45:59.527 [main] DEBUG Federation repository root node: _:node1drgd6286x784
09:45:59.527 [main] DEBUG _:node1drgd6286x784 http://www.w3.org/1999/02/22-rdf-syntax-ns#type http://www.openrdf.org/config/repository#Repository
09:45:59.527 [main] DEBUG _:node1drgd6286x784 http://www.openrdf.org/config/repository#repositoryID "fedID"
09:45:59.527 [main] DEBUG _:node1drgd6286x784 http://www.w3.org/2000/01/rdf-schema#label "Test Federation Title"
09:45:59.527 [main] DEBUG _:node1drgd6286x784 http://www.openrdf.org/config/repository#repositoryImpl _:node1drgd6286x785
09:45:59.527 [main] DEBUG _:node1drgd6286x785 http://www.openrdf.org/config/repository#repositoryType "openrdf:SailRepository"
09:45:59.527 [main] DEBUG _:node1drgd6286x785 http://www.openrdf.org/config/repository/sail#sailImpl _:node1drgd6286x786
09:45:59.527 [main] DEBUG _:node1drgd6286x786 http://www.openrdf.org/config/sail#sailType "openrdf:Federation"
09:45:59.527 [main] DEBUG _:node1drgd6286x786 http://www.openrdf.org/config/sail/federation#readOnly "true"^^<http://www.w3.org/2001/XMLSchema#boolean>
09:45:59.527 [main] DEBUG _:node1drgd6286x786 http://www.openrdf.org/config/sail/federation#distinct "false"^^<http://www.w3.org/2001/XMLSchema#boolean>
09:45:59.527 [main] DEBUG Adding member: http
09:45:59.527 [main] DEBUG _:node1drgd6286x786 http://www.openrdf.org/config/sail/federation#member _:node1drgd6286x787
09:45:59.527 [main] DEBUG _:node1drgd6286x787 http://www.openrdf.org/config/repository#repositoryType "openrdf:HTTPRepository"
09:45:59.528 [main] DEBUG _:node1drgd6286x787 http://www.openrdf.org/config/repository/http#repositoryURL http://localhost:8080/openrdf-sesame/repositories/http
09:45:59.528 [main] DEBUG Added member http: 
09:45:59.528 [main] DEBUG Adding member: http2
09:45:59.528 [main] DEBUG _:node1drgd6286x786 http://www.openrdf.org/config/sail/federation#member _:node1drgd6286x790
09:45:59.528 [main] DEBUG _:node1drgd6286x790 http://www.openrdf.org/config/repository#repositoryType "openrdf:HTTPRepository"
09:45:59.529 [main] DEBUG _:node1drgd6286x790 http://www.openrdf.org/config/repository/http#repositoryURL http://localhost:8080/openrdf-sesame/repositories/http
09:45:59.529 [main] DEBUG Added member http2: 
[INFO] Tests run: 15, Failures: 0, Errors: 0, Skipped: 0, Time elapsed: 0.43 s - in org.eclipse.rdf4j.console.command.FederateTest
[INFO] Running org.eclipse.rdf4j.console.command.SparqlTest
[MockitoHint] SparqlTest.testInputFile (see javadoc for MockitoHint):
[MockitoHint] 1. Unused -> at org.eclipse.rdf4j.console.command.SparqlTest.setUp(SparqlTest.java:49)

09:45:59.572 [main] ERROR No suitable result writer found
[MockitoHint] SparqlTest.testSelectError (see javadoc for MockitoHint):
[MockitoHint] 1. Unused -> at org.eclipse.rdf4j.console.command.SparqlTest.setUp(SparqlTest.java:49)

[MockitoHint] SparqlTest.testSelectMissingBindings (see javadoc for MockitoHint):
[MockitoHint] 1. Unused -> at org.eclipse.rdf4j.console.command.SparqlTest.setUp(SparqlTest.java:49)

[MockitoHint] SparqlTest.testInputFileWorkdir (see javadoc for MockitoHint):
[MockitoHint] 1. Unused -> at org.eclipse.rdf4j.console.command.SparqlTest.setUp(SparqlTest.java:49)

[INFO] Tests run: 9, Failures: 0, Errors: 0, Skipped: 0, Time elapsed: 0.127 s - in org.eclipse.rdf4j.console.command.SparqlTest
[INFO] Running org.eclipse.rdf4j.console.UtilTest
 one, two
 three
 four
 five, six
 seven
 eight
[INFO] Tests run: 4, Failures: 0, Errors: 0, Skipped: 0, Time elapsed: 0 s - in org.eclipse.rdf4j.console.UtilTest
[INFO] Running org.eclipse.rdf4j.console.ConsoleIOTest
[INFO] Tests run: 3, Failures: 0, Errors: 0, Skipped: 0, Time elapsed: 0.038 s - in org.eclipse.rdf4j.console.ConsoleIOTest
[INFO] 
[INFO] Results:
[INFO] 
[INFO] Tests run: 64, Failures: 0, Errors: 0, Skipped: 0
[INFO] 
[JENKINS] Recording test results
[INFO] 
[INFO] --- animal-sniffer-maven-plugin:1.16:check (default) @ rdf4j-console ---
[INFO] Checking unresolved references to org.codehaus.mojo.signature:java18:1.0
[INFO] 
[INFO] --- maven-jar-plugin:2.3.1:jar (default-jar) @ rdf4j-console ---
[INFO] Building jar: /home/hudson/genie.rdf4j/.jenkins/jobs/rdf4j-pr-verify/workspace/tools/console/target/rdf4j-console-3.1.0-SNAPSHOT.jar