SuccessConsole Output

[INFO] 
[INFO] -----------< org.eclipse.rdf4j:rdf4j-repository-compliance >------------
[INFO] Building RDF4J Repository compliance tests 3.1.3-SNAPSHOT       [90/100]
[INFO] --------------------------------[ war ]---------------------------------
[INFO] 
[INFO] --- maven-clean-plugin:3.0.0:clean (default-clean) @ rdf4j-repository-compliance ---
[INFO] 
[INFO] --- buildnumber-maven-plugin:1.4:create (default) @ rdf4j-repository-compliance ---
[INFO] ShortRevision tag detected. The value is '7'.
[INFO] Executing: /bin/sh -c cd '/home/jenkins/agent/workspace/rdf4j-master-deploy/compliance/repository' && 'git' 'rev-parse' '--verify' '--short=7' 'HEAD'
[INFO] Working directory: /home/jenkins/agent/workspace/rdf4j-master-deploy/compliance/repository
[INFO] Storing buildNumber: 0f38727 at timestamp: 1585848527782
[WARNING] Cannot get the branch information from the git repository: 
Detecting the current branch failed: fatal: ref HEAD is not a symbolic ref

[INFO] ShortRevision tag detected. The value is '7'.
[INFO] Executing: /bin/sh -c cd '/home/jenkins/agent/workspace/rdf4j-master-deploy/compliance/repository' && 'git' 'rev-parse' '--verify' '--short=7' 'HEAD'
[INFO] Working directory: /home/jenkins/agent/workspace/rdf4j-master-deploy/compliance/repository
[INFO] Storing buildScmBranch: UNKNOWN
[INFO] 
[INFO] --- maven-enforcer-plugin:1.4.1:enforce (enforce-bytecode-version) @ rdf4j-repository-compliance ---
[INFO] Adding ignore: META-INF/**/module-info
[INFO] 
[INFO] --- formatter-maven-plugin:2.8.1:validate (default) @ rdf4j-repository-compliance ---
[INFO] Using 'UTF-8' encoding to format source files.
[INFO] Number of files to be formatted: 16
[INFO] Successfully formatted:          0 file(s)
[INFO] Fail to format:                  0 file(s)
[INFO] Skipped:                         16 file(s)
[INFO] Read only skipped:               0 file(s)
[INFO] Approximate time taken:          0s
[INFO] 
[INFO] --- maven-resources-plugin:3.0.2:resources (default-resources) @ rdf4j-repository-compliance ---
[INFO] Using 'UTF-8' encoding to copy filtered resources.
[INFO] skip non existing resourceDirectory /home/jenkins/agent/workspace/rdf4j-master-deploy/compliance/repository/src/main/resources
[INFO] 
[INFO] --- maven-compiler-plugin:3.7.0:compile (default-compile) @ rdf4j-repository-compliance ---
[INFO] No sources to compile
[INFO] 
[INFO] --- maven-resources-plugin:3.0.2:testResources (default-testResources) @ rdf4j-repository-compliance ---
[INFO] Using 'UTF-8' encoding to copy filtered resources.
[INFO] Copying 4 resources
[INFO] 
[INFO] --- maven-compiler-plugin:3.7.0:testCompile (default-testCompile) @ rdf4j-repository-compliance ---
[INFO] Changes detected - recompiling the module!
[INFO] Compiling 16 source files to /home/jenkins/agent/workspace/rdf4j-master-deploy/compliance/repository/target/test-classes
[INFO] 
[INFO] --- maven-surefire-plugin:2.22.2:test (default-test) @ rdf4j-repository-compliance ---
[INFO] Tests are skipped.
[INFO] 
[INFO] --- animal-sniffer-maven-plugin:1.16:check (default) @ rdf4j-repository-compliance ---
[INFO] Checking unresolved references to org.codehaus.mojo.signature:java18:1.0
[INFO] 
[INFO] --- maven-war-plugin:2.1.1:war (default-war) @ rdf4j-repository-compliance ---
[INFO] Packaging webapp
[INFO] Assembling webapp [rdf4j-repository-compliance] in [/home/jenkins/agent/workspace/rdf4j-master-deploy/compliance/repository/target/rdf4j-server]
[INFO] Processing war project
[INFO] Processing overlay [ id org.eclipse.rdf4j:rdf4j-http-server]
[INFO] Webapp assembled in [357 msecs]
[INFO] Building war: /home/jenkins/agent/workspace/rdf4j-master-deploy/compliance/repository/target/rdf4j-repository-compliance-3.1.3-SNAPSHOT.war
[INFO] WEB-INF/web.xml already added, skipping
[INFO] 
[INFO] --- maven-failsafe-plugin:2.19.1:integration-test (integration-tests) @ rdf4j-repository-compliance ---

-------------------------------------------------------
 T E S T S
-------------------------------------------------------
Picked up JAVA_TOOL_OPTIONS: -XX:+IgnoreUnrecognizedVMOptions -XX:+UseContainerSupport -XX:+UnlockExperimentalVMOptions -XX:+UseCGroupMemoryLimitForHeap
Picked up _JAVA_OPTIONS: -XX:MaxRAMPercentage=64.0
Running org.eclipse.rdf4j.repository.http.HTTPSparqlDatasetTest
17:28:51.635 [main] INFO  Logging initialized @243ms to org.eclipse.jetty.util.log.Slf4jLog
17:28:51.739 [main] INFO  jetty-9.4.19.v20190610; built: 2019-06-10T16:30:51.723Z; git: afcf563148970e98786327af5e07c261fda175d3; jvm 1.8.0_202-b08
17:28:51.923 [main] INFO  NO JSP Support for /rdf4j, did not find org.eclipse.jetty.jsp.JettyJspServlet
17:28:51.932 [main] INFO  DefaultSessionIdManager workerName=node0
17:28:51.932 [main] INFO  No SessionScavenger set, using defaults
17:28:51.933 [main] INFO  node0 Scavenging every 600000ms
SLF4J: Class path contains multiple SLF4J bindings.
SLF4J: Found binding in [jar:file:/home/jenkins/agent/workspace/rdf4j-master-deploy/compliance/repository/target/rdf4j-server/WEB-INF/lib/logback-classic-1.1.11.jar!/org/slf4j/impl/StaticLoggerBinder.class]
SLF4J: Found binding in [jar:file:/home/jenkins/.m2/repository/ch/qos/logback/logback-classic/1.1.11/logback-classic-1.1.11.jar!/org/slf4j/impl/StaticLoggerBinder.class]
SLF4J: See http://www.slf4j.org/codes.html#multiple_bindings for an explanation.
SLF4J: Actual binding is of type [ch.qos.logback.classic.util.ContextSelectorStaticBinder]
17:28:52.000 [main] INFO  CompressingFilter has initialized
17:28:52.004 [main] INFO  org.tuckey.web.filters.urlrewrite.UrlRewriteFilter INFO: status display disabled
17:28:52.027 [main] INFO  org.tuckey.web.filters.urlrewrite.UrlRewriteFilter INFO: loaded (conf ok)
17:28:52.135 [main] INFO  Initializing Spring DispatcherServlet 'rdf4j-http-server'
17:28:52.135 [main] INFO  Initializing Servlet 'rdf4j-http-server'
17:28:52.735 [main] INFO  Started o.e.j.w.WebAppContext@4b629f13{RDF4J Server,/rdf4j,file:///home/jenkins/agent/workspace/rdf4j-master-deploy/compliance/repository/target/rdf4j-server/,AVAILABLE}{./target/rdf4j-server}
17:28:52.743 [main] INFO  Started ServerConnector@4c762604{HTTP/1.1,[http/1.1]}{0.0.0.0:18081}
17:28:52.743 [main] INFO  Started @1352ms
17:28:53.523 [main] INFO  Stopped ServerConnector@4c762604{HTTP/1.1,[http/1.1]}{0.0.0.0:18081}
17:28:53.523 [main] INFO  node0 Stopped scavenging
17:28:53.524 [main] INFO  org.tuckey.web.filters.urlrewrite.UrlRewriteFilter INFO: destroy called
17:28:53.524 [main] INFO  Destroying Spring FrameworkServlet 'rdf4j-http-server'
17:28:53.529 [main] INFO  Stopped o.e.j.w.WebAppContext@4b629f13{RDF4J Server,/rdf4j,null,UNAVAILABLE}{./target/rdf4j-server}
Tests run: 2, Failures: 0, Errors: 0, Skipped: 0, Time elapsed: 2.042 sec - in org.eclipse.rdf4j.repository.http.HTTPSparqlDatasetTest
Picked up JAVA_TOOL_OPTIONS: -XX:+IgnoreUnrecognizedVMOptions -XX:+UseContainerSupport -XX:+UnlockExperimentalVMOptions -XX:+UseCGroupMemoryLimitForHeap
Picked up _JAVA_OPTIONS: -XX:MaxRAMPercentage=64.0
Running org.eclipse.rdf4j.repository.http.HTTPTupleQueryResultTest
17:28:54.088 [main] INFO  Logging initialized @227ms to org.eclipse.jetty.util.log.Slf4jLog
17:28:54.182 [main] INFO  jetty-9.4.19.v20190610; built: 2019-06-10T16:30:51.723Z; git: afcf563148970e98786327af5e07c261fda175d3; jvm 1.8.0_202-b08
17:28:54.342 [main] INFO  NO JSP Support for /rdf4j, did not find org.eclipse.jetty.jsp.JettyJspServlet
17:28:54.352 [main] INFO  DefaultSessionIdManager workerName=node0
17:28:54.352 [main] INFO  No SessionScavenger set, using defaults
17:28:54.353 [main] INFO  node0 Scavenging every 660000ms
SLF4J: Class path contains multiple SLF4J bindings.
SLF4J: Found binding in [jar:file:/home/jenkins/agent/workspace/rdf4j-master-deploy/compliance/repository/target/rdf4j-server/WEB-INF/lib/logback-classic-1.1.11.jar!/org/slf4j/impl/StaticLoggerBinder.class]
SLF4J: Found binding in [jar:file:/home/jenkins/.m2/repository/ch/qos/logback/logback-classic/1.1.11/logback-classic-1.1.11.jar!/org/slf4j/impl/StaticLoggerBinder.class]
SLF4J: See http://www.slf4j.org/codes.html#multiple_bindings for an explanation.
SLF4J: Actual binding is of type [ch.qos.logback.classic.util.ContextSelectorStaticBinder]
17:28:54.437 [main] INFO  CompressingFilter has initialized
17:28:54.441 [main] INFO  org.tuckey.web.filters.urlrewrite.UrlRewriteFilter INFO: status display disabled
17:28:54.459 [main] INFO  org.tuckey.web.filters.urlrewrite.UrlRewriteFilter INFO: loaded (conf ok)
17:28:54.545 [main] INFO  Initializing Spring DispatcherServlet 'rdf4j-http-server'
17:28:54.545 [main] INFO  Initializing Servlet 'rdf4j-http-server'
17:28:55.147 [main] INFO  Started o.e.j.w.WebAppContext@62d363ab{RDF4J Server,/rdf4j,file:///home/jenkins/agent/workspace/rdf4j-master-deploy/compliance/repository/target/rdf4j-server/,AVAILABLE}{./target/rdf4j-server}
17:28:55.155 [main] INFO  Started ServerConnector@5579bb86{HTTP/1.1,[http/1.1]}{0.0.0.0:18081}
17:28:55.155 [main] INFO  Started @1295ms
17:29:03.666 [main] INFO  Open lots of TupleQueryResults without closing them
17:29:04.240 [main] INFO  Stopped ServerConnector@5579bb86{HTTP/1.1,[http/1.1]}{0.0.0.0:18081}
17:29:04.240 [main] INFO  node0 Stopped scavenging
17:29:04.241 [main] INFO  org.tuckey.web.filters.urlrewrite.UrlRewriteFilter INFO: destroy called
17:29:04.241 [main] INFO  Destroying Spring FrameworkServlet 'rdf4j-http-server'
17:29:04.245 [main] INFO  Stopped o.e.j.w.WebAppContext@62d363ab{RDF4J Server,/rdf4j,null,UNAVAILABLE}{./target/rdf4j-server}
Tests run: 5, Failures: 0, Errors: 0, Skipped: 0, Time elapsed: 10.29 sec - in org.eclipse.rdf4j.repository.http.HTTPTupleQueryResultTest
Picked up JAVA_TOOL_OPTIONS: -XX:+IgnoreUnrecognizedVMOptions -XX:+UseContainerSupport -XX:+UnlockExperimentalVMOptions -XX:+UseCGroupMemoryLimitForHeap
Picked up _JAVA_OPTIONS: -XX:MaxRAMPercentage=64.0
Running org.eclipse.rdf4j.repository.http.HTTPStoreConnectionTest
17:29:04.856 [main] INFO  Logging initialized @272ms to org.eclipse.jetty.util.log.Slf4jLog
17:29:04.961 [main] INFO  jetty-9.4.19.v20190610; built: 2019-06-10T16:30:51.723Z; git: afcf563148970e98786327af5e07c261fda175d3; jvm 1.8.0_202-b08
17:29:05.128 [main] INFO  NO JSP Support for /rdf4j, did not find org.eclipse.jetty.jsp.JettyJspServlet
17:29:05.141 [main] INFO  DefaultSessionIdManager workerName=node0
17:29:05.141 [main] INFO  No SessionScavenger set, using defaults
17:29:05.142 [main] INFO  node0 Scavenging every 660000ms
SLF4J: Class path contains multiple SLF4J bindings.
SLF4J: Found binding in [jar:file:/home/jenkins/agent/workspace/rdf4j-master-deploy/compliance/repository/target/rdf4j-server/WEB-INF/lib/logback-classic-1.1.11.jar!/org/slf4j/impl/StaticLoggerBinder.class]
SLF4J: Found binding in [jar:file:/home/jenkins/.m2/repository/ch/qos/logback/logback-classic/1.1.11/logback-classic-1.1.11.jar!/org/slf4j/impl/StaticLoggerBinder.class]
SLF4J: See http://www.slf4j.org/codes.html#multiple_bindings for an explanation.
SLF4J: Actual binding is of type [ch.qos.logback.classic.util.ContextSelectorStaticBinder]
17:29:05.212 [main] INFO  CompressingFilter has initialized
17:29:05.216 [main] INFO  org.tuckey.web.filters.urlrewrite.UrlRewriteFilter INFO: status display disabled
17:29:05.234 [main] INFO  org.tuckey.web.filters.urlrewrite.UrlRewriteFilter INFO: loaded (conf ok)
17:29:05.336 [main] INFO  Initializing Spring DispatcherServlet 'rdf4j-http-server'
17:29:05.336 [main] INFO  Initializing Servlet 'rdf4j-http-server'
17:29:05.929 [main] INFO  Started o.e.j.w.WebAppContext@22c01ab0{RDF4J Server,/rdf4j,file:///home/jenkins/agent/workspace/rdf4j-master-deploy/compliance/repository/target/rdf4j-server/,AVAILABLE}{./target/rdf4j-server}
17:29:05.936 [main] INFO  Started ServerConnector@1068e947{HTTP/1.1,[http/1.1]}{0.0.0.0:18081}
17:29:05.936 [main] INFO  Started @1354ms
17:29:07.417 [Time-limited test] WARN  Server reports problem: Unexpected end of file
17:29:09.062 [Time-limited test] WARN  Server reports problem: Unexpected end of file
17:29:10.213 [Time-limited test] WARN  Server reports problem: Unexpected end of file
17:29:11.056 [Time-limited test] WARN  Server reports problem: Unexpected end of file
17:29:11.858 [Time-limited test] WARN  Server reports problem: Unexpected end of file
17:29:12.614 [Time-limited test] WARN  Server reports problem: Unexpected end of file
17:29:13.070 [main] INFO  Stopped ServerConnector@1068e947{HTTP/1.1,[http/1.1]}{0.0.0.0:18081}
17:29:13.070 [main] INFO  node0 Stopped scavenging
17:29:13.070 [main] INFO  org.tuckey.web.filters.urlrewrite.UrlRewriteFilter INFO: destroy called
17:29:13.071 [main] INFO  Destroying Spring FrameworkServlet 'rdf4j-http-server'
17:29:13.114 [main] INFO  Stopped o.e.j.w.WebAppContext@22c01ab0{RDF4J Server,/rdf4j,null,UNAVAILABLE}{./target/rdf4j-server}
Tests run: 438, Failures: 0, Errors: 0, Skipped: 6, Time elapsed: 8.436 sec - in org.eclipse.rdf4j.repository.http.HTTPStoreConnectionTest
Picked up JAVA_TOOL_OPTIONS: -XX:+IgnoreUnrecognizedVMOptions -XX:+UseContainerSupport -XX:+UnlockExperimentalVMOptions -XX:+UseCGroupMemoryLimitForHeap
Picked up _JAVA_OPTIONS: -XX:MaxRAMPercentage=64.0
Running org.eclipse.rdf4j.repository.http.HTTPRepositoryOptimisticIsolationTest
17:29:13.725 [main] INFO  Logging initialized @274ms to org.eclipse.jetty.util.log.Slf4jLog
17:29:13.817 [main] INFO  jetty-9.4.19.v20190610; built: 2019-06-10T16:30:51.723Z; git: afcf563148970e98786327af5e07c261fda175d3; jvm 1.8.0_202-b08
17:29:13.974 [main] INFO  NO JSP Support for /rdf4j, did not find org.eclipse.jetty.jsp.JettyJspServlet
17:29:14.013 [main] INFO  DefaultSessionIdManager workerName=node0
17:29:14.013 [main] INFO  No SessionScavenger set, using defaults
17:29:14.014 [main] INFO  node0 Scavenging every 600000ms
SLF4J: Class path contains multiple SLF4J bindings.
SLF4J: Found binding in [jar:file:/home/jenkins/agent/workspace/rdf4j-master-deploy/compliance/repository/target/rdf4j-server/WEB-INF/lib/logback-classic-1.1.11.jar!/org/slf4j/impl/StaticLoggerBinder.class]
SLF4J: Found binding in [jar:file:/home/jenkins/.m2/repository/ch/qos/logback/logback-classic/1.1.11/logback-classic-1.1.11.jar!/org/slf4j/impl/StaticLoggerBinder.class]
SLF4J: See http://www.slf4j.org/codes.html#multiple_bindings for an explanation.
SLF4J: Actual binding is of type [ch.qos.logback.classic.util.ContextSelectorStaticBinder]
17:29:14.084 [main] INFO  CompressingFilter has initialized
17:29:14.087 [main] INFO  org.tuckey.web.filters.urlrewrite.UrlRewriteFilter INFO: status display disabled
17:29:14.121 [main] INFO  org.tuckey.web.filters.urlrewrite.UrlRewriteFilter INFO: loaded (conf ok)
17:29:14.223 [main] INFO  Initializing Spring DispatcherServlet 'rdf4j-http-server'
17:29:14.223 [main] INFO  Initializing Servlet 'rdf4j-http-server'
17:29:14.848 [main] INFO  Started o.e.j.w.WebAppContext@2f66e802{RDF4J Server,/rdf4j,file:///home/jenkins/agent/workspace/rdf4j-master-deploy/compliance/repository/target/rdf4j-server/,AVAILABLE}{./target/rdf4j-server}
17:29:14.856 [main] INFO  Started ServerConnector@61ca2dfa{HTTP/1.1,[http/1.1]}{0.0.0.0:18081}
17:29:14.856 [main] INFO  Started @1406ms
17:29:17.738 [Thread-22] WARN  Server reports problem: Transaction handling error: org.eclipse.rdf4j.repository.RepositoryException: org.eclipse.rdf4j.sail.SailConflictException: Observed State has Changed
17:29:17.757 [Thread-24] WARN  Server reports problem: Transaction handling error: org.eclipse.rdf4j.repository.RepositoryException: org.eclipse.rdf4j.sail.SailConflictException: Observed State has Changed
17:29:17.825 [Thread-26] WARN  Server reports problem: Transaction handling error: org.eclipse.rdf4j.repository.RepositoryException: org.eclipse.rdf4j.sail.SailConflictException: Observed State has Changed
17:29:19.537 [main] WARN  Server reports problem: Transaction handling error: org.eclipse.rdf4j.repository.RepositoryException: org.eclipse.rdf4j.sail.SailConflictException: Observed State has Changed
17:29:19.560 [main] WARN  Server reports problem: Transaction handling error: org.eclipse.rdf4j.repository.RepositoryException: org.eclipse.rdf4j.sail.SailConflictException: Observed State has Changed
17:29:19.638 [main] WARN  Server reports problem: Transaction handling error: org.eclipse.rdf4j.repository.RepositoryException: org.eclipse.rdf4j.sail.SailConflictException: Observed State has Changed
17:29:19.652 [main] WARN  Server reports problem: Transaction handling error: org.eclipse.rdf4j.repository.RepositoryException: org.eclipse.rdf4j.sail.SailConflictException: Observed State has Changed
17:29:19.711 [main] WARN  Server reports problem: Transaction handling error: org.eclipse.rdf4j.repository.RepositoryException: org.eclipse.rdf4j.sail.SailConflictException: Observed State has Changed
17:29:19.726 [main] WARN  Server reports problem: Transaction handling error: org.eclipse.rdf4j.repository.RepositoryException: org.eclipse.rdf4j.sail.SailConflictException: Observed State has Changed
17:29:19.752 [main] WARN  Server reports problem: Transaction handling error: org.eclipse.rdf4j.repository.RepositoryException: org.eclipse.rdf4j.sail.SailConflictException: Observed State has Changed
17:29:19.767 [main] WARN  Server reports problem: Transaction handling error: org.eclipse.rdf4j.repository.RepositoryException: org.eclipse.rdf4j.sail.SailConflictException: Observed State has Changed
17:29:19.825 [main] WARN  Server reports problem: Transaction handling error: org.eclipse.rdf4j.repository.RepositoryException: org.eclipse.rdf4j.sail.SailConflictException: Observed State has Changed
17:29:19.861 [main] WARN  Server reports problem: Transaction handling error: org.eclipse.rdf4j.repository.RepositoryException: org.eclipse.rdf4j.sail.SailConflictException: Observed State has Changed
17:29:19.937 [main] WARN  Server reports problem: Transaction handling error: org.eclipse.rdf4j.repository.RepositoryException: org.eclipse.rdf4j.sail.SailConflictException: Observed State has Changed
17:29:19.948 [main] WARN  Server reports problem: Transaction handling error: org.eclipse.rdf4j.repository.RepositoryException: org.eclipse.rdf4j.sail.SailConflictException: Observed State has Changed
17:29:19.962 [main] WARN  Server reports problem: Transaction handling error: org.eclipse.rdf4j.repository.RepositoryException: org.eclipse.rdf4j.sail.SailConflictException: Observed State has Changed
17:29:20.018 [main] INFO  Stopped ServerConnector@61ca2dfa{HTTP/1.1,[http/1.1]}{0.0.0.0:18081}
17:29:20.018 [main] INFO  node0 Stopped scavenging
17:29:20.018 [main] INFO  org.tuckey.web.filters.urlrewrite.UrlRewriteFilter INFO: destroy called
17:29:20.019 [main] INFO  Destroying Spring FrameworkServlet 'rdf4j-http-server'
17:29:20.022 [main] INFO  Stopped o.e.j.w.WebAppContext@2f66e802{RDF4J Server,/rdf4j,null,UNAVAILABLE}{./target/rdf4j-server}
Tests run: 113, Failures: 0, Errors: 0, Skipped: 0, Time elapsed: 6.479 sec - in org.eclipse.rdf4j.repository.http.HTTPRepositoryOptimisticIsolationTest
Picked up JAVA_TOOL_OPTIONS: -XX:+IgnoreUnrecognizedVMOptions -XX:+UseContainerSupport -XX:+UnlockExperimentalVMOptions -XX:+UseCGroupMemoryLimitForHeap
Picked up _JAVA_OPTIONS: -XX:MaxRAMPercentage=64.0
Running org.eclipse.rdf4j.repository.http.HTTPRepositoryTransactionTest
17:29:20.576 [main] INFO  Logging initialized @223ms to org.eclipse.jetty.util.log.Slf4jLog
17:29:20.671 [main] INFO  jetty-9.4.19.v20190610; built: 2019-06-10T16:30:51.723Z; git: afcf563148970e98786327af5e07c261fda175d3; jvm 1.8.0_202-b08
17:29:20.827 [main] INFO  NO JSP Support for /rdf4j, did not find org.eclipse.jetty.jsp.JettyJspServlet
17:29:20.836 [main] INFO  DefaultSessionIdManager workerName=node0
17:29:20.836 [main] INFO  No SessionScavenger set, using defaults
17:29:20.838 [main] INFO  node0 Scavenging every 600000ms
SLF4J: Class path contains multiple SLF4J bindings.
SLF4J: Found binding in [jar:file:/home/jenkins/agent/workspace/rdf4j-master-deploy/compliance/repository/target/rdf4j-server/WEB-INF/lib/logback-classic-1.1.11.jar!/org/slf4j/impl/StaticLoggerBinder.class]
SLF4J: Found binding in [jar:file:/home/jenkins/.m2/repository/ch/qos/logback/logback-classic/1.1.11/logback-classic-1.1.11.jar!/org/slf4j/impl/StaticLoggerBinder.class]
SLF4J: See http://www.slf4j.org/codes.html#multiple_bindings for an explanation.
SLF4J: Actual binding is of type [ch.qos.logback.classic.util.ContextSelectorStaticBinder]
17:29:20.919 [main] INFO  CompressingFilter has initialized
17:29:20.922 [main] INFO  org.tuckey.web.filters.urlrewrite.UrlRewriteFilter INFO: status display disabled
17:29:20.942 [main] INFO  org.tuckey.web.filters.urlrewrite.UrlRewriteFilter INFO: loaded (conf ok)
17:29:21.027 [main] INFO  Initializing Spring DispatcherServlet 'rdf4j-http-server'
17:29:21.027 [main] INFO  Initializing Servlet 'rdf4j-http-server'
17:29:21.594 [main] INFO  Started o.e.j.w.WebAppContext@452e26d0{RDF4J Server,/rdf4j,file:///home/jenkins/agent/workspace/rdf4j-master-deploy/compliance/repository/target/rdf4j-server/,AVAILABLE}{./target/rdf4j-server}
17:29:21.601 [main] INFO  Started ServerConnector@306279ee{HTTP/1.1,[http/1.1]}{0.0.0.0:18081}
17:29:21.601 [main] INFO  Started @1250ms
17:29:25.143 [main] INFO  Stopped ServerConnector@306279ee{HTTP/1.1,[http/1.1]}{0.0.0.0:18081}
17:29:25.143 [main] INFO  node0 Stopped scavenging
17:29:25.143 [main] INFO  org.tuckey.web.filters.urlrewrite.UrlRewriteFilter INFO: destroy called
17:29:25.144 [main] INFO  Destroying Spring FrameworkServlet 'rdf4j-http-server'
17:29:25.149 [main] INFO  Stopped o.e.j.w.WebAppContext@452e26d0{RDF4J Server,/rdf4j,null,UNAVAILABLE}{./target/rdf4j-server}
Tests run: 1, Failures: 0, Errors: 0, Skipped: 0, Time elapsed: 4.703 sec - in org.eclipse.rdf4j.repository.http.HTTPRepositoryTransactionTest
Picked up JAVA_TOOL_OPTIONS: -XX:+IgnoreUnrecognizedVMOptions -XX:+UseContainerSupport -XX:+UnlockExperimentalVMOptions -XX:+UseCGroupMemoryLimitForHeap
Picked up _JAVA_OPTIONS: -XX:MaxRAMPercentage=64.0
Running org.eclipse.rdf4j.repository.http.HTTPRepositoryTest
17:29:25.695 [main] INFO  Logging initialized @217ms to org.eclipse.jetty.util.log.Slf4jLog
17:29:25.792 [main] INFO  jetty-9.4.19.v20190610; built: 2019-06-10T16:30:51.723Z; git: afcf563148970e98786327af5e07c261fda175d3; jvm 1.8.0_202-b08
17:29:25.947 [main] INFO  NO JSP Support for /rdf4j, did not find org.eclipse.jetty.jsp.JettyJspServlet
17:29:25.956 [main] INFO  DefaultSessionIdManager workerName=node0
17:29:25.956 [main] INFO  No SessionScavenger set, using defaults
17:29:25.957 [main] INFO  node0 Scavenging every 600000ms
SLF4J: Class path contains multiple SLF4J bindings.
SLF4J: Found binding in [jar:file:/home/jenkins/agent/workspace/rdf4j-master-deploy/compliance/repository/target/rdf4j-server/WEB-INF/lib/logback-classic-1.1.11.jar!/org/slf4j/impl/StaticLoggerBinder.class]
SLF4J: Found binding in [jar:file:/home/jenkins/.m2/repository/ch/qos/logback/logback-classic/1.1.11/logback-classic-1.1.11.jar!/org/slf4j/impl/StaticLoggerBinder.class]
SLF4J: See http://www.slf4j.org/codes.html#multiple_bindings for an explanation.
SLF4J: Actual binding is of type [ch.qos.logback.classic.util.ContextSelectorStaticBinder]
17:29:26.042 [main] INFO  CompressingFilter has initialized
17:29:26.046 [main] INFO  org.tuckey.web.filters.urlrewrite.UrlRewriteFilter INFO: status display disabled
17:29:26.064 [main] INFO  org.tuckey.web.filters.urlrewrite.UrlRewriteFilter INFO: loaded (conf ok)
17:29:26.159 [main] INFO  Initializing Spring DispatcherServlet 'rdf4j-http-server'
17:29:26.159 [main] INFO  Initializing Servlet 'rdf4j-http-server'
17:29:26.789 [main] INFO  Started o.e.j.w.WebAppContext@42257bdd{RDF4J Server,/rdf4j,file:///home/jenkins/agent/workspace/rdf4j-master-deploy/compliance/repository/target/rdf4j-server/,AVAILABLE}{./target/rdf4j-server}
17:29:26.797 [main] INFO  Started ServerConnector@4cf4d528{HTTP/1.1,[http/1.1]}{0.0.0.0:18081}
17:29:26.797 [main] INFO  Started @1320ms
17:29:27.337 [main] INFO  Stopped ServerConnector@4cf4d528{HTTP/1.1,[http/1.1]}{0.0.0.0:18081}
17:29:27.337 [main] INFO  node0 Stopped scavenging
17:29:27.337 [main] INFO  org.tuckey.web.filters.urlrewrite.UrlRewriteFilter INFO: destroy called
17:29:27.338 [main] INFO  Destroying Spring FrameworkServlet 'rdf4j-http-server'
17:29:27.341 [main] INFO  Stopped o.e.j.w.WebAppContext@42257bdd{RDF4J Server,/rdf4j,null,UNAVAILABLE}{./target/rdf4j-server}
Tests run: 2, Failures: 0, Errors: 0, Skipped: 0, Time elapsed: 1.768 sec - in org.eclipse.rdf4j.repository.http.HTTPRepositoryTest
Picked up JAVA_TOOL_OPTIONS: -XX:+IgnoreUnrecognizedVMOptions -XX:+UseContainerSupport -XX:+UnlockExperimentalVMOptions -XX:+UseCGroupMemoryLimitForHeap
Picked up _JAVA_OPTIONS: -XX:MaxRAMPercentage=64.0
Running org.eclipse.rdf4j.repository.http.HTTPSparqlSetBindingTest
17:29:27.892 [main] INFO  Logging initialized @216ms to org.eclipse.jetty.util.log.Slf4jLog
17:29:27.982 [main] INFO  jetty-9.4.19.v20190610; built: 2019-06-10T16:30:51.723Z; git: afcf563148970e98786327af5e07c261fda175d3; jvm 1.8.0_202-b08
17:29:28.137 [main] INFO  NO JSP Support for /rdf4j, did not find org.eclipse.jetty.jsp.JettyJspServlet
17:29:28.146 [main] INFO  DefaultSessionIdManager workerName=node0
17:29:28.146 [main] INFO  No SessionScavenger set, using defaults
17:29:28.147 [main] INFO  node0 Scavenging every 600000ms
SLF4J: Class path contains multiple SLF4J bindings.
SLF4J: Found binding in [jar:file:/home/jenkins/agent/workspace/rdf4j-master-deploy/compliance/repository/target/rdf4j-server/WEB-INF/lib/logback-classic-1.1.11.jar!/org/slf4j/impl/StaticLoggerBinder.class]
SLF4J: Found binding in [jar:file:/home/jenkins/.m2/repository/ch/qos/logback/logback-classic/1.1.11/logback-classic-1.1.11.jar!/org/slf4j/impl/StaticLoggerBinder.class]
SLF4J: See http://www.slf4j.org/codes.html#multiple_bindings for an explanation.
SLF4J: Actual binding is of type [ch.qos.logback.classic.util.ContextSelectorStaticBinder]
17:29:28.228 [main] INFO  CompressingFilter has initialized
17:29:28.231 [main] INFO  org.tuckey.web.filters.urlrewrite.UrlRewriteFilter INFO: status display disabled
17:29:28.250 [main] INFO  org.tuckey.web.filters.urlrewrite.UrlRewriteFilter INFO: loaded (conf ok)
17:29:28.345 [main] INFO  Initializing Spring DispatcherServlet 'rdf4j-http-server'
17:29:28.345 [main] INFO  Initializing Servlet 'rdf4j-http-server'
17:29:28.948 [main] INFO  Started o.e.j.w.WebAppContext@46ab18da{RDF4J Server,/rdf4j,file:///home/jenkins/agent/workspace/rdf4j-master-deploy/compliance/repository/target/rdf4j-server/,AVAILABLE}{./target/rdf4j-server}
17:29:28.955 [main] INFO  Started ServerConnector@306279ee{HTTP/1.1,[http/1.1]}{0.0.0.0:18081}
17:29:28.956 [main] INFO  Started @1281ms
17:29:29.738 [main] INFO  Stopped ServerConnector@306279ee{HTTP/1.1,[http/1.1]}{0.0.0.0:18081}
17:29:29.738 [main] INFO  node0 Stopped scavenging
17:29:29.738 [main] INFO  org.tuckey.web.filters.urlrewrite.UrlRewriteFilter INFO: destroy called
17:29:29.739 [main] INFO  Destroying Spring FrameworkServlet 'rdf4j-http-server'
17:29:29.742 [main] INFO  Stopped o.e.j.w.WebAppContext@46ab18da{RDF4J Server,/rdf4j,null,UNAVAILABLE}{./target/rdf4j-server}
Tests run: 2, Failures: 0, Errors: 0, Skipped: 0, Time elapsed: 1.972 sec - in org.eclipse.rdf4j.repository.http.HTTPSparqlSetBindingTest
Picked up JAVA_TOOL_OPTIONS: -XX:+IgnoreUnrecognizedVMOptions -XX:+UseContainerSupport -XX:+UnlockExperimentalVMOptions -XX:+UseCGroupMemoryLimitForHeap
Picked up _JAVA_OPTIONS: -XX:MaxRAMPercentage=64.0
Running org.eclipse.rdf4j.repository.http.RDFSchemaHTTPRepositoryConnectionTest
17:29:30.397 [main] INFO  Logging initialized @322ms to org.eclipse.jetty.util.log.Slf4jLog
17:29:30.504 [main] INFO  jetty-9.4.19.v20190610; built: 2019-06-10T16:30:51.723Z; git: afcf563148970e98786327af5e07c261fda175d3; jvm 1.8.0_202-b08
17:29:30.726 [main] INFO  NO JSP Support for /rdf4j, did not find org.eclipse.jetty.jsp.JettyJspServlet
17:29:30.744 [main] INFO  DefaultSessionIdManager workerName=node0
17:29:30.744 [main] INFO  No SessionScavenger set, using defaults
17:29:30.745 [main] INFO  node0 Scavenging every 660000ms
SLF4J: Class path contains multiple SLF4J bindings.
SLF4J: Found binding in [jar:file:/home/jenkins/agent/workspace/rdf4j-master-deploy/compliance/repository/target/rdf4j-server/WEB-INF/lib/logback-classic-1.1.11.jar!/org/slf4j/impl/StaticLoggerBinder.class]
SLF4J: Found binding in [jar:file:/home/jenkins/.m2/repository/ch/qos/logback/logback-classic/1.1.11/logback-classic-1.1.11.jar!/org/slf4j/impl/StaticLoggerBinder.class]
SLF4J: See http://www.slf4j.org/codes.html#multiple_bindings for an explanation.
SLF4J: Actual binding is of type [ch.qos.logback.classic.util.ContextSelectorStaticBinder]
17:29:30.843 [main] INFO  CompressingFilter has initialized
17:29:30.848 [main] INFO  org.tuckey.web.filters.urlrewrite.UrlRewriteFilter INFO: status display disabled
17:29:30.875 [main] INFO  org.tuckey.web.filters.urlrewrite.UrlRewriteFilter INFO: loaded (conf ok)
17:29:31.010 [main] INFO  Initializing Spring DispatcherServlet 'rdf4j-http-server'
17:29:31.010 [main] INFO  Initializing Servlet 'rdf4j-http-server'
17:29:31.637 [main] INFO  Started o.e.j.w.WebAppContext@4c4d362a{RDF4J Server,/rdf4j,file:///home/jenkins/agent/workspace/rdf4j-master-deploy/compliance/repository/target/rdf4j-server/,AVAILABLE}{./target/rdf4j-server}
17:29:31.645 [main] INFO  Started ServerConnector@aecb35a{HTTP/1.1,[http/1.1]}{0.0.0.0:18081}
17:29:31.645 [main] INFO  Started @1571ms
17:29:33.835 [Time-limited test] WARN  Server reports problem: Unexpected end of file
17:29:35.641 [Time-limited test] WARN  Server reports problem: Unexpected end of file
17:29:36.846 [Time-limited test] WARN  Server reports problem: Unexpected end of file
17:29:37.946 [Time-limited test] WARN  Server reports problem: Unexpected end of file
17:29:39.027 [Time-limited test] WARN  Server reports problem: Unexpected end of file
17:29:39.637 [main] INFO  Stopped ServerConnector@aecb35a{HTTP/1.1,[http/1.1]}{0.0.0.0:18081}
17:29:39.637 [main] INFO  node0 Stopped scavenging
17:29:39.638 [main] INFO  org.tuckey.web.filters.urlrewrite.UrlRewriteFilter INFO: destroy called
17:29:39.638 [main] INFO  Destroying Spring FrameworkServlet 'rdf4j-http-server'
17:29:39.642 [main] INFO  Stopped o.e.j.w.WebAppContext@4c4d362a{RDF4J Server,/rdf4j,null,UNAVAILABLE}{./target/rdf4j-server}
Tests run: 405, Failures: 0, Errors: 0, Skipped: 75, Time elapsed: 9.462 sec - in org.eclipse.rdf4j.repository.http.RDFSchemaHTTPRepositoryConnectionTest
Picked up JAVA_TOOL_OPTIONS: -XX:+IgnoreUnrecognizedVMOptions -XX:+UseContainerSupport -XX:+UnlockExperimentalVMOptions -XX:+UseCGroupMemoryLimitForHeap
Picked up _JAVA_OPTIONS: -XX:MaxRAMPercentage=64.0
Running org.eclipse.rdf4j.repository.sparql.SPARQLStoreConnectionTest
17:29:40.252 [main] INFO  Logging initialized @272ms to org.eclipse.jetty.util.log.Slf4jLog
17:29:40.354 [main] INFO  jetty-9.4.19.v20190610; built: 2019-06-10T16:30:51.723Z; git: afcf563148970e98786327af5e07c261fda175d3; jvm 1.8.0_202-b08
17:29:40.516 [main] INFO  NO JSP Support for /rdf4j, did not find org.eclipse.jetty.jsp.JettyJspServlet
17:29:40.529 [main] INFO  DefaultSessionIdManager workerName=node0
17:29:40.529 [main] INFO  No SessionScavenger set, using defaults
17:29:40.530 [main] INFO  node0 Scavenging every 600000ms
SLF4J: Class path contains multiple SLF4J bindings.
SLF4J: Found binding in [jar:file:/home/jenkins/agent/workspace/rdf4j-master-deploy/compliance/repository/target/rdf4j-server/WEB-INF/lib/logback-classic-1.1.11.jar!/org/slf4j/impl/StaticLoggerBinder.class]
SLF4J: Found binding in [jar:file:/home/jenkins/.m2/repository/ch/qos/logback/logback-classic/1.1.11/logback-classic-1.1.11.jar!/org/slf4j/impl/StaticLoggerBinder.class]
SLF4J: See http://www.slf4j.org/codes.html#multiple_bindings for an explanation.
SLF4J: Actual binding is of type [ch.qos.logback.classic.util.ContextSelectorStaticBinder]
17:29:40.594 [main] INFO  CompressingFilter has initialized
17:29:40.612 [main] INFO  org.tuckey.web.filters.urlrewrite.UrlRewriteFilter INFO: status display disabled
17:29:40.631 [main] INFO  org.tuckey.web.filters.urlrewrite.UrlRewriteFilter INFO: loaded (conf ok)
17:29:40.729 [main] INFO  Initializing Spring DispatcherServlet 'rdf4j-http-server'
17:29:40.729 [main] INFO  Initializing Servlet 'rdf4j-http-server'
17:29:41.286 [main] INFO  Started o.e.j.w.WebAppContext@f713686{RDF4J Server,/rdf4j,file:///home/jenkins/agent/workspace/rdf4j-master-deploy/compliance/repository/target/rdf4j-server/,AVAILABLE}{./target/rdf4j-server}
17:29:41.293 [main] INFO  Started ServerConnector@57f23557{HTTP/1.1,[http/1.1]}{0.0.0.0:18081}
17:29:41.293 [main] INFO  Started @1314ms
disabled testGetNamespace() as namespace retrieval is not supported by SPARQL
17:29:42.041 [Time-limited test] WARN  [Rio error] Illegal language tag char: '_' (6, -1)
17:29:42.055 [Time-limited test] WARN  [Rio error] Illegal language tag char: '_' (6, -1)
temporarily disabled testSizeRollback() for SPARQLRepository
temporarily disabled testAutoCommit() for SPARQLRepository
temporarily disabled testEmptyRollback() for SPARQLRepository
temporarily disabled testLiteralSerialization() for SPARQLRepository
temporarily disabled testBNodeSerialization() for SPARQLRepository
temporarily disabled testGetStatementsInMultipleContexts() for SPARQLRepository: implementation of statement context using SPARQL not yet complete
temporarily disabled testGetStatementsInSingleContext() for SPARQLRepository: implementation of statement context using SPARQL not yet complete
temporarily disabled testEmptyCommit() for SPARQLRepository
temporarily disabled testDuplicateFilter() for SPARQLRepository
temporarily disabled testAddDelete() for SPARQLRepository
temporarily disabled testRollback() for SPARQLRepository
temporarily disabled testAddRemoveInsert() for SPARQLRepository
temporarily disabled testSizeCommit() for SPARQLRepository
disabled testPrepareSeRQLQuery() for SPARQLRepository
disabled testGetNamespaces() as namespace retrieval is not supported by SPARQL
temporarily disabled testTransactionIsolation() for SPARQLRepository
disabled testGetNamespace() as namespace retrieval is not supported by SPARQL
17:29:42.971 [Time-limited test] WARN  [Rio error] Illegal language tag char: '_' (6, -1)
17:29:43.011 [Time-limited test] WARN  [Rio error] Illegal language tag char: '_' (6, -1)
temporarily disabled testSizeRollback() for SPARQLRepository
temporarily disabled testAutoCommit() for SPARQLRepository
temporarily disabled testEmptyRollback() for SPARQLRepository
temporarily disabled testLiteralSerialization() for SPARQLRepository
temporarily disabled testBNodeSerialization() for SPARQLRepository
temporarily disabled testGetStatementsInMultipleContexts() for SPARQLRepository: implementation of statement context using SPARQL not yet complete
temporarily disabled testGetStatementsInSingleContext() for SPARQLRepository: implementation of statement context using SPARQL not yet complete
temporarily disabled testEmptyCommit() for SPARQLRepository
temporarily disabled testDuplicateFilter() for SPARQLRepository
temporarily disabled testAddDelete() for SPARQLRepository
temporarily disabled testRollback() for SPARQLRepository
temporarily disabled testAddRemoveInsert() for SPARQLRepository
temporarily disabled testSizeCommit() for SPARQLRepository
disabled testPrepareSeRQLQuery() for SPARQLRepository
disabled testGetNamespaces() as namespace retrieval is not supported by SPARQL
temporarily disabled testTransactionIsolation() for SPARQLRepository
disabled testGetNamespace() as namespace retrieval is not supported by SPARQL
17:29:43.728 [Time-limited test] WARN  [Rio error] Illegal language tag char: '_' (6, -1)
17:29:43.736 [Time-limited test] WARN  [Rio error] Illegal language tag char: '_' (6, -1)
temporarily disabled testSizeRollback() for SPARQLRepository
temporarily disabled testAutoCommit() for SPARQLRepository
temporarily disabled testEmptyRollback() for SPARQLRepository
temporarily disabled testLiteralSerialization() for SPARQLRepository
temporarily disabled testBNodeSerialization() for SPARQLRepository
temporarily disabled testGetStatementsInMultipleContexts() for SPARQLRepository: implementation of statement context using SPARQL not yet complete
temporarily disabled testGetStatementsInSingleContext() for SPARQLRepository: implementation of statement context using SPARQL not yet complete
temporarily disabled testEmptyCommit() for SPARQLRepository
temporarily disabled testDuplicateFilter() for SPARQLRepository
temporarily disabled testAddDelete() for SPARQLRepository
temporarily disabled testRollback() for SPARQLRepository
temporarily disabled testAddRemoveInsert() for SPARQLRepository
temporarily disabled testSizeCommit() for SPARQLRepository
disabled testPrepareSeRQLQuery() for SPARQLRepository
disabled testGetNamespaces() as namespace retrieval is not supported by SPARQL
temporarily disabled testTransactionIsolation() for SPARQLRepository
disabled testGetNamespace() as namespace retrieval is not supported by SPARQL
17:29:44.364 [Time-limited test] WARN  [Rio error] Illegal language tag char: '_' (6, -1)
17:29:44.372 [Time-limited test] WARN  [Rio error] Illegal language tag char: '_' (6, -1)
temporarily disabled testSizeRollback() for SPARQLRepository
temporarily disabled testAutoCommit() for SPARQLRepository
temporarily disabled testEmptyRollback() for SPARQLRepository
temporarily disabled testLiteralSerialization() for SPARQLRepository
temporarily disabled testBNodeSerialization() for SPARQLRepository
temporarily disabled testGetStatementsInMultipleContexts() for SPARQLRepository: implementation of statement context using SPARQL not yet complete
temporarily disabled testGetStatementsInSingleContext() for SPARQLRepository: implementation of statement context using SPARQL not yet complete
temporarily disabled testEmptyCommit() for SPARQLRepository
temporarily disabled testDuplicateFilter() for SPARQLRepository
temporarily disabled testAddDelete() for SPARQLRepository
temporarily disabled testRollback() for SPARQLRepository
temporarily disabled testAddRemoveInsert() for SPARQLRepository
temporarily disabled testSizeCommit() for SPARQLRepository
disabled testPrepareSeRQLQuery() for SPARQLRepository
disabled testGetNamespaces() as namespace retrieval is not supported by SPARQL
temporarily disabled testTransactionIsolation() for SPARQLRepository
disabled testGetNamespace() as namespace retrieval is not supported by SPARQL
17:29:44.940 [Time-limited test] WARN  [Rio error] Illegal language tag char: '_' (6, -1)
17:29:44.948 [Time-limited test] WARN  [Rio error] Illegal language tag char: '_' (6, -1)
temporarily disabled testSizeRollback() for SPARQLRepository
temporarily disabled testAutoCommit() for SPARQLRepository
temporarily disabled testEmptyRollback() for SPARQLRepository
temporarily disabled testLiteralSerialization() for SPARQLRepository
temporarily disabled testBNodeSerialization() for SPARQLRepository
temporarily disabled testGetStatementsInMultipleContexts() for SPARQLRepository: implementation of statement context using SPARQL not yet complete
temporarily disabled testGetStatementsInSingleContext() for SPARQLRepository: implementation of statement context using SPARQL not yet complete
temporarily disabled testEmptyCommit() for SPARQLRepository
temporarily disabled testDuplicateFilter() for SPARQLRepository
temporarily disabled testAddDelete() for SPARQLRepository
temporarily disabled testRollback() for SPARQLRepository
temporarily disabled testAddRemoveInsert() for SPARQLRepository
temporarily disabled testSizeCommit() for SPARQLRepository
disabled testPrepareSeRQLQuery() for SPARQLRepository
disabled testGetNamespaces() as namespace retrieval is not supported by SPARQL
temporarily disabled testTransactionIsolation() for SPARQLRepository
disabled testGetNamespace() as namespace retrieval is not supported by SPARQL
17:29:45.438 [Time-limited test] WARN  [Rio error] Illegal language tag char: '_' (6, -1)
17:29:45.444 [Time-limited test] WARN  [Rio error] Illegal language tag char: '_' (6, -1)
temporarily disabled testSizeRollback() for SPARQLRepository
temporarily disabled testAutoCommit() for SPARQLRepository
temporarily disabled testEmptyRollback() for SPARQLRepository
temporarily disabled testLiteralSerialization() for SPARQLRepository
temporarily disabled testBNodeSerialization() for SPARQLRepository
temporarily disabled testGetStatementsInMultipleContexts() for SPARQLRepository: implementation of statement context using SPARQL not yet complete
temporarily disabled testGetStatementsInSingleContext() for SPARQLRepository: implementation of statement context using SPARQL not yet complete
temporarily disabled testEmptyCommit() for SPARQLRepository
temporarily disabled testDuplicateFilter() for SPARQLRepository
temporarily disabled testAddDelete() for SPARQLRepository
temporarily disabled testRollback() for SPARQLRepository
temporarily disabled testAddRemoveInsert() for SPARQLRepository
temporarily disabled testSizeCommit() for SPARQLRepository
disabled testPrepareSeRQLQuery() for SPARQLRepository
disabled testGetNamespaces() as namespace retrieval is not supported by SPARQL
temporarily disabled testTransactionIsolation() for SPARQLRepository
17:29:45.875 [main] INFO  Stopped ServerConnector@57f23557{HTTP/1.1,[http/1.1]}{0.0.0.0:18081}
17:29:45.875 [main] INFO  node0 Stopped scavenging
17:29:45.875 [main] INFO  org.tuckey.web.filters.urlrewrite.UrlRewriteFilter INFO: destroy called
17:29:45.876 [main] INFO  Destroying Spring FrameworkServlet 'rdf4j-http-server'
17:29:45.911 [main] INFO  Stopped o.e.j.w.WebAppContext@f713686{RDF4J Server,/rdf4j,null,UNAVAILABLE}{./target/rdf4j-server}
Tests run: 438, Failures: 0, Errors: 0, Skipped: 18, Time elapsed: 5.839 sec - in org.eclipse.rdf4j.repository.sparql.SPARQLStoreConnectionTest
Picked up JAVA_TOOL_OPTIONS: -XX:+IgnoreUnrecognizedVMOptions -XX:+UseContainerSupport -XX:+UnlockExperimentalVMOptions -XX:+UseCGroupMemoryLimitForHeap
Picked up _JAVA_OPTIONS: -XX:MaxRAMPercentage=64.0
Running org.eclipse.rdf4j.repository.sparql.SPARQLGraphQueryResultTest
17:29:46.479 [main] INFO  Logging initialized @231ms to org.eclipse.jetty.util.log.Slf4jLog
17:29:46.578 [main] INFO  jetty-9.4.19.v20190610; built: 2019-06-10T16:30:51.723Z; git: afcf563148970e98786327af5e07c261fda175d3; jvm 1.8.0_202-b08
17:29:46.754 [main] INFO  NO JSP Support for /rdf4j, did not find org.eclipse.jetty.jsp.JettyJspServlet
17:29:46.764 [main] INFO  DefaultSessionIdManager workerName=node0
17:29:46.764 [main] INFO  No SessionScavenger set, using defaults
17:29:46.765 [main] INFO  node0 Scavenging every 600000ms
SLF4J: Class path contains multiple SLF4J bindings.
SLF4J: Found binding in [jar:file:/home/jenkins/agent/workspace/rdf4j-master-deploy/compliance/repository/target/rdf4j-server/WEB-INF/lib/logback-classic-1.1.11.jar!/org/slf4j/impl/StaticLoggerBinder.class]
SLF4J: Found binding in [jar:file:/home/jenkins/.m2/repository/ch/qos/logback/logback-classic/1.1.11/logback-classic-1.1.11.jar!/org/slf4j/impl/StaticLoggerBinder.class]
SLF4J: See http://www.slf4j.org/codes.html#multiple_bindings for an explanation.
SLF4J: Actual binding is of type [ch.qos.logback.classic.util.ContextSelectorStaticBinder]
17:29:46.855 [main] INFO  CompressingFilter has initialized
17:29:46.859 [main] INFO  org.tuckey.web.filters.urlrewrite.UrlRewriteFilter INFO: status display disabled
17:29:46.878 [main] INFO  org.tuckey.web.filters.urlrewrite.UrlRewriteFilter INFO: loaded (conf ok)
17:29:46.971 [main] INFO  Initializing Spring DispatcherServlet 'rdf4j-http-server'
17:29:46.971 [main] INFO  Initializing Servlet 'rdf4j-http-server'
17:29:47.594 [main] INFO  Started o.e.j.w.WebAppContext@687a762c{RDF4J Server,/rdf4j,file:///home/jenkins/agent/workspace/rdf4j-master-deploy/compliance/repository/target/rdf4j-server/,AVAILABLE}{./target/rdf4j-server}
17:29:47.601 [main] INFO  Started ServerConnector@548ad73b{HTTP/1.1,[http/1.1]}{0.0.0.0:18081}
17:29:47.601 [main] INFO  Started @1355ms
17:29:48.331 [main] INFO  Stopped ServerConnector@548ad73b{HTTP/1.1,[http/1.1]}{0.0.0.0:18081}
17:29:48.331 [main] INFO  node0 Stopped scavenging
17:29:48.332 [main] INFO  org.tuckey.web.filters.urlrewrite.UrlRewriteFilter INFO: destroy called
17:29:48.332 [main] INFO  Destroying Spring FrameworkServlet 'rdf4j-http-server'
17:29:48.336 [main] INFO  Stopped o.e.j.w.WebAppContext@687a762c{RDF4J Server,/rdf4j,null,UNAVAILABLE}{./target/rdf4j-server}
Tests run: 6, Failures: 0, Errors: 0, Skipped: 0, Time elapsed: 1.996 sec - in org.eclipse.rdf4j.repository.sparql.SPARQLGraphQueryResultTest
Picked up JAVA_TOOL_OPTIONS: -XX:+IgnoreUnrecognizedVMOptions -XX:+UseContainerSupport -XX:+UnlockExperimentalVMOptions -XX:+UseCGroupMemoryLimitForHeap
Picked up _JAVA_OPTIONS: -XX:MaxRAMPercentage=64.0
Running org.eclipse.rdf4j.repository.sparql.federation.RepositoryFederatedServiceIntegrationTest
Tests run: 17, Failures: 0, Errors: 0, Skipped: 0, Time elapsed: 0.379 sec - in org.eclipse.rdf4j.repository.sparql.federation.RepositoryFederatedServiceIntegrationTest
Picked up JAVA_TOOL_OPTIONS: -XX:+IgnoreUnrecognizedVMOptions -XX:+UseContainerSupport -XX:+UnlockExperimentalVMOptions -XX:+UseCGroupMemoryLimitForHeap
Picked up _JAVA_OPTIONS: -XX:MaxRAMPercentage=64.0
Running org.eclipse.rdf4j.repository.sparql.SPARQLRepositoryTest
17:29:49.690 [main] INFO  Logging initialized @219ms to org.eclipse.jetty.util.log.Slf4jLog
17:29:49.786 [main] INFO  jetty-9.4.19.v20190610; built: 2019-06-10T16:30:51.723Z; git: afcf563148970e98786327af5e07c261fda175d3; jvm 1.8.0_202-b08
17:29:49.938 [main] INFO  NO JSP Support for /rdf4j, did not find org.eclipse.jetty.jsp.JettyJspServlet
17:29:49.948 [main] INFO  DefaultSessionIdManager workerName=node0
17:29:49.948 [main] INFO  No SessionScavenger set, using defaults
17:29:49.949 [main] INFO  node0 Scavenging every 660000ms
SLF4J: Class path contains multiple SLF4J bindings.
SLF4J: Found binding in [jar:file:/home/jenkins/agent/workspace/rdf4j-master-deploy/compliance/repository/target/rdf4j-server/WEB-INF/lib/logback-classic-1.1.11.jar!/org/slf4j/impl/StaticLoggerBinder.class]
SLF4J: Found binding in [jar:file:/home/jenkins/.m2/repository/ch/qos/logback/logback-classic/1.1.11/logback-classic-1.1.11.jar!/org/slf4j/impl/StaticLoggerBinder.class]
SLF4J: See http://www.slf4j.org/codes.html#multiple_bindings for an explanation.
SLF4J: Actual binding is of type [ch.qos.logback.classic.util.ContextSelectorStaticBinder]
17:29:50.024 [main] INFO  CompressingFilter has initialized
17:29:50.028 [main] INFO  org.tuckey.web.filters.urlrewrite.UrlRewriteFilter INFO: status display disabled
17:29:50.047 [main] INFO  org.tuckey.web.filters.urlrewrite.UrlRewriteFilter INFO: loaded (conf ok)
17:29:50.143 [main] INFO  Initializing Spring DispatcherServlet 'rdf4j-http-server'
17:29:50.143 [main] INFO  Initializing Servlet 'rdf4j-http-server'
17:29:50.773 [main] INFO  Started o.e.j.w.WebAppContext@42257bdd{RDF4J Server,/rdf4j,file:///home/jenkins/agent/workspace/rdf4j-master-deploy/compliance/repository/target/rdf4j-server/,AVAILABLE}{./target/rdf4j-server}
17:29:50.781 [main] INFO  Started ServerConnector@4cf4d528{HTTP/1.1,[http/1.1]}{0.0.0.0:18081}
17:29:50.781 [main] INFO  Started @1311ms
17:29:51.414 [main] INFO  Stopped ServerConnector@4cf4d528{HTTP/1.1,[http/1.1]}{0.0.0.0:18081}
17:29:51.414 [main] INFO  node0 Stopped scavenging
17:29:51.414 [main] INFO  org.tuckey.web.filters.urlrewrite.UrlRewriteFilter INFO: destroy called
17:29:51.415 [main] INFO  Destroying Spring FrameworkServlet 'rdf4j-http-server'
17:29:51.418 [main] INFO  Stopped o.e.j.w.WebAppContext@42257bdd{RDF4J Server,/rdf4j,null,UNAVAILABLE}{./target/rdf4j-server}
Tests run: 2, Failures: 0, Errors: 0, Skipped: 0, Time elapsed: 1.855 sec - in org.eclipse.rdf4j.repository.sparql.SPARQLRepositoryTest
Picked up JAVA_TOOL_OPTIONS: -XX:+IgnoreUnrecognizedVMOptions -XX:+UseContainerSupport -XX:+UnlockExperimentalVMOptions -XX:+UseCGroupMemoryLimitForHeap
Picked up _JAVA_OPTIONS: -XX:MaxRAMPercentage=64.0
Running org.eclipse.rdf4j.repository.manager.LocalRepositoryManagerIntegrationTest
Tests run: 8, Failures: 0, Errors: 0, Skipped: 0, Time elapsed: 0.389 sec - in org.eclipse.rdf4j.repository.manager.LocalRepositoryManagerIntegrationTest

Results :

Tests run: 1439, Failures: 0, Errors: 0, Skipped: 99

[JENKINS] Recording test results
[INFO] 
[INFO] --- maven-failsafe-plugin:2.19.1:verify (verify) @ rdf4j-repository-compliance ---
[JENKINS] Recording test results[INFO] 
[INFO] --- maven-install-plugin:2.4:install (default-install) @ rdf4j-repository-compliance ---
[INFO] Installing /home/jenkins/agent/workspace/rdf4j-master-deploy/compliance/repository/target/rdf4j-repository-compliance-3.1.3-SNAPSHOT.war to /home/jenkins/.m2/repository/org/eclipse/rdf4j/rdf4j-repository-compliance/3.1.3-SNAPSHOT/rdf4j-repository-compliance-3.1.3-SNAPSHOT.war

[INFO] Installing /home/jenkins/agent/workspace/rdf4j-master-deploy/compliance/repository/pom.xml to /home/jenkins/.m2/repository/org/eclipse/rdf4j/rdf4j-repository-compliance/3.1.3-SNAPSHOT/rdf4j-repository-compliance-3.1.3-SNAPSHOT.pom