Console Output

[INFO] 
[INFO] -------------< org.eclipse.rdf4j:rdf4j-sparql-compliance >--------------
[INFO] Building RDF4J SPARQL query parser compliance tests 3.1.3-SNAPSHOT [94/100]
[INFO] --------------------------------[ war ]---------------------------------
[INFO] 
[INFO] --- maven-clean-plugin:3.0.0:clean (default-clean) @ rdf4j-sparql-compliance ---
[INFO] 
[INFO] --- buildnumber-maven-plugin:1.4:create (default) @ rdf4j-sparql-compliance ---
[INFO] ShortRevision tag detected. The value is '7'.
[INFO] Executing: /bin/sh -c cd '/home/jenkins/agent/workspace/rdf4j-master-deploy/compliance/sparql' && 'git' 'rev-parse' '--verify' '--short=7' 'HEAD'
[INFO] Working directory: /home/jenkins/agent/workspace/rdf4j-master-deploy/compliance/sparql
[INFO] Storing buildNumber: 0f38727 at timestamp: 1585848621565
[WARNING] Cannot get the branch information from the git repository: 
Detecting the current branch failed: fatal: ref HEAD is not a symbolic ref

[INFO] ShortRevision tag detected. The value is '7'.
[INFO] Executing: /bin/sh -c cd '/home/jenkins/agent/workspace/rdf4j-master-deploy/compliance/sparql' && 'git' 'rev-parse' '--verify' '--short=7' 'HEAD'
[INFO] Working directory: /home/jenkins/agent/workspace/rdf4j-master-deploy/compliance/sparql
[INFO] Storing buildScmBranch: UNKNOWN
[INFO] 
[INFO] --- maven-enforcer-plugin:1.4.1:enforce (enforce-bytecode-version) @ rdf4j-sparql-compliance ---
[INFO] Adding ignore: META-INF/**/module-info
[INFO] 
[INFO] --- formatter-maven-plugin:2.8.1:validate (default) @ rdf4j-sparql-compliance ---
[INFO] Using 'UTF-8' encoding to format source files.
[INFO] Number of files to be formatted: 18
[INFO] Successfully formatted:          0 file(s)
[INFO] Fail to format:                  0 file(s)
[INFO] Skipped:                         18 file(s)
[INFO] Read only skipped:               0 file(s)
[INFO] Approximate time taken:          0s
[INFO] 
[INFO] --- maven-resources-plugin:3.0.2:resources (default-resources) @ rdf4j-sparql-compliance ---
[INFO] Using 'UTF-8' encoding to copy filtered resources.
[INFO] skip non existing resourceDirectory /home/jenkins/agent/workspace/rdf4j-master-deploy/compliance/sparql/src/main/resources
[INFO] 
[INFO] --- maven-compiler-plugin:3.7.0:compile (default-compile) @ rdf4j-sparql-compliance ---
[INFO] No sources to compile
[INFO] 
[INFO] --- maven-resources-plugin:3.0.2:testResources (default-testResources) @ rdf4j-sparql-compliance ---
[INFO] Using 'UTF-8' encoding to copy filtered resources.
[INFO] Copying 1 resource
[INFO] 
[INFO] --- maven-compiler-plugin:3.7.0:testCompile (default-testCompile) @ rdf4j-sparql-compliance ---
[INFO] Changes detected - recompiling the module!
[INFO] Compiling 18 source files to /home/jenkins/agent/workspace/rdf4j-master-deploy/compliance/sparql/target/test-classes
[INFO] 
[INFO] --- maven-surefire-plugin:2.22.2:test (default-test) @ rdf4j-sparql-compliance ---
[INFO] Tests are skipped.
[INFO] 
[INFO] --- animal-sniffer-maven-plugin:1.16:check (default) @ rdf4j-sparql-compliance ---
[INFO] Checking unresolved references to org.codehaus.mojo.signature:java18:1.0
[INFO] 
[INFO] --- maven-war-plugin:2.1.1:war (default-war) @ rdf4j-sparql-compliance ---
[INFO] Packaging webapp
[INFO] Assembling webapp [rdf4j-sparql-compliance] in [/home/jenkins/agent/workspace/rdf4j-master-deploy/compliance/sparql/target/rdf4j-server]
[INFO] Processing war project
[INFO] Processing overlay [ id org.eclipse.rdf4j:rdf4j-http-server]
[INFO] Webapp assembled in [387 msecs]
[INFO] Building war: /home/jenkins/agent/workspace/rdf4j-master-deploy/compliance/sparql/target/rdf4j-sparql-compliance-3.1.3-SNAPSHOT.war
[INFO] WEB-INF/web.xml already added, skipping
[INFO] 
[INFO] --- maven-failsafe-plugin:2.19.1:integration-test (integration-tests) @ rdf4j-sparql-compliance ---

-------------------------------------------------------
 T E S T S
-------------------------------------------------------
Picked up JAVA_TOOL_OPTIONS: -XX:+IgnoreUnrecognizedVMOptions -XX:+UseContainerSupport -XX:+UnlockExperimentalVMOptions -XX:+UseCGroupMemoryLimitForHeap
Picked up _JAVA_OPTIONS: -XX:MaxRAMPercentage=64.0
Running org.eclipse.rdf4j.sail.federation.FederationSPARQL11QueryTest
17:30:26.541 [main] WARN  Query test ignored: STRDT   TypeErrors
17:30:26.550 [main] WARN  Query test ignored: STRLANG   TypeErrors
 pp34  Named Graph 1
17:30:27.056 [main] WARN  Query test ignored: sq03 - Subquery within graph pattern, graph variable is not bound
Tests run: 179, Failures: 0, Errors: 0, Skipped: 0, Time elapsed: 1.685 sec - in org.eclipse.rdf4j.sail.federation.FederationSPARQL11QueryTest
Picked up JAVA_TOOL_OPTIONS: -XX:+IgnoreUnrecognizedVMOptions -XX:+UseContainerSupport -XX:+UnlockExperimentalVMOptions -XX:+UseCGroupMemoryLimitForHeap
Picked up _JAVA_OPTIONS: -XX:MaxRAMPercentage=64.0
Running org.eclipse.rdf4j.sail.federation.FederationSPARQL10QueryTest
17:30:28.539 [main] WARN  Query test ignored: Basic - Term 6
17:30:28.541 [main] WARN  Query test ignored: Basic - Term 7
17:30:28.732 [main] WARN  Query test ignored: date-2
Tests run: 242, Failures: 0, Errors: 0, Skipped: 0, Time elapsed: 2.108 sec - in org.eclipse.rdf4j.sail.federation.FederationSPARQL10QueryTest
Picked up JAVA_TOOL_OPTIONS: -XX:+IgnoreUnrecognizedVMOptions -XX:+UseContainerSupport -XX:+UnlockExperimentalVMOptions -XX:+UseCGroupMemoryLimitForHeap
Picked up _JAVA_OPTIONS: -XX:MaxRAMPercentage=64.0
Running org.eclipse.rdf4j.sail.federation.FederationSparqlTest
Tests run: 1, Failures: 0, Errors: 0, Skipped: 0, Time elapsed: 0.305 sec - in org.eclipse.rdf4j.sail.federation.FederationSparqlTest
Picked up JAVA_TOOL_OPTIONS: -XX:+IgnoreUnrecognizedVMOptions -XX:+UseContainerSupport -XX:+UnlockExperimentalVMOptions -XX:+UseCGroupMemoryLimitForHeap
Picked up _JAVA_OPTIONS: -XX:MaxRAMPercentage=64.0
Running org.eclipse.rdf4j.sail.memory.MemoryComplexSPARQLQueryTest
Tests run: 81, Failures: 0, Errors: 0, Skipped: 0, Time elapsed: 0.614 sec - in org.eclipse.rdf4j.sail.memory.MemoryComplexSPARQLQueryTest
Picked up JAVA_TOOL_OPTIONS: -XX:+IgnoreUnrecognizedVMOptions -XX:+UseContainerSupport -XX:+UnlockExperimentalVMOptions -XX:+UseCGroupMemoryLimitForHeap
Picked up _JAVA_OPTIONS: -XX:MaxRAMPercentage=64.0
Running org.eclipse.rdf4j.sail.memory.MemorySPARQLUpdateTest
17:30:32.215 [main] WARN  exception during update execution: 
org.eclipse.rdf4j.sail.SailException: Named graph http://example.org/graph1 already exists. 
	at org.eclipse.rdf4j.repository.sail.helpers.SailUpdateExecutor.executeCreate(SailUpdateExecutor.java:174)
	at org.eclipse.rdf4j.repository.sail.helpers.SailUpdateExecutor.executeUpdate(SailUpdateExecutor.java:128)
	at org.eclipse.rdf4j.repository.sail.SailUpdate.execute(SailUpdate.java:64)
	at org.eclipse.rdf4j.query.parser.sparql.SPARQLUpdateTest.testCreateExistingGraph(SPARQLUpdateTest.java:1193)
	at sun.reflect.NativeMethodAccessorImpl.invoke0(Native Method)
	at sun.reflect.NativeMethodAccessorImpl.invoke(NativeMethodAccessorImpl.java:62)
	at sun.reflect.DelegatingMethodAccessorImpl.invoke(DelegatingMethodAccessorImpl.java:43)
	at java.lang.reflect.Method.invoke(Method.java:498)
	at org.junit.runners.model.FrameworkMethod$1.runReflectiveCall(FrameworkMethod.java:50)
	at org.junit.internal.runners.model.ReflectiveCallable.run(ReflectiveCallable.java:12)
	at org.junit.runners.model.FrameworkMethod.invokeExplosively(FrameworkMethod.java:47)
	at org.junit.internal.runners.statements.InvokeMethod.evaluate(InvokeMethod.java:17)
	at org.junit.internal.runners.statements.RunBefores.evaluate(RunBefores.java:26)
	at org.junit.internal.runners.statements.RunAfters.evaluate(RunAfters.java:27)
	at org.junit.runners.ParentRunner.runLeaf(ParentRunner.java:325)
	at org.junit.runners.BlockJUnit4ClassRunner.runChild(BlockJUnit4ClassRunner.java:78)
	at org.junit.runners.BlockJUnit4ClassRunner.runChild(BlockJUnit4ClassRunner.java:57)
	at org.junit.runners.ParentRunner$3.run(ParentRunner.java:290)
	at org.junit.runners.ParentRunner$1.schedule(ParentRunner.java:71)
	at org.junit.runners.ParentRunner.runChildren(ParentRunner.java:288)
	at org.junit.runners.ParentRunner.access$000(ParentRunner.java:58)
	at org.junit.runners.ParentRunner$2.evaluate(ParentRunner.java:268)
	at org.junit.runners.ParentRunner.run(ParentRunner.java:363)
	at org.apache.maven.surefire.junit4.JUnit4Provider.execute(JUnit4Provider.java:367)
	at org.apache.maven.surefire.junit4.JUnit4Provider.executeWithRerun(JUnit4Provider.java:274)
	at org.apache.maven.surefire.junit4.JUnit4Provider.executeTestSet(JUnit4Provider.java:238)
	at org.apache.maven.surefire.junit4.JUnit4Provider.invoke(JUnit4Provider.java:161)
	at org.apache.maven.surefire.booter.ForkedBooter.invokeProviderInSameClassLoader(ForkedBooter.java:290)
	at org.apache.maven.surefire.booter.ForkedBooter.runSuitesInProcess(ForkedBooter.java:242)
	at org.apache.maven.surefire.booter.ForkedBooter.main(ForkedBooter.java:121)
(http://example.org/bob, http://example.org/age, "42"^^<http://www.w3.org/2001/XMLSchema#integer>) [http://example.org/graph1]
(http://example.org/bob, http://example.org/age, "43"^^<http://www.w3.org/2001/XMLSchema#integer>) [null]
Tests run: 74, Failures: 0, Errors: 0, Skipped: 0, Time elapsed: 0.587 sec - in org.eclipse.rdf4j.sail.memory.MemorySPARQLUpdateTest
Picked up JAVA_TOOL_OPTIONS: -XX:+IgnoreUnrecognizedVMOptions -XX:+UseContainerSupport -XX:+UnlockExperimentalVMOptions -XX:+UseCGroupMemoryLimitForHeap
Picked up _JAVA_OPTIONS: -XX:MaxRAMPercentage=64.0
Running org.eclipse.rdf4j.sail.nativerdf.NativeSPARQLQueryTest
17:30:42.337 [main] WARN  Query test ignored: STRDT   TypeErrors
17:30:42.844 [main] WARN  Query test ignored: STRLANG   TypeErrors
 pp34  Named Graph 1
17:31:00.100 [main] WARN  Query test ignored: sq03 - Subquery within graph pattern, graph variable is not bound
Tests run: 179, Failures: 0, Errors: 0, Skipped: 0, Time elapsed: 28.851 sec - in org.eclipse.rdf4j.sail.nativerdf.NativeSPARQLQueryTest
Picked up JAVA_TOOL_OPTIONS: -XX:+IgnoreUnrecognizedVMOptions -XX:+UseContainerSupport -XX:+UnlockExperimentalVMOptions -XX:+UseCGroupMemoryLimitForHeap
Picked up _JAVA_OPTIONS: -XX:MaxRAMPercentage=64.0
Running org.eclipse.rdf4j.sail.nativerdf.NativeComplexSPARQLQueryTest
Tests run: 81, Failures: 0, Errors: 0, Skipped: 0, Time elapsed: 6.94 sec - in org.eclipse.rdf4j.sail.nativerdf.NativeComplexSPARQLQueryTest
Picked up JAVA_TOOL_OPTIONS: -XX:+IgnoreUnrecognizedVMOptions -XX:+UseContainerSupport -XX:+UnlockExperimentalVMOptions -XX:+UseCGroupMemoryLimitForHeap
Picked up _JAVA_OPTIONS: -XX:MaxRAMPercentage=64.0
Running org.eclipse.rdf4j.query.parser.sparql.manifest.W3CApprovedSPARQL11UpdateTest
17:31:10.423 [main] WARN  exception during update execution: 
java.net.MalformedURLException: unknown protocol: somescheme
	at java.net.URL.<init>(URL.java:600)
	at java.net.URL.<init>(URL.java:490)
	at java.net.URL.<init>(URL.java:439)
	at org.eclipse.rdf4j.repository.sail.helpers.SailUpdateExecutor.executeLoad(SailUpdateExecutor.java:147)
	at org.eclipse.rdf4j.repository.sail.helpers.SailUpdateExecutor.executeUpdate(SailUpdateExecutor.java:118)
	at org.eclipse.rdf4j.repository.sail.SailUpdate.execute(SailUpdate.java:64)
	at org.eclipse.rdf4j.query.parser.sparql.manifest.SPARQLUpdateConformanceTest.runTest(SPARQLUpdateConformanceTest.java:198)
	at junit.framework.TestCase.runBare(TestCase.java:141)
	at junit.framework.TestResult$1.protect(TestResult.java:122)
	at junit.framework.TestResult.runProtected(TestResult.java:142)
	at junit.framework.TestResult.run(TestResult.java:125)
	at junit.framework.TestCase.run(TestCase.java:129)
	at junit.framework.TestSuite.runTest(TestSuite.java:252)
	at junit.framework.TestSuite.run(TestSuite.java:247)
	at junit.framework.TestSuite.runTest(TestSuite.java:252)
	at junit.framework.TestSuite.run(TestSuite.java:247)
	at org.eclipse.rdf4j.query.parser.sparql.manifest.SPARQL11ManifestTest$2.run(SPARQL11ManifestTest.java:130)
	at org.junit.internal.runners.JUnit38ClassRunner.run(JUnit38ClassRunner.java:86)
	at org.apache.maven.surefire.junit4.JUnit4Provider.execute(JUnit4Provider.java:367)
	at org.apache.maven.surefire.junit4.JUnit4Provider.executeWithRerun(JUnit4Provider.java:274)
	at org.apache.maven.surefire.junit4.JUnit4Provider.executeTestSet(JUnit4Provider.java:238)
	at org.apache.maven.surefire.junit4.JUnit4Provider.invoke(JUnit4Provider.java:161)
	at org.apache.maven.surefire.booter.ForkedBooter.invokeProviderInSameClassLoader(ForkedBooter.java:290)
	at org.apache.maven.surefire.booter.ForkedBooter.runSuitesInProcess(ForkedBooter.java:242)
	at org.apache.maven.surefire.booter.ForkedBooter.main(ForkedBooter.java:121)
17:31:10.426 [main] WARN  exception during update execution: 
java.net.MalformedURLException: unknown protocol: somescheme
	at java.net.URL.<init>(URL.java:600)
	at java.net.URL.<init>(URL.java:490)
	at java.net.URL.<init>(URL.java:439)
	at org.eclipse.rdf4j.repository.sail.helpers.SailUpdateExecutor.executeLoad(SailUpdateExecutor.java:147)
	at org.eclipse.rdf4j.repository.sail.helpers.SailUpdateExecutor.executeUpdate(SailUpdateExecutor.java:118)
	at org.eclipse.rdf4j.repository.sail.SailUpdate.execute(SailUpdate.java:64)
	at org.eclipse.rdf4j.query.parser.sparql.manifest.SPARQLUpdateConformanceTest.runTest(SPARQLUpdateConformanceTest.java:198)
	at junit.framework.TestCase.runBare(TestCase.java:141)
	at junit.framework.TestResult$1.protect(TestResult.java:122)
	at junit.framework.TestResult.runProtected(TestResult.java:142)
	at junit.framework.TestResult.run(TestResult.java:125)
	at junit.framework.TestCase.run(TestCase.java:129)
	at junit.framework.TestSuite.runTest(TestSuite.java:252)
	at junit.framework.TestSuite.run(TestSuite.java:247)
	at junit.framework.TestSuite.runTest(TestSuite.java:252)
	at junit.framework.TestSuite.run(TestSuite.java:247)
	at org.eclipse.rdf4j.query.parser.sparql.manifest.SPARQL11ManifestTest$2.run(SPARQL11ManifestTest.java:130)
	at org.junit.internal.runners.JUnit38ClassRunner.run(JUnit38ClassRunner.java:86)
	at org.apache.maven.surefire.junit4.JUnit4Provider.execute(JUnit4Provider.java:367)
	at org.apache.maven.surefire.junit4.JUnit4Provider.executeWithRerun(JUnit4Provider.java:274)
	at org.apache.maven.surefire.junit4.JUnit4Provider.executeTestSet(JUnit4Provider.java:238)
	at org.apache.maven.surefire.junit4.JUnit4Provider.invoke(JUnit4Provider.java:161)
	at org.apache.maven.surefire.booter.ForkedBooter.invokeProviderInSameClassLoader(ForkedBooter.java:290)
	at org.apache.maven.surefire.booter.ForkedBooter.runSuitesInProcess(ForkedBooter.java:242)
	at org.apache.maven.surefire.booter.ForkedBooter.main(ForkedBooter.java:121)
17:31:10.428 [main] WARN  exception during update execution: 
org.eclipse.rdf4j.sail.SailException: Named graph http://example.org/g1 already exists. 
	at org.eclipse.rdf4j.repository.sail.helpers.SailUpdateExecutor.executeCreate(SailUpdateExecutor.java:174)
	at org.eclipse.rdf4j.repository.sail.helpers.SailUpdateExecutor.executeUpdate(SailUpdateExecutor.java:128)
	at org.eclipse.rdf4j.repository.sail.SailUpdate.execute(SailUpdate.java:64)
	at org.eclipse.rdf4j.query.parser.sparql.manifest.SPARQLUpdateConformanceTest.runTest(SPARQLUpdateConformanceTest.java:198)
	at junit.framework.TestCase.runBare(TestCase.java:141)
	at junit.framework.TestResult$1.protect(TestResult.java:122)
	at junit.framework.TestResult.runProtected(TestResult.java:142)
	at junit.framework.TestResult.run(TestResult.java:125)
	at junit.framework.TestCase.run(TestCase.java:129)
	at junit.framework.TestSuite.runTest(TestSuite.java:252)
	at junit.framework.TestSuite.run(TestSuite.java:247)
	at junit.framework.TestSuite.runTest(TestSuite.java:252)
	at junit.framework.TestSuite.run(TestSuite.java:247)
	at org.eclipse.rdf4j.query.parser.sparql.manifest.SPARQL11ManifestTest$2.run(SPARQL11ManifestTest.java:130)
	at org.junit.internal.runners.JUnit38ClassRunner.run(JUnit38ClassRunner.java:86)
	at org.apache.maven.surefire.junit4.JUnit4Provider.execute(JUnit4Provider.java:367)
	at org.apache.maven.surefire.junit4.JUnit4Provider.executeWithRerun(JUnit4Provider.java:274)
	at org.apache.maven.surefire.junit4.JUnit4Provider.executeTestSet(JUnit4Provider.java:238)
	at org.apache.maven.surefire.junit4.JUnit4Provider.invoke(JUnit4Provider.java:161)
	at org.apache.maven.surefire.booter.ForkedBooter.invokeProviderInSameClassLoader(ForkedBooter.java:290)
	at org.apache.maven.surefire.booter.ForkedBooter.runSuitesInProcess(ForkedBooter.java:242)
	at org.apache.maven.surefire.booter.ForkedBooter.main(ForkedBooter.java:121)
Tests run: 90, Failures: 0, Errors: 0, Skipped: 0, Time elapsed: 0.909 sec - in org.eclipse.rdf4j.query.parser.sparql.manifest.W3CApprovedSPARQL11UpdateTest
Picked up JAVA_TOOL_OPTIONS: -XX:+IgnoreUnrecognizedVMOptions -XX:+UseContainerSupport -XX:+UnlockExperimentalVMOptions -XX:+UseCGroupMemoryLimitForHeap
Picked up _JAVA_OPTIONS: -XX:MaxRAMPercentage=64.0
Running org.eclipse.rdf4j.query.parser.sparql.manifest.W3CApprovedSPARQL10QueryTest
17:31:11.831 [main] WARN  Query test ignored: Basic - Term 6
17:31:11.833 [main] WARN  Query test ignored: Basic - Term 7
17:31:11.974 [main] WARN  Query test ignored: date-2
Tests run: 242, Failures: 0, Errors: 0, Skipped: 0, Time elapsed: 1.9 sec - in org.eclipse.rdf4j.query.parser.sparql.manifest.W3CApprovedSPARQL10QueryTest
Picked up JAVA_TOOL_OPTIONS: -XX:+IgnoreUnrecognizedVMOptions -XX:+UseContainerSupport -XX:+UnlockExperimentalVMOptions -XX:+UseCGroupMemoryLimitForHeap
Picked up _JAVA_OPTIONS: -XX:MaxRAMPercentage=64.0
Running org.eclipse.rdf4j.query.parser.sparql.manifest.W3CApprovedSPARQL10SyntaxTest
Tests run: 160, Failures: 0, Errors: 0, Skipped: 0, Time elapsed: 1.673 sec - in org.eclipse.rdf4j.query.parser.sparql.manifest.W3CApprovedSPARQL10SyntaxTest
Picked up JAVA_TOOL_OPTIONS: -XX:+IgnoreUnrecognizedVMOptions -XX:+UseContainerSupport -XX:+UnlockExperimentalVMOptions -XX:+UseCGroupMemoryLimitForHeap
Picked up _JAVA_OPTIONS: -XX:MaxRAMPercentage=64.0
Running org.eclipse.rdf4j.query.parser.sparql.manifest.SPARQL12QueryTest
Tests run: 4, Failures: 0, Errors: 0, Skipped: 0, Time elapsed: 0.364 sec - in org.eclipse.rdf4j.query.parser.sparql.manifest.SPARQL12QueryTest
Picked up JAVA_TOOL_OPTIONS: -XX:+IgnoreUnrecognizedVMOptions -XX:+UseContainerSupport -XX:+UnlockExperimentalVMOptions -XX:+UseCGroupMemoryLimitForHeap
Picked up _JAVA_OPTIONS: -XX:MaxRAMPercentage=64.0
Running org.eclipse.rdf4j.query.parser.sparql.manifest.W3CApprovedSPARQL11QueryTest
17:31:17.113 [main] WARN  Query test ignored: STRDT   TypeErrors
17:31:17.121 [main] WARN  Query test ignored: STRLANG   TypeErrors
 pp34  Named Graph 1
17:31:17.537 [main] WARN  Query test ignored: sq03 - Subquery within graph pattern, graph variable is not bound
Tests run: 179, Failures: 0, Errors: 0, Skipped: 0, Time elapsed: 1.479 sec - in org.eclipse.rdf4j.query.parser.sparql.manifest.W3CApprovedSPARQL11QueryTest
Picked up JAVA_TOOL_OPTIONS: -XX:+IgnoreUnrecognizedVMOptions -XX:+UseContainerSupport -XX:+UnlockExperimentalVMOptions -XX:+UseCGroupMemoryLimitForHeap
Picked up _JAVA_OPTIONS: -XX:MaxRAMPercentage=64.0
Running org.eclipse.rdf4j.query.parser.sparql.manifest.W3CApprovedSPARQL11SyntaxTest
Tests run: 160, Failures: 0, Errors: 0, Skipped: 0, Time elapsed: 1.646 sec - in org.eclipse.rdf4j.query.parser.sparql.manifest.W3CApprovedSPARQL11SyntaxTest
Picked up JAVA_TOOL_OPTIONS: -XX:+IgnoreUnrecognizedVMOptions -XX:+UseContainerSupport -XX:+UnlockExperimentalVMOptions -XX:+UseCGroupMemoryLimitForHeap
Picked up _JAVA_OPTIONS: -XX:MaxRAMPercentage=64.0
Running org.eclipse.rdf4j.query.parser.sparql.HTTPSparqlUpdateTest
SLF4J: Class path contains multiple SLF4J bindings.
SLF4J: Found binding in [jar:file:/home/jenkins/agent/workspace/rdf4j-master-deploy/compliance/sparql/target/rdf4j-server/WEB-INF/lib/logback-classic-1.1.11.jar!/org/slf4j/impl/StaticLoggerBinder.class]
SLF4J: Found binding in [jar:file:/home/jenkins/.m2/repository/ch/qos/logback/logback-classic/1.1.11/logback-classic-1.1.11.jar!/org/slf4j/impl/StaticLoggerBinder.class]
SLF4J: See http://www.slf4j.org/codes.html#multiple_bindings for an explanation.
SLF4J: Actual binding is of type [ch.qos.logback.classic.util.ContextSelectorStaticBinder]
17:31:22.922 [main] WARN  Server reports problem: org.eclipse.rdf4j.query.UpdateExecutionException: org.eclipse.rdf4j.sail.SailException: Named graph http://example.org/graph1 already exists.
(http://example.org/bob, http://example.org/age, "42"^^<http://www.w3.org/2001/XMLSchema#integer>) [http://example.org/graph1]
(http://example.org/bob, http://example.org/age, "43"^^<http://www.w3.org/2001/XMLSchema#integer>) [null]
Tests run: 75, Failures: 0, Errors: 0, Skipped: 2, Time elapsed: 5.057 sec - in org.eclipse.rdf4j.query.parser.sparql.HTTPSparqlUpdateTest
Picked up JAVA_TOOL_OPTIONS: -XX:+IgnoreUnrecognizedVMOptions -XX:+UseContainerSupport -XX:+UnlockExperimentalVMOptions -XX:+UseCGroupMemoryLimitForHeap
Picked up _JAVA_OPTIONS: -XX:MaxRAMPercentage=64.0
Running org.eclipse.rdf4j.query.parser.sparql.ArbitraryLengthPathTest
Tests run: 7, Failures: 0, Errors: 0, Skipped: 0, Time elapsed: 1.056 sec - in org.eclipse.rdf4j.query.parser.sparql.ArbitraryLengthPathTest
Picked up JAVA_TOOL_OPTIONS: -XX:+IgnoreUnrecognizedVMOptions -XX:+UseContainerSupport -XX:+UnlockExperimentalVMOptions -XX:+UseCGroupMemoryLimitForHeap
Picked up _JAVA_OPTIONS: -XX:MaxRAMPercentage=64.0
Running org.eclipse.rdf4j.query.parser.sparql.SPARQLServiceEvaluationTest
SLF4J: Class path contains multiple SLF4J bindings.
SLF4J: Found binding in [jar:file:/home/jenkins/agent/workspace/rdf4j-master-deploy/compliance/sparql/target/rdf4j-server/WEB-INF/lib/logback-classic-1.1.11.jar!/org/slf4j/impl/StaticLoggerBinder.class]
SLF4J: Found binding in [jar:file:/home/jenkins/.m2/repository/ch/qos/logback/logback-classic/1.1.11/logback-classic-1.1.11.jar!/org/slf4j/impl/StaticLoggerBinder.class]
SLF4J: See http://www.slf4j.org/codes.html#multiple_bindings for an explanation.
SLF4J: Actual binding is of type [ch.qos.logback.classic.util.ContextSelectorStaticBinder]
SLF4J: Class path contains multiple SLF4J bindings.
SLF4J: Found binding in [jar:file:/home/jenkins/agent/workspace/rdf4j-master-deploy/compliance/sparql/target/rdf4j-server/WEB-INF/lib/logback-classic-1.1.11.jar!/org/slf4j/impl/StaticLoggerBinder.class]
SLF4J: Found binding in [jar:file:/home/jenkins/.m2/repository/ch/qos/logback/logback-classic/1.1.11/logback-classic-1.1.11.jar!/org/slf4j/impl/StaticLoggerBinder.class]
SLF4J: See http://www.slf4j.org/codes.html#multiple_bindings for an explanation.
SLF4J: Actual binding is of type [ch.qos.logback.classic.util.ContextSelectorStaticBinder]
SLF4J: Class path contains multiple SLF4J bindings.
SLF4J: Found binding in [jar:file:/home/jenkins/agent/workspace/rdf4j-master-deploy/compliance/sparql/target/rdf4j-server/WEB-INF/lib/logback-classic-1.1.11.jar!/org/slf4j/impl/StaticLoggerBinder.class]
SLF4J: Found binding in [jar:file:/home/jenkins/.m2/repository/ch/qos/logback/logback-classic/1.1.11/logback-classic-1.1.11.jar!/org/slf4j/impl/StaticLoggerBinder.class]
SLF4J: See http://www.slf4j.org/codes.html#multiple_bindings for an explanation.
SLF4J: Actual binding is of type [ch.qos.logback.classic.util.ContextSelectorStaticBinder]
SLF4J: Class path contains multiple SLF4J bindings.
SLF4J: Found binding in [jar:file:/home/jenkins/agent/workspace/rdf4j-master-deploy/compliance/sparql/target/rdf4j-server/WEB-INF/lib/logback-classic-1.1.11.jar!/org/slf4j/impl/StaticLoggerBinder.class]
SLF4J: Found binding in [jar:file:/home/jenkins/.m2/repository/ch/qos/logback/logback-classic/1.1.11/logback-classic-1.1.11.jar!/org/slf4j/impl/StaticLoggerBinder.class]
SLF4J: See http://www.slf4j.org/codes.html#multiple_bindings for an explanation.
SLF4J: Actual binding is of type [ch.qos.logback.classic.util.ContextSelectorStaticBinder]
SLF4J: Class path contains multiple SLF4J bindings.
SLF4J: Found binding in [jar:file:/home/jenkins/agent/workspace/rdf4j-master-deploy/compliance/sparql/target/rdf4j-server/WEB-INF/lib/logback-classic-1.1.11.jar!/org/slf4j/impl/StaticLoggerBinder.class]
SLF4J: Found binding in [jar:file:/home/jenkins/.m2/repository/ch/qos/logback/logback-classic/1.1.11/logback-classic-1.1.11.jar!/org/slf4j/impl/StaticLoggerBinder.class]
SLF4J: See http://www.slf4j.org/codes.html#multiple_bindings for an explanation.
SLF4J: Actual binding is of type [ch.qos.logback.classic.util.ContextSelectorStaticBinder]
SLF4J: Class path contains multiple SLF4J bindings.
SLF4J: Found binding in [jar:file:/home/jenkins/agent/workspace/rdf4j-master-deploy/compliance/sparql/target/rdf4j-server/WEB-INF/lib/logback-classic-1.1.11.jar!/org/slf4j/impl/StaticLoggerBinder.class]
SLF4J: Found binding in [jar:file:/home/jenkins/.m2/repository/ch/qos/logback/logback-classic/1.1.11/logback-classic-1.1.11.jar!/org/slf4j/impl/StaticLoggerBinder.class]
SLF4J: See http://www.slf4j.org/codes.html#multiple_bindings for an explanation.
SLF4J: Actual binding is of type [ch.qos.logback.classic.util.ContextSelectorStaticBinder]
SLF4J: Class path contains multiple SLF4J bindings.
SLF4J: Found binding in [jar:file:/home/jenkins/agent/workspace/rdf4j-master-deploy/compliance/sparql/target/rdf4j-server/WEB-INF/lib/logback-classic-1.1.11.jar!/org/slf4j/impl/StaticLoggerBinder.class]
SLF4J: Found binding in [jar:file:/home/jenkins/.m2/repository/ch/qos/logback/logback-classic/1.1.11/logback-classic-1.1.11.jar!/org/slf4j/impl/StaticLoggerBinder.class]
SLF4J: See http://www.slf4j.org/codes.html#multiple_bindings for an explanation.
SLF4J: Actual binding is of type [ch.qos.logback.classic.util.ContextSelectorStaticBinder]
SLF4J: Class path contains multiple SLF4J bindings.
SLF4J: Found binding in [jar:file:/home/jenkins/agent/workspace/rdf4j-master-deploy/compliance/sparql/target/rdf4j-server/WEB-INF/lib/logback-classic-1.1.11.jar!/org/slf4j/impl/StaticLoggerBinder.class]
SLF4J: Found binding in [jar:file:/home/jenkins/.m2/repository/ch/qos/logback/logback-classic/1.1.11/logback-classic-1.1.11.jar!/org/slf4j/impl/StaticLoggerBinder.class]
SLF4J: See http://www.slf4j.org/codes.html#multiple_bindings for an explanation.
SLF4J: Actual binding is of type [ch.qos.logback.classic.util.ContextSelectorStaticBinder]
SLF4J: Class path contains multiple SLF4J bindings.
SLF4J: Found binding in [jar:file:/home/jenkins/agent/workspace/rdf4j-master-deploy/compliance/sparql/target/rdf4j-server/WEB-INF/lib/logback-classic-1.1.11.jar!/org/slf4j/impl/StaticLoggerBinder.class]
SLF4J: Found binding in [jar:file:/home/jenkins/.m2/repository/ch/qos/logback/logback-classic/1.1.11/logback-classic-1.1.11.jar!/org/slf4j/impl/StaticLoggerBinder.class]
SLF4J: See http://www.slf4j.org/codes.html#multiple_bindings for an explanation.
SLF4J: Actual binding is of type [ch.qos.logback.classic.util.ContextSelectorStaticBinder]
SLF4J: Class path contains multiple SLF4J bindings.
SLF4J: Found binding in [jar:file:/home/jenkins/agent/workspace/rdf4j-master-deploy/compliance/sparql/target/rdf4j-server/WEB-INF/lib/logback-classic-1.1.11.jar!/org/slf4j/impl/StaticLoggerBinder.class]
SLF4J: Found binding in [jar:file:/home/jenkins/.m2/repository/ch/qos/logback/logback-classic/1.1.11/logback-classic-1.1.11.jar!/org/slf4j/impl/StaticLoggerBinder.class]
SLF4J: See http://www.slf4j.org/codes.html#multiple_bindings for an explanation.
SLF4J: Actual binding is of type [ch.qos.logback.classic.util.ContextSelectorStaticBinder]
SLF4J: Class path contains multiple SLF4J bindings.
SLF4J: Found binding in [jar:file:/home/jenkins/agent/workspace/rdf4j-master-deploy/compliance/sparql/target/rdf4j-server/WEB-INF/lib/logback-classic-1.1.11.jar!/org/slf4j/impl/StaticLoggerBinder.class]
SLF4J: Found binding in [jar:file:/home/jenkins/.m2/repository/ch/qos/logback/logback-classic/1.1.11/logback-classic-1.1.11.jar!/org/slf4j/impl/StaticLoggerBinder.class]
SLF4J: See http://www.slf4j.org/codes.html#multiple_bindings for an explanation.
SLF4J: Actual binding is of type [ch.qos.logback.classic.util.ContextSelectorStaticBinder]
SLF4J: Class path contains multiple SLF4J bindings.
SLF4J: Found binding in [jar:file:/home/jenkins/agent/workspace/rdf4j-master-deploy/compliance/sparql/target/rdf4j-server/WEB-INF/lib/logback-classic-1.1.11.jar!/org/slf4j/impl/StaticLoggerBinder.class]
SLF4J: Found binding in [jar:file:/home/jenkins/.m2/repository/ch/qos/logback/logback-classic/1.1.11/logback-classic-1.1.11.jar!/org/slf4j/impl/StaticLoggerBinder.class]
SLF4J: See http://www.slf4j.org/codes.html#multiple_bindings for an explanation.
SLF4J: Actual binding is of type [ch.qos.logback.classic.util.ContextSelectorStaticBinder]
SLF4J: Class path contains multiple SLF4J bindings.
SLF4J: Found binding in [jar:file:/home/jenkins/agent/workspace/rdf4j-master-deploy/compliance/sparql/target/rdf4j-server/WEB-INF/lib/logback-classic-1.1.11.jar!/org/slf4j/impl/StaticLoggerBinder.class]
SLF4J: Found binding in [jar:file:/home/jenkins/.m2/repository/ch/qos/logback/logback-classic/1.1.11/logback-classic-1.1.11.jar!/org/slf4j/impl/StaticLoggerBinder.class]
SLF4J: See http://www.slf4j.org/codes.html#multiple_bindings for an explanation.
SLF4J: Actual binding is of type [ch.qos.logback.classic.util.ContextSelectorStaticBinder]
SLF4J: Class path contains multiple SLF4J bindings.
SLF4J: Found binding in [jar:file:/home/jenkins/agent/workspace/rdf4j-master-deploy/compliance/sparql/target/rdf4j-server/WEB-INF/lib/logback-classic-1.1.11.jar!/org/slf4j/impl/StaticLoggerBinder.class]
SLF4J: Found binding in [jar:file:/home/jenkins/.m2/repository/ch/qos/logback/logback-classic/1.1.11/logback-classic-1.1.11.jar!/org/slf4j/impl/StaticLoggerBinder.class]
SLF4J: See http://www.slf4j.org/codes.html#multiple_bindings for an explanation.
SLF4J: Actual binding is of type [ch.qos.logback.classic.util.ContextSelectorStaticBinder]
SLF4J: Class path contains multiple SLF4J bindings.
SLF4J: Found binding in [jar:file:/home/jenkins/agent/workspace/rdf4j-master-deploy/compliance/sparql/target/rdf4j-server/WEB-INF/lib/logback-classic-1.1.11.jar!/org/slf4j/impl/StaticLoggerBinder.class]
SLF4J: Found binding in [jar:file:/home/jenkins/.m2/repository/ch/qos/logback/logback-classic/1.1.11/logback-classic-1.1.11.jar!/org/slf4j/impl/StaticLoggerBinder.class]
SLF4J: See http://www.slf4j.org/codes.html#multiple_bindings for an explanation.
SLF4J: Actual binding is of type [ch.qos.logback.classic.util.ContextSelectorStaticBinder]
SLF4J: Class path contains multiple SLF4J bindings.
SLF4J: Found binding in [jar:file:/home/jenkins/agent/workspace/rdf4j-master-deploy/compliance/sparql/target/rdf4j-server/WEB-INF/lib/logback-classic-1.1.11.jar!/org/slf4j/impl/StaticLoggerBinder.class]
SLF4J: Found binding in [jar:file:/home/jenkins/.m2/repository/ch/qos/logback/logback-classic/1.1.11/logback-classic-1.1.11.jar!/org/slf4j/impl/StaticLoggerBinder.class]
SLF4J: See http://www.slf4j.org/codes.html#multiple_bindings for an explanation.
SLF4J: Actual binding is of type [ch.qos.logback.classic.util.ContextSelectorStaticBinder]
SLF4J: Class path contains multiple SLF4J bindings.
SLF4J: Found binding in [jar:file:/home/jenkins/agent/workspace/rdf4j-master-deploy/compliance/sparql/target/rdf4j-server/WEB-INF/lib/logback-classic-1.1.11.jar!/org/slf4j/impl/StaticLoggerBinder.class]
SLF4J: Found binding in [jar:file:/home/jenkins/.m2/repository/ch/qos/logback/logback-classic/1.1.11/logback-classic-1.1.11.jar!/org/slf4j/impl/StaticLoggerBinder.class]
SLF4J: See http://www.slf4j.org/codes.html#multiple_bindings for an explanation.
SLF4J: Actual binding is of type [ch.qos.logback.classic.util.ContextSelectorStaticBinder]
SLF4J: Class path contains multiple SLF4J bindings.
SLF4J: Found binding in [jar:file:/home/jenkins/agent/workspace/rdf4j-master-deploy/compliance/sparql/target/rdf4j-server/WEB-INF/lib/logback-classic-1.1.11.jar!/org/slf4j/impl/StaticLoggerBinder.class]
SLF4J: Found binding in [jar:file:/home/jenkins/.m2/repository/ch/qos/logback/logback-classic/1.1.11/logback-classic-1.1.11.jar!/org/slf4j/impl/StaticLoggerBinder.class]
SLF4J: See http://www.slf4j.org/codes.html#multiple_bindings for an explanation.
SLF4J: Actual binding is of type [ch.qos.logback.classic.util.ContextSelectorStaticBinder]
Tests run: 18, Failures: 0, Errors: 0, Skipped: 0, Time elapsed: 132.715 sec - in org.eclipse.rdf4j.query.parser.sparql.SPARQLServiceEvaluationTest

Results :

Tests run: 1772, Failures: 0, Errors: 0, Skipped: 2

[JENKINS] Recording test results
[INFO] 
[INFO] --- maven-failsafe-plugin:2.19.1:verify (verify) @ rdf4j-sparql-compliance ---
[JENKINS] Recording test results[INFO] 
[INFO] --- maven-install-plugin:2.4:install (default-install) @ rdf4j-sparql-compliance ---
[INFO] Installing /home/jenkins/agent/workspace/rdf4j-master-deploy/compliance/sparql/target/rdf4j-sparql-compliance-3.1.3-SNAPSHOT.war to /home/jenkins/.m2/repository/org/eclipse/rdf4j/rdf4j-sparql-compliance/3.1.3-SNAPSHOT/rdf4j-sparql-compliance-3.1.3-SNAPSHOT.war

[INFO] Installing /home/jenkins/agent/workspace/rdf4j-master-deploy/compliance/sparql/pom.xml to /home/jenkins/.m2/repository/org/eclipse/rdf4j/rdf4j-sparql-compliance/3.1.3-SNAPSHOT/rdf4j-sparql-compliance-3.1.3-SNAPSHOT.pom