SuccessConsole Output

Skipping 443 KB.. Full Log
ion
test-cases/minLength/simple/shacl.ttl
org.eclipse.rdf4j.sail.shacl.ShaclSailValidationException: Failed SHACL validation
test-cases/minLength/simple/invalid/case3/query1.rq
test-cases/minLength/simple/invalid/case3/query2.rq
org.eclipse.rdf4j.sail.shacl.ShaclSailValidationException: Failed SHACL validation
test-cases/minLength/simple/shacl.ttl
org.eclipse.rdf4j.sail.shacl.ShaclSailValidationException: Failed SHACL validation
test-cases/minLength/simple/shacl.ttl
org.eclipse.rdf4j.sail.shacl.ShaclSailValidationException: Failed SHACL validation
test-cases/minLength/simple/invalid/case3/query1.rq
test-cases/minLength/simple/invalid/case3/query2.rq
org.eclipse.rdf4j.sail.shacl.ShaclSailValidationException: Failed SHACL validation
test-cases/minLength/simple/shacl.ttl
org.eclipse.rdf4j.sail.shacl.ShaclSailValidationException: Failed SHACL validation
test-cases/minLength/simple/shacl.ttl
org.eclipse.rdf4j.sail.shacl.ShaclSailValidationException: Failed SHACL validation
test-cases/minLength/simple/invalid/case4/query1.rq
test-cases/minLength/simple/invalid/case4/query2.rq
org.eclipse.rdf4j.sail.shacl.ShaclSailValidationException: Failed SHACL validation
test-cases/minLength/simple/shacl.ttl
org.eclipse.rdf4j.sail.shacl.ShaclSailValidationException: Failed SHACL validation
test-cases/minLength/simple/shacl.ttl
org.eclipse.rdf4j.sail.shacl.ShaclSailValidationException: Failed SHACL validation
test-cases/minLength/simple/invalid/case4/query1.rq
test-cases/minLength/simple/invalid/case4/query2.rq
org.eclipse.rdf4j.sail.shacl.ShaclSailValidationException: Failed SHACL validation
test-cases/minLength/simple/shacl.ttl
org.eclipse.rdf4j.sail.shacl.ShaclSailValidationException: Failed SHACL validation
test-cases/minLength/simple/shacl.ttl
org.eclipse.rdf4j.sail.shacl.ShaclSailValidationException: Failed SHACL validation
test-cases/minLength/simple/invalid/case4/query1.rq
test-cases/minLength/simple/invalid/case4/query2.rq
org.eclipse.rdf4j.sail.shacl.ShaclSailValidationException: Failed SHACL validation
test-cases/minLength/simple/shacl.ttl
org.eclipse.rdf4j.sail.shacl.ShaclSailValidationException: Failed SHACL validation
test-cases/minLength/simple/shacl.ttl
org.eclipse.rdf4j.sail.shacl.ShaclSailValidationException: Failed SHACL validation
test-cases/minLength/simple/invalid/case5/query1.rq
test-cases/minLength/simple/invalid/case5/query2.rq
org.eclipse.rdf4j.sail.shacl.ShaclSailValidationException: Failed SHACL validation
test-cases/minLength/simple/shacl.ttl
org.eclipse.rdf4j.sail.shacl.ShaclSailValidationException: Failed SHACL validation
test-cases/minLength/simple/shacl.ttl
org.eclipse.rdf4j.sail.shacl.ShaclSailValidationException: Failed SHACL validation
test-cases/minLength/simple/invalid/case5/query1.rq
test-cases/minLength/simple/invalid/case5/query2.rq
org.eclipse.rdf4j.sail.shacl.ShaclSailValidationException: Failed SHACL validation
test-cases/minLength/simple/shacl.ttl
org.eclipse.rdf4j.sail.shacl.ShaclSailValidationException: Failed SHACL validation
test-cases/minLength/simple/shacl.ttl
org.eclipse.rdf4j.sail.shacl.ShaclSailValidationException: Failed SHACL validation
test-cases/minLength/simple/invalid/case5/query1.rq
test-cases/minLength/simple/invalid/case5/query2.rq
org.eclipse.rdf4j.sail.shacl.ShaclSailValidationException: Failed SHACL validation
test-cases/minLength/simple/shacl.ttl
org.eclipse.rdf4j.sail.shacl.ShaclSailValidationException: Failed SHACL validation
test-cases/nodeKind/not/shacl.ttl
test-cases/nodeKind/not/valid/case1/query1.rq
test-cases/nodeKind/not/shacl.ttl
test-cases/nodeKind/not/shacl.ttl
test-cases/nodeKind/not/valid/case1/query1.rq
test-cases/nodeKind/not/shacl.ttl
test-cases/nodeKind/not/shacl.ttl
test-cases/nodeKind/not/valid/case1/query1.rq
test-cases/nodeKind/not/shacl.ttl
test-cases/nodeKind/not/shacl.ttl
test-cases/nodeKind/not/valid/case2/query1.rq
test-cases/nodeKind/not/valid/case2/query2.rq
test-cases/nodeKind/not/shacl.ttl
test-cases/nodeKind/not/shacl.ttl
test-cases/nodeKind/not/valid/case2/query1.rq
test-cases/nodeKind/not/valid/case2/query2.rq
test-cases/nodeKind/not/shacl.ttl
test-cases/nodeKind/not/shacl.ttl
test-cases/nodeKind/not/valid/case2/query1.rq
test-cases/nodeKind/not/valid/case2/query2.rq
test-cases/nodeKind/not/shacl.ttl
test-cases/nodeKind/not/shacl.ttl
test-cases/nodeKind/not/valid/case3/query1.rq
test-cases/nodeKind/not/valid/case3/query2.rq
test-cases/nodeKind/not/shacl.ttl
test-cases/nodeKind/not/shacl.ttl
test-cases/nodeKind/not/valid/case3/query1.rq
test-cases/nodeKind/not/valid/case3/query2.rq
test-cases/nodeKind/not/shacl.ttl
test-cases/nodeKind/not/shacl.ttl
test-cases/nodeKind/not/valid/case3/query1.rq
test-cases/nodeKind/not/valid/case3/query2.rq
test-cases/nodeKind/not/shacl.ttl
test-cases/nodeKind/not/shacl.ttl
test-cases/nodeKind/not/valid/case4/query1.rq
test-cases/nodeKind/not/shacl.ttl
test-cases/nodeKind/not/shacl.ttl
test-cases/nodeKind/not/valid/case4/query1.rq
test-cases/nodeKind/not/shacl.ttl
test-cases/nodeKind/not/shacl.ttl
test-cases/nodeKind/not/valid/case4/query1.rq
test-cases/nodeKind/not/shacl.ttl
test-cases/nodeKind/not/shacl.ttl
test-cases/nodeKind/not/valid/case5/query1.rq
test-cases/nodeKind/not/shacl.ttl
test-cases/nodeKind/not/shacl.ttl
test-cases/nodeKind/not/valid/case5/query1.rq
test-cases/nodeKind/not/shacl.ttl
test-cases/nodeKind/not/shacl.ttl
test-cases/nodeKind/not/valid/case5/query1.rq
test-cases/nodeKind/not/shacl.ttl
test-cases/nodeKind/not/shacl.ttl
org.eclipse.rdf4j.sail.shacl.ShaclSailValidationException: Failed SHACL validation
test-cases/nodeKind/not/invalid/case1/query1.rq
org.eclipse.rdf4j.sail.shacl.ShaclSailValidationException: Failed SHACL validation
test-cases/nodeKind/not/shacl.ttl
org.eclipse.rdf4j.sail.shacl.ShaclSailValidationException: Failed SHACL validation
test-cases/nodeKind/not/shacl.ttl
org.eclipse.rdf4j.sail.shacl.ShaclSailValidationException: Failed SHACL validation
test-cases/nodeKind/not/invalid/case1/query1.rq
org.eclipse.rdf4j.sail.shacl.ShaclSailValidationException: Failed SHACL validation
test-cases/nodeKind/not/shacl.ttl
org.eclipse.rdf4j.sail.shacl.ShaclSailValidationException: Failed SHACL validation
test-cases/nodeKind/not/shacl.ttl
org.eclipse.rdf4j.sail.shacl.ShaclSailValidationException: Failed SHACL validation
test-cases/nodeKind/not/invalid/case1/query1.rq
org.eclipse.rdf4j.sail.shacl.ShaclSailValidationException: Failed SHACL validation
test-cases/nodeKind/not/shacl.ttl
org.eclipse.rdf4j.sail.shacl.ShaclSailValidationException: Failed SHACL validation
test-cases/nodeKind/not/shacl.ttl
org.eclipse.rdf4j.sail.shacl.ShaclSailValidationException: Failed SHACL validation
test-cases/nodeKind/not/invalid/case2/query1.rq
test-cases/nodeKind/not/invalid/case2/query2.rq
org.eclipse.rdf4j.sail.shacl.ShaclSailValidationException: Failed SHACL validation
test-cases/nodeKind/not/shacl.ttl
org.eclipse.rdf4j.sail.shacl.ShaclSailValidationException: Failed SHACL validation
test-cases/nodeKind/not/shacl.ttl
org.eclipse.rdf4j.sail.shacl.ShaclSailValidationException: Failed SHACL validation
test-cases/nodeKind/not/invalid/case2/query1.rq
test-cases/nodeKind/not/invalid/case2/query2.rq
org.eclipse.rdf4j.sail.shacl.ShaclSailValidationException: Failed SHACL validation
test-cases/nodeKind/not/shacl.ttl
org.eclipse.rdf4j.sail.shacl.ShaclSailValidationException: Failed SHACL validation
test-cases/nodeKind/not/shacl.ttl
org.eclipse.rdf4j.sail.shacl.ShaclSailValidationException: Failed SHACL validation
test-cases/nodeKind/not/invalid/case2/query1.rq
test-cases/nodeKind/not/invalid/case2/query2.rq
org.eclipse.rdf4j.sail.shacl.ShaclSailValidationException: Failed SHACL validation
test-cases/nodeKind/not/shacl.ttl
org.eclipse.rdf4j.sail.shacl.ShaclSailValidationException: Failed SHACL validation
test-cases/nodeKind/not/shacl.ttl
org.eclipse.rdf4j.sail.shacl.ShaclSailValidationException: Failed SHACL validation
test-cases/nodeKind/not/invalid/case3/query1.rq
test-cases/nodeKind/not/invalid/case3/query2.rq
org.eclipse.rdf4j.sail.shacl.ShaclSailValidationException: Failed SHACL validation
test-cases/nodeKind/not/shacl.ttl
org.eclipse.rdf4j.sail.shacl.ShaclSailValidationException: Failed SHACL validation
test-cases/nodeKind/not/shacl.ttl
org.eclipse.rdf4j.sail.shacl.ShaclSailValidationException: Failed SHACL validation
test-cases/nodeKind/not/invalid/case3/query1.rq
test-cases/nodeKind/not/invalid/case3/query2.rq
org.eclipse.rdf4j.sail.shacl.ShaclSailValidationException: Failed SHACL validation
test-cases/nodeKind/not/shacl.ttl
org.eclipse.rdf4j.sail.shacl.ShaclSailValidationException: Failed SHACL validation
test-cases/nodeKind/not/shacl.ttl
org.eclipse.rdf4j.sail.shacl.ShaclSailValidationException: Failed SHACL validation
test-cases/nodeKind/not/invalid/case3/query1.rq
test-cases/nodeKind/not/invalid/case3/query2.rq
org.eclipse.rdf4j.sail.shacl.ShaclSailValidationException: Failed SHACL validation
test-cases/nodeKind/not/shacl.ttl
org.eclipse.rdf4j.sail.shacl.ShaclSailValidationException: Failed SHACL validation
test-cases/nodeKind/not/shacl.ttl
org.eclipse.rdf4j.sail.shacl.ShaclSailValidationException: Failed SHACL validation
test-cases/nodeKind/not/invalid/case4/query1.rq
test-cases/nodeKind/not/invalid/case4/query2.rq
org.eclipse.rdf4j.sail.shacl.ShaclSailValidationException: Failed SHACL validation
test-cases/nodeKind/not/shacl.ttl
org.eclipse.rdf4j.sail.shacl.ShaclSailValidationException: Failed SHACL validation
test-cases/nodeKind/not/shacl.ttl
org.eclipse.rdf4j.sail.shacl.ShaclSailValidationException: Failed SHACL validation
test-cases/nodeKind/not/invalid/case4/query1.rq
test-cases/nodeKind/not/invalid/case4/query2.rq
org.eclipse.rdf4j.sail.shacl.ShaclSailValidationException: Failed SHACL validation
test-cases/nodeKind/not/shacl.ttl
org.eclipse.rdf4j.sail.shacl.ShaclSailValidationException: Failed SHACL validation
test-cases/nodeKind/not/shacl.ttl
org.eclipse.rdf4j.sail.shacl.ShaclSailValidationException: Failed SHACL validation
test-cases/nodeKind/not/invalid/case4/query1.rq
test-cases/nodeKind/not/invalid/case4/query2.rq
org.eclipse.rdf4j.sail.shacl.ShaclSailValidationException: Failed SHACL validation
test-cases/nodeKind/not/shacl.ttl
org.eclipse.rdf4j.sail.shacl.ShaclSailValidationException: Failed SHACL validation
test-cases/nodeKind/not/shacl.ttl
org.eclipse.rdf4j.sail.shacl.ShaclSailValidationException: Failed SHACL validation
test-cases/nodeKind/not/invalid/case5/query1.rq
test-cases/nodeKind/not/invalid/case5/query2.rq
org.eclipse.rdf4j.sail.shacl.ShaclSailValidationException: Failed SHACL validation
test-cases/nodeKind/not/shacl.ttl
org.eclipse.rdf4j.sail.shacl.ShaclSailValidationException: Failed SHACL validation
test-cases/nodeKind/not/shacl.ttl
org.eclipse.rdf4j.sail.shacl.ShaclSailValidationException: Failed SHACL validation
test-cases/nodeKind/not/invalid/case5/query1.rq
test-cases/nodeKind/not/invalid/case5/query2.rq
org.eclipse.rdf4j.sail.shacl.ShaclSailValidationException: Failed SHACL validation
test-cases/nodeKind/not/shacl.ttl
org.eclipse.rdf4j.sail.shacl.ShaclSailValidationException: Failed SHACL validation
test-cases/nodeKind/not/shacl.ttl
org.eclipse.rdf4j.sail.shacl.ShaclSailValidationException: Failed SHACL validation
test-cases/nodeKind/not/invalid/case5/query1.rq
test-cases/nodeKind/not/invalid/case5/query2.rq
org.eclipse.rdf4j.sail.shacl.ShaclSailValidationException: Failed SHACL validation
test-cases/nodeKind/not/shacl.ttl
org.eclipse.rdf4j.sail.shacl.ShaclSailValidationException: Failed SHACL validation
test-cases/nodeKind/simple/shacl.ttl
test-cases/nodeKind/simple/valid/case1/query1.rq
test-cases/nodeKind/simple/shacl.ttl
test-cases/nodeKind/simple/shacl.ttl
test-cases/nodeKind/simple/valid/case1/query1.rq
test-cases/nodeKind/simple/shacl.ttl
test-cases/nodeKind/simple/shacl.ttl
test-cases/nodeKind/simple/valid/case1/query1.rq
test-cases/nodeKind/simple/shacl.ttl
test-cases/nodeKind/simple/shacl.ttl
test-cases/nodeKind/simple/valid/case2/query1.rq
test-cases/nodeKind/simple/valid/case2/query2.rq
test-cases/nodeKind/simple/shacl.ttl
test-cases/nodeKind/simple/shacl.ttl
test-cases/nodeKind/simple/valid/case2/query1.rq
test-cases/nodeKind/simple/valid/case2/query2.rq
test-cases/nodeKind/simple/shacl.ttl
test-cases/nodeKind/simple/shacl.ttl
test-cases/nodeKind/simple/valid/case2/query1.rq
test-cases/nodeKind/simple/valid/case2/query2.rq
test-cases/nodeKind/simple/shacl.ttl
test-cases/nodeKind/simple/shacl.ttl
test-cases/nodeKind/simple/valid/case3/query1.rq
test-cases/nodeKind/simple/valid/case3/query2.rq
test-cases/nodeKind/simple/shacl.ttl
test-cases/nodeKind/simple/shacl.ttl
test-cases/nodeKind/simple/valid/case3/query1.rq
test-cases/nodeKind/simple/valid/case3/query2.rq
test-cases/nodeKind/simple/shacl.ttl
test-cases/nodeKind/simple/shacl.ttl
test-cases/nodeKind/simple/valid/case3/query1.rq
test-cases/nodeKind/simple/valid/case3/query2.rq
test-cases/nodeKind/simple/shacl.ttl
test-cases/nodeKind/simple/shacl.ttl
test-cases/nodeKind/simple/valid/case4/query1.rq
test-cases/nodeKind/simple/shacl.ttl
test-cases/nodeKind/simple/shacl.ttl
test-cases/nodeKind/simple/valid/case4/query1.rq
test-cases/nodeKind/simple/shacl.ttl
test-cases/nodeKind/simple/shacl.ttl
test-cases/nodeKind/simple/valid/case4/query1.rq
test-cases/nodeKind/simple/shacl.ttl
test-cases/nodeKind/simple/shacl.ttl
test-cases/nodeKind/simple/valid/case5/query1.rq
test-cases/nodeKind/simple/shacl.ttl
test-cases/nodeKind/simple/shacl.ttl
test-cases/nodeKind/simple/valid/case5/query1.rq
test-cases/nodeKind/simple/shacl.ttl
test-cases/nodeKind/simple/shacl.ttl
test-cases/nodeKind/simple/valid/case5/query1.rq
test-cases/nodeKind/simple/shacl.ttl
test-cases/nodeKind/simple/shacl.ttl
org.eclipse.rdf4j.sail.shacl.ShaclSailValidationException: Failed SHACL validation
test-cases/nodeKind/simple/invalid/case1/query1.rq
org.eclipse.rdf4j.sail.shacl.ShaclSailValidationException: Failed SHACL validation
test-cases/nodeKind/simple/shacl.ttl
org.eclipse.rdf4j.sail.shacl.ShaclSailValidationException: Failed SHACL validation
test-cases/nodeKind/simple/shacl.ttl
org.eclipse.rdf4j.sail.shacl.ShaclSailValidationException: Failed SHACL validation
test-cases/nodeKind/simple/invalid/case1/query1.rq
org.eclipse.rdf4j.sail.shacl.ShaclSailValidationException: Failed SHACL validation
test-cases/nodeKind/simple/shacl.ttl
org.eclipse.rdf4j.sail.shacl.ShaclSailValidationException: Failed SHACL validation
test-cases/nodeKind/simple/shacl.ttl
org.eclipse.rdf4j.sail.shacl.ShaclSailValidationException: Failed SHACL validation
test-cases/nodeKind/simple/invalid/case1/query1.rq
org.eclipse.rdf4j.sail.shacl.ShaclSailValidationException: Failed SHACL validation
test-cases/nodeKind/simple/shacl.ttl
org.eclipse.rdf4j.sail.shacl.ShaclSailValidationException: Failed SHACL validation
test-cases/nodeKind/simple/shacl.ttl
org.eclipse.rdf4j.sail.shacl.ShaclSailValidationException: Failed SHACL validation
test-cases/nodeKind/simple/invalid/case2/query1.rq
test-cases/nodeKind/simple/invalid/case2/query2.rq
org.eclipse.rdf4j.sail.shacl.ShaclSailValidationException: Failed SHACL validation
test-cases/nodeKind/simple/shacl.ttl
org.eclipse.rdf4j.sail.shacl.ShaclSailValidationException: Failed SHACL validation
test-cases/nodeKind/simple/shacl.ttl
org.eclipse.rdf4j.sail.shacl.ShaclSailValidationException: Failed SHACL validation
test-cases/nodeKind/simple/invalid/case2/query1.rq
test-cases/nodeKind/simple/invalid/case2/query2.rq
org.eclipse.rdf4j.sail.shacl.ShaclSailValidationException: Failed SHACL validation
test-cases/nodeKind/simple/shacl.ttl
org.eclipse.rdf4j.sail.shacl.ShaclSailValidationException: Failed SHACL validation
test-cases/nodeKind/simple/shacl.ttl
org.eclipse.rdf4j.sail.shacl.ShaclSailValidationException: Failed SHACL validation
test-cases/nodeKind/simple/invalid/case2/query1.rq
test-cases/nodeKind/simple/invalid/case2/query2.rq
org.eclipse.rdf4j.sail.shacl.ShaclSailValidationException: Failed SHACL validation
test-cases/nodeKind/simple/shacl.ttl
org.eclipse.rdf4j.sail.shacl.ShaclSailValidationException: Failed SHACL validation
test-cases/nodeKind/simple/shacl.ttl
org.eclipse.rdf4j.sail.shacl.ShaclSailValidationException: Failed SHACL validation
test-cases/nodeKind/simple/invalid/case3/query1.rq
test-cases/nodeKind/simple/invalid/case3/query2.rq
org.eclipse.rdf4j.sail.shacl.ShaclSailValidationException: Failed SHACL validation
test-cases/nodeKind/simple/shacl.ttl
org.eclipse.rdf4j.sail.shacl.ShaclSailValidationException: Failed SHACL validation
test-cases/nodeKind/simple/shacl.ttl
org.eclipse.rdf4j.sail.shacl.ShaclSailValidationException: Failed SHACL validation
test-cases/nodeKind/simple/invalid/case3/query1.rq
test-cases/nodeKind/simple/invalid/case3/query2.rq
org.eclipse.rdf4j.sail.shacl.ShaclSailValidationException: Failed SHACL validation
test-cases/nodeKind/simple/shacl.ttl
org.eclipse.rdf4j.sail.shacl.ShaclSailValidationException: Failed SHACL validation
test-cases/nodeKind/simple/shacl.ttl
org.eclipse.rdf4j.sail.shacl.ShaclSailValidationException: Failed SHACL validation
test-cases/nodeKind/simple/invalid/case3/query1.rq
test-cases/nodeKind/simple/invalid/case3/query2.rq
org.eclipse.rdf4j.sail.shacl.ShaclSailValidationException: Failed SHACL validation
test-cases/nodeKind/simple/shacl.ttl
org.eclipse.rdf4j.sail.shacl.ShaclSailValidationException: Failed SHACL validation
test-cases/nodeKind/simple/shacl.ttl
org.eclipse.rdf4j.sail.shacl.ShaclSailValidationException: Failed SHACL validation
test-cases/nodeKind/simple/invalid/case4/query1.rq
test-cases/nodeKind/simple/invalid/case4/query2.rq
org.eclipse.rdf4j.sail.shacl.ShaclSailValidationException: Failed SHACL validation
test-cases/nodeKind/simple/shacl.ttl
org.eclipse.rdf4j.sail.shacl.ShaclSailValidationException: Failed SHACL validation
test-cases/nodeKind/simple/shacl.ttl
org.eclipse.rdf4j.sail.shacl.ShaclSailValidationException: Failed SHACL validation
test-cases/nodeKind/simple/invalid/case4/query1.rq
test-cases/nodeKind/simple/invalid/case4/query2.rq
org.eclipse.rdf4j.sail.shacl.ShaclSailValidationException: Failed SHACL validation
test-cases/nodeKind/simple/shacl.ttl
org.eclipse.rdf4j.sail.shacl.ShaclSailValidationException: Failed SHACL validation
test-cases/nodeKind/simple/shacl.ttl
org.eclipse.rdf4j.sail.shacl.ShaclSailValidationException: Failed SHACL validation
test-cases/nodeKind/simple/invalid/case4/query1.rq
test-cases/nodeKind/simple/invalid/case4/query2.rq
org.eclipse.rdf4j.sail.shacl.ShaclSailValidationException: Failed SHACL validation
test-cases/nodeKind/simple/shacl.ttl
org.eclipse.rdf4j.sail.shacl.ShaclSailValidationException: Failed SHACL validation
test-cases/nodeKind/simple/shacl.ttl
org.eclipse.rdf4j.sail.shacl.ShaclSailValidationException: Failed SHACL validation
test-cases/nodeKind/simple/invalid/case5/query1.rq
test-cases/nodeKind/simple/invalid/case5/query2.rq
org.eclipse.rdf4j.sail.shacl.ShaclSailValidationException: Failed SHACL validation
test-cases/nodeKind/simple/shacl.ttl
org.eclipse.rdf4j.sail.shacl.ShaclSailValidationException: Failed SHACL validation
test-cases/nodeKind/simple/shacl.ttl
org.eclipse.rdf4j.sail.shacl.ShaclSailValidationException: Failed SHACL validation
test-cases/nodeKind/simple/invalid/case5/query1.rq
test-cases/nodeKind/simple/invalid/case5/query2.rq
org.eclipse.rdf4j.sail.shacl.ShaclSailValidationException: Failed SHACL validation
test-cases/nodeKind/simple/shacl.ttl
org.eclipse.rdf4j.sail.shacl.ShaclSailValidationException: Failed SHACL validation
test-cases/nodeKind/simple/shacl.ttl
org.eclipse.rdf4j.sail.shacl.ShaclSailValidationException: Failed SHACL validation
test-cases/nodeKind/simple/invalid/case5/query1.rq
test-cases/nodeKind/simple/invalid/case5/query2.rq
org.eclipse.rdf4j.sail.shacl.ShaclSailValidationException: Failed SHACL validation
test-cases/nodeKind/simple/shacl.ttl
org.eclipse.rdf4j.sail.shacl.ShaclSailValidationException: Failed SHACL validation
test-cases/nodeKind/validateTarget/shacl.ttl
test-cases/nodeKind/validateTarget/valid/case1/query1.rq
test-cases/nodeKind/validateTarget/shacl.ttl
test-cases/nodeKind/validateTarget/shacl.ttl
test-cases/nodeKind/validateTarget/valid/case1/query1.rq
test-cases/nodeKind/validateTarget/shacl.ttl
test-cases/nodeKind/validateTarget/shacl.ttl
test-cases/nodeKind/validateTarget/valid/case1/query1.rq
test-cases/nodeKind/validateTarget/shacl.ttl
test-cases/nodeKind/validateTarget/shacl.ttl
test-cases/nodeKind/validateTarget/valid/case2/query1.rq
test-cases/nodeKind/validateTarget/valid/case2/query2.rq
test-cases/nodeKind/validateTarget/shacl.ttl
test-cases/nodeKind/validateTarget/shacl.ttl
test-cases/nodeKind/validateTarget/valid/case2/query1.rq
test-cases/nodeKind/validateTarget/valid/case2/query2.rq
test-cases/nodeKind/validateTarget/shacl.ttl
test-cases/nodeKind/validateTarget/shacl.ttl
test-cases/nodeKind/validateTarget/valid/case2/query1.rq
test-cases/nodeKind/validateTarget/valid/case2/query2.rq
test-cases/nodeKind/validateTarget/shacl.ttl
test-cases/nodeKind/validateTarget/shacl.ttl
org.eclipse.rdf4j.sail.shacl.ShaclSailValidationException: Failed SHACL validation
test-cases/nodeKind/validateTarget/invalid/case1/query1.rq
org.eclipse.rdf4j.sail.shacl.ShaclSailValidationException: Failed SHACL validation
test-cases/nodeKind/validateTarget/shacl.ttl
org.eclipse.rdf4j.sail.shacl.ShaclSailValidationException: Failed SHACL validation
test-cases/nodeKind/validateTarget/shacl.ttl
org.eclipse.rdf4j.sail.shacl.ShaclSailValidationException: Failed SHACL validation
test-cases/nodeKind/validateTarget/invalid/case1/query1.rq
org.eclipse.rdf4j.sail.shacl.ShaclSailValidationException: Failed SHACL validation
test-cases/nodeKind/validateTarget/shacl.ttl
org.eclipse.rdf4j.sail.shacl.ShaclSailValidationException: Failed SHACL validation
test-cases/nodeKind/validateTarget/shacl.ttl
org.eclipse.rdf4j.sail.shacl.ShaclSailValidationException: Failed SHACL validation
test-cases/nodeKind/validateTarget/invalid/case1/query1.rq
org.eclipse.rdf4j.sail.shacl.ShaclSailValidationException: Failed SHACL validation
test-cases/nodeKind/validateTarget/shacl.ttl
org.eclipse.rdf4j.sail.shacl.ShaclSailValidationException: Failed SHACL validation
test-cases/or/class/shacl.ttl
test-cases/or/class/valid/case1/query1.rq
test-cases/or/class/shacl.ttl
test-cases/or/class/shacl.ttl
test-cases/or/class/valid/case1/query1.rq
test-cases/or/class/shacl.ttl
test-cases/or/class/shacl.ttl
test-cases/or/class/valid/case1/query1.rq
test-cases/or/class/shacl.ttl
test-cases/or/class/shacl.ttl
test-cases/or/class/valid/case2/query1.rq
test-cases/or/class/valid/case2/query2.rq
test-cases/or/class/shacl.ttl
test-cases/or/class/shacl.ttl
test-cases/or/class/valid/case2/query1.rq
test-cases/or/class/valid/case2/query2.rq
test-cases/or/class/shacl.ttl
test-cases/or/class/shacl.ttl
test-cases/or/class/valid/case2/query1.rq
test-cases/or/class/valid/case2/query2.rq
test-cases/or/class/shacl.ttl
test-cases/or/class/shacl.ttl
test-cases/or/class/valid/case3/query1.rq
test-cases/or/class/valid/case3/query2.rq
test-cases/or/class/shacl.ttl
test-cases/or/class/shacl.ttl
test-cases/or/class/valid/case3/query1.rq
test-cases/or/class/valid/case3/query2.rq
test-cases/or/class/shacl.ttl
test-cases/or/class/shacl.ttl
test-cases/or/class/valid/case3/query1.rq
test-cases/or/class/valid/case3/query2.rq
test-cases/or/class/shacl.ttl
test-cases/or/class/shacl.ttl
org.eclipse.rdf4j.sail.shacl.ShaclSailValidationException: Failed SHACL validation
test-cases/or/class/invalid/case1/query1.rq
org.eclipse.rdf4j.sail.shacl.ShaclSailValidationException: Failed SHACL validation
test-cases/or/class/shacl.ttl
org.eclipse.rdf4j.sail.shacl.ShaclSailValidationException: Failed SHACL validation
test-cases/or/class/shacl.ttl
org.eclipse.rdf4j.sail.shacl.ShaclSailValidationException: Failed SHACL validation
test-cases/or/class/invalid/case1/query1.rq
org.eclipse.rdf4j.sail.shacl.ShaclSailValidationException: Failed SHACL validation
test-cases/or/class/shacl.ttl
org.eclipse.rdf4j.sail.shacl.ShaclSailValidationException: Failed SHACL validation
test-cases/or/class/shacl.ttl
org.eclipse.rdf4j.sail.shacl.ShaclSailValidationException: Failed SHACL validation
test-cases/or/class/invalid/case1/query1.rq
org.eclipse.rdf4j.sail.shacl.ShaclSailValidationException: Failed SHACL validation
test-cases/or/class/shacl.ttl
org.eclipse.rdf4j.sail.shacl.ShaclSailValidationException: Failed SHACL validation
test-cases/or/class/shacl.ttl
org.eclipse.rdf4j.sail.shacl.ShaclSailValidationException: Failed SHACL validation
test-cases/or/class/invalid/case2/query1.rq
test-cases/or/class/invalid/case2/query2.rq
org.eclipse.rdf4j.sail.shacl.ShaclSailValidationException: Failed SHACL validation
test-cases/or/class/shacl.ttl
org.eclipse.rdf4j.sail.shacl.ShaclSailValidationException: Failed SHACL validation
test-cases/or/class/shacl.ttl
org.eclipse.rdf4j.sail.shacl.ShaclSailValidationException: Failed SHACL validation
test-cases/or/class/invalid/case2/query1.rq
test-cases/or/class/invalid/case2/query2.rq
org.eclipse.rdf4j.sail.shacl.ShaclSailValidationException: Failed SHACL validation
test-cases/or/class/shacl.ttl
org.eclipse.rdf4j.sail.shacl.ShaclSailValidationException: Failed SHACL validation
test-cases/or/class/shacl.ttl
org.eclipse.rdf4j.sail.shacl.ShaclSailValidationException: Failed SHACL validation
test-cases/or/class/invalid/case2/query1.rq
test-cases/or/class/invalid/case2/query2.rq
org.eclipse.rdf4j.sail.shacl.ShaclSailValidationException: Failed SHACL validation
test-cases/or/class/shacl.ttl
org.eclipse.rdf4j.sail.shacl.ShaclSailValidationException: Failed SHACL validation
test-cases/or/class/shacl.ttl
org.eclipse.rdf4j.sail.shacl.ShaclSailValidationException: Failed SHACL validation
test-cases/or/class/invalid/case3/query1.rq
test-cases/or/class/invalid/case3/query2.rq
org.eclipse.rdf4j.sail.shacl.ShaclSailValidationException: Failed SHACL validation
test-cases/or/class/shacl.ttl
org.eclipse.rdf4j.sail.shacl.ShaclSailValidationException: Failed SHACL validation
test-cases/or/class/shacl.ttl
org.eclipse.rdf4j.sail.shacl.ShaclSailValidationException: Failed SHACL validation
test-cases/or/class/invalid/case3/query1.rq
test-cases/or/class/invalid/case3/query2.rq
org.eclipse.rdf4j.sail.shacl.ShaclSailValidationException: Failed SHACL validation
test-cases/or/class/shacl.ttl
org.eclipse.rdf4j.sail.shacl.ShaclSailValidationException: Failed SHACL validation
test-cases/or/class/shacl.ttl
org.eclipse.rdf4j.sail.shacl.ShaclSailValidationException: Failed SHACL validation
test-cases/or/class/invalid/case3/query1.rq
test-cases/or/class/invalid/case3/query2.rq
org.eclipse.rdf4j.sail.shacl.ShaclSailValidationException: Failed SHACL validation
test-cases/or/class/shacl.ttl
org.eclipse.rdf4j.sail.shacl.ShaclSailValidationException: Failed SHACL validation
test-cases/or/class2/shacl.ttl
test-cases/or/class2/valid/case1/query1.rq
test-cases/or/class2/shacl.ttl
test-cases/or/class2/shacl.ttl
test-cases/or/class2/valid/case1/query1.rq
test-cases/or/class2/shacl.ttl
test-cases/or/class2/shacl.ttl
test-cases/or/class2/valid/case1/query1.rq
test-cases/or/class2/shacl.ttl
test-cases/or/class2/shacl.ttl
test-cases/or/class2/valid/case2/query1.rq
test-cases/or/class2/valid/case2/query2.rq
test-cases/or/class2/shacl.ttl
test-cases/or/class2/shacl.ttl
test-cases/or/class2/valid/case2/query1.rq
test-cases/or/class2/valid/case2/query2.rq
test-cases/or/class2/shacl.ttl
test-cases/or/class2/shacl.ttl
test-cases/or/class2/valid/case2/query1.rq
test-cases/or/class2/valid/case2/query2.rq
test-cases/or/class2/shacl.ttl
test-cases/or/class2/shacl.ttl
test-cases/or/class2/valid/case3/query1.rq
test-cases/or/class2/valid/case3/query2.rq
test-cases/or/class2/shacl.ttl
test-cases/or/class2/shacl.ttl
test-cases/or/class2/valid/case3/query1.rq
test-cases/or/class2/valid/case3/query2.rq
test-cases/or/class2/shacl.ttl
test-cases/or/class2/shacl.ttl
test-cases/or/class2/valid/case3/query1.rq
test-cases/or/class2/valid/case3/query2.rq
test-cases/or/class2/shacl.ttl
test-cases/or/class2/shacl.ttl
org.eclipse.rdf4j.sail.shacl.ShaclSailValidationException: Failed SHACL validation
test-cases/or/class2/invalid/case1/query1.rq
org.eclipse.rdf4j.sail.shacl.ShaclSailValidationException: Failed SHACL validation
test-cases/or/class2/shacl.ttl
org.eclipse.rdf4j.sail.shacl.ShaclSailValidationException: Failed SHACL validation
test-cases/or/class2/shacl.ttl
org.eclipse.rdf4j.sail.shacl.ShaclSailValidationException: Failed SHACL validation
test-cases/or/class2/invalid/case1/query1.rq
org.eclipse.rdf4j.sail.shacl.ShaclSailValidationException: Failed SHACL validation
test-cases/or/class2/shacl.ttl
org.eclipse.rdf4j.sail.shacl.ShaclSailValidationException: Failed SHACL validation
test-cases/or/class2/shacl.ttl
org.eclipse.rdf4j.sail.shacl.ShaclSailValidationException: Failed SHACL validation
test-cases/or/class2/invalid/case1/query1.rq
org.eclipse.rdf4j.sail.shacl.ShaclSailValidationException: Failed SHACL validation
test-cases/or/class2/shacl.ttl
org.eclipse.rdf4j.sail.shacl.ShaclSailValidationException: Failed SHACL validation
test-cases/or/class2/shacl.ttl
org.eclipse.rdf4j.sail.shacl.ShaclSailValidationException: Failed SHACL validation
test-cases/or/class2/invalid/case2/query1.rq
test-cases/or/class2/invalid/case2/query2.rq
org.eclipse.rdf4j.sail.shacl.ShaclSailValidationException: Failed SHACL validation
test-cases/or/class2/shacl.ttl
org.eclipse.rdf4j.sail.shacl.ShaclSailValidationException: Failed SHACL validation
test-cases/or/class2/shacl.ttl
org.eclipse.rdf4j.sail.shacl.ShaclSailValidationException: Failed SHACL validation
test-cases/or/class2/invalid/case2/query1.rq
test-cases/or/class2/invalid/case2/query2.rq
org.eclipse.rdf4j.sail.shacl.ShaclSailValidationException: Failed SHACL validation
test-cases/or/class2/shacl.ttl
org.eclipse.rdf4j.sail.shacl.ShaclSailValidationException: Failed SHACL validation
test-cases/or/class2/shacl.ttl
org.eclipse.rdf4j.sail.shacl.ShaclSailValidationException: Failed SHACL validation
test-cases/or/class2/invalid/case2/query1.rq
test-cases/or/class2/invalid/case2/query2.rq
org.eclipse.rdf4j.sail.shacl.ShaclSailValidationException: Failed SHACL validation
test-cases/or/class2/shacl.ttl
org.eclipse.rdf4j.sail.shacl.ShaclSailValidationException: Failed SHACL validation
test-cases/or/class2/shacl.ttl
org.eclipse.rdf4j.sail.shacl.ShaclSailValidationException: Failed SHACL validation
test-cases/or/class2/invalid/case3/query1.rq
test-cases/or/class2/invalid/case3/query2.rq
org.eclipse.rdf4j.sail.shacl.ShaclSailValidationException: Failed SHACL validation
test-cases/or/class2/shacl.ttl
org.eclipse.rdf4j.sail.shacl.ShaclSailValidationException: Failed SHACL validation
test-cases/or/class2/shacl.ttl
org.eclipse.rdf4j.sail.shacl.ShaclSailValidationException: Failed SHACL validation
test-cases/or/class2/invalid/case3/query1.rq
test-cases/or/class2/invalid/case3/query2.rq
org.eclipse.rdf4j.sail.shacl.ShaclSailValidationException: Failed SHACL validation
test-cases/or/class2/shacl.ttl
org.eclipse.rdf4j.sail.shacl.ShaclSailValidationException: Failed SHACL validation
test-cases/or/class2/shacl.ttl
org.eclipse.rdf4j.sail.shacl.ShaclSailValidationException: Failed SHACL validation
test-cases/or/class2/invalid/case3/query1.rq
test-cases/or/class2/invalid/case3/query2.rq
org.eclipse.rdf4j.sail.shacl.ShaclSailValidationException: Failed SHACL validation
test-cases/or/class2/shacl.ttl
org.eclipse.rdf4j.sail.shacl.ShaclSailValidationException: Failed SHACL validation
test-cases/or/classValidateTarget/shacl.ttl
test-cases/or/classValidateTarget/valid/case1/query1.rq
test-cases/or/classValidateTarget/shacl.ttl
test-cases/or/classValidateTarget/shacl.ttl
test-cases/or/classValidateTarget/valid/case1/query1.rq
test-cases/or/classValidateTarget/shacl.ttl
test-cases/or/classValidateTarget/shacl.ttl
test-cases/or/classValidateTarget/valid/case1/query1.rq
test-cases/or/classValidateTarget/shacl.ttl
test-cases/or/classValidateTarget/shacl.ttl
test-cases/or/classValidateTarget/valid/case2/query1.rq
test-cases/or/classValidateTarget/shacl.ttl
test-cases/or/classValidateTarget/shacl.ttl
test-cases/or/classValidateTarget/valid/case2/query1.rq
test-cases/or/classValidateTarget/shacl.ttl
test-cases/or/classValidateTarget/shacl.ttl
test-cases/or/classValidateTarget/valid/case2/query1.rq
test-cases/or/classValidateTarget/shacl.ttl
test-cases/or/classValidateTarget/shacl.ttl
test-cases/or/classValidateTarget/valid/case3/query1.rq
test-cases/or/classValidateTarget/shacl.ttl
test-cases/or/classValidateTarget/shacl.ttl
test-cases/or/classValidateTarget/valid/case3/query1.rq
test-cases/or/classValidateTarget/shacl.ttl
test-cases/or/classValidateTarget/shacl.ttl
test-cases/or/classValidateTarget/valid/case3/query1.rq
test-cases/or/classValidateTarget/shacl.ttl
test-cases/or/classValidateTarget/shacl.ttl
test-cases/or/classValidateTarget/valid/case4/query1.rq
test-cases/or/classValidateTarget/valid/case4/query2.rq
test-cases/or/classValidateTarget/shacl.ttl
test-cases/or/classValidateTarget/shacl.ttl
test-cases/or/classValidateTarget/valid/case4/query1.rq
test-cases/or/classValidateTarget/valid/case4/query2.rq
test-cases/or/classValidateTarget/shacl.ttl
test-cases/or/classValidateTarget/shacl.ttl
test-cases/or/classValidateTarget/valid/case4/query1.rq
test-cases/or/classValidateTarget/valid/case4/query2.rq
test-cases/or/classValidateTarget/shacl.ttl
test-cases/or/classValidateTarget/shacl.ttl
test-cases/or/classValidateTarget/valid/case5/query1.rq
test-cases/or/classValidateTarget/valid/case5/query2.rq
test-cases/or/classValidateTarget/shacl.ttl
test-cases/or/classValidateTarget/shacl.ttl
test-cases/or/classValidateTarget/valid/case5/query1.rq
test-cases/or/classValidateTarget/valid/case5/query2.rq
test-cases/or/classValidateTarget/shacl.ttl
test-cases/or/classValidateTarget/shacl.ttl
test-cases/or/classValidateTarget/valid/case5/query1.rq
test-cases/or/classValidateTarget/valid/case5/query2.rq
test-cases/or/classValidateTarget/shacl.ttl
test-cases/or/classValidateTarget/shacl.ttl
org.eclipse.rdf4j.sail.shacl.ShaclSailValidationException: Failed SHACL validation
test-cases/or/classValidateTarget/invalid/case1/query1.rq
org.eclipse.rdf4j.sail.shacl.ShaclSailValidationException: Failed SHACL validation
test-cases/or/classValidateTarget/shacl.ttl
org.eclipse.rdf4j.sail.shacl.ShaclSailValidationException: Failed SHACL validation
test-cases/or/classValidateTarget/shacl.ttl
org.eclipse.rdf4j.sail.shacl.ShaclSailValidationException: Failed SHACL validation
test-cases/or/classValidateTarget/invalid/case1/query1.rq
org.eclipse.rdf4j.sail.shacl.ShaclSailValidationException: Failed SHACL validation
test-cases/or/classValidateTarget/shacl.ttl
org.eclipse.rdf4j.sail.shacl.ShaclSailValidationException: Failed SHACL validation
test-cases/or/classValidateTarget/shacl.ttl
org.eclipse.rdf4j.sail.shacl.ShaclSailValidationException: Failed SHACL validation
test-cases/or/classValidateTarget/invalid/case1/query1.rq
org.eclipse.rdf4j.sail.shacl.ShaclSailValidationException: Failed SHACL validation
test-cases/or/classValidateTarget/shacl.ttl
org.eclipse.rdf4j.sail.shacl.ShaclSailValidationException: Failed SHACL validation
test-cases/or/classValidateTarget/shacl.ttl
org.eclipse.rdf4j.sail.shacl.ShaclSailValidationException: Failed SHACL validation
test-cases/or/classValidateTarget/invalid/case2/query1.rq
test-cases/or/classValidateTarget/invalid/case2/query2.rq
org.eclipse.rdf4j.sail.shacl.ShaclSailValidationException: Failed SHACL validation
test-cases/or/classValidateTarget/shacl.ttl
org.eclipse.rdf4j.sail.shacl.ShaclSailValidationException: Failed SHACL validation
test-cases/or/classValidateTarget/shacl.ttl
org.eclipse.rdf4j.sail.shacl.ShaclSailValidationException: Failed SHACL validation
test-cases/or/classValidateTarget/invalid/case2/query1.rq
test-cases/or/classValidateTarget/invalid/case2/query2.rq
org.eclipse.rdf4j.sail.shacl.ShaclSailValidationException: Failed SHACL validation
test-cases/or/classValidateTarget/shacl.ttl
org.eclipse.rdf4j.sail.shacl.ShaclSailValidationException: Failed SHACL validation
test-cases/or/classValidateTarget/shacl.ttl
org.eclipse.rdf4j.sail.shacl.ShaclSailValidationException: Failed SHACL validation
test-cases/or/classValidateTarget/invalid/case2/query1.rq
test-cases/or/classValidateTarget/invalid/case2/query2.rq
org.eclipse.rdf4j.sail.shacl.ShaclSailValidationException: Failed SHACL validation
test-cases/or/classValidateTarget/shacl.ttl
org.eclipse.rdf4j.sail.shacl.ShaclSailValidationException: Failed SHACL validation
test-cases/or/classValidateTarget/shacl.ttl
org.eclipse.rdf4j.sail.shacl.ShaclSailValidationException: Failed SHACL validation
test-cases/or/classValidateTarget/invalid/case3/query1.rq
test-cases/or/classValidateTarget/invalid/case3/query2.rq
org.eclipse.rdf4j.sail.shacl.ShaclSailValidationException: Failed SHACL validation
test-cases/or/classValidateTarget/shacl.ttl
org.eclipse.rdf4j.sail.shacl.ShaclSailValidationException: Failed SHACL validation
test-cases/or/classValidateTarget/shacl.ttl
org.eclipse.rdf4j.sail.shacl.ShaclSailValidationException: Failed SHACL validation
test-cases/or/classValidateTarget/invalid/case3/query1.rq
test-cases/or/classValidateTarget/invalid/case3/query2.rq
org.eclipse.rdf4j.sail.shacl.ShaclSailValidationException: Failed SHACL validation
test-cases/or/classValidateTarget/shacl.ttl
org.eclipse.rdf4j.sail.shacl.ShaclSailValidationException: Failed SHACL validation
test-cases/or/classValidateTarget/shacl.ttl
org.eclipse.rdf4j.sail.shacl.ShaclSailValidationException: Failed SHACL validation
test-cases/or/classValidateTarget/invalid/case3/query1.rq
test-cases/or/classValidateTarget/invalid/case3/query2.rq
org.eclipse.rdf4j.sail.shacl.ShaclSailValidationException: Failed SHACL validation
test-cases/or/classValidateTarget/shacl.ttl
org.eclipse.rdf4j.sail.shacl.ShaclSailValidationException: Failed SHACL validation
test-cases/or/datatype/shacl.ttl
test-cases/or/datatype/valid/case1/query1.rq
test-cases/or/datatype/shacl.ttl
test-cases/or/datatype/shacl.ttl
test-cases/or/datatype/valid/case1/query1.rq
test-cases/or/datatype/shacl.ttl
test-cases/or/datatype/shacl.ttl
test-cases/or/datatype/valid/case1/query1.rq
test-cases/or/datatype/shacl.ttl
test-cases/or/datatype/shacl.ttl
org.eclipse.rdf4j.sail.shacl.ShaclSailValidationException: Failed SHACL validation
test-cases/or/datatype/invalid/case1/query1.rq
org.eclipse.rdf4j.sail.shacl.ShaclSailValidationException: Failed SHACL validation
test-cases/or/datatype/shacl.ttl
org.eclipse.rdf4j.sail.shacl.ShaclSailValidationException: Failed SHACL validation
test-cases/or/datatype/shacl.ttl
org.eclipse.rdf4j.sail.shacl.ShaclSailValidationException: Failed SHACL validation
test-cases/or/datatype/invalid/case1/query1.rq
org.eclipse.rdf4j.sail.shacl.ShaclSailValidationException: Failed SHACL validation
test-cases/or/datatype/shacl.ttl
org.eclipse.rdf4j.sail.shacl.ShaclSailValidationException: Failed SHACL validation
test-cases/or/datatype/shacl.ttl
org.eclipse.rdf4j.sail.shacl.ShaclSailValidationException: Failed SHACL validation
test-cases/or/datatype/invalid/case1/query1.rq
org.eclipse.rdf4j.sail.shacl.ShaclSailValidationException: Failed SHACL validation
test-cases/or/datatype/shacl.ttl
org.eclipse.rdf4j.sail.shacl.ShaclSailValidationException: Failed SHACL validation
test-cases/or/datatype2/shacl.ttl
test-cases/or/datatype2/valid/case1/query1.rq
test-cases/or/datatype2/shacl.ttl
test-cases/or/datatype2/shacl.ttl
test-cases/or/datatype2/valid/case1/query1.rq
test-cases/or/datatype2/shacl.ttl
test-cases/or/datatype2/shacl.ttl
test-cases/or/datatype2/valid/case1/query1.rq
test-cases/or/datatype2/shacl.ttl
test-cases/or/datatype2/shacl.ttl
org.eclipse.rdf4j.sail.shacl.ShaclSailValidationException: Failed SHACL validation
test-cases/or/datatype2/invalid/case1/query1.rq
test-cases/or/datatype2/invalid/case1/query2.rq
org.eclipse.rdf4j.sail.shacl.ShaclSailValidationException: Failed SHACL validation
test-cases/or/datatype2/shacl.ttl
org.eclipse.rdf4j.sail.shacl.ShaclSailValidationException: Failed SHACL validation
test-cases/or/datatype2/shacl.ttl
org.eclipse.rdf4j.sail.shacl.ShaclSailValidationException: Failed SHACL validation
test-cases/or/datatype2/invalid/case1/query1.rq
test-cases/or/datatype2/invalid/case1/query2.rq
org.eclipse.rdf4j.sail.shacl.ShaclSailValidationException: Failed SHACL validation
test-cases/or/datatype2/shacl.ttl
org.eclipse.rdf4j.sail.shacl.ShaclSailValidationException: Failed SHACL validation
test-cases/or/datatype2/shacl.ttl
org.eclipse.rdf4j.sail.shacl.ShaclSailValidationException: Failed SHACL validation
test-cases/or/datatype2/invalid/case1/query1.rq
test-cases/or/datatype2/invalid/case1/query2.rq
org.eclipse.rdf4j.sail.shacl.ShaclSailValidationException: Failed SHACL validation
test-cases/or/datatype2/shacl.ttl
org.eclipse.rdf4j.sail.shacl.ShaclSailValidationException: Failed SHACL validation
test-cases/or/datatypeDifferentPaths/shacl.ttl
test-cases/or/datatypeDifferentPaths/valid/case1/query1.rq
test-cases/or/datatypeDifferentPaths/shacl.ttl
test-cases/or/datatypeDifferentPaths/shacl.ttl
test-cases/or/datatypeDifferentPaths/valid/case1/query1.rq
test-cases/or/datatypeDifferentPaths/shacl.ttl
test-cases/or/datatypeDifferentPaths/shacl.ttl
test-cases/or/datatypeDifferentPaths/valid/case1/query1.rq
test-cases/or/datatypeDifferentPaths/shacl.ttl
test-cases/or/datatypeDifferentPaths/shacl.ttl
test-cases/or/datatypeDifferentPaths/valid/case2/query1.rq
test-cases/or/datatypeDifferentPaths/shacl.ttl
test-cases/or/datatypeDifferentPaths/shacl.ttl
test-cases/or/datatypeDifferentPaths/valid/case2/query1.rq
test-cases/or/datatypeDifferentPaths/shacl.ttl
test-cases/or/datatypeDifferentPaths/shacl.ttl
test-cases/or/datatypeDifferentPaths/valid/case2/query1.rq
test-cases/or/datatypeDifferentPaths/shacl.ttl
test-cases/or/datatypeDifferentPaths/shacl.ttl
test-cases/or/datatypeDifferentPaths/valid/case3/query1.rq
test-cases/or/datatypeDifferentPaths/shacl.ttl
test-cases/or/datatypeDifferentPaths/shacl.ttl
test-cases/or/datatypeDifferentPaths/valid/case3/query1.rq
test-cases/or/datatypeDifferentPaths/shacl.ttl
test-cases/or/datatypeDifferentPaths/shacl.ttl
test-cases/or/datatypeDifferentPaths/valid/case3/query1.rq
test-cases/or/datatypeDifferentPaths/shacl.ttl
test-cases/or/datatypeDifferentPaths/shacl.ttl
test-cases/or/datatypeDifferentPaths/valid/case4/query1.rq
test-cases/or/datatypeDifferentPaths/shacl.ttl
test-cases/or/datatypeDifferentPaths/shacl.ttl
test-cases/or/datatypeDifferentPaths/valid/case4/query1.rq
test-cases/or/datatypeDifferentPaths/shacl.ttl
test-cases/or/datatypeDifferentPaths/shacl.ttl
test-cases/or/datatypeDifferentPaths/valid/case4/query1.rq
test-cases/or/datatypeDifferentPaths/shacl.ttl
test-cases/or/datatypeDifferentPaths/shacl.ttl
org.eclipse.rdf4j.sail.shacl.ShaclSailValidationException: Failed SHACL validation
test-cases/or/datatypeDifferentPaths/invalid/case1/query1.rq
org.eclipse.rdf4j.sail.shacl.ShaclSailValidationException: Failed SHACL validation
test-cases/or/datatypeDifferentPaths/shacl.ttl
org.eclipse.rdf4j.sail.shacl.ShaclSailValidationException: Failed SHACL validation
test-cases/or/datatypeDifferentPaths/shacl.ttl
org.eclipse.rdf4j.sail.shacl.ShaclSailValidationException: Failed SHACL validation
test-cases/or/datatypeDifferentPaths/invalid/case1/query1.rq
org.eclipse.rdf4j.sail.shacl.ShaclSailValidationException: Failed SHACL validation
test-cases/or/datatypeDifferentPaths/shacl.ttl
org.eclipse.rdf4j.sail.shacl.ShaclSailValidationException: Failed SHACL validation
test-cases/or/datatypeDifferentPaths/shacl.ttl
org.eclipse.rdf4j.sail.shacl.ShaclSailValidationException: Failed SHACL validation
test-cases/or/datatypeDifferentPaths/invalid/case1/query1.rq
org.eclipse.rdf4j.sail.shacl.ShaclSailValidationException: Failed SHACL validation
test-cases/or/datatypeDifferentPaths/shacl.ttl
org.eclipse.rdf4j.sail.shacl.ShaclSailValidationException: Failed SHACL validation
test-cases/or/datatypeNodeShape/shacl.ttl
test-cases/or/datatypeNodeShape/valid/case1/query1.rq
test-cases/or/datatypeNodeShape/shacl.ttl
test-cases/or/datatypeNodeShape/shacl.ttl
test-cases/or/datatypeNodeShape/valid/case1/query1.rq
test-cases/or/datatypeNodeShape/shacl.ttl
test-cases/or/datatypeNodeShape/shacl.ttl
test-cases/or/datatypeNodeShape/valid/case1/query1.rq
test-cases/or/datatypeNodeShape/shacl.ttl
test-cases/or/datatypeNodeShape/shacl.ttl
org.eclipse.rdf4j.sail.shacl.ShaclSailValidationException: Failed SHACL validation
test-cases/or/datatypeNodeShape/invalid/case1/query1.rq
org.eclipse.rdf4j.sail.shacl.ShaclSailValidationException: Failed SHACL validation
test-cases/or/datatypeNodeShape/shacl.ttl
org.eclipse.rdf4j.sail.shacl.ShaclSailValidationException: Failed SHACL validation
test-cases/or/datatypeNodeShape/shacl.ttl
org.eclipse.rdf4j.sail.shacl.ShaclSailValidationException: Failed SHACL validation
test-cases/or/datatypeNodeShape/invalid/case1/query1.rq
org.eclipse.rdf4j.sail.shacl.ShaclSailValidationException: Failed SHACL validation
test-cases/or/datatypeNodeShape/shacl.ttl
org.eclipse.rdf4j.sail.shacl.ShaclSailValidationException: Failed SHACL validation
test-cases/or/datatypeNodeShape/shacl.ttl
org.eclipse.rdf4j.sail.shacl.ShaclSailValidationException: Failed SHACL validation
test-cases/or/datatypeNodeShape/invalid/case1/query1.rq
org.eclipse.rdf4j.sail.shacl.ShaclSailValidationException: Failed SHACL validation
test-cases/or/datatypeNodeShape/shacl.ttl
org.eclipse.rdf4j.sail.shacl.ShaclSailValidationException: Failed SHACL validation
test-cases/or/datatypeTargetNode/shacl.ttl
test-cases/or/datatypeTargetNode/valid/case1/query1.rq
test-cases/or/datatypeTargetNode/shacl.ttl
test-cases/or/datatypeTargetNode/shacl.ttl
test-cases/or/datatypeTargetNode/valid/case1/query1.rq
test-cases/or/datatypeTargetNode/shacl.ttl
test-cases/or/datatypeTargetNode/shacl.ttl
test-cases/or/datatypeTargetNode/valid/case1/query1.rq
test-cases/or/datatypeTargetNode/shacl.ttl
test-cases/or/datatypeTargetNode/shacl.ttl
org.eclipse.rdf4j.sail.shacl.ShaclSailValidationException: Failed SHACL validation
test-cases/or/datatypeTargetNode/invalid/case1/query1.rq
org.eclipse.rdf4j.sail.shacl.ShaclSailValidationException: Failed SHACL validation
test-cases/or/datatypeTargetNode/shacl.ttl
org.eclipse.rdf4j.sail.shacl.ShaclSailValidationException: Failed SHACL validation
test-cases/or/datatypeTargetNode/shacl.ttl
org.eclipse.rdf4j.sail.shacl.ShaclSailValidationException: Failed SHACL validation
test-cases/or/datatypeTargetNode/invalid/case1/query1.rq
org.eclipse.rdf4j.sail.shacl.ShaclSailValidationException: Failed SHACL validation
test-cases/or/datatypeTargetNode/shacl.ttl
org.eclipse.rdf4j.sail.shacl.ShaclSailValidationException: Failed SHACL validation
test-cases/or/datatypeTargetNode/shacl.ttl
org.eclipse.rdf4j.sail.shacl.ShaclSailValidationException: Failed SHACL validation
test-cases/or/datatypeTargetNode/invalid/case1/query1.rq
org.eclipse.rdf4j.sail.shacl.ShaclSailValidationException: Failed SHACL validation
test-cases/or/datatypeTargetNode/shacl.ttl
org.eclipse.rdf4j.sail.shacl.ShaclSailValidationException: Failed SHACL validation
test-cases/or/implicitAnd/shacl.ttl
test-cases/or/implicitAnd/valid/case1/query1.rq
test-cases/or/implicitAnd/shacl.ttl
test-cases/or/implicitAnd/shacl.ttl
test-cases/or/implicitAnd/valid/case1/query1.rq
test-cases/or/implicitAnd/shacl.ttl
test-cases/or/implicitAnd/shacl.ttl
test-cases/or/implicitAnd/valid/case1/query1.rq
test-cases/or/implicitAnd/shacl.ttl
test-cases/or/implicitAnd/shacl.ttl
test-cases/or/implicitAnd/valid/case2/query1.rq
test-cases/or/implicitAnd/shacl.ttl
test-cases/or/implicitAnd/shacl.ttl
test-cases/or/implicitAnd/valid/case2/query1.rq
test-cases/or/implicitAnd/shacl.ttl
test-cases/or/implicitAnd/shacl.ttl
test-cases/or/implicitAnd/valid/case2/query1.rq
test-cases/or/implicitAnd/shacl.ttl
test-cases/or/implicitAnd/shacl.ttl
org.eclipse.rdf4j.sail.shacl.ShaclSailValidationException: Failed SHACL validation
test-cases/or/implicitAnd/invalid/case1/query1.rq
org.eclipse.rdf4j.sail.shacl.ShaclSailValidationException: Failed SHACL validation
test-cases/or/implicitAnd/shacl.ttl
org.eclipse.rdf4j.sail.shacl.ShaclSailValidationException: Failed SHACL validation
test-cases/or/implicitAnd/shacl.ttl
org.eclipse.rdf4j.sail.shacl.ShaclSailValidationException: Failed SHACL validation
test-cases/or/implicitAnd/invalid/case1/query1.rq
org.eclipse.rdf4j.sail.shacl.ShaclSailValidationException: Failed SHACL validation
test-cases/or/implicitAnd/shacl.ttl
org.eclipse.rdf4j.sail.shacl.ShaclSailValidationException: Failed SHACL validation
test-cases/or/implicitAnd/shacl.ttl
org.eclipse.rdf4j.sail.shacl.ShaclSailValidationException: Failed SHACL validation
test-cases/or/implicitAnd/invalid/case1/query1.rq
org.eclipse.rdf4j.sail.shacl.ShaclSailValidationException: Failed SHACL validation
test-cases/or/implicitAnd/shacl.ttl
org.eclipse.rdf4j.sail.shacl.ShaclSailValidationException: Failed SHACL validation
test-cases/or/implicitAnd/shacl.ttl
org.eclipse.rdf4j.sail.shacl.ShaclSailValidationException: Failed SHACL validation
test-cases/or/implicitAnd/invalid/case2/query1.rq
org.eclipse.rdf4j.sail.shacl.ShaclSailValidationException: Failed SHACL validation
test-cases/or/implicitAnd/shacl.ttl
org.eclipse.rdf4j.sail.shacl.ShaclSailValidationException: Failed SHACL validation
test-cases/or/implicitAnd/shacl.ttl
org.eclipse.rdf4j.sail.shacl.ShaclSailValidationException: Failed SHACL validation
test-cases/or/implicitAnd/invalid/case2/query1.rq
org.eclipse.rdf4j.sail.shacl.ShaclSailValidationException: Failed SHACL validation
test-cases/or/implicitAnd/shacl.ttl
org.eclipse.rdf4j.sail.shacl.ShaclSailValidationException: Failed SHACL validation
test-cases/or/implicitAnd/shacl.ttl
org.eclipse.rdf4j.sail.shacl.ShaclSailValidationException: Failed SHACL validation
test-cases/or/implicitAnd/invalid/case2/query1.rq
org.eclipse.rdf4j.sail.shacl.ShaclSailValidationException: Failed SHACL validation
test-cases/or/implicitAnd/shacl.ttl
org.eclipse.rdf4j.sail.shacl.ShaclSailValidationException: Failed SHACL validation
test-cases/or/inheritance/shacl.ttl
test-cases/or/inheritance/valid/case1/query1.rq
test-cases/or/inheritance/shacl.ttl
test-cases/or/inheritance/shacl.ttl
test-cases/or/inheritance/valid/case1/query1.rq
test-cases/or/inheritance/shacl.ttl
test-cases/or/inheritance/shacl.ttl
test-cases/or/inheritance/valid/case1/query1.rq
test-cases/or/inheritance/shacl.ttl
test-cases/or/inheritance/shacl.ttl
org.eclipse.rdf4j.sail.shacl.ShaclSailValidationException: Failed SHACL validation
test-cases/or/inheritance/invalid/case1/query1.rq
org.eclipse.rdf4j.sail.shacl.ShaclSailValidationException: Failed SHACL validation
test-cases/or/inheritance/shacl.ttl
org.eclipse.rdf4j.sail.shacl.ShaclSailValidationException: Failed SHACL validation
test-cases/or/inheritance/shacl.ttl
org.eclipse.rdf4j.sail.shacl.ShaclSailValidationException: Failed SHACL validation
test-cases/or/inheritance/invalid/case1/query1.rq
org.eclipse.rdf4j.sail.shacl.ShaclSailValidationException: Failed SHACL validation
test-cases/or/inheritance/shacl.ttl
org.eclipse.rdf4j.sail.shacl.ShaclSailValidationException: Failed SHACL validation
test-cases/or/inheritance/shacl.ttl
org.eclipse.rdf4j.sail.shacl.ShaclSailValidationException: Failed SHACL validation
test-cases/or/inheritance/invalid/case1/query1.rq
org.eclipse.rdf4j.sail.shacl.ShaclSailValidationException: Failed SHACL validation
test-cases/or/inheritance/shacl.ttl
org.eclipse.rdf4j.sail.shacl.ShaclSailValidationException: Failed SHACL validation
test-cases/or/inheritance-deep/shacl.ttl
test-cases/or/inheritance-deep/valid/case1/query1.rq
test-cases/or/inheritance-deep/shacl.ttl
test-cases/or/inheritance-deep/shacl.ttl
test-cases/or/inheritance-deep/valid/case1/query1.rq
test-cases/or/inheritance-deep/shacl.ttl
test-cases/or/inheritance-deep/shacl.ttl
test-cases/or/inheritance-deep/valid/case1/query1.rq
test-cases/or/inheritance-deep/shacl.ttl
test-cases/or/inheritance-deep/shacl.ttl
org.eclipse.rdf4j.sail.shacl.ShaclSailValidationException: Failed SHACL validation
test-cases/or/inheritance-deep/invalid/case1/query1.rq
org.eclipse.rdf4j.sail.shacl.ShaclSailValidationException: Failed SHACL validation
test-cases/or/inheritance-deep/shacl.ttl
org.eclipse.rdf4j.sail.shacl.ShaclSailValidationException: Failed SHACL validation
test-cases/or/inheritance-deep/shacl.ttl
org.eclipse.rdf4j.sail.shacl.ShaclSailValidationException: Failed SHACL validation
test-cases/or/inheritance-deep/invalid/case1/query1.rq
org.eclipse.rdf4j.sail.shacl.ShaclSailValidationException: Failed SHACL validation
test-cases/or/inheritance-deep/shacl.ttl
org.eclipse.rdf4j.sail.shacl.ShaclSailValidationException: Failed SHACL validation
test-cases/or/inheritance-deep/shacl.ttl
org.eclipse.rdf4j.sail.shacl.ShaclSailValidationException: Failed SHACL validation
test-cases/or/inheritance-deep/invalid/case1/query1.rq
org.eclipse.rdf4j.sail.shacl.ShaclSailValidationException: Failed SHACL validation
test-cases/or/inheritance-deep/shacl.ttl
org.eclipse.rdf4j.sail.shacl.ShaclSailValidationException: Failed SHACL validation
test-cases/or/inheritanceNodeShape/shacl.ttl
test-cases/or/inheritanceNodeShape/valid/case1/query1.rq
test-cases/or/inheritanceNodeShape/shacl.ttl
test-cases/or/inheritanceNodeShape/shacl.ttl
test-cases/or/inheritanceNodeShape/valid/case1/query1.rq
test-cases/or/inheritanceNodeShape/shacl.ttl
test-cases/or/inheritanceNodeShape/shacl.ttl
test-cases/or/inheritanceNodeShape/valid/case1/query1.rq
test-cases/or/inheritanceNodeShape/shacl.ttl
test-cases/or/inheritanceNodeShape/shacl.ttl
org.eclipse.rdf4j.sail.shacl.ShaclSailValidationException: Failed SHACL validation
test-cases/or/inheritanceNodeShape/invalid/case1/query1.rq
org.eclipse.rdf4j.sail.shacl.ShaclSailValidationException: Failed SHACL validation
test-cases/or/inheritanceNodeShape/shacl.ttl
org.eclipse.rdf4j.sail.shacl.ShaclSailValidationException: Failed SHACL validation
test-cases/or/inheritanceNodeShape/shacl.ttl
org.eclipse.rdf4j.sail.shacl.ShaclSailValidationException: Failed SHACL validation
test-cases/or/inheritanceNodeShape/invalid/case1/query1.rq
org.eclipse.rdf4j.sail.shacl.ShaclSailValidationException: Failed SHACL validation
test-cases/or/inheritanceNodeShape/shacl.ttl
org.eclipse.rdf4j.sail.shacl.ShaclSailValidationException: Failed SHACL validation
test-cases/or/inheritanceNodeShape/shacl.ttl
org.eclipse.rdf4j.sail.shacl.ShaclSailValidationException: Failed SHACL validation
test-cases/or/inheritanceNodeShape/invalid/case1/query1.rq
org.eclipse.rdf4j.sail.shacl.ShaclSailValidationException: Failed SHACL validation
test-cases/or/inheritanceNodeShape/shacl.ttl
org.eclipse.rdf4j.sail.shacl.ShaclSailValidationException: Failed SHACL validation
test-cases/or/maxCount/shacl.ttl
test-cases/or/maxCount/valid/case1/query1.rq
test-cases/or/maxCount/shacl.ttl
test-cases/or/maxCount/shacl.ttl
test-cases/or/maxCount/valid/case1/query1.rq
test-cases/or/maxCount/shacl.ttl
test-cases/or/maxCount/shacl.ttl
test-cases/or/maxCount/valid/case1/query1.rq
test-cases/or/maxCount/shacl.ttl
test-cases/or/maxCount/shacl.ttl
test-cases/or/maxCount/valid/case2/query1.rq
test-cases/or/maxCount/valid/case2/query2.rq
test-cases/or/maxCount/shacl.ttl
test-cases/or/maxCount/shacl.ttl
test-cases/or/maxCount/valid/case2/query1.rq
test-cases/or/maxCount/valid/case2/query2.rq
test-cases/or/maxCount/shacl.ttl
test-cases/or/maxCount/shacl.ttl
test-cases/or/maxCount/valid/case2/query1.rq
test-cases/or/maxCount/valid/case2/query2.rq
test-cases/or/maxCount/shacl.ttl
test-cases/or/maxCount/shacl.ttl
test-cases/or/maxCount/valid/case3/query1.rq
test-cases/or/maxCount/valid/case3/query2.rq
test-cases/or/maxCount/valid/case3/query3.rq
test-cases/or/maxCount/shacl.ttl
test-cases/or/maxCount/shacl.ttl
test-cases/or/maxCount/valid/case3/query1.rq
test-cases/or/maxCount/valid/case3/query2.rq
test-cases/or/maxCount/valid/case3/query3.rq
test-cases/or/maxCount/shacl.ttl
test-cases/or/maxCount/shacl.ttl
test-cases/or/maxCount/valid/case3/query1.rq
test-cases/or/maxCount/valid/case3/query2.rq
test-cases/or/maxCount/valid/case3/query3.rq
test-cases/or/maxCount/shacl.ttl
test-cases/or/maxCount/shacl.ttl
org.eclipse.rdf4j.sail.shacl.ShaclSailValidationException: Failed SHACL validation
test-cases/or/maxCount/invalid/case1/query1.rq
org.eclipse.rdf4j.sail.shacl.ShaclSailValidationException: Failed SHACL validation
test-cases/or/maxCount/shacl.ttl
org.eclipse.rdf4j.sail.shacl.ShaclSailValidationException: Failed SHACL validation
test-cases/or/maxCount/shacl.ttl
org.eclipse.rdf4j.sail.shacl.ShaclSailValidationException: Failed SHACL validation
test-cases/or/maxCount/invalid/case1/query1.rq
org.eclipse.rdf4j.sail.shacl.ShaclSailValidationException: Failed SHACL validation
test-cases/or/maxCount/shacl.ttl
org.eclipse.rdf4j.sail.shacl.ShaclSailValidationException: Failed SHACL validation
test-cases/or/maxCount/shacl.ttl
org.eclipse.rdf4j.sail.shacl.ShaclSailValidationException: Failed SHACL validation
test-cases/or/maxCount/invalid/case1/query1.rq
org.eclipse.rdf4j.sail.shacl.ShaclSailValidationException: Failed SHACL validation
test-cases/or/maxCount/shacl.ttl
org.eclipse.rdf4j.sail.shacl.ShaclSailValidationException: Failed SHACL validation
test-cases/or/maxCount/shacl.ttl
org.eclipse.rdf4j.sail.shacl.ShaclSailValidationException: Failed SHACL validation
test-cases/or/maxCount/invalid/case2/query1.rq
test-cases/or/maxCount/invalid/case2/query2.rq
org.eclipse.rdf4j.sail.shacl.ShaclSailValidationException: Failed SHACL validation
test-cases/or/maxCount/shacl.ttl
org.eclipse.rdf4j.sail.shacl.ShaclSailValidationException: Failed SHACL validation
test-cases/or/maxCount/shacl.ttl
org.eclipse.rdf4j.sail.shacl.ShaclSailValidationException: Failed SHACL validation
test-cases/or/maxCount/invalid/case2/query1.rq
test-cases/or/maxCount/invalid/case2/query2.rq
org.eclipse.rdf4j.sail.shacl.ShaclSailValidationException: Failed SHACL validation
test-cases/or/maxCount/shacl.ttl
org.eclipse.rdf4j.sail.shacl.ShaclSailValidationException: Failed SHACL validation
test-cases/or/maxCount/shacl.ttl
org.eclipse.rdf4j.sail.shacl.ShaclSailValidationException: Failed SHACL validation
test-cases/or/maxCount/invalid/case2/query1.rq
test-cases/or/maxCount/invalid/case2/query2.rq
org.eclipse.rdf4j.sail.shacl.ShaclSailValidationException: Failed SHACL validation
test-cases/or/maxCount/shacl.ttl
org.eclipse.rdf4j.sail.shacl.ShaclSailValidationException: Failed SHACL validation
test-cases/or/maxCount/shacl.ttl
org.eclipse.rdf4j.sail.shacl.ShaclSailValidationException: Failed SHACL validation
test-cases/or/maxCount/invalid/case3/query1.rq
test-cases/or/maxCount/invalid/case3/query2.rq
test-cases/or/maxCount/invalid/case3/query3.rq
org.eclipse.rdf4j.sail.shacl.ShaclSailValidationException: Failed SHACL validation
test-cases/or/maxCount/shacl.ttl
org.eclipse.rdf4j.sail.shacl.ShaclSailValidationException: Failed SHACL validation
test-cases/or/maxCount/shacl.ttl
org.eclipse.rdf4j.sail.shacl.ShaclSailValidationException: Failed SHACL validation
test-cases/or/maxCount/invalid/case3/query1.rq
test-cases/or/maxCount/invalid/case3/query2.rq
test-cases/or/maxCount/invalid/case3/query3.rq
org.eclipse.rdf4j.sail.shacl.ShaclSailValidationException: Failed SHACL validation
test-cases/or/maxCount/shacl.ttl
org.eclipse.rdf4j.sail.shacl.ShaclSailValidationException: Failed SHACL validation
test-cases/or/maxCount/shacl.ttl
org.eclipse.rdf4j.sail.shacl.ShaclSailValidationException: Failed SHACL validation
test-cases/or/maxCount/invalid/case3/query1.rq
test-cases/or/maxCount/invalid/case3/query2.rq
test-cases/or/maxCount/invalid/case3/query3.rq
org.eclipse.rdf4j.sail.shacl.ShaclSailValidationException: Failed SHACL validation
test-cases/or/maxCount/shacl.ttl
org.eclipse.rdf4j.sail.shacl.ShaclSailValidationException: Failed SHACL validation
test-cases/or/minCount/shacl.ttl
test-cases/or/minCount/valid/case1/query1.rq
test-cases/or/minCount/shacl.ttl
test-cases/or/minCount/shacl.ttl
test-cases/or/minCount/valid/case1/query1.rq
test-cases/or/minCount/shacl.ttl
test-cases/or/minCount/shacl.ttl
test-cases/or/minCount/valid/case1/query1.rq
test-cases/or/minCount/shacl.ttl
test-cases/or/minCount/shacl.ttl
test-cases/or/minCount/valid/case2/query1.rq
test-cases/or/minCount/valid/case2/query2.rq
test-cases/or/minCount/shacl.ttl
test-cases/or/minCount/shacl.ttl
test-cases/or/minCount/valid/case2/query1.rq
test-cases/or/minCount/valid/case2/query2.rq
test-cases/or/minCount/shacl.ttl
test-cases/or/minCount/shacl.ttl
test-cases/or/minCount/valid/case2/query1.rq
test-cases/or/minCount/valid/case2/query2.rq
test-cases/or/minCount/shacl.ttl
test-cases/or/minCount/shacl.ttl
test-cases/or/minCount/valid/case3/query1.rq
test-cases/or/minCount/valid/case3/query2.rq
test-cases/or/minCount/shacl.ttl
test-cases/or/minCount/shacl.ttl
test-cases/or/minCount/valid/case3/query1.rq
test-cases/or/minCount/valid/case3/query2.rq
test-cases/or/minCount/shacl.ttl
test-cases/or/minCount/shacl.ttl
test-cases/or/minCount/valid/case3/query1.rq
test-cases/or/minCount/valid/case3/query2.rq
test-cases/or/minCount/shacl.ttl
test-cases/or/minCount/shacl.ttl
test-cases/or/minCount/valid/case4/query1.rq
test-cases/or/minCount/valid/case4/query2.rq
test-cases/or/minCount/valid/case4/query3.rq
test-cases/or/minCount/shacl.ttl
test-cases/or/minCount/shacl.ttl
test-cases/or/minCount/valid/case4/query1.rq
test-cases/or/minCount/valid/case4/query2.rq
test-cases/or/minCount/valid/case4/query3.rq
test-cases/or/minCount/shacl.ttl
test-cases/or/minCount/shacl.ttl
test-cases/or/minCount/valid/case4/query1.rq
test-cases/or/minCount/valid/case4/query2.rq
test-cases/or/minCount/valid/case4/query3.rq
test-cases/or/minCount/shacl.ttl
test-cases/or/minCount/shacl.ttl
org.eclipse.rdf4j.sail.shacl.ShaclSailValidationException: Failed SHACL validation
test-cases/or/minCount/invalid/case1/query1.rq
org.eclipse.rdf4j.sail.shacl.ShaclSailValidationException: Failed SHACL validation
test-cases/or/minCount/shacl.ttl
org.eclipse.rdf4j.sail.shacl.ShaclSailValidationException: Failed SHACL validation
test-cases/or/minCount/shacl.ttl
org.eclipse.rdf4j.sail.shacl.ShaclSailValidationException: Failed SHACL validation
test-cases/or/minCount/invalid/case1/query1.rq
org.eclipse.rdf4j.sail.shacl.ShaclSailValidationException: Failed SHACL validation
test-cases/or/minCount/shacl.ttl
org.eclipse.rdf4j.sail.shacl.ShaclSailValidationException: Failed SHACL validation
test-cases/or/minCount/shacl.ttl
org.eclipse.rdf4j.sail.shacl.ShaclSailValidationException: Failed SHACL validation
test-cases/or/minCount/invalid/case1/query1.rq
org.eclipse.rdf4j.sail.shacl.ShaclSailValidationException: Failed SHACL validation
test-cases/or/minCount/shacl.ttl
org.eclipse.rdf4j.sail.shacl.ShaclSailValidationException: Failed SHACL validation
test-cases/or/minCount/shacl.ttl
org.eclipse.rdf4j.sail.shacl.ShaclSailValidationException: Failed SHACL validation
test-cases/or/minCount/invalid/case2/query1.rq
test-cases/or/minCount/invalid/case2/query2.rq
org.eclipse.rdf4j.sail.shacl.ShaclSailValidationException: Failed SHACL validation
test-cases/or/minCount/shacl.ttl
org.eclipse.rdf4j.sail.shacl.ShaclSailValidationException: Failed SHACL validation
test-cases/or/minCount/shacl.ttl
org.eclipse.rdf4j.sail.shacl.ShaclSailValidationException: Failed SHACL validation
test-cases/or/minCount/invalid/case2/query1.rq
test-cases/or/minCount/invalid/case2/query2.rq
org.eclipse.rdf4j.sail.shacl.ShaclSailValidationException: Failed SHACL validation
test-cases/or/minCount/shacl.ttl
org.eclipse.rdf4j.sail.shacl.ShaclSailValidationException: Failed SHACL validation
test-cases/or/minCount/shacl.ttl
org.eclipse.rdf4j.sail.shacl.ShaclSailValidationException: Failed SHACL validation
test-cases/or/minCount/invalid/case2/query1.rq
test-cases/or/minCount/invalid/case2/query2.rq
org.eclipse.rdf4j.sail.shacl.ShaclSailValidationException: Failed SHACL validation
test-cases/or/minCount/shacl.ttl
org.eclipse.rdf4j.sail.shacl.ShaclSailValidationException: Failed SHACL validation
test-cases/or/minCount/shacl.ttl
org.eclipse.rdf4j.sail.shacl.ShaclSailValidationException: Failed SHACL validation
test-cases/or/minCount/invalid/case3/query1.rq
test-cases/or/minCount/invalid/case3/query2.rq
org.eclipse.rdf4j.sail.shacl.ShaclSailValidationException: Failed SHACL validation
test-cases/or/minCount/shacl.ttl
org.eclipse.rdf4j.sail.shacl.ShaclSailValidationException: Failed SHACL validation
test-cases/or/minCount/shacl.ttl
org.eclipse.rdf4j.sail.shacl.ShaclSailValidationException: Failed SHACL validation
test-cases/or/minCount/invalid/case3/query1.rq
test-cases/or/minCount/invalid/case3/query2.rq
org.eclipse.rdf4j.sail.shacl.ShaclSailValidationException: Failed SHACL validation
test-cases/or/minCount/shacl.ttl
org.eclipse.rdf4j.sail.shacl.ShaclSailValidationException: Failed SHACL validation
test-cases/or/minCount/shacl.ttl
org.eclipse.rdf4j.sail.shacl.ShaclSailValidationException: Failed SHACL validation
test-cases/or/minCount/invalid/case3/query1.rq
test-cases/or/minCount/invalid/case3/query2.rq
org.eclipse.rdf4j.sail.shacl.ShaclSailValidationException: Failed SHACL validation
test-cases/or/minCount/shacl.ttl
org.eclipse.rdf4j.sail.shacl.ShaclSailValidationException: Failed SHACL validation
test-cases/or/minCount/shacl.ttl
org.eclipse.rdf4j.sail.shacl.ShaclSailValidationException: Failed SHACL validation
test-cases/or/minCount/invalid/case4/query1.rq
test-cases/or/minCount/invalid/case4/query2.rq
test-cases/or/minCount/invalid/case4/query3.rq
org.eclipse.rdf4j.sail.shacl.ShaclSailValidationException: Failed SHACL validation
test-cases/or/minCount/shacl.ttl
org.eclipse.rdf4j.sail.shacl.ShaclSailValidationException: Failed SHACL validation
test-cases/or/minCount/shacl.ttl
org.eclipse.rdf4j.sail.shacl.ShaclSailValidationException: Failed SHACL validation
test-cases/or/minCount/invalid/case4/query1.rq
test-cases/or/minCount/invalid/case4/query2.rq
test-cases/or/minCount/invalid/case4/query3.rq
org.eclipse.rdf4j.sail.shacl.ShaclSailValidationException: Failed SHACL validation
test-cases/or/minCount/shacl.ttl
org.eclipse.rdf4j.sail.shacl.ShaclSailValidationException: Failed SHACL validation
test-cases/or/minCount/shacl.ttl
org.eclipse.rdf4j.sail.shacl.ShaclSailValidationException: Failed SHACL validation
test-cases/or/minCount/invalid/case4/query1.rq
test-cases/or/minCount/invalid/case4/query2.rq
test-cases/or/minCount/invalid/case4/query3.rq
org.eclipse.rdf4j.sail.shacl.ShaclSailValidationException: Failed SHACL validation
test-cases/or/minCount/shacl.ttl
org.eclipse.rdf4j.sail.shacl.ShaclSailValidationException: Failed SHACL validation
test-cases/or/minCountDifferentPath/shacl.ttl
test-cases/or/minCountDifferentPath/valid/case1/query1.rq
test-cases/or/minCountDifferentPath/shacl.ttl
test-cases/or/minCountDifferentPath/shacl.ttl
test-cases/or/minCountDifferentPath/valid/case1/query1.rq
test-cases/or/minCountDifferentPath/shacl.ttl
test-cases/or/minCountDifferentPath/shacl.ttl
test-cases/or/minCountDifferentPath/valid/case1/query1.rq
test-cases/or/minCountDifferentPath/shacl.ttl
test-cases/or/minCountDifferentPath/shacl.ttl
test-cases/or/minCountDifferentPath/valid/case2/query1.rq
test-cases/or/minCountDifferentPath/valid/case2/query2.rq
test-cases/or/minCountDifferentPath/shacl.ttl
test-cases/or/minCountDifferentPath/shacl.ttl
test-cases/or/minCountDifferentPath/valid/case2/query1.rq
test-cases/or/minCountDifferentPath/valid/case2/query2.rq
test-cases/or/minCountDifferentPath/shacl.ttl
test-cases/or/minCountDifferentPath/shacl.ttl
test-cases/or/minCountDifferentPath/valid/case2/query1.rq
test-cases/or/minCountDifferentPath/valid/case2/query2.rq
test-cases/or/minCountDifferentPath/shacl.ttl
test-cases/or/minCountDifferentPath/shacl.ttl
test-cases/or/minCountDifferentPath/valid/case3/query1.rq
test-cases/or/minCountDifferentPath/shacl.ttl
test-cases/or/minCountDifferentPath/shacl.ttl
test-cases/or/minCountDifferentPath/valid/case3/query1.rq
test-cases/or/minCountDifferentPath/shacl.ttl
test-cases/or/minCountDifferentPath/shacl.ttl
test-cases/or/minCountDifferentPath/valid/case3/query1.rq
test-cases/or/minCountDifferentPath/shacl.ttl
test-cases/or/minCountDifferentPath/shacl.ttl
test-cases/or/minCountDifferentPath/valid/case4/query1.rq
test-cases/or/minCountDifferentPath/shacl.ttl
test-cases/or/minCountDifferentPath/shacl.ttl
test-cases/or/minCountDifferentPath/valid/case4/query1.rq
test-cases/or/minCountDifferentPath/shacl.ttl
test-cases/or/minCountDifferentPath/shacl.ttl
test-cases/or/minCountDifferentPath/valid/case4/query1.rq
test-cases/or/minCountDifferentPath/shacl.ttl
test-cases/or/minCountDifferentPath/shacl.ttl
test-cases/or/minCountDifferentPath/valid/case5/query1.rq
test-cases/or/minCountDifferentPath/shacl.ttl
test-cases/or/minCountDifferentPath/shacl.ttl
test-cases/or/minCountDifferentPath/valid/case5/query1.rq
test-cases/or/minCountDifferentPath/shacl.ttl
test-cases/or/minCountDifferentPath/shacl.ttl
test-cases/or/minCountDifferentPath/valid/case5/query1.rq
test-cases/or/minCountDifferentPath/shacl.ttl
test-cases/or/minCountDifferentPath/shacl.ttl
org.eclipse.rdf4j.sail.shacl.ShaclSailValidationException: Failed SHACL validation
test-cases/or/minCountDifferentPath/invalid/case1/query1.rq
org.eclipse.rdf4j.sail.shacl.ShaclSailValidationException: Failed SHACL validation
test-cases/or/minCountDifferentPath/shacl.ttl
org.eclipse.rdf4j.sail.shacl.ShaclSailValidationException: Failed SHACL validation
test-cases/or/minCountDifferentPath/shacl.ttl
org.eclipse.rdf4j.sail.shacl.ShaclSailValidationException: Failed SHACL validation
test-cases/or/minCountDifferentPath/invalid/case1/query1.rq
org.eclipse.rdf4j.sail.shacl.ShaclSailValidationException: Failed SHACL validation
test-cases/or/minCountDifferentPath/shacl.ttl
org.eclipse.rdf4j.sail.shacl.ShaclSailValidationException: Failed SHACL validation
test-cases/or/minCountDifferentPath/shacl.ttl
org.eclipse.rdf4j.sail.shacl.ShaclSailValidationException: Failed SHACL validation
test-cases/or/minCountDifferentPath/invalid/case1/query1.rq
org.eclipse.rdf4j.sail.shacl.ShaclSailValidationException: Failed SHACL validation
test-cases/or/minCountDifferentPath/shacl.ttl
org.eclipse.rdf4j.sail.shacl.ShaclSailValidationException: Failed SHACL validation
test-cases/or/minCountDifferentPath/shacl.ttl
org.eclipse.rdf4j.sail.shacl.ShaclSailValidationException: Failed SHACL validation
test-cases/or/minCountDifferentPath/invalid/case2/query1.rq
test-cases/or/minCountDifferentPath/invalid/case2/query2.rq
org.eclipse.rdf4j.sail.shacl.ShaclSailValidationException: Failed SHACL validation
test-cases/or/minCountDifferentPath/shacl.ttl
org.eclipse.rdf4j.sail.shacl.ShaclSailValidationException: Failed SHACL validation
test-cases/or/minCountDifferentPath/shacl.ttl
org.eclipse.rdf4j.sail.shacl.ShaclSailValidationException: Failed SHACL validation
test-cases/or/minCountDifferentPath/invalid/case2/query1.rq
test-cases/or/minCountDifferentPath/invalid/case2/query2.rq
org.eclipse.rdf4j.sail.shacl.ShaclSailValidationException: Failed SHACL validation
test-cases/or/minCountDifferentPath/shacl.ttl
org.eclipse.rdf4j.sail.shacl.ShaclSailValidationException: Failed SHACL validation
test-cases/or/minCountDifferentPath/shacl.ttl
org.eclipse.rdf4j.sail.shacl.ShaclSailValidationException: Failed SHACL validation
test-cases/or/minCountDifferentPath/invalid/case2/query1.rq
test-cases/or/minCountDifferentPath/invalid/case2/query2.rq
org.eclipse.rdf4j.sail.shacl.ShaclSailValidationException: Failed SHACL validation
test-cases/or/minCountDifferentPath/shacl.ttl
org.eclipse.rdf4j.sail.shacl.ShaclSailValidationException: Failed SHACL validation
test-cases/or/minCountDifferentPath/shacl.ttl
org.eclipse.rdf4j.sail.shacl.ShaclSailValidationException: Failed SHACL validation
test-cases/or/minCountDifferentPath/invalid/case3/query1.rq
test-cases/or/minCountDifferentPath/invalid/case3/query2.rq
org.eclipse.rdf4j.sail.shacl.ShaclSailValidationException: Failed SHACL validation
test-cases/or/minCountDifferentPath/shacl.ttl
org.eclipse.rdf4j.sail.shacl.ShaclSailValidationException: Failed SHACL validation
test-cases/or/minCountDifferentPath/shacl.ttl
org.eclipse.rdf4j.sail.shacl.ShaclSailValidationException: Failed SHACL validation
test-cases/or/minCountDifferentPath/invalid/case3/query1.rq
test-cases/or/minCountDifferentPath/invalid/case3/query2.rq
org.eclipse.rdf4j.sail.shacl.ShaclSailValidationException: Failed SHACL validation
test-cases/or/minCountDifferentPath/shacl.ttl
org.eclipse.rdf4j.sail.shacl.ShaclSailValidationException: Failed SHACL validation
test-cases/or/minCountDifferentPath/shacl.ttl
org.eclipse.rdf4j.sail.shacl.ShaclSailValidationException: Failed SHACL validation
test-cases/or/minCountDifferentPath/invalid/case3/query1.rq
test-cases/or/minCountDifferentPath/invalid/case3/query2.rq
org.eclipse.rdf4j.sail.shacl.ShaclSailValidationException: Failed SHACL validation
test-cases/or/minCountDifferentPath/shacl.ttl
org.eclipse.rdf4j.sail.shacl.ShaclSailValidationException: Failed SHACL validation
test-cases/or/minCountMaxCount/shacl.ttl
test-cases/or/minCountMaxCount/valid/case1/query1.rq
test-cases/or/minCountMaxCount/shacl.ttl
test-cases/or/minCountMaxCount/shacl.ttl
test-cases/or/minCountMaxCount/valid/case1/query1.rq
test-cases/or/minCountMaxCount/shacl.ttl
test-cases/or/minCountMaxCount/shacl.ttl
test-cases/or/minCountMaxCount/valid/case1/query1.rq
test-cases/or/minCountMaxCount/shacl.ttl
test-cases/or/minCountMaxCount/shacl.ttl
test-cases/or/minCountMaxCount/valid/case2/query1.rq
test-cases/or/minCountMaxCount/valid/case2/query2.rq
test-cases/or/minCountMaxCount/shacl.ttl
test-cases/or/minCountMaxCount/shacl.ttl
test-cases/or/minCountMaxCount/valid/case2/query1.rq
test-cases/or/minCountMaxCount/valid/case2/query2.rq
test-cases/or/minCountMaxCount/shacl.ttl
test-cases/or/minCountMaxCount/shacl.ttl
test-cases/or/minCountMaxCount/valid/case2/query1.rq
test-cases/or/minCountMaxCount/valid/case2/query2.rq
test-cases/or/minCountMaxCount/shacl.ttl
test-cases/or/minCountMaxCount/shacl.ttl
test-cases/or/minCountMaxCount/valid/case3/query1.rq
test-cases/or/minCountMaxCount/valid/case3/query2.rq
test-cases/or/minCountMaxCount/valid/case3/query3.rq
test-cases/or/minCountMaxCount/valid/case3/query4.rq
test-cases/or/minCountMaxCount/shacl.ttl
test-cases/or/minCountMaxCount/shacl.ttl
test-cases/or/minCountMaxCount/valid/case3/query1.rq
test-cases/or/minCountMaxCount/valid/case3/query2.rq
test-cases/or/minCountMaxCount/valid/case3/query3.rq
test-cases/or/minCountMaxCount/valid/case3/query4.rq
test-cases/or/minCountMaxCount/shacl.ttl
test-cases/or/minCountMaxCount/shacl.ttl
test-cases/or/minCountMaxCount/valid/case3/query1.rq
test-cases/or/minCountMaxCount/valid/case3/query2.rq
test-cases/or/minCountMaxCount/valid/case3/query3.rq
test-cases/or/minCountMaxCount/valid/case3/query4.rq
test-cases/or/minCountMaxCount/shacl.ttl
test-cases/or/minCountMaxCount/shacl.ttl
org.eclipse.rdf4j.sail.shacl.ShaclSailValidationException: Failed SHACL validation
test-cases/or/minCountMaxCount/invalid/case1/query1.rq
org.eclipse.rdf4j.sail.shacl.ShaclSailValidationException: Failed SHACL validation
test-cases/or/minCountMaxCount/shacl.ttl
org.eclipse.rdf4j.sail.shacl.ShaclSailValidationException: Failed SHACL validation
test-cases/or/minCountMaxCount/shacl.ttl
org.eclipse.rdf4j.sail.shacl.ShaclSailValidationException: Failed SHACL validation
test-cases/or/minCountMaxCount/invalid/case1/query1.rq
org.eclipse.rdf4j.sail.shacl.ShaclSailValidationException: Failed SHACL validation
test-cases/or/minCountMaxCount/shacl.ttl
org.eclipse.rdf4j.sail.shacl.ShaclSailValidationException: Failed SHACL validation
test-cases/or/minCountMaxCount/shacl.ttl
org.eclipse.rdf4j.sail.shacl.ShaclSailValidationException: Failed SHACL validation
test-cases/or/minCountMaxCount/invalid/case1/query1.rq
org.eclipse.rdf4j.sail.shacl.ShaclSailValidationException: Failed SHACL validation
test-cases/or/minCountMaxCount/shacl.ttl
org.eclipse.rdf4j.sail.shacl.ShaclSailValidationException: Failed SHACL validation
test-cases/or/minCountMaxCount/shacl.ttl
org.eclipse.rdf4j.sail.shacl.ShaclSailValidationException: Failed SHACL validation
test-cases/or/minCountMaxCount/invalid/case2/query1.rq
test-cases/or/minCountMaxCount/invalid/case2/query2.rq
org.eclipse.rdf4j.sail.shacl.ShaclSailValidationException: Failed SHACL validation
test-cases/or/minCountMaxCount/shacl.ttl
org.eclipse.rdf4j.sail.shacl.ShaclSailValidationException: Failed SHACL validation
test-cases/or/minCountMaxCount/shacl.ttl
org.eclipse.rdf4j.sail.shacl.ShaclSailValidationException: Failed SHACL validation
test-cases/or/minCountMaxCount/invalid/case2/query1.rq
test-cases/or/minCountMaxCount/invalid/case2/query2.rq
org.eclipse.rdf4j.sail.shacl.ShaclSailValidationException: Failed SHACL validation
test-cases/or/minCountMaxCount/shacl.ttl
org.eclipse.rdf4j.sail.shacl.ShaclSailValidationException: Failed SHACL validation
test-cases/or/minCountMaxCount/shacl.ttl
org.eclipse.rdf4j.sail.shacl.ShaclSailValidationException: Failed SHACL validation
test-cases/or/minCountMaxCount/invalid/case2/query1.rq
test-cases/or/minCountMaxCount/invalid/case2/query2.rq
org.eclipse.rdf4j.sail.shacl.ShaclSailValidationException: Failed SHACL validation
test-cases/or/minCountMaxCount/shacl.ttl
org.eclipse.rdf4j.sail.shacl.ShaclSailValidationException: Failed SHACL validation
test-cases/or/minCountMaxCount/shacl.ttl
org.eclipse.rdf4j.sail.shacl.ShaclSailValidationException: Failed SHACL validation
test-cases/or/minCountMaxCount/invalid/case3/query1.rq
test-cases/or/minCountMaxCount/invalid/case3/query2.rq
org.eclipse.rdf4j.sail.shacl.ShaclSailValidationException: Failed SHACL validation
test-cases/or/minCountMaxCount/shacl.ttl
org.eclipse.rdf4j.sail.shacl.ShaclSailValidationException: Failed SHACL validation
test-cases/or/minCountMaxCount/shacl.ttl
org.eclipse.rdf4j.sail.shacl.ShaclSailValidationException: Failed SHACL validation
test-cases/or/minCountMaxCount/invalid/case3/query1.rq
test-cases/or/minCountMaxCount/invalid/case3/query2.rq
org.eclipse.rdf4j.sail.shacl.ShaclSailValidationException: Failed SHACL validation
test-cases/or/minCountMaxCount/shacl.ttl
org.eclipse.rdf4j.sail.shacl.ShaclSailValidationException: Failed SHACL validation
test-cases/or/minCountMaxCount/shacl.ttl
org.eclipse.rdf4j.sail.shacl.ShaclSailValidationException: Failed SHACL validation
test-cases/or/minCountMaxCount/invalid/case3/query1.rq
test-cases/or/minCountMaxCount/invalid/case3/query2.rq
org.eclipse.rdf4j.sail.shacl.ShaclSailValidationException: Failed SHACL validation
test-cases/or/minCountMaxCount/shacl.ttl
org.eclipse.rdf4j.sail.shacl.ShaclSailValidationException: Failed SHACL validation
test-cases/or/minCountMaxCount/shacl.ttl
org.eclipse.rdf4j.sail.shacl.ShaclSailValidationException: Failed SHACL validation
test-cases/or/minCountMaxCount/invalid/case4/query1.rq
test-cases/or/minCountMaxCount/invalid/case4/query2.rq
org.eclipse.rdf4j.sail.shacl.ShaclSailValidationException: Failed SHACL validation
test-cases/or/minCountMaxCount/shacl.ttl
org.eclipse.rdf4j.sail.shacl.ShaclSailValidationException: Failed SHACL validation
test-cases/or/minCountMaxCount/shacl.ttl
org.eclipse.rdf4j.sail.shacl.ShaclSailValidationException: Failed SHACL validation
test-cases/or/minCountMaxCount/invalid/case4/query1.rq
test-cases/or/minCountMaxCount/invalid/case4/query2.rq
org.eclipse.rdf4j.sail.shacl.ShaclSailValidationException: Failed SHACL validation
test-cases/or/minCountMaxCount/shacl.ttl
org.eclipse.rdf4j.sail.shacl.ShaclSailValidationException: Failed SHACL validation
test-cases/or/minCountMaxCount/shacl.ttl
org.eclipse.rdf4j.sail.shacl.ShaclSailValidationException: Failed SHACL validation
test-cases/or/minCountMaxCount/invalid/case4/query1.rq
test-cases/or/minCountMaxCount/invalid/case4/query2.rq
org.eclipse.rdf4j.sail.shacl.ShaclSailValidationException: Failed SHACL validation
test-cases/or/minCountMaxCount/shacl.ttl
org.eclipse.rdf4j.sail.shacl.ShaclSailValidationException: Failed SHACL validation
test-cases/or/multiple/shacl.ttl
test-cases/or/multiple/valid/case1/query1.rq
test-cases/or/multiple/shacl.ttl
test-cases/or/multiple/shacl.ttl
test-cases/or/multiple/valid/case1/query1.rq
test-cases/or/multiple/shacl.ttl
test-cases/or/multiple/shacl.ttl
test-cases/or/multiple/valid/case1/query1.rq
test-cases/or/multiple/shacl.ttl
test-cases/or/multiple/shacl.ttl
org.eclipse.rdf4j.sail.shacl.ShaclSailValidationException: Failed SHACL validation
test-cases/or/multiple/invalid/case1/query1.rq
org.eclipse.rdf4j.sail.shacl.ShaclSailValidationException: Failed SHACL validation
test-cases/or/multiple/shacl.ttl
org.eclipse.rdf4j.sail.shacl.ShaclSailValidationException: Failed SHACL validation
test-cases/or/multiple/shacl.ttl
org.eclipse.rdf4j.sail.shacl.ShaclSailValidationException: Failed SHACL validation
test-cases/or/multiple/invalid/case1/query1.rq
org.eclipse.rdf4j.sail.shacl.ShaclSailValidationException: Failed SHACL validation
test-cases/or/multiple/shacl.ttl
org.eclipse.rdf4j.sail.shacl.ShaclSailValidationException: Failed SHACL validation
test-cases/or/multiple/shacl.ttl
org.eclipse.rdf4j.sail.shacl.ShaclSailValidationException: Failed SHACL validation
test-cases/or/multiple/invalid/case1/query1.rq
org.eclipse.rdf4j.sail.shacl.ShaclSailValidationException: Failed SHACL validation
test-cases/or/multiple/shacl.ttl
org.eclipse.rdf4j.sail.shacl.ShaclSailValidationException: Failed SHACL validation
test-cases/or/nodeKindMinLength/shacl.ttl
test-cases/or/nodeKindMinLength/valid/case1/query1.rq
test-cases/or/nodeKindMinLength/shacl.ttl
test-cases/or/nodeKindMinLength/shacl.ttl
test-cases/or/nodeKindMinLength/valid/case1/query1.rq
test-cases/or/nodeKindMinLength/shacl.ttl
test-cases/or/nodeKindMinLength/shacl.ttl
test-cases/or/nodeKindMinLength/valid/case1/query1.rq
test-cases/or/nodeKindMinLength/shacl.ttl
test-cases/or/nodeKindMinLength/shacl.ttl
test-cases/or/nodeKindMinLength/valid/case2/query1.rq
test-cases/or/nodeKindMinLength/valid/case2/query2.rq
test-cases/or/nodeKindMinLength/shacl.ttl
test-cases/or/nodeKindMinLength/shacl.ttl
test-cases/or/nodeKindMinLength/valid/case2/query1.rq
test-cases/or/nodeKindMinLength/valid/case2/query2.rq
test-cases/or/nodeKindMinLength/shacl.ttl
test-cases/or/nodeKindMinLength/shacl.ttl
test-cases/or/nodeKindMinLength/valid/case2/query1.rq
test-cases/or/nodeKindMinLength/valid/case2/query2.rq
test-cases/or/nodeKindMinLength/shacl.ttl
test-cases/or/nodeKindMinLength/shacl.ttl
org.eclipse.rdf4j.sail.shacl.ShaclSailValidationException: Failed SHACL validation
test-cases/or/nodeKindMinLength/invalid/case1/query1.rq
org.eclipse.rdf4j.sail.shacl.ShaclSailValidationException: Failed SHACL validation
test-cases/or/nodeKindMinLength/shacl.ttl
org.eclipse.rdf4j.sail.shacl.ShaclSailValidationException: Failed SHACL validation
test-cases/or/nodeKindMinLength/shacl.ttl
org.eclipse.rdf4j.sail.shacl.ShaclSailValidationException: Failed SHACL validation
test-cases/or/nodeKindMinLength/invalid/case1/query1.rq
org.eclipse.rdf4j.sail.shacl.ShaclSailValidationException: Failed SHACL validation
test-cases/or/nodeKindMinLength/shacl.ttl
org.eclipse.rdf4j.sail.shacl.ShaclSailValidationException: Failed SHACL validation
test-cases/or/nodeKindMinLength/shacl.ttl
org.eclipse.rdf4j.sail.shacl.ShaclSailValidationException: Failed SHACL validation
test-cases/or/nodeKindMinLength/invalid/case1/query1.rq
org.eclipse.rdf4j.sail.shacl.ShaclSailValidationException: Failed SHACL validation
test-cases/or/nodeKindMinLength/shacl.ttl
org.eclipse.rdf4j.sail.shacl.ShaclSailValidationException: Failed SHACL validation
test-cases/or/nodeKindMinLength/shacl.ttl
org.eclipse.rdf4j.sail.shacl.ShaclSailValidationException: Failed SHACL validation
test-cases/or/nodeKindMinLength/invalid/case2/query1.rq
org.eclipse.rdf4j.sail.shacl.ShaclSailValidationException: Failed SHACL validation
test-cases/or/nodeKindMinLength/shacl.ttl
org.eclipse.rdf4j.sail.shacl.ShaclSailValidationException: Failed SHACL validation
test-cases/or/nodeKindMinLength/shacl.ttl
org.eclipse.rdf4j.sail.shacl.ShaclSailValidationException: Failed SHACL validation
test-cases/or/nodeKindMinLength/invalid/case2/query1.rq
org.eclipse.rdf4j.sail.shacl.ShaclSailValidationException: Failed SHACL validation
test-cases/or/nodeKindMinLength/shacl.ttl
org.eclipse.rdf4j.sail.shacl.ShaclSailValidationException: Failed SHACL validation
test-cases/or/nodeKindMinLength/shacl.ttl
org.eclipse.rdf4j.sail.shacl.ShaclSailValidationException: Failed SHACL validation
test-cases/or/nodeKindMinLength/invalid/case2/query1.rq
org.eclipse.rdf4j.sail.shacl.ShaclSailValidationException: Failed SHACL validation
test-cases/or/nodeKindMinLength/shacl.ttl
org.eclipse.rdf4j.sail.shacl.ShaclSailValidationException: Failed SHACL validation
test-cases/or/nodeKindMinLength/shacl.ttl
org.eclipse.rdf4j.sail.shacl.ShaclSailValidationException: Failed SHACL validation
test-cases/or/nodeKindMinLength/invalid/case3/query1.rq
test-cases/or/nodeKindMinLength/invalid/case3/query2.rq
org.eclipse.rdf4j.sail.shacl.ShaclSailValidationException: Failed SHACL validation
test-cases/or/nodeKindMinLength/shacl.ttl
org.eclipse.rdf4j.sail.shacl.ShaclSailValidationException: Failed SHACL validation
test-cases/or/nodeKindMinLength/shacl.ttl
org.eclipse.rdf4j.sail.shacl.ShaclSailValidationException: Failed SHACL validation
test-cases/or/nodeKindMinLength/invalid/case3/query1.rq
test-cases/or/nodeKindMinLength/invalid/case3/query2.rq
org.eclipse.rdf4j.sail.shacl.ShaclSailValidationException: Failed SHACL validation
test-cases/or/nodeKindMinLength/shacl.ttl
org.eclipse.rdf4j.sail.shacl.ShaclSailValidationException: Failed SHACL validation
test-cases/or/nodeKindMinLength/shacl.ttl
org.eclipse.rdf4j.sail.shacl.ShaclSailValidationException: Failed SHACL validation
test-cases/or/nodeKindMinLength/invalid/case3/query1.rq
test-cases/or/nodeKindMinLength/invalid/case3/query2.rq
org.eclipse.rdf4j.sail.shacl.ShaclSailValidationException: Failed SHACL validation
test-cases/or/nodeKindMinLength/shacl.ttl
org.eclipse.rdf4j.sail.shacl.ShaclSailValidationException: Failed SHACL validation
test-cases/or/nodeKindMinLength/shacl.ttl
org.eclipse.rdf4j.sail.shacl.ShaclSailValidationException: Failed SHACL validation
test-cases/or/nodeKindMinLength/invalid/case4/query1.rq
test-cases/or/nodeKindMinLength/invalid/case4/query2.rq
org.eclipse.rdf4j.sail.shacl.ShaclSailValidationException: Failed SHACL validation
test-cases/or/nodeKindMinLength/shacl.ttl
org.eclipse.rdf4j.sail.shacl.ShaclSailValidationException: Failed SHACL validation
test-cases/or/nodeKindMinLength/shacl.ttl
org.eclipse.rdf4j.sail.shacl.ShaclSailValidationException: Failed SHACL validation
test-cases/or/nodeKindMinLength/invalid/case4/query1.rq
test-cases/or/nodeKindMinLength/invalid/case4/query2.rq
org.eclipse.rdf4j.sail.shacl.ShaclSailValidationException: Failed SHACL validation
test-cases/or/nodeKindMinLength/shacl.ttl
org.eclipse.rdf4j.sail.shacl.ShaclSailValidationException: Failed SHACL validation
test-cases/or/nodeKindMinLength/shacl.ttl
org.eclipse.rdf4j.sail.shacl.ShaclSailValidationException: Failed SHACL validation
test-cases/or/nodeKindMinLength/invalid/case4/query1.rq
test-cases/or/nodeKindMinLength/invalid/case4/query2.rq
org.eclipse.rdf4j.sail.shacl.ShaclSailValidationException: Failed SHACL validation
test-cases/or/nodeKindMinLength/shacl.ttl
org.eclipse.rdf4j.sail.shacl.ShaclSailValidationException: Failed SHACL validation
test-cases/or/nodeKindValidateTarget/shacl.ttl
test-cases/or/nodeKindValidateTarget/valid/case1/query1.rq
test-cases/or/nodeKindValidateTarget/shacl.ttl
test-cases/or/nodeKindValidateTarget/shacl.ttl
test-cases/or/nodeKindValidateTarget/valid/case1/query1.rq
test-cases/or/nodeKindValidateTarget/shacl.ttl
test-cases/or/nodeKindValidateTarget/shacl.ttl
test-cases/or/nodeKindValidateTarget/valid/case1/query1.rq
test-cases/or/nodeKindValidateTarget/shacl.ttl
test-cases/or/nodeKindValidateTarget/shacl.ttl
test-cases/or/nodeKindValidateTarget/valid/case2/query1.rq
test-cases/or/nodeKindValidateTarget/shacl.ttl
test-cases/or/nodeKindValidateTarget/shacl.ttl
test-cases/or/nodeKindValidateTarget/valid/case2/query1.rq
test-cases/or/nodeKindValidateTarget/shacl.ttl
test-cases/or/nodeKindValidateTarget/shacl.ttl
test-cases/or/nodeKindValidateTarget/valid/case2/query1.rq
test-cases/or/nodeKindValidateTarget/shacl.ttl
test-cases/or/nodeKindValidateTarget/shacl.ttl
org.eclipse.rdf4j.sail.shacl.ShaclSailValidationException: Failed SHACL validation
test-cases/or/nodeKindValidateTarget/invalid/case1/query1.rq
org.eclipse.rdf4j.sail.shacl.ShaclSailValidationException: Failed SHACL validation
test-cases/or/nodeKindValidateTarget/shacl.ttl
org.eclipse.rdf4j.sail.shacl.ShaclSailValidationException: Failed SHACL validation
test-cases/or/nodeKindValidateTarget/shacl.ttl
org.eclipse.rdf4j.sail.shacl.ShaclSailValidationException: Failed SHACL validation
test-cases/or/nodeKindValidateTarget/invalid/case1/query1.rq
org.eclipse.rdf4j.sail.shacl.ShaclSailValidationException: Failed SHACL validation
test-cases/or/nodeKindValidateTarget/shacl.ttl
org.eclipse.rdf4j.sail.shacl.ShaclSailValidationException: Failed SHACL validation
test-cases/or/nodeKindValidateTarget/shacl.ttl
org.eclipse.rdf4j.sail.shacl.ShaclSailValidationException: Failed SHACL validation
test-cases/or/nodeKindValidateTarget/invalid/case1/query1.rq
org.eclipse.rdf4j.sail.shacl.ShaclSailValidationException: Failed SHACL validation
test-cases/or/nodeKindValidateTarget/shacl.ttl
org.eclipse.rdf4j.sail.shacl.ShaclSailValidationException: Failed SHACL validation
test-cases/or/nodeKindValidateTarget/shacl.ttl
org.eclipse.rdf4j.sail.shacl.ShaclSailValidationException: Failed SHACL validation
test-cases/or/nodeKindValidateTarget/invalid/case2/query1.rq
org.eclipse.rdf4j.sail.shacl.ShaclSailValidationException: Failed SHACL validation
test-cases/or/nodeKindValidateTarget/shacl.ttl
org.eclipse.rdf4j.sail.shacl.ShaclSailValidationException: Failed SHACL validation
test-cases/or/nodeKindValidateTarget/shacl.ttl
org.eclipse.rdf4j.sail.shacl.ShaclSailValidationException: Failed SHACL validation
test-cases/or/nodeKindValidateTarget/invalid/case2/query1.rq
org.eclipse.rdf4j.sail.shacl.ShaclSailValidationException: Failed SHACL validation
test-cases/or/nodeKindValidateTarget/shacl.ttl
org.eclipse.rdf4j.sail.shacl.ShaclSailValidationException: Failed SHACL validation
test-cases/or/nodeKindValidateTarget/shacl.ttl
org.eclipse.rdf4j.sail.shacl.ShaclSailValidationException: Failed SHACL validation
test-cases/or/nodeKindValidateTarget/invalid/case2/query1.rq
org.eclipse.rdf4j.sail.shacl.ShaclSailValidationException: Failed SHACL validation
test-cases/or/nodeKindValidateTarget/shacl.ttl
org.eclipse.rdf4j.sail.shacl.ShaclSailValidationException: Failed SHACL validation
test-cases/or/nodeKindValidateTarget/shacl.ttl
org.eclipse.rdf4j.sail.shacl.ShaclSailValidationException: Failed SHACL validation
test-cases/or/nodeKindValidateTarget/invalid/case3/query1.rq
org.eclipse.rdf4j.sail.shacl.ShaclSailValidationException: Failed SHACL validation
test-cases/or/nodeKindValidateTarget/shacl.ttl
org.eclipse.rdf4j.sail.shacl.ShaclSailValidationException: Failed SHACL validation
test-cases/or/nodeKindValidateTarget/shacl.ttl
org.eclipse.rdf4j.sail.shacl.ShaclSailValidationException: Failed SHACL validation
test-cases/or/nodeKindValidateTarget/invalid/case3/query1.rq
org.eclipse.rdf4j.sail.shacl.ShaclSailValidationException: Failed SHACL validation
test-cases/or/nodeKindValidateTarget/shacl.ttl
org.eclipse.rdf4j.sail.shacl.ShaclSailValidationException: Failed SHACL validation
test-cases/or/nodeKindValidateTarget/shacl.ttl
org.eclipse.rdf4j.sail.shacl.ShaclSailValidationException: Failed SHACL validation
test-cases/or/nodeKindValidateTarget/invalid/case3/query1.rq
org.eclipse.rdf4j.sail.shacl.ShaclSailValidationException: Failed SHACL validation
test-cases/or/nodeKindValidateTarget/shacl.ttl
org.eclipse.rdf4j.sail.shacl.ShaclSailValidationException: Failed SHACL validation
test-cases/or/nodeKindValidateTarget/shacl.ttl
org.eclipse.rdf4j.sail.shacl.ShaclSailValidationException: Failed SHACL validation
test-cases/or/nodeKindValidateTarget/invalid/case4/query1.rq
org.eclipse.rdf4j.sail.shacl.ShaclSailValidationException: Failed SHACL validation
test-cases/or/nodeKindValidateTarget/shacl.ttl
org.eclipse.rdf4j.sail.shacl.ShaclSailValidationException: Failed SHACL validation
test-cases/or/nodeKindValidateTarget/shacl.ttl
org.eclipse.rdf4j.sail.shacl.ShaclSailValidationException: Failed SHACL validation
test-cases/or/nodeKindValidateTarget/invalid/case4/query1.rq
org.eclipse.rdf4j.sail.shacl.ShaclSailValidationException: Failed SHACL validation
test-cases/or/nodeKindValidateTarget/shacl.ttl
org.eclipse.rdf4j.sail.shacl.ShaclSailValidationException: Failed SHACL validation
test-cases/or/nodeKindValidateTarget/shacl.ttl
org.eclipse.rdf4j.sail.shacl.ShaclSailValidationException: Failed SHACL validation
test-cases/or/nodeKindValidateTarget/invalid/case4/query1.rq
org.eclipse.rdf4j.sail.shacl.ShaclSailValidationException: Failed SHACL validation
test-cases/or/nodeKindValidateTarget/shacl.ttl
org.eclipse.rdf4j.sail.shacl.ShaclSailValidationException: Failed SHACL validation
test-cases/pattern/multiple/shacl.ttl
test-cases/pattern/multiple/valid/case1/query1.rq
test-cases/pattern/multiple/shacl.ttl
test-cases/pattern/multiple/shacl.ttl
test-cases/pattern/multiple/valid/case1/query1.rq
test-cases/pattern/multiple/shacl.ttl
test-cases/pattern/multiple/shacl.ttl
test-cases/pattern/multiple/valid/case1/query1.rq
test-cases/pattern/multiple/shacl.ttl
test-cases/pattern/multiple/shacl.ttl
test-cases/pattern/multiple/valid/case2/query1.rq
test-cases/pattern/multiple/shacl.ttl
test-cases/pattern/multiple/shacl.ttl
test-cases/pattern/multiple/valid/case2/query1.rq
test-cases/pattern/multiple/shacl.ttl
test-cases/pattern/multiple/shacl.ttl
test-cases/pattern/multiple/valid/case2/query1.rq
test-cases/pattern/multiple/shacl.ttl
test-cases/pattern/multiple/shacl.ttl
org.eclipse.rdf4j.sail.shacl.ShaclSailValidationException: Failed SHACL validation
test-cases/pattern/multiple/invalid/case1/query1.rq
org.eclipse.rdf4j.sail.shacl.ShaclSailValidationException: Failed SHACL validation
test-cases/pattern/multiple/shacl.ttl
org.eclipse.rdf4j.sail.shacl.ShaclSailValidationException: Failed SHACL validation
test-cases/pattern/multiple/shacl.ttl
org.eclipse.rdf4j.sail.shacl.ShaclSailValidationException: Failed SHACL validation
test-cases/pattern/multiple/invalid/case1/query1.rq
org.eclipse.rdf4j.sail.shacl.ShaclSailValidationException: Failed SHACL validation
test-cases/pattern/multiple/shacl.ttl
org.eclipse.rdf4j.sail.shacl.ShaclSailValidationException: Failed SHACL validation
test-cases/pattern/multiple/shacl.ttl
org.eclipse.rdf4j.sail.shacl.ShaclSailValidationException: Failed SHACL validation
test-cases/pattern/multiple/invalid/case1/query1.rq
org.eclipse.rdf4j.sail.shacl.ShaclSailValidationException: Failed SHACL validation
test-cases/pattern/multiple/shacl.ttl
org.eclipse.rdf4j.sail.shacl.ShaclSailValidationException: Failed SHACL validation
test-cases/pattern/multiple/shacl.ttl
org.eclipse.rdf4j.sail.shacl.ShaclSailValidationException: Failed SHACL validation
test-cases/pattern/multiple/invalid/case2/query1.rq
org.eclipse.rdf4j.sail.shacl.ShaclSailValidationException: Failed SHACL validation
test-cases/pattern/multiple/shacl.ttl
org.eclipse.rdf4j.sail.shacl.ShaclSailValidationException: Failed SHACL validation
test-cases/pattern/multiple/shacl.ttl
org.eclipse.rdf4j.sail.shacl.ShaclSailValidationException: Failed SHACL validation
test-cases/pattern/multiple/invalid/case2/query1.rq
org.eclipse.rdf4j.sail.shacl.ShaclSailValidationException: Failed SHACL validation
test-cases/pattern/multiple/shacl.ttl
org.eclipse.rdf4j.sail.shacl.ShaclSailValidationException: Failed SHACL validation
test-cases/pattern/multiple/shacl.ttl
org.eclipse.rdf4j.sail.shacl.ShaclSailValidationException: Failed SHACL validation
test-cases/pattern/multiple/invalid/case2/query1.rq
org.eclipse.rdf4j.sail.shacl.ShaclSailValidationException: Failed SHACL validation
test-cases/pattern/multiple/shacl.ttl
org.eclipse.rdf4j.sail.shacl.ShaclSailValidationException: Failed SHACL validation
test-cases/pattern/simple/shacl.ttl
test-cases/pattern/simple/valid/case1/query1.rq
test-cases/pattern/simple/shacl.ttl
test-cases/pattern/simple/shacl.ttl
test-cases/pattern/simple/valid/case1/query1.rq
test-cases/pattern/simple/shacl.ttl
test-cases/pattern/simple/shacl.ttl
test-cases/pattern/simple/valid/case1/query1.rq
test-cases/pattern/simple/shacl.ttl
test-cases/pattern/simple/shacl.ttl
test-cases/pattern/simple/valid/case2/query1.rq
test-cases/pattern/simple/valid/case2/query2.rq
test-cases/pattern/simple/shacl.ttl
test-cases/pattern/simple/shacl.ttl
test-cases/pattern/simple/valid/case2/query1.rq
test-cases/pattern/simple/valid/case2/query2.rq
test-cases/pattern/simple/shacl.ttl
test-cases/pattern/simple/shacl.ttl
test-cases/pattern/simple/valid/case2/query1.rq
test-cases/pattern/simple/valid/case2/query2.rq
test-cases/pattern/simple/shacl.ttl
test-cases/pattern/simple/shacl.ttl
test-cases/pattern/simple/valid/case3/query1.rq
test-cases/pattern/simple/valid/case3/query2.rq
test-cases/pattern/simple/shacl.ttl
test-cases/pattern/simple/shacl.ttl
test-cases/pattern/simple/valid/case3/query1.rq
test-cases/pattern/simple/valid/case3/query2.rq
test-cases/pattern/simple/shacl.ttl
test-cases/pattern/simple/shacl.ttl
test-cases/pattern/simple/valid/case3/query1.rq
test-cases/pattern/simple/valid/case3/query2.rq
test-cases/pattern/simple/shacl.ttl
test-cases/pattern/simple/shacl.ttl
test-cases/pattern/simple/valid/case4/query1.rq
test-cases/pattern/simple/shacl.ttl
test-cases/pattern/simple/shacl.ttl
test-cases/pattern/simple/valid/case4/query1.rq
test-cases/pattern/simple/shacl.ttl
test-cases/pattern/simple/shacl.ttl
test-cases/pattern/simple/valid/case4/query1.rq
test-cases/pattern/simple/shacl.ttl
test-cases/pattern/simple/shacl.ttl
test-cases/pattern/simple/valid/case5/query1.rq
test-cases/pattern/simple/shacl.ttl
test-cases/pattern/simple/shacl.ttl
test-cases/pattern/simple/valid/case5/query1.rq
test-cases/pattern/simple/shacl.ttl
test-cases/pattern/simple/shacl.ttl
test-cases/pattern/simple/valid/case5/query1.rq
test-cases/pattern/simple/shacl.ttl
test-cases/pattern/simple/shacl.ttl
org.eclipse.rdf4j.sail.shacl.ShaclSailValidationException: Failed SHACL validation
test-cases/pattern/simple/invalid/case1/query1.rq
org.eclipse.rdf4j.sail.shacl.ShaclSailValidationException: Failed SHACL validation
test-cases/pattern/simple/shacl.ttl
org.eclipse.rdf4j.sail.shacl.ShaclSailValidationException: Failed SHACL validation
test-cases/pattern/simple/shacl.ttl
org.eclipse.rdf4j.sail.shacl.ShaclSailValidationException: Failed SHACL validation
test-cases/pattern/simple/invalid/case1/query1.rq
org.eclipse.rdf4j.sail.shacl.ShaclSailValidationException: Failed SHACL validation
test-cases/pattern/simple/shacl.ttl
org.eclipse.rdf4j.sail.shacl.ShaclSailValidationException: Failed SHACL validation
test-cases/pattern/simple/shacl.ttl
org.eclipse.rdf4j.sail.shacl.ShaclSailValidationException: Failed SHACL validation
test-cases/pattern/simple/invalid/case1/query1.rq
org.eclipse.rdf4j.sail.shacl.ShaclSailValidationException: Failed SHACL validation
test-cases/pattern/simple/shacl.ttl
org.eclipse.rdf4j.sail.shacl.ShaclSailValidationException: Failed SHACL validation
test-cases/pattern/simple/shacl.ttl
org.eclipse.rdf4j.sail.shacl.ShaclSailValidationException: Failed SHACL validation
test-cases/pattern/simple/invalid/case2/query1.rq
test-cases/pattern/simple/invalid/case2/query2.rq
org.eclipse.rdf4j.sail.shacl.ShaclSailValidationException: Failed SHACL validation
test-cases/pattern/simple/shacl.ttl
org.eclipse.rdf4j.sail.shacl.ShaclSailValidationException: Failed SHACL validation
test-cases/pattern/simple/shacl.ttl
org.eclipse.rdf4j.sail.shacl.ShaclSailValidationException: Failed SHACL validation
test-cases/pattern/simple/invalid/case2/query1.rq
test-cases/pattern/simple/invalid/case2/query2.rq
org.eclipse.rdf4j.sail.shacl.ShaclSailValidationException: Failed SHACL validation
test-cases/pattern/simple/shacl.ttl
org.eclipse.rdf4j.sail.shacl.ShaclSailValidationException: Failed SHACL validation
test-cases/pattern/simple/shacl.ttl
org.eclipse.rdf4j.sail.shacl.ShaclSailValidationException: Failed SHACL validation
test-cases/pattern/simple/invalid/case2/query1.rq
test-cases/pattern/simple/invalid/case2/query2.rq
org.eclipse.rdf4j.sail.shacl.ShaclSailValidationException: Failed SHACL validation
test-cases/pattern/simple/shacl.ttl
org.eclipse.rdf4j.sail.shacl.ShaclSailValidationException: Failed SHACL validation
test-cases/pattern/simple/shacl.ttl
org.eclipse.rdf4j.sail.shacl.ShaclSailValidationException: Failed SHACL validation
test-cases/pattern/simple/invalid/case3/query1.rq
test-cases/pattern/simple/invalid/case3/query2.rq
org.eclipse.rdf4j.sail.shacl.ShaclSailValidationException: Failed SHACL validation
test-cases/pattern/simple/shacl.ttl
org.eclipse.rdf4j.sail.shacl.ShaclSailValidationException: Failed SHACL validation
test-cases/pattern/simple/shacl.ttl
org.eclipse.rdf4j.sail.shacl.ShaclSailValidationException: Failed SHACL validation
test-cases/pattern/simple/invalid/case3/query1.rq
test-cases/pattern/simple/invalid/case3/query2.rq
org.eclipse.rdf4j.sail.shacl.ShaclSailValidationException: Failed SHACL validation
test-cases/pattern/simple/shacl.ttl
org.eclipse.rdf4j.sail.shacl.ShaclSailValidationException: Failed SHACL validation
test-cases/pattern/simple/shacl.ttl
org.eclipse.rdf4j.sail.shacl.ShaclSailValidationException: Failed SHACL validation
test-cases/pattern/simple/invalid/case3/query1.rq
test-cases/pattern/simple/invalid/case3/query2.rq
org.eclipse.rdf4j.sail.shacl.ShaclSailValidationException: Failed SHACL validation
test-cases/pattern/simple/shacl.ttl
org.eclipse.rdf4j.sail.shacl.ShaclSailValidationException: Failed SHACL validation
test-cases/pattern/simple/shacl.ttl
org.eclipse.rdf4j.sail.shacl.ShaclSailValidationException: Failed SHACL validation
test-cases/pattern/simple/invalid/case4/query1.rq
test-cases/pattern/simple/invalid/case4/query2.rq
org.eclipse.rdf4j.sail.shacl.ShaclSailValidationException: Failed SHACL validation
test-cases/pattern/simple/shacl.ttl
org.eclipse.rdf4j.sail.shacl.ShaclSailValidationException: Failed SHACL validation
test-cases/pattern/simple/shacl.ttl
org.eclipse.rdf4j.sail.shacl.ShaclSailValidationException: Failed SHACL validation
test-cases/pattern/simple/invalid/case4/query1.rq
test-cases/pattern/simple/invalid/case4/query2.rq
org.eclipse.rdf4j.sail.shacl.ShaclSailValidationException: Failed SHACL validation
test-cases/pattern/simple/shacl.ttl
org.eclipse.rdf4j.sail.shacl.ShaclSailValidationException: Failed SHACL validation
test-cases/pattern/simple/shacl.ttl
org.eclipse.rdf4j.sail.shacl.ShaclSailValidationException: Failed SHACL validation
test-cases/pattern/simple/invalid/case4/query1.rq
test-cases/pattern/simple/invalid/case4/query2.rq
org.eclipse.rdf4j.sail.shacl.ShaclSailValidationException: Failed SHACL validation
test-cases/pattern/simple/shacl.ttl
org.eclipse.rdf4j.sail.shacl.ShaclSailValidationException: Failed SHACL validation
test-cases/pattern/simple/shacl.ttl
org.eclipse.rdf4j.sail.shacl.ShaclSailValidationException: Failed SHACL validation
test-cases/pattern/simple/invalid/case5/query1.rq
test-cases/pattern/simple/invalid/case5/query2.rq
org.eclipse.rdf4j.sail.shacl.ShaclSailValidationException: Failed SHACL validation
test-cases/pattern/simple/shacl.ttl
org.eclipse.rdf4j.sail.shacl.ShaclSailValidationException: Failed SHACL validation
test-cases/pattern/simple/shacl.ttl
org.eclipse.rdf4j.sail.shacl.ShaclSailValidationException: Failed SHACL validation
test-cases/pattern/simple/invalid/case5/query1.rq
test-cases/pattern/simple/invalid/case5/query2.rq
org.eclipse.rdf4j.sail.shacl.ShaclSailValidationException: Failed SHACL validation
test-cases/pattern/simple/shacl.ttl
org.eclipse.rdf4j.sail.shacl.ShaclSailValidationException: Failed SHACL validation
test-cases/pattern/simple/shacl.ttl
org.eclipse.rdf4j.sail.shacl.ShaclSailValidationException: Failed SHACL validation
test-cases/pattern/simple/invalid/case5/query1.rq
test-cases/pattern/simple/invalid/case5/query2.rq
org.eclipse.rdf4j.sail.shacl.ShaclSailValidationException: Failed SHACL validation
test-cases/pattern/simple/shacl.ttl
org.eclipse.rdf4j.sail.shacl.ShaclSailValidationException: Failed SHACL validation
test-cases/pattern/simple/shacl.ttl
org.eclipse.rdf4j.sail.shacl.ShaclSailValidationException: Failed SHACL validation
test-cases/pattern/simple/invalid/case6/query1.rq
org.eclipse.rdf4j.sail.shacl.ShaclSailValidationException: Failed SHACL validation
test-cases/pattern/simple/shacl.ttl
org.eclipse.rdf4j.sail.shacl.ShaclSailValidationException: Failed SHACL validation
test-cases/pattern/simple/shacl.ttl
org.eclipse.rdf4j.sail.shacl.ShaclSailValidationException: Failed SHACL validation
test-cases/pattern/simple/invalid/case6/query1.rq
org.eclipse.rdf4j.sail.shacl.ShaclSailValidationException: Failed SHACL validation
test-cases/pattern/simple/shacl.ttl
org.eclipse.rdf4j.sail.shacl.ShaclSailValidationException: Failed SHACL validation
test-cases/pattern/simple/shacl.ttl
org.eclipse.rdf4j.sail.shacl.ShaclSailValidationException: Failed SHACL validation
test-cases/pattern/simple/invalid/case6/query1.rq
org.eclipse.rdf4j.sail.shacl.ShaclSailValidationException: Failed SHACL validation
test-cases/pattern/simple/shacl.ttl
org.eclipse.rdf4j.sail.shacl.ShaclSailValidationException: Failed SHACL validation
test-cases/propertyShapeWithTarget/simple/shacl.ttl
test-cases/propertyShapeWithTarget/simple/valid/case1/query1.rq
test-cases/propertyShapeWithTarget/simple/shacl.ttl
test-cases/propertyShapeWithTarget/simple/shacl.ttl
test-cases/propertyShapeWithTarget/simple/valid/case1/query1.rq
test-cases/propertyShapeWithTarget/simple/shacl.ttl
test-cases/propertyShapeWithTarget/simple/shacl.ttl
test-cases/propertyShapeWithTarget/simple/valid/case1/query1.rq
test-cases/propertyShapeWithTarget/simple/shacl.ttl
test-cases/propertyShapeWithTarget/simple/shacl.ttl
org.eclipse.rdf4j.sail.shacl.ShaclSailValidationException: Failed SHACL validation
test-cases/propertyShapeWithTarget/simple/invalid/case1/query1.rq
org.eclipse.rdf4j.sail.shacl.ShaclSailValidationException: Failed SHACL validation
test-cases/propertyShapeWithTarget/simple/shacl.ttl
org.eclipse.rdf4j.sail.shacl.ShaclSailValidationException: Failed SHACL validation
test-cases/propertyShapeWithTarget/simple/shacl.ttl
org.eclipse.rdf4j.sail.shacl.ShaclSailValidationException: Failed SHACL validation
test-cases/propertyShapeWithTarget/simple/invalid/case1/query1.rq
org.eclipse.rdf4j.sail.shacl.ShaclSailValidationException: Failed SHACL validation
test-cases/propertyShapeWithTarget/simple/shacl.ttl
org.eclipse.rdf4j.sail.shacl.ShaclSailValidationException: Failed SHACL validation
test-cases/propertyShapeWithTarget/simple/shacl.ttl
org.eclipse.rdf4j.sail.shacl.ShaclSailValidationException: Failed SHACL validation
test-cases/propertyShapeWithTarget/simple/invalid/case1/query1.rq
org.eclipse.rdf4j.sail.shacl.ShaclSailValidationException: Failed SHACL validation
test-cases/propertyShapeWithTarget/simple/shacl.ttl
org.eclipse.rdf4j.sail.shacl.ShaclSailValidationException: Failed SHACL validation
test-cases/uniqueLang/not/shacl.ttl
test-cases/uniqueLang/not/valid/case1/query1.rq
test-cases/uniqueLang/not/shacl.ttl
test-cases/uniqueLang/not/shacl.ttl
test-cases/uniqueLang/not/valid/case1/query1.rq
test-cases/uniqueLang/not/shacl.ttl
test-cases/uniqueLang/not/shacl.ttl
test-cases/uniqueLang/not/valid/case1/query1.rq
test-cases/uniqueLang/not/shacl.ttl
test-cases/uniqueLang/not/shacl.ttl
test-cases/uniqueLang/not/valid/case2/query1.rq
test-cases/uniqueLang/not/valid/case2/query2.rq
test-cases/uniqueLang/not/shacl.ttl
test-cases/uniqueLang/not/shacl.ttl
test-cases/uniqueLang/not/valid/case2/query1.rq
test-cases/uniqueLang/not/valid/case2/query2.rq
test-cases/uniqueLang/not/shacl.ttl
test-cases/uniqueLang/not/shacl.ttl
test-cases/uniqueLang/not/valid/case2/query1.rq
test-cases/uniqueLang/not/valid/case2/query2.rq
test-cases/uniqueLang/not/shacl.ttl
test-cases/uniqueLang/not/shacl.ttl
test-cases/uniqueLang/not/valid/case3/query1.rq
test-cases/uniqueLang/not/valid/case3/query2.rq
test-cases/uniqueLang/not/shacl.ttl
test-cases/uniqueLang/not/shacl.ttl
test-cases/uniqueLang/not/valid/case3/query1.rq
test-cases/uniqueLang/not/valid/case3/query2.rq
test-cases/uniqueLang/not/shacl.ttl
test-cases/uniqueLang/not/shacl.ttl
test-cases/uniqueLang/not/valid/case3/query1.rq
test-cases/uniqueLang/not/valid/case3/query2.rq
test-cases/uniqueLang/not/shacl.ttl
test-cases/uniqueLang/not/shacl.ttl
org.eclipse.rdf4j.sail.shacl.ShaclSailValidationException: Failed SHACL validation
test-cases/uniqueLang/not/invalid/case1/query1.rq
org.eclipse.rdf4j.sail.shacl.ShaclSailValidationException: Failed SHACL validation
test-cases/uniqueLang/not/shacl.ttl
org.eclipse.rdf4j.sail.shacl.ShaclSailValidationException: Failed SHACL validation
test-cases/uniqueLang/not/shacl.ttl
org.eclipse.rdf4j.sail.shacl.ShaclSailValidationException: Failed SHACL validation
test-cases/uniqueLang/not/invalid/case1/query1.rq
org.eclipse.rdf4j.sail.shacl.ShaclSailValidationException: Failed SHACL validation
test-cases/uniqueLang/not/shacl.ttl
org.eclipse.rdf4j.sail.shacl.ShaclSailValidationException: Failed SHACL validation
test-cases/uniqueLang/not/shacl.ttl
org.eclipse.rdf4j.sail.shacl.ShaclSailValidationException: Failed SHACL validation
test-cases/uniqueLang/not/invalid/case1/query1.rq
org.eclipse.rdf4j.sail.shacl.ShaclSailValidationException: Failed SHACL validation
test-cases/uniqueLang/not/shacl.ttl
org.eclipse.rdf4j.sail.shacl.ShaclSailValidationException: Failed SHACL validation
test-cases/uniqueLang/not/shacl.ttl
org.eclipse.rdf4j.sail.shacl.ShaclSailValidationException: Failed SHACL validation
org.eclipse.rdf4j.sail.shacl.ShaclSailValidationException: Failed SHACL validation
test-cases/uniqueLang/not/invalid/case2/query1.rq
test-cases/uniqueLang/not/invalid/case2/query2.rq
org.eclipse.rdf4j.sail.shacl.ShaclSailValidationException: Failed SHACL validation
test-cases/uniqueLang/not/shacl.ttl
org.eclipse.rdf4j.sail.shacl.ShaclSailValidationException: Failed SHACL validation
org.eclipse.rdf4j.sail.shacl.ShaclSailValidationException: Failed SHACL validation
test-cases/uniqueLang/not/shacl.ttl
org.eclipse.rdf4j.sail.shacl.ShaclSailValidationException: Failed SHACL validation
test-cases/uniqueLang/not/invalid/case2/query1.rq
test-cases/uniqueLang/not/invalid/case2/query2.rq
org.eclipse.rdf4j.sail.shacl.ShaclSailValidationException: Failed SHACL validation
test-cases/uniqueLang/not/shacl.ttl
org.eclipse.rdf4j.sail.shacl.ShaclSailValidationException: Failed SHACL validation
test-cases/uniqueLang/not/shacl.ttl
org.eclipse.rdf4j.sail.shacl.ShaclSailValidationException: Failed SHACL validation
test-cases/uniqueLang/not/invalid/case2/query1.rq
test-cases/uniqueLang/not/invalid/case2/query2.rq
org.eclipse.rdf4j.sail.shacl.ShaclSailValidationException: Failed SHACL validation
test-cases/uniqueLang/not/shacl.ttl
org.eclipse.rdf4j.sail.shacl.ShaclSailValidationException: Failed SHACL validation
test-cases/uniqueLang/not/shacl.ttl
org.eclipse.rdf4j.sail.shacl.ShaclSailValidationException: Failed SHACL validation
org.eclipse.rdf4j.sail.shacl.ShaclSailValidationException: Failed SHACL validation
test-cases/uniqueLang/not/invalid/case4/query1.rq
test-cases/uniqueLang/not/invalid/case4/query2.rq
org.eclipse.rdf4j.sail.shacl.ShaclSailValidationException: Failed SHACL validation
test-cases/uniqueLang/not/shacl.ttl
org.eclipse.rdf4j.sail.shacl.ShaclSailValidationException: Failed SHACL validation
org.eclipse.rdf4j.sail.shacl.ShaclSailValidationException: Failed SHACL validation
test-cases/uniqueLang/not/shacl.ttl
org.eclipse.rdf4j.sail.shacl.ShaclSailValidationException: Failed SHACL validation
test-cases/uniqueLang/not/invalid/case4/query1.rq
test-cases/uniqueLang/not/invalid/case4/query2.rq
org.eclipse.rdf4j.sail.shacl.ShaclSailValidationException: Failed SHACL validation
test-cases/uniqueLang/not/shacl.ttl
org.eclipse.rdf4j.sail.shacl.ShaclSailValidationException: Failed SHACL validation
test-cases/uniqueLang/not/shacl.ttl
org.eclipse.rdf4j.sail.shacl.ShaclSailValidationException: Failed SHACL validation
test-cases/uniqueLang/not/invalid/case4/query1.rq
test-cases/uniqueLang/not/invalid/case4/query2.rq
org.eclipse.rdf4j.sail.shacl.ShaclSailValidationException: Failed SHACL validation
test-cases/uniqueLang/not/shacl.ttl
org.eclipse.rdf4j.sail.shacl.ShaclSailValidationException: Failed SHACL validation
test-cases/uniqueLang/not/shacl.ttl
org.eclipse.rdf4j.sail.shacl.ShaclSailValidationException: Failed SHACL validation
test-cases/uniqueLang/not/invalid/case5/query1.rq
org.eclipse.rdf4j.sail.shacl.ShaclSailValidationException: Failed SHACL validation
test-cases/uniqueLang/not/shacl.ttl
org.eclipse.rdf4j.sail.shacl.ShaclSailValidationException: Failed SHACL validation
test-cases/uniqueLang/not/shacl.ttl
org.eclipse.rdf4j.sail.shacl.ShaclSailValidationException: Failed SHACL validation
test-cases/uniqueLang/not/invalid/case5/query1.rq
org.eclipse.rdf4j.sail.shacl.ShaclSailValidationException: Failed SHACL validation
test-cases/uniqueLang/not/shacl.ttl
org.eclipse.rdf4j.sail.shacl.ShaclSailValidationException: Failed SHACL validation
test-cases/uniqueLang/not/shacl.ttl
org.eclipse.rdf4j.sail.shacl.ShaclSailValidationException: Failed SHACL validation
test-cases/uniqueLang/not/invalid/case5/query1.rq
org.eclipse.rdf4j.sail.shacl.ShaclSailValidationException: Failed SHACL validation
test-cases/uniqueLang/not/shacl.ttl
org.eclipse.rdf4j.sail.shacl.ShaclSailValidationException: Failed SHACL validation
test-cases/uniqueLang/not/shacl.ttl
org.eclipse.rdf4j.sail.shacl.ShaclSailValidationException: Failed SHACL validation
test-cases/uniqueLang/not/invalid/case6/query1.rq
org.eclipse.rdf4j.sail.shacl.ShaclSailValidationException: Failed SHACL validation
test-cases/uniqueLang/not/shacl.ttl
org.eclipse.rdf4j.sail.shacl.ShaclSailValidationException: Failed SHACL validation
test-cases/uniqueLang/not/shacl.ttl
org.eclipse.rdf4j.sail.shacl.ShaclSailValidationException: Failed SHACL validation
test-cases/uniqueLang/not/invalid/case6/query1.rq
org.eclipse.rdf4j.sail.shacl.ShaclSailValidationException: Failed SHACL validation
test-cases/uniqueLang/not/shacl.ttl
org.eclipse.rdf4j.sail.shacl.ShaclSailValidationException: Failed SHACL validation
test-cases/uniqueLang/not/shacl.ttl
org.eclipse.rdf4j.sail.shacl.ShaclSailValidationException: Failed SHACL validation
test-cases/uniqueLang/not/invalid/case6/query1.rq
org.eclipse.rdf4j.sail.shacl.ShaclSailValidationException: Failed SHACL validation
test-cases/uniqueLang/not/shacl.ttl
org.eclipse.rdf4j.sail.shacl.ShaclSailValidationException: Failed SHACL validation
test-cases/uniqueLang/not/shacl.ttl
org.eclipse.rdf4j.sail.shacl.ShaclSailValidationException: Failed SHACL validation
test-cases/uniqueLang/not/invalid/case7/query1.rq
org.eclipse.rdf4j.sail.shacl.ShaclSailValidationException: Failed SHACL validation
test-cases/uniqueLang/not/shacl.ttl
org.eclipse.rdf4j.sail.shacl.ShaclSailValidationException: Failed SHACL validation
test-cases/uniqueLang/not/shacl.ttl
org.eclipse.rdf4j.sail.shacl.ShaclSailValidationException: Failed SHACL validation
test-cases/uniqueLang/not/invalid/case7/query1.rq
org.eclipse.rdf4j.sail.shacl.ShaclSailValidationException: Failed SHACL validation
test-cases/uniqueLang/not/shacl.ttl
org.eclipse.rdf4j.sail.shacl.ShaclSailValidationException: Failed SHACL validation
test-cases/uniqueLang/not/shacl.ttl
org.eclipse.rdf4j.sail.shacl.ShaclSailValidationException: Failed SHACL validation
test-cases/uniqueLang/not/invalid/case7/query1.rq
org.eclipse.rdf4j.sail.shacl.ShaclSailValidationException: Failed SHACL validation
test-cases/uniqueLang/not/shacl.ttl
org.eclipse.rdf4j.sail.shacl.ShaclSailValidationException: Failed SHACL validation
test-cases/uniqueLang/not/shacl.ttl
org.eclipse.rdf4j.sail.shacl.ShaclSailValidationException: Failed SHACL validation
org.eclipse.rdf4j.sail.shacl.ShaclSailValidationException: Failed SHACL validation
test-cases/uniqueLang/not/invalid/case8/query1.rq
test-cases/uniqueLang/not/invalid/case8/query2.rq
org.eclipse.rdf4j.sail.shacl.ShaclSailValidationException: Failed SHACL validation
test-cases/uniqueLang/not/shacl.ttl
org.eclipse.rdf4j.sail.shacl.ShaclSailValidationException: Failed SHACL validation
org.eclipse.rdf4j.sail.shacl.ShaclSailValidationException: Failed SHACL validation
test-cases/uniqueLang/not/shacl.ttl
org.eclipse.rdf4j.sail.shacl.ShaclSailValidationException: Failed SHACL validation
org.eclipse.rdf4j.sail.shacl.ShaclSailValidationException: Failed SHACL validation
test-cases/uniqueLang/not/invalid/case8/query1.rq
test-cases/uniqueLang/not/invalid/case8/query2.rq
org.eclipse.rdf4j.sail.shacl.ShaclSailValidationException: Failed SHACL validation
test-cases/uniqueLang/not/shacl.ttl
org.eclipse.rdf4j.sail.shacl.ShaclSailValidationException: Failed SHACL validation
org.eclipse.rdf4j.sail.shacl.ShaclSailValidationException: Failed SHACL validation
test-cases/uniqueLang/not/shacl.ttl
org.eclipse.rdf4j.sail.shacl.ShaclSailValidationException: Failed SHACL validation
org.eclipse.rdf4j.sail.shacl.ShaclSailValidationException: Failed SHACL validation
test-cases/uniqueLang/not/invalid/case8/query1.rq
test-cases/uniqueLang/not/invalid/case8/query2.rq
org.eclipse.rdf4j.sail.shacl.ShaclSailValidationException: Failed SHACL validation
test-cases/uniqueLang/not/shacl.ttl
org.eclipse.rdf4j.sail.shacl.ShaclSailValidationException: Failed SHACL validation
org.eclipse.rdf4j.sail.shacl.ShaclSailValidationException: Failed SHACL validation
test-cases/uniqueLang/not/shacl.ttl
org.eclipse.rdf4j.sail.shacl.ShaclSailValidationException: Failed SHACL validation
test-cases/uniqueLang/not/invalid/case9/query1.rq
test-cases/uniqueLang/not/invalid/case9/query2.rq
org.eclipse.rdf4j.sail.shacl.ShaclSailValidationException: Failed SHACL validation
test-cases/uniqueLang/not/shacl.ttl
org.eclipse.rdf4j.sail.shacl.ShaclSailValidationException: Failed SHACL validation
test-cases/uniqueLang/not/shacl.ttl
org.eclipse.rdf4j.sail.shacl.ShaclSailValidationException: Failed SHACL validation
test-cases/uniqueLang/not/invalid/case9/query1.rq
test-cases/uniqueLang/not/invalid/case9/query2.rq
org.eclipse.rdf4j.sail.shacl.ShaclSailValidationException: Failed SHACL validation
test-cases/uniqueLang/not/shacl.ttl
org.eclipse.rdf4j.sail.shacl.ShaclSailValidationException: Failed SHACL validation
test-cases/uniqueLang/not/shacl.ttl
org.eclipse.rdf4j.sail.shacl.ShaclSailValidationException: Failed SHACL validation
test-cases/uniqueLang/not/invalid/case9/query1.rq
test-cases/uniqueLang/not/invalid/case9/query2.rq
org.eclipse.rdf4j.sail.shacl.ShaclSailValidationException: Failed SHACL validation
test-cases/uniqueLang/not/shacl.ttl
org.eclipse.rdf4j.sail.shacl.ShaclSailValidationException: Failed SHACL validation
test-cases/uniqueLang/not/shacl.ttl
org.eclipse.rdf4j.sail.shacl.ShaclSailValidationException: Failed SHACL validation
org.eclipse.rdf4j.sail.shacl.ShaclSailValidationException: Failed SHACL validation
test-cases/uniqueLang/not/invalid/case10/query1.rq
test-cases/uniqueLang/not/invalid/case10/query2.rq
org.eclipse.rdf4j.sail.shacl.ShaclSailValidationException: Failed SHACL validation
test-cases/uniqueLang/not/shacl.ttl
org.eclipse.rdf4j.sail.shacl.ShaclSailValidationException: Failed SHACL validation
org.eclipse.rdf4j.sail.shacl.ShaclSailValidationException: Failed SHACL validation
test-cases/uniqueLang/not/shacl.ttl
org.eclipse.rdf4j.sail.shacl.ShaclSailValidationException: Failed SHACL validation
test-cases/uniqueLang/not/invalid/case10/query1.rq
test-cases/uniqueLang/not/invalid/case10/query2.rq
org.eclipse.rdf4j.sail.shacl.ShaclSailValidationException: Failed SHACL validation
test-cases/uniqueLang/not/shacl.ttl
org.eclipse.rdf4j.sail.shacl.ShaclSailValidationException: Failed SHACL validation
test-cases/uniqueLang/not/shacl.ttl
org.eclipse.rdf4j.sail.shacl.ShaclSailValidationException: Failed SHACL validation
test-cases/uniqueLang/not/invalid/case10/query1.rq
test-cases/uniqueLang/not/invalid/case10/query2.rq
org.eclipse.rdf4j.sail.shacl.ShaclSailValidationException: Failed SHACL validation
test-cases/uniqueLang/not/shacl.ttl
org.eclipse.rdf4j.sail.shacl.ShaclSailValidationException: Failed SHACL validation
test-cases/uniqueLang/simple/shacl.ttl
test-cases/uniqueLang/simple/valid/case1/query1.rq
test-cases/uniqueLang/simple/shacl.ttl
test-cases/uniqueLang/simple/shacl.ttl
test-cases/uniqueLang/simple/valid/case1/query1.rq
test-cases/uniqueLang/simple/shacl.ttl
test-cases/uniqueLang/simple/shacl.ttl
test-cases/uniqueLang/simple/valid/case1/query1.rq
test-cases/uniqueLang/simple/shacl.ttl
test-cases/uniqueLang/simple/shacl.ttl
test-cases/uniqueLang/simple/valid/case2/query1.rq
test-cases/uniqueLang/simple/valid/case2/query2.rq
test-cases/uniqueLang/simple/shacl.ttl
test-cases/uniqueLang/simple/shacl.ttl
test-cases/uniqueLang/simple/valid/case2/query1.rq
test-cases/uniqueLang/simple/valid/case2/query2.rq
test-cases/uniqueLang/simple/shacl.ttl
test-cases/uniqueLang/simple/shacl.ttl
test-cases/uniqueLang/simple/valid/case2/query1.rq
test-cases/uniqueLang/simple/valid/case2/query2.rq
test-cases/uniqueLang/simple/shacl.ttl
test-cases/uniqueLang/simple/shacl.ttl
test-cases/uniqueLang/simple/valid/case4/query1.rq
test-cases/uniqueLang/simple/valid/case4/query2.rq
test-cases/uniqueLang/simple/shacl.ttl
test-cases/uniqueLang/simple/shacl.ttl
test-cases/uniqueLang/simple/valid/case4/query1.rq
test-cases/uniqueLang/simple/valid/case4/query2.rq
test-cases/uniqueLang/simple/shacl.ttl
test-cases/uniqueLang/simple/shacl.ttl
test-cases/uniqueLang/simple/valid/case4/query1.rq
test-cases/uniqueLang/simple/valid/case4/query2.rq
test-cases/uniqueLang/simple/shacl.ttl
test-cases/uniqueLang/simple/shacl.ttl
test-cases/uniqueLang/simple/valid/case5/query1.rq
test-cases/uniqueLang/simple/shacl.ttl
test-cases/uniqueLang/simple/shacl.ttl
test-cases/uniqueLang/simple/valid/case5/query1.rq
test-cases/uniqueLang/simple/shacl.ttl
test-cases/uniqueLang/simple/shacl.ttl
test-cases/uniqueLang/simple/valid/case5/query1.rq
test-cases/uniqueLang/simple/shacl.ttl
test-cases/uniqueLang/simple/shacl.ttl
test-cases/uniqueLang/simple/valid/case6/query1.rq
test-cases/uniqueLang/simple/shacl.ttl
test-cases/uniqueLang/simple/shacl.ttl
test-cases/uniqueLang/simple/valid/case6/query1.rq
test-cases/uniqueLang/simple/shacl.ttl
test-cases/uniqueLang/simple/shacl.ttl
test-cases/uniqueLang/simple/valid/case6/query1.rq
test-cases/uniqueLang/simple/shacl.ttl
test-cases/uniqueLang/simple/shacl.ttl
test-cases/uniqueLang/simple/valid/case7/query1.rq
test-cases/uniqueLang/simple/shacl.ttl
test-cases/uniqueLang/simple/shacl.ttl
test-cases/uniqueLang/simple/valid/case7/query1.rq
test-cases/uniqueLang/simple/shacl.ttl
test-cases/uniqueLang/simple/shacl.ttl
test-cases/uniqueLang/simple/valid/case7/query1.rq
test-cases/uniqueLang/simple/shacl.ttl
test-cases/uniqueLang/simple/shacl.ttl
org.eclipse.rdf4j.sail.shacl.ShaclSailValidationException: Failed SHACL validation
test-cases/uniqueLang/simple/invalid/case1/query1.rq
org.eclipse.rdf4j.sail.shacl.ShaclSailValidationException: Failed SHACL validation
test-cases/uniqueLang/simple/shacl.ttl
org.eclipse.rdf4j.sail.shacl.ShaclSailValidationException: Failed SHACL validation
test-cases/uniqueLang/simple/shacl.ttl
org.eclipse.rdf4j.sail.shacl.ShaclSailValidationException: Failed SHACL validation
test-cases/uniqueLang/simple/invalid/case1/query1.rq
org.eclipse.rdf4j.sail.shacl.ShaclSailValidationException: Failed SHACL validation
test-cases/uniqueLang/simple/shacl.ttl
org.eclipse.rdf4j.sail.shacl.ShaclSailValidationException: Failed SHACL validation
test-cases/uniqueLang/simple/shacl.ttl
org.eclipse.rdf4j.sail.shacl.ShaclSailValidationException: Failed SHACL validation
test-cases/uniqueLang/simple/invalid/case1/query1.rq
org.eclipse.rdf4j.sail.shacl.ShaclSailValidationException: Failed SHACL validation
test-cases/uniqueLang/simple/shacl.ttl
org.eclipse.rdf4j.sail.shacl.ShaclSailValidationException: Failed SHACL validation
test-cases/uniqueLang/simple/shacl.ttl
org.eclipse.rdf4j.sail.shacl.ShaclSailValidationException: Failed SHACL validation
test-cases/uniqueLang/simple/invalid/case2/query1.rq
test-cases/uniqueLang/simple/invalid/case2/query2.rq
org.eclipse.rdf4j.sail.shacl.ShaclSailValidationException: Failed SHACL validation
test-cases/uniqueLang/simple/shacl.ttl
org.eclipse.rdf4j.sail.shacl.ShaclSailValidationException: Failed SHACL validation
test-cases/uniqueLang/simple/shacl.ttl
org.eclipse.rdf4j.sail.shacl.ShaclSailValidationException: Failed SHACL validation
test-cases/uniqueLang/simple/invalid/case2/query1.rq
test-cases/uniqueLang/simple/invalid/case2/query2.rq
org.eclipse.rdf4j.sail.shacl.ShaclSailValidationException: Failed SHACL validation
test-cases/uniqueLang/simple/shacl.ttl
org.eclipse.rdf4j.sail.shacl.ShaclSailValidationException: Failed SHACL validation
test-cases/uniqueLang/simple/shacl.ttl
org.eclipse.rdf4j.sail.shacl.ShaclSailValidationException: Failed SHACL validation
test-cases/uniqueLang/simple/invalid/case2/query1.rq
test-cases/uniqueLang/simple/invalid/case2/query2.rq
org.eclipse.rdf4j.sail.shacl.ShaclSailValidationException: Failed SHACL validation
test-cases/uniqueLang/simple/shacl.ttl
org.eclipse.rdf4j.sail.shacl.ShaclSailValidationException: Failed SHACL validation
test-cases/uniqueLang/simple/shacl.ttl
org.eclipse.rdf4j.sail.shacl.ShaclSailValidationException: Failed SHACL validation
test-cases/uniqueLang/simple/invalid/case3/query1.rq
test-cases/uniqueLang/simple/invalid/case3/query2.rq
org.eclipse.rdf4j.sail.shacl.ShaclSailValidationException: Failed SHACL validation
test-cases/uniqueLang/simple/shacl.ttl
org.eclipse.rdf4j.sail.shacl.ShaclSailValidationException: Failed SHACL validation
test-cases/uniqueLang/simple/shacl.ttl
org.eclipse.rdf4j.sail.shacl.ShaclSailValidationException: Failed SHACL validation
test-cases/uniqueLang/simple/invalid/case3/query1.rq
test-cases/uniqueLang/simple/invalid/case3/query2.rq
org.eclipse.rdf4j.sail.shacl.ShaclSailValidationException: Failed SHACL validation
test-cases/uniqueLang/simple/shacl.ttl
org.eclipse.rdf4j.sail.shacl.ShaclSailValidationException: Failed SHACL validation
test-cases/uniqueLang/simple/shacl.ttl
org.eclipse.rdf4j.sail.shacl.ShaclSailValidationException: Failed SHACL validation
test-cases/uniqueLang/simple/invalid/case3/query1.rq
test-cases/uniqueLang/simple/invalid/case3/query2.rq
org.eclipse.rdf4j.sail.shacl.ShaclSailValidationException: Failed SHACL validation
test-cases/uniqueLang/simple/shacl.ttl
org.eclipse.rdf4j.sail.shacl.ShaclSailValidationException: Failed SHACL validation
test-cases/uniqueLang/simple/shacl.ttl
org.eclipse.rdf4j.sail.shacl.ShaclSailValidationException: Failed SHACL validation
test-cases/uniqueLang/simple/invalid/case4/query1.rq
test-cases/uniqueLang/simple/invalid/case4/query2.rq
org.eclipse.rdf4j.sail.shacl.ShaclSailValidationException: Failed SHACL validation
test-cases/uniqueLang/simple/shacl.ttl
org.eclipse.rdf4j.sail.shacl.ShaclSailValidationException: Failed SHACL validation
test-cases/uniqueLang/simple/shacl.ttl
org.eclipse.rdf4j.sail.shacl.ShaclSailValidationException: Failed SHACL validation
test-cases/uniqueLang/simple/invalid/case4/query1.rq
test-cases/uniqueLang/simple/invalid/case4/query2.rq
org.eclipse.rdf4j.sail.shacl.ShaclSailValidationException: Failed SHACL validation
test-cases/uniqueLang/simple/shacl.ttl
org.eclipse.rdf4j.sail.shacl.ShaclSailValidationException: Failed SHACL validation
test-cases/uniqueLang/simple/shacl.ttl
org.eclipse.rdf4j.sail.shacl.ShaclSailValidationException: Failed SHACL validation
test-cases/uniqueLang/simple/invalid/case4/query1.rq
test-cases/uniqueLang/simple/invalid/case4/query2.rq
org.eclipse.rdf4j.sail.shacl.ShaclSailValidationException: Failed SHACL validation
test-cases/uniqueLang/simple/shacl.ttl
org.eclipse.rdf4j.sail.shacl.ShaclSailValidationException: Failed SHACL validation
[INFO] Tests run: 6300, Failures: 0, Errors: 0, Skipped: 0, Time elapsed: 67.114 s - in org.eclipse.rdf4j.sail.shacl.ShaclTest
[INFO] Running org.eclipse.rdf4j.sail.shacl.LeftOuterJoinTest
Tuple{line=["a1", "b1"], propertyShapes= }
Tuple{line=["a2", "b2"], propertyShapes= }
Tuple{line=["a2", "b22"], propertyShapes= }
Tuple{line=["a3"], propertyShapes= }
Tuple{line=["a4", "b4"], propertyShapes= }
Tuple{line=["a1"], propertyShapes= }
Tuple{line=["a2", "b2"], propertyShapes= }
Tuple{line=["a2", "b22"], propertyShapes= }
Tuple{line=["a3"], propertyShapes= }
Tuple{line=["a4", "b4"], propertyShapes= }
Tuple{line=["a1"], propertyShapes= }
Tuple{line=["a2", "b2"], propertyShapes= }
Tuple{line=["a2", "b22"], propertyShapes= }
Tuple{line=["a3"], propertyShapes= }
Tuple{line=["a4"], propertyShapes= }
Tuple{line=["a1", "b1"], propertyShapes= }
Tuple{line=["a1", "b11"], propertyShapes= }
Tuple{line=["a2", "b2"], propertyShapes= }
Tuple{line=["a2", "b22"], propertyShapes= }
Tuple{line=["a3"], propertyShapes= }
Tuple{line=["a4"], propertyShapes= }
Tuple{line=["a1", "b"], propertyShapes= }
Tuple{line=["a2"], propertyShapes= }
Tuple{line=["a1"], propertyShapes= }
Tuple{line=["a2", "b"], propertyShapes= }
Tuple{line=["a1"], propertyShapes= }
Tuple{line=["a2"], propertyShapes= }
Tuple{line=["a1", "b1"], propertyShapes= }
Tuple{line=["a2", "b2"], propertyShapes= }
Tuple{line=["a3", "b3"], propertyShapes= }
Tuple{line=["a4", "b4"], propertyShapes= }
Tuple{line=["a1", "b1"], propertyShapes= }
Tuple{line=["a2", "b2"], propertyShapes= }
Tuple{line=["a1", "b1"], propertyShapes= }
Tuple{line=["a2", "b2"], propertyShapes= }
Tuple{line=["a3", "b3"], propertyShapes= }
Tuple{line=["a1", "b1"], propertyShapes= }
Tuple{line=["a2", "b2"], propertyShapes= }
Tuple{line=["a2", "b22"], propertyShapes= }
Tuple{line=["a3", "b3"], propertyShapes= }
Tuple{line=["a4", "b4"], propertyShapes= }
Tuple{line=["a", "b"], propertyShapes= }
[INFO] Tests run: 13, Failures: 0, Errors: 0, Skipped: 0, Time elapsed: 0 s - in org.eclipse.rdf4j.sail.shacl.LeftOuterJoinTest
[INFO] Running org.eclipse.rdf4j.sail.shacl.TempTest












































[WARNING] Tests run: 9, Failures: 0, Errors: 0, Skipped: 1, Time elapsed: 0 s - in org.eclipse.rdf4j.sail.shacl.TempTest
[INFO] Running org.eclipse.rdf4j.sail.shacl.UnknownShapesTest
04:20:32.017 [main] WARN  Unsupported SHACL feature with complex path. Only single predicate paths are supported. <http://example.com/ns#PersonPropertyShape> shape has been deactivated! 
@prefix sh: <http://www.w3.org/ns/shacl#> .

<http://example.com/ns#PersonPropertyShape> sh:path [
      sh:inversePath <http://example.com/ns#inverseThis>
    ] .

04:20:32.018 [main] WARN  Unsupported SHACL feature with complex path. Only single predicate paths are supported. <http://example.com/ns#PersonPropertyShape2> shape has been deactivated! 
@prefix sh: <http://www.w3.org/ns/shacl#> .

<http://example.com/ns#path> sh:inversePath <http://example.com/ns#inverseThis> .

<http://example.com/ns#PersonPropertyShape2> sh:path <http://example.com/ns#path> .

04:20:32.019 [main] WARN  Unsupported SHACL feature with complex path. Only single predicate paths are supported. <http://example.com/ns#PersonPropertyShape3> shape has been deactivated! 
@prefix sh: <http://www.w3.org/ns/shacl#> .

<http://example.com/ns#pathList> <http://www.w3.org/1999/02/22-rdf-syntax-ns#first>
    "one";
  <http://www.w3.org/1999/02/22-rdf-syntax-ns#rest> <http://www.w3.org/1999/02/22-rdf-syntax-ns#nil> .

<http://example.com/ns#PersonPropertyShape3> sh:path <http://example.com/ns#pathList> .

04:20:32.024 [main] WARN  Unsupported SHACL feature detected sh:unknownTarget in statement (http://example.com/ns#PersonShape, http://www.w3.org/ns/shacl#unknownTarget, http://www.w3.org/2000/01/rdf-schema#Class) [null]
04:20:32.024 [main] WARN  Unsupported SHACL feature detected sh:unknownShaclProperty in statement (http://example.com/ns#PersonPropertyShape, http://www.w3.org/ns/shacl#unknownShaclProperty, "1"^^<http://www.w3.org/2001/XMLSchema#integer>) [null]
04:20:32.024 [main] WARN  Unsupported SHACL feature detected sh:unknownTarget in statement (http://example.com/ns#PersonShape, http://www.w3.org/ns/shacl#unknownTarget, http://www.w3.org/2000/01/rdf-schema#Class) [null]
[INFO] Tests run: 2, Failures: 0, Errors: 0, Skipped: 0, Time elapsed: 0 s - in org.eclipse.rdf4j.sail.shacl.UnknownShapesTest
[INFO] Running org.eclipse.rdf4j.sail.shacl.DeadlockTest
04:20:32.154 [pool-18318-thread-1] ERROR ShaclSail was garbage collected without shutdown() having been called first.
04:20:32.166 [pool-18322-thread-1] ERROR ShaclSail was garbage collected without shutdown() having been called first.
04:20:32.172 [pool-18324-thread-1] ERROR ShaclSail was garbage collected without shutdown() having been called first.
04:20:32.178 [pool-18327-thread-1] ERROR ShaclSail was garbage collected without shutdown() having been called first.
04:20:32.183 [pool-18330-thread-1] ERROR ShaclSail was garbage collected without shutdown() having been called first.
04:20:32.188 [pool-18333-thread-1] ERROR ShaclSail was garbage collected without shutdown() having been called first.
04:20:32.194 [pool-18336-thread-1] ERROR ShaclSail was garbage collected without shutdown() having been called first.
04:20:32.200 [pool-18339-thread-1] ERROR ShaclSail was garbage collected without shutdown() having been called first.
04:20:32.207 [pool-18342-thread-1] ERROR ShaclSail was garbage collected without shutdown() having been called first.
04:20:32.222 [pool-18343-thread-1] ERROR ShaclSail was garbage collected without shutdown() having been called first.
[INFO] Tests run: 1, Failures: 0, Errors: 0, Skipped: 0, Time elapsed: 3.32 s - in org.eclipse.rdf4j.sail.shacl.DeadlockTest
[INFO] Running org.eclipse.rdf4j.sail.shacl.ShaclConcurrencyTest
04:20:35.440 [main] INFO  executing two large concurrent transactions
04:20:36.163 [pool-18410-thread-1] ERROR ShaclSail was garbage collected without shutdown() having been called first.
04:20:36.163 [pool-18377-thread-1] ERROR ShaclSail was garbage collected without shutdown() having been called first.
04:20:36.163 [pool-18641-thread-1] ERROR ShaclSail was garbage collected without shutdown() having been called first.
04:20:36.164 [pool-18608-thread-1] ERROR ShaclSail was garbage collected without shutdown() having been called first.
04:20:36.164 [pool-18542-thread-1] ERROR ShaclSail was garbage collected without shutdown() having been called first.
04:20:36.164 [pool-18443-thread-1] ERROR ShaclSail was garbage collected without shutdown() having been called first.
04:20:36.164 [pool-18344-thread-1] ERROR ShaclSail was garbage collected without shutdown() having been called first.
04:20:36.164 [pool-18575-thread-1] ERROR ShaclSail was garbage collected without shutdown() having been called first.
04:20:36.265 [pool-18476-thread-1] ERROR ShaclSail was garbage collected without shutdown() having been called first.
04:20:36.265 [pool-18509-thread-1] ERROR ShaclSail was garbage collected without shutdown() having been called first.
04:20:37.090 [Thread-72] INFO  Uploaded 200000 statements
04:20:37.131 [Thread-73] INFO  Uploaded 200000 statements
04:20:38.758 [main] INFO  committed both txns in 3s
[WARNING] Tests run: 3, Failures: 0, Errors: 0, Skipped: 2, Time elapsed: 3.388 s - in org.eclipse.rdf4j.sail.shacl.ShaclConcurrencyTest
[INFO] Running org.eclipse.rdf4j.sail.shacl.SortPlanNodeTest
[INFO] Tests run: 1, Failures: 0, Errors: 0, Skipped: 0, Time elapsed: 0 s - in org.eclipse.rdf4j.sail.shacl.SortPlanNodeTest
[INFO] Running org.eclipse.rdf4j.sail.shacl.ShaclRepositoryConnectionTest
04:20:38.918 [Time-limited test] WARN  [Rio error] Illegal language tag char: '_' (6, -1)
04:20:38.926 [Time-limited test] WARN  [Rio error] Illegal language tag char: '_' (6, -1)
04:20:39.181 [Time-limited test] WARN  [Rio error] Illegal language tag char: '_' (6, -1)
04:20:39.185 [Time-limited test] WARN  [Rio error] Illegal language tag char: '_' (6, -1)
04:20:39.324 [Time-limited test] WARN  [Rio error] Illegal language tag char: '_' (6, -1)
04:20:39.327 [Time-limited test] WARN  [Rio error] Illegal language tag char: '_' (6, -1)
04:20:39.452 [Time-limited test] WARN  [Rio error] Illegal language tag char: '_' (6, -1)
04:20:39.455 [Time-limited test] WARN  [Rio error] Illegal language tag char: '_' (6, -1)
04:20:39.581 [Time-limited test] WARN  [Rio error] Illegal language tag char: '_' (6, -1)
04:20:39.584 [Time-limited test] WARN  [Rio error] Illegal language tag char: '_' (6, -1)
04:20:39.690 [Time-limited test] WARN  [Rio error] Illegal language tag char: '_' (6, -1)
04:20:39.693 [Time-limited test] WARN  [Rio error] Illegal language tag char: '_' (6, -1)
[INFO] Tests run: 420, Failures: 0, Errors: 0, Skipped: 0, Time elapsed: 0.965 s - in org.eclipse.rdf4j.sail.shacl.ShaclRepositoryConnectionTest
[INFO] Running org.eclipse.rdf4j.sail.shacl.ShaclIsolationLevelTest
[INFO] Tests run: 6, Failures: 0, Errors: 0, Skipped: 0, Time elapsed: 0.243 s - in org.eclipse.rdf4j.sail.shacl.ShaclIsolationLevelTest
[INFO] Running org.eclipse.rdf4j.sail.shacl.TrackAddedStatementsTest
(http://www.w3.org/2000/01/rdf-schema#Resource, http://www.w3.org/1999/02/22-rdf-syntax-ns#type, http://www.w3.org/2000/01/rdf-schema#Resource) [null]
(http://www.w3.org/2000/01/rdf-schema#Resource, http://www.w3.org/1999/02/22-rdf-syntax-ns#type, http://www.w3.org/2000/01/rdf-schema#Resource) [null]
(http://www.w3.org/2000/01/rdf-schema#Resource, http://www.w3.org/1999/02/22-rdf-syntax-ns#type, http://www.w3.org/2000/01/rdf-schema#Resource) [null]
1
org.eclipse.rdf4j.sail.shacl.ShaclSailValidationException: Failed SHACL validation
(http://www.w3.org/2000/01/rdf-schema#Resource, http://www.w3.org/1999/02/22-rdf-syntax-ns#type, http://www.w3.org/2000/01/rdf-schema#Resource) [null]
(http://www.w3.org/2000/01/rdf-schema#Resource, http://www.w3.org/1999/02/22-rdf-syntax-ns#type, http://www.w3.org/2000/01/rdf-schema#Resource) [null]
0
(http://www.w3.org/2000/01/rdf-schema#Resource, http://www.w3.org/1999/02/22-rdf-syntax-ns#type, http://www.w3.org/2000/01/rdf-schema#Resource) [null]
[INFO] Tests run: 13, Failures: 0, Errors: 0, Skipped: 0, Time elapsed: 0.033 s - in org.eclipse.rdf4j.sail.shacl.TrackAddedStatementsTest
[INFO] Running org.eclipse.rdf4j.sail.shacl.TestPlanNodeOrdering
[INFO] Tests run: 1, Failures: 0, Errors: 0, Skipped: 0, Time elapsed: 0 s - in org.eclipse.rdf4j.sail.shacl.TestPlanNodeOrdering
[INFO] Running org.eclipse.rdf4j.sail.shacl.ShaclSailSupportedPredicatesDocumentationTest
04:20:40.543 [pool-19107-thread-1] ERROR ShaclSail was garbage collected without shutdown() having been called first.
04:20:40.547 [pool-19108-thread-1] ERROR ShaclSail was garbage collected without shutdown() having been called first.
04:20:40.551 [pool-19109-thread-1] ERROR ShaclSail was garbage collected without shutdown() having been called first.
04:20:40.554 [pool-19110-thread-1] ERROR ShaclSail was garbage collected without shutdown() having been called first.
04:20:40.556 [pool-19111-thread-1] ERROR ShaclSail was garbage collected without shutdown() having been called first.
04:20:40.561 [pool-19113-thread-1] ERROR ShaclSail was garbage collected without shutdown() having been called first.
04:20:40.563 [pool-19114-thread-1] ERROR ShaclSail was garbage collected without shutdown() having been called first.
04:20:40.565 [pool-19115-thread-1] ERROR ShaclSail was garbage collected without shutdown() having been called first.
04:20:40.568 [pool-19117-thread-1] ERROR ShaclSail was garbage collected without shutdown() having been called first.
04:20:40.569 [pool-19118-thread-1] ERROR ShaclSail was garbage collected without shutdown() having been called first.
04:20:40.571 [pool-19119-thread-1] ERROR ShaclSail was garbage collected without shutdown() having been called first.
04:20:40.573 [pool-19120-thread-1] ERROR ShaclSail was garbage collected without shutdown() having been called first.
04:20:40.576 [pool-19121-thread-1] ERROR ShaclSail was garbage collected without shutdown() having been called first.
[INFO] Tests run: 1575, Failures: 0, Errors: 0, Skipped: 0, Time elapsed: 0.697 s - in org.eclipse.rdf4j.sail.shacl.ShaclSailSupportedPredicatesDocumentationTest
[INFO] Running org.eclipse.rdf4j.sail.shacl.BulkedExternalInnerJoinTest
Tuple{line=[http://b, http://www.w3.org/2000/01/rdf-schema#Resource], propertyShapes= }
Tuple{line=[http://d, http://www.w3.org/2000/01/rdf-schema#subPropertyOf], propertyShapes= }
[INFO] Tests run: 1, Failures: 0, Errors: 0, Skipped: 0, Time elapsed: 0.001 s - in org.eclipse.rdf4j.sail.shacl.BulkedExternalInnerJoinTest
[INFO] Running org.eclipse.rdf4j.sail.shacl.ReduceNumberOfPlansTest
[INFO] Tests run: 2, Failures: 0, Errors: 0, Skipped: 0, Time elapsed: 0 s - in org.eclipse.rdf4j.sail.shacl.ReduceNumberOfPlansTest
[INFO] Running org.eclipse.rdf4j.sail.shacl.InnerJoinTest
Tuple{line=["a1", "b1"], propertyShapes= }
Tuple{line=["a2", "b2"], propertyShapes= }
Tuple{line=["a2", "b22"], propertyShapes= }
Tuple{line=["a4", "b4"], propertyShapes= }
Tuple{line=["a2", "b2"], propertyShapes= }
Tuple{line=["a2", "b22"], propertyShapes= }
Tuple{line=["a4", "b4"], propertyShapes= }
Tuple{line=["a2", "b2"], propertyShapes= }
Tuple{line=["a2", "b22"], propertyShapes= }
Tuple{line=["a1", "b1"], propertyShapes= }
Tuple{line=["a1", "b11"], propertyShapes= }
Tuple{line=["a2", "b2"], propertyShapes= }
Tuple{line=["a2", "b22"], propertyShapes= }
Tuple{line=["a1", "b"], propertyShapes= }
Tuple{line=["a2", "b"], propertyShapes= }
Tuple{line=["a1", "b1"], propertyShapes= }
Tuple{line=["a2", "b2"], propertyShapes= }
Tuple{line=["a3", "b3"], propertyShapes= }
Tuple{line=["a4", "b4"], propertyShapes= }
Tuple{line=["a1", "b1"], propertyShapes= }
Tuple{line=["a2", "b2"], propertyShapes= }
Tuple{line=["a1", "b1"], propertyShapes= }
Tuple{line=["a2", "b2"], propertyShapes= }
Tuple{line=["a3", "b3"], propertyShapes= }
Tuple{line=["a1", "b1"], propertyShapes= }
Tuple{line=["a2", "b2"], propertyShapes= }
Tuple{line=["a2", "b22"], propertyShapes= }
Tuple{line=["a3", "b3"], propertyShapes= }
Tuple{line=["a4", "b4"], propertyShapes= }
Tuple{line=["a", "b"], propertyShapes= }
[INFO] Tests run: 13, Failures: 0, Errors: 0, Skipped: 0, Time elapsed: 0 s - in org.eclipse.rdf4j.sail.shacl.InnerJoinTest
[INFO] Running org.eclipse.rdf4j.sail.shacl.PrepareCommitTest
04:20:40.834 [main] WARN  Cannot rollback transaction on connection because transaction is not active
java.lang.Throwable: null
	at org.eclipse.rdf4j.sail.helpers.AbstractSailConnection.rollback(AbstractSailConnection.java:426)
	at org.eclipse.rdf4j.sail.shacl.ShaclSailConnection.rollback(ShaclSailConnection.java:242)
	at org.eclipse.rdf4j.sail.shacl.PrepareCommitTest.testPrepareAfterRollback(PrepareCommitTest.java:93)
	at java.base/jdk.internal.reflect.NativeMethodAccessorImpl.invoke0(Native Method)
	at java.base/jdk.internal.reflect.NativeMethodAccessorImpl.invoke(NativeMethodAccessorImpl.java:62)
	at java.base/jdk.internal.reflect.DelegatingMethodAccessorImpl.invoke(DelegatingMethodAccessorImpl.java:43)
	at java.base/java.lang.reflect.Method.invoke(Method.java:566)
	at org.junit.runners.model.FrameworkMethod$1.runReflectiveCall(FrameworkMethod.java:50)
	at org.junit.internal.runners.model.ReflectiveCallable.run(ReflectiveCallable.java:12)
	at org.junit.runners.model.FrameworkMethod.invokeExplosively(FrameworkMethod.java:47)
	at org.junit.internal.runners.statements.InvokeMethod.evaluate(InvokeMethod.java:17)
	at org.junit.runners.ParentRunner.runLeaf(ParentRunner.java:325)
	at org.junit.runners.BlockJUnit4ClassRunner.runChild(BlockJUnit4ClassRunner.java:78)
	at org.junit.runners.BlockJUnit4ClassRunner.runChild(BlockJUnit4ClassRunner.java:57)
	at org.junit.runners.ParentRunner$3.run(ParentRunner.java:290)
	at org.junit.runners.ParentRunner$1.schedule(ParentRunner.java:71)
	at org.junit.runners.ParentRunner.runChildren(ParentRunner.java:288)
	at org.junit.runners.ParentRunner.access$000(ParentRunner.java:58)
	at org.junit.runners.ParentRunner$2.evaluate(ParentRunner.java:268)
	at org.junit.runners.ParentRunner.run(ParentRunner.java:363)
	at org.apache.maven.surefire.junit4.JUnit4Provider.execute(JUnit4Provider.java:365)
	at org.apache.maven.surefire.junit4.JUnit4Provider.executeWithRerun(JUnit4Provider.java:273)
	at org.apache.maven.surefire.junit4.JUnit4Provider.executeTestSet(JUnit4Provider.java:238)
	at org.apache.maven.surefire.junit4.JUnit4Provider.invoke(JUnit4Provider.java:159)
	at org.apache.maven.surefire.booter.ForkedBooter.invokeProviderInSameClassLoader(ForkedBooter.java:384)
	at org.apache.maven.surefire.booter.ForkedBooter.runSuitesInProcess(ForkedBooter.java:345)
	at org.apache.maven.surefire.booter.ForkedBooter.execute(ForkedBooter.java:126)
	at org.apache.maven.surefire.booter.ForkedBooter.main(ForkedBooter.java:418)
04:20:40.834 [main] WARN  Cannot rollback transaction on connection because transaction is not active
java.lang.Throwable: null
	at org.eclipse.rdf4j.sail.helpers.AbstractSailConnection.rollback(AbstractSailConnection.java:426)
	at org.eclipse.rdf4j.repository.sail.SailRepositoryConnection.rollback(SailRepositoryConnection.java:167)
	at org.eclipse.rdf4j.sail.shacl.ShaclSailConnection.rollback(ShaclSailConnection.java:243)
	at org.eclipse.rdf4j.sail.shacl.PrepareCommitTest.testPrepareAfterRollback(PrepareCommitTest.java:93)
	at java.base/jdk.internal.reflect.NativeMethodAccessorImpl.invoke0(Native Method)
	at java.base/jdk.internal.reflect.NativeMethodAccessorImpl.invoke(NativeMethodAccessorImpl.java:62)
	at java.base/jdk.internal.reflect.DelegatingMethodAccessorImpl.invoke(DelegatingMethodAccessorImpl.java:43)
	at java.base/java.lang.reflect.Method.invoke(Method.java:566)
	at org.junit.runners.model.FrameworkMethod$1.runReflectiveCall(FrameworkMethod.java:50)
	at org.junit.internal.runners.model.ReflectiveCallable.run(ReflectiveCallable.java:12)
	at org.junit.runners.model.FrameworkMethod.invokeExplosively(FrameworkMethod.java:47)
	at org.junit.internal.runners.statements.InvokeMethod.evaluate(InvokeMethod.java:17)
	at org.junit.runners.ParentRunner.runLeaf(ParentRunner.java:325)
	at org.junit.runners.BlockJUnit4ClassRunner.runChild(BlockJUnit4ClassRunner.java:78)
	at org.junit.runners.BlockJUnit4ClassRunner.runChild(BlockJUnit4ClassRunner.java:57)
	at org.junit.runners.ParentRunner$3.run(ParentRunner.java:290)
	at org.junit.runners.ParentRunner$1.schedule(ParentRunner.java:71)
	at org.junit.runners.ParentRunner.runChildren(ParentRunner.java:288)
	at org.junit.runners.ParentRunner.access$000(ParentRunner.java:58)
	at org.junit.runners.ParentRunner$2.evaluate(ParentRunner.java:268)
	at org.junit.runners.ParentRunner.run(ParentRunner.java:363)
	at org.apache.maven.surefire.junit4.JUnit4Provider.execute(JUnit4Provider.java:365)
	at org.apache.maven.surefire.junit4.JUnit4Provider.executeWithRerun(JUnit4Provider.java:273)
	at org.apache.maven.surefire.junit4.JUnit4Provider.executeTestSet(JUnit4Provider.java:238)
	at org.apache.maven.surefire.junit4.JUnit4Provider.invoke(JUnit4Provider.java:159)
	at org.apache.maven.surefire.booter.ForkedBooter.invokeProviderInSameClassLoader(ForkedBooter.java:384)
	at org.apache.maven.surefire.booter.ForkedBooter.runSuitesInProcess(ForkedBooter.java:345)
	at org.apache.maven.surefire.booter.ForkedBooter.execute(ForkedBooter.java:126)
	at org.apache.maven.surefire.booter.ForkedBooter.main(ForkedBooter.java:418)
04:20:40.835 [main] WARN  Cannot rollback transaction on connection because transaction is not active
java.lang.Throwable: null
	at org.eclipse.rdf4j.sail.helpers.AbstractSailConnection.rollback(AbstractSailConnection.java:426)
	at org.eclipse.rdf4j.sail.helpers.SailConnectionWrapper.rollback(SailConnectionWrapper.java:123)
	at org.eclipse.rdf4j.sail.shacl.ShaclSailConnection.rollback(ShaclSailConnection.java:244)
	at org.eclipse.rdf4j.sail.shacl.PrepareCommitTest.testPrepareAfterRollback(PrepareCommitTest.java:93)
	at java.base/jdk.internal.reflect.NativeMethodAccessorImpl.invoke0(Native Method)
	at java.base/jdk.internal.reflect.NativeMethodAccessorImpl.invoke(NativeMethodAccessorImpl.java:62)
	at java.base/jdk.internal.reflect.DelegatingMethodAccessorImpl.invoke(DelegatingMethodAccessorImpl.java:43)
	at java.base/java.lang.reflect.Method.invoke(Method.java:566)
	at org.junit.runners.model.FrameworkMethod$1.runReflectiveCall(FrameworkMethod.java:50)
	at org.junit.internal.runners.model.ReflectiveCallable.run(ReflectiveCallable.java:12)
	at org.junit.runners.model.FrameworkMethod.invokeExplosively(FrameworkMethod.java:47)
	at org.junit.internal.runners.statements.InvokeMethod.evaluate(InvokeMethod.java:17)
	at org.junit.runners.ParentRunner.runLeaf(ParentRunner.java:325)
	at org.junit.runners.BlockJUnit4ClassRunner.runChild(BlockJUnit4ClassRunner.java:78)
	at org.junit.runners.BlockJUnit4ClassRunner.runChild(BlockJUnit4ClassRunner.java:57)
	at org.junit.runners.ParentRunner$3.run(ParentRunner.java:290)
	at org.junit.runners.ParentRunner$1.schedule(ParentRunner.java:71)
	at org.junit.runners.ParentRunner.runChildren(ParentRunner.java:288)
	at org.junit.runners.ParentRunner.access$000(ParentRunner.java:58)
	at org.junit.runners.ParentRunner$2.evaluate(ParentRunner.java:268)
	at org.junit.runners.ParentRunner.run(ParentRunner.java:363)
	at org.apache.maven.surefire.junit4.JUnit4Provider.execute(JUnit4Provider.java:365)
	at org.apache.maven.surefire.junit4.JUnit4Provider.executeWithRerun(JUnit4Provider.java:273)
	at org.apache.maven.surefire.junit4.JUnit4Provider.executeTestSet(JUnit4Provider.java:238)
	at org.apache.maven.surefire.junit4.JUnit4Provider.invoke(JUnit4Provider.java:159)
	at org.apache.maven.surefire.booter.ForkedBooter.invokeProviderInSameClassLoader(ForkedBooter.java:384)
	at org.apache.maven.surefire.booter.ForkedBooter.runSuitesInProcess(ForkedBooter.java:345)
	at org.apache.maven.surefire.booter.ForkedBooter.execute(ForkedBooter.java:126)
	at org.apache.maven.surefire.booter.ForkedBooter.main(ForkedBooter.java:418)
[INFO] Tests run: 7, Failures: 0, Errors: 0, Skipped: 0, Time elapsed: 0.027 s - in org.eclipse.rdf4j.sail.shacl.PrepareCommitTest
[INFO] Running org.eclipse.rdf4j.sail.shacl.ShutdownTest
0
04:20:41.101 [pool-19125-thread-1] ERROR ShaclSail was garbage collected without shutdown() having been called first.
1
04:20:41.201 [pool-19139-thread-1] ERROR ShaclSail was garbage collected without shutdown() having been called first.
04:20:41.261 [pool-19122-thread-1] ERROR ShaclSail was garbage collected without shutdown() having been called first.
04:20:41.261 [pool-19131-thread-1] ERROR ShaclSail was garbage collected without shutdown() having been called first.
04:20:41.758 [main] ERROR Shutdown ShaclSail while validation is still running.
04:20:42.162 [main] ERROR Shutdown ShaclSail while validation is still running.
04:20:42.565 [main] ERROR Shutdown ShaclSail while validation is still running.
04:20:42.968 [main] ERROR Shutdown ShaclSail while validation is still running.
[INFO] Tests run: 3, Failures: 0, Errors: 0, Skipped: 0, Time elapsed: 2.232 s - in org.eclipse.rdf4j.sail.shacl.ShutdownTest
[INFO] Running org.eclipse.rdf4j.sail.shacl.EqualsJoinTest
[Tuple{line=["a"], propertyShapes= }]
[Tuple{line=["a"], propertyShapes= }, Tuple{line=["c"], propertyShapes= }]
[Tuple{line=["a"], propertyShapes= }, Tuple{line=["c"], propertyShapes= }]
[]
[Tuple{line=["c"], propertyShapes= }]
[Tuple{line=["a", "1"], propertyShapes= }, Tuple{line=["b", "1"], propertyShapes= }, Tuple{line=["b", "1"], propertyShapes= }, Tuple{line=["c", "1"], propertyShapes= }]
[INFO] Tests run: 6, Failures: 0, Errors: 0, Skipped: 0, Time elapsed: 0.003 s - in org.eclipse.rdf4j.sail.shacl.EqualsJoinTest
[INFO] Running org.eclipse.rdf4j.sail.shacl.UniqueTest
[INFO] Tests run: 3, Failures: 0, Errors: 0, Skipped: 0, Time elapsed: 0 s - in org.eclipse.rdf4j.sail.shacl.UniqueTest
[INFO] Running org.eclipse.rdf4j.sail.shacl.ShaclRepositoryTest
[INFO] Tests run: 2, Failures: 0, Errors: 0, Skipped: 0, Time elapsed: 0 s - in org.eclipse.rdf4j.sail.shacl.ShaclRepositoryTest
[INFO] 
[INFO] Results:
[INFO] 
[WARNING] Tests run: 8527, Failures: 0, Errors: 0, Skipped: 102
[INFO] 
[JENKINS] Recording test results
[INFO] 
[INFO] --- animal-sniffer-maven-plugin:1.16:check (default) @ rdf4j-shacl ---
[INFO] Checking unresolved references to org.codehaus.mojo.signature:java18:1.0
[INFO] 
[INFO] --- maven-jar-plugin:2.3.1:jar (default-jar) @ rdf4j-shacl ---
[INFO] Building jar: /home/hudson/genie.rdf4j/.jenkins/jobs/rdf4j-develop-verify/workspace/core/sail/shacl/target/rdf4j-shacl-3.1.0-SNAPSHOT.jar