SuccessConsole Output

[INFO] 
[INFO] --------------< org.eclipse.rdf4j:rdf4j-lucene-testsuite >--------------
[INFO] Building RDF4J Lucene Sail Tests 3.4.0                          [88/103]
[INFO] --------------------------------[ jar ]---------------------------------
[INFO] 
[INFO] --- buildnumber-maven-plugin:1.4:create (default) @ rdf4j-lucene-testsuite ---
[INFO] ShortRevision tag detected. The value is '7'.
[INFO] Executing: /bin/sh -c cd '/home/jenkins/agent/workspace/rdf4j-deploy-release-sdk/testsuites/lucene' && 'git' 'rev-parse' '--verify' '--short=7' 'HEAD'
[INFO] Working directory: /home/jenkins/agent/workspace/rdf4j-deploy-release-sdk/testsuites/lucene
[INFO] Storing buildNumber: ace0473 at timestamp: 1598318678057
[WARNING] Cannot get the branch information from the git repository: 
Detecting the current branch failed: fatal: ref HEAD is not a symbolic ref

[INFO] ShortRevision tag detected. The value is '7'.
[INFO] Executing: /bin/sh -c cd '/home/jenkins/agent/workspace/rdf4j-deploy-release-sdk/testsuites/lucene' && 'git' 'rev-parse' '--verify' '--short=7' 'HEAD'
[INFO] Working directory: /home/jenkins/agent/workspace/rdf4j-deploy-release-sdk/testsuites/lucene
[INFO] Storing buildScmBranch: UNKNOWN
[INFO] 
[INFO] --- formatter-maven-plugin:2.12.0:format (default) @ rdf4j-lucene-testsuite ---
[INFO] Using 'UTF-8' encoding to format source files.
[INFO] Number of files to be formatted: 3
[INFO] Successfully formatted:          0 file(s)
[INFO] Fail to format:                  0 file(s)
[INFO] Skipped:                         3 file(s)
[INFO] Read only skipped:               0 file(s)
[INFO] Approximate time taken:          0s
[INFO] 
[INFO] --- impsort-maven-plugin:1.3.2:sort (default) @ rdf4j-lucene-testsuite ---
[INFO]  Total Files Processed: 3 in 00:00.020
[INFO]         Already Sorted: 3
[INFO]         Needed Sorting: 0
[INFO] 
[INFO] --- maven-resources-plugin:3.0.2:resources (default-resources) @ rdf4j-lucene-testsuite ---
[INFO] Using 'UTF-8' encoding to copy filtered resources.
[INFO] Copying 1 resource
[INFO] 
[INFO] --- xml-format-maven-plugin:3.1.2:xml-format (default) @ rdf4j-lucene-testsuite ---
[INFO] 
[INFO] --- maven-compiler-plugin:3.7.0:compile (default-compile) @ rdf4j-lucene-testsuite ---
[INFO] Nothing to compile - all classes are up to date
[INFO] 
[INFO] --- maven-resources-plugin:3.0.2:testResources (default-testResources) @ rdf4j-lucene-testsuite ---
[INFO] Using 'UTF-8' encoding to copy filtered resources.
[INFO] skip non existing resourceDirectory /home/jenkins/agent/workspace/rdf4j-deploy-release-sdk/testsuites/lucene/src/test/resources
[INFO] 
[INFO] --- maven-compiler-plugin:3.7.0:testCompile (default-testCompile) @ rdf4j-lucene-testsuite ---
[INFO] No sources to compile
[INFO] 
[INFO] --- maven-surefire-plugin:2.22.2:test (default-test) @ rdf4j-lucene-testsuite ---
[INFO] Tests are skipped.
[INFO] 
[INFO] --- animal-sniffer-maven-plugin:1.16:check (default) @ rdf4j-lucene-testsuite ---
[INFO] Checking unresolved references to org.codehaus.mojo.signature:java18:1.0
[INFO] 
[INFO] --- maven-jar-plugin:2.3.1:jar (default-jar) @ rdf4j-lucene-testsuite ---
[INFO] 
[INFO] --- maven-source-plugin:2.4:jar-no-fork (attach-sources) @ rdf4j-lucene-testsuite ---
[INFO] Building jar: /home/jenkins/agent/workspace/rdf4j-deploy-release-sdk/testsuites/lucene/target/rdf4j-lucene-testsuite-3.4.0-sources.jar
[INFO] ------------------------------------------------------------------------
[INFO] Reactor Summary for Eclipse RDF4J 3.4.0:
[INFO] 
[INFO] Eclipse RDF4J ...................................... SUCCESS [01:05 min]
[INFO] RDF4J Assembly Descriptors ......................... SUCCESS [  1.167 s]
[INFO] RDF4J Core ......................................... SUCCESS [  0.725 s]
[INFO] RDF4J: util ........................................ SUCCESS [  6.136 s]
[INFO] RDF4J: Model ....................................... SUCCESS [  3.144 s]
[INFO] RDF4J: SparqlBuilder ............................... SUCCESS [  2.144 s]
[INFO] RDF4J: Rio ......................................... SUCCESS [  0.550 s]
[INFO] RDF4J: Rio - API ................................... SUCCESS [  2.421 s]
[INFO] RDF4J: Rio - Languages ............................. SUCCESS [  1.539 s]
[INFO] RDF4J: Rio - Datatypes ............................. SUCCESS [  1.391 s]
[INFO] RDF4J: Query ....................................... SUCCESS [  1.157 s]
[INFO] RDF4J: Rio - Binary ................................ SUCCESS [  1.519 s]
[INFO] RDF4J: Rio - N-Triples ............................. SUCCESS [  1.687 s]
[INFO] RDF4J: Rio - HDT ................................... SUCCESS [  1.790 s]
[INFO] RDF4J: Rio - JSON-LD ............................... SUCCESS [  1.686 s]
[INFO] RDF4J: Rio - Turtle ................................ SUCCESS [  2.689 s]
[INFO] RDF4J: Rio - N3 (writer-only) ...................... SUCCESS [  1.352 s]
[INFO] RDF4J: Rio - N-Quads ............................... SUCCESS [  1.445 s]
[INFO] RDF4J: Rio - RDF/JSON .............................. SUCCESS [  1.559 s]
[INFO] RDF4J: Rio - RDF/XML ............................... SUCCESS [  1.847 s]
[INFO] RDF4J: Rio - TriX .................................. SUCCESS [  1.530 s]
[INFO] RDF4J: Rio - TriG .................................. SUCCESS [  1.505 s]
[INFO] RDF4J: Query result IO ............................. SUCCESS [  0.549 s]
[INFO] RDF4J: Query result IO - API ....................... SUCCESS [  1.129 s]
[INFO] RDF4J : Test Suites ................................ SUCCESS [  0.634 s]
[INFO] RDF4J: QueryResultIO testsuite ..................... SUCCESS [  1.158 s]
[INFO] RDF4J: Query result IO - binary .................... SUCCESS [  1.047 s]
[INFO] RDF4J: Query result IO - SPARQL/JSON ............... SUCCESS [  1.125 s]
[INFO] RDF4J: Query result IO - SPARQL/XML ................ SUCCESS [  0.987 s]
[INFO] RDF4J: Query result IO - plain text booleans ....... SUCCESS [  1.170 s]
[INFO] RDF4J: Query algebra ............................... SUCCESS [  0.608 s]
[INFO] RDF4J: Query algebra - model ....................... SUCCESS [  2.677 s]
[INFO] RDF4J: Query parser ................................ SUCCESS [  0.610 s]
[INFO] RDF4J: Query parser - API .......................... SUCCESS [  1.064 s]
[INFO] RDF4J: Query parser - SeRQL ........................ SUCCESS [  2.715 s]
[INFO] RDF4J: Sail ........................................ SUCCESS [  0.708 s]
[INFO] RDF4J: Sail API .................................... SUCCESS [  1.921 s]
[INFO] RDF4J: Repository .................................. SUCCESS [  0.531 s]
[INFO] RDF4J: Repository - API ............................ SUCCESS [  2.020 s]
[INFO] RDF4J: HTTP ........................................ SUCCESS [  0.543 s]
[INFO] RDF4J: HTTP protocol ............................... SUCCESS [  1.063 s]
[INFO] RDF4J: HTTP client ................................. SUCCESS [  1.148 s]
[INFO] RDF4J: Query parser - SPARQL ....................... SUCCESS [  7.018 s]
[INFO] RDF4J: SPARQL Repository ........................... SUCCESS [  2.007 s]
[INFO] RDF4J: Query algebra - evaluation .................. SUCCESS [  6.310 s]
[INFO] RDF4J: Repository API testsuite .................... SUCCESS [  1.311 s]
[INFO] RDF4J: SailRepository .............................. SUCCESS [  2.015 s]
[INFO] RDF4J: Repository - event (wrapper) ................ SUCCESS [  1.713 s]
[INFO] RDF4J: HTTPRepository .............................. SUCCESS [  1.776 s]
[INFO] RDF4J: Repository manager .......................... SUCCESS [  1.832 s]
[INFO] RDF4J: Sail base implementations ................... SUCCESS [  2.075 s]
[INFO] RDF4J: Sail API testsuite .......................... SUCCESS [  1.129 s]
[INFO] RDF4J: MemoryStore ................................. SUCCESS [  5.189 s]
[INFO] RDF4J: Query algebra - GeoSPARQL ................... SUCCESS [  1.189 s]
[INFO] RDF4J: Query Rendering ............................. SUCCESS [  2.286 s]
[INFO] RDF4J: DatasetRepository (wrapper) ................. SUCCESS [  1.612 s]
[INFO] RDF4J: Repository - context aware (wrapper) ........ SUCCESS [  1.673 s]
[INFO] RDF4J: Model API testsuite ......................... SUCCESS [  1.068 s]
[INFO] RDF4J: Sail Model .................................. SUCCESS [  1.055 s]
[INFO] RDF4J: NativeStore ................................. SUCCESS [  5.452 s]
[INFO] RDF4J: Inferencer Sails ............................ SUCCESS [  2.241 s]
[INFO] RDF4J: Federation SAIL ............................. SUCCESS [  1.176 s]
[INFO] RDF4J: SPIN ........................................ SUCCESS [  2.946 s]
[INFO] RDF4J: SPIN SAIL ................................... SUCCESS [  4.253 s]
[INFO] RDF4J: SHACL ....................................... SUCCESS [  6.726 s]
[INFO] RDF4J Lucene Sail API .............................. SUCCESS [  2.281 s]
[INFO] RDF4J Lucene Sail Index ............................ SUCCESS [  1.323 s]
[INFO] RDF4J Lucene Sail Spin ............................. SUCCESS [  1.255 s]
[INFO] RDF4J Solr Sail Index .............................. SUCCESS [  2.316 s]
[INFO] RDF4J Elastic Search Sail Index .................... SUCCESS [  2.428 s]
[INFO] RDF4J Extensible Store ............................. SUCCESS [  6.361 s]
[INFO] RDF4J Elasticsearch Store .......................... SUCCESS [  2.883 s]
[INFO] RDF4J: Client Libraries ............................ SUCCESS [  0.783 s]
[INFO] RDF4J: Storage Libraries ........................... SUCCESS [  1.119 s]
[INFO] RDF4J Tools ........................................ SUCCESS [  0.641 s]
[INFO] RDF4J: application configuration ................... SUCCESS [  0.948 s]
[INFO] RDF4J: Console ..................................... SUCCESS [  2.662 s]
[INFO] RDF4J: HTTP server - core .......................... SUCCESS [  1.753 s]
[INFO] RDF4J SPARQL compliance test suite ................. SUCCESS [  2.034 s]
[INFO] RDF4J: Federation .................................. SUCCESS [  1.754 s]
[INFO] RDF4J: HTTP server ................................. SUCCESS [  3.038 s]
[INFO] RDF4J Workbench .................................... SUCCESS [  2.772 s]
[INFO] RDF4J: Runtime ..................................... SUCCESS [  1.156 s]
[INFO] RDF4J: Runtime - OSGi .............................. SUCCESS [ 11.656 s]
[INFO] RDF4J Rio compliance test suite .................... SUCCESS [  2.673 s]
[INFO] RDF4J SeRQL test suite ............................. SUCCESS [  1.116 s]
[INFO] RDF4J SHACL compliance test suite .................. SUCCESS [  1.131 s]
[INFO] RDF4J Lucene Sail Tests ............................ SUCCESS [  1.198 s]
[INFO] RDF4J GeoSPARQL compliance test suite .............. SUCCESS [  1.094 s]
[INFO] RDF4J: benchmarks .................................. SUCCESS [  3.388 s]
[INFO] RDF4J Compliance tests ............................. SUCCESS [  0.637 s]
[INFO] RDF4J Repository compliance tests .................. SUCCESS [  3.749 s]
[INFO] RDF4J Rio compliance tests ......................... SUCCESS [  1.411 s]
[INFO] RDF4J Model compliance tests ....................... SUCCESS [  0.973 s]
[INFO] RDF4J SeRQL query parser compliance tests .......... SUCCESS [  1.162 s]
[INFO] RDF4J SPARQL query parser compliance tests ......... SUCCESS [  2.999 s]
[INFO] RDF4J SHACL compliance tests ....................... SUCCESS [  1.092 s]
[INFO] RDF4J Lucene Sail Tests ............................ SUCCESS [  0.969 s]
[INFO] RDF4J Solr Sail Tests .............................. SUCCESS [  1.182 s]
[INFO] RDF4J Elasticsearch Sail Tests ..................... SUCCESS [  1.027 s]
[INFO] RDF4J GeoSPARQL compliance tests ................... SUCCESS [  1.185 s]
[INFO] RDF4J BOM .......................................... SUCCESS [  0.577 s]
[INFO] RDF4J: Assembly .................................... FAILURE [  3.760 s]
[INFO] ------------------------------------------------------------------------
[INFO] BUILD FAILURE
[INFO] ------------------------------------------------------------------------
[INFO] Total time:  05:40 min
[INFO] Finished at: 2020-08-25T01:25:23Z
[INFO] ------------------------------------------------------------------------
Waiting for Jenkins to finish collecting data
[ERROR] Failed to execute goal org.apache.maven.plugins:maven-assembly-plugin:3.3.0:single (create-sdk) on project rdf4j-assembly: Execution create-sdk of goal org.apache.maven.plugins:maven-assembly-plugin:3.3.0:single failed: group id '1001930000' is too big ( > 2097151 ). Use STAR or POSIX extensions to overcome this limit -> [Help 1]
[ERROR] 
[ERROR] To see the full stack trace of the errors, re-run Maven with the -e switch.
[ERROR] Re-run Maven using the -X switch to enable full debug logging.
[ERROR] 
[ERROR] For more information about the errors and possible solutions, please read the following articles:
[ERROR] [Help 1] http://cwiki.apache.org/confluence/display/MAVEN/PluginExecutionException
[ERROR] 
[ERROR] After correcting the problems, you can resume the build with the command
[ERROR]   mvn <goals> -rf :rdf4j-assembly