UnstableConsole Output

10:07:00 Started by timer
10:07:00 Building in workspace /home/hudson/genie.rcptt/.jenkins/jobs/EclipsePlatform/workspace
10:07:00  > /usr/local/bin/git rev-parse --is-inside-work-tree # timeout=10
10:07:00 Fetching changes from the remote Git repository
10:07:00  > /usr/local/bin/git config remote.origin.url https://github.com/eclipse-testing/eclipse-platform.git # timeout=10
10:07:00 Fetching upstream changes from https://github.com/eclipse-testing/eclipse-platform.git
10:07:00  > /usr/local/bin/git --version # timeout=10
10:07:00  > /usr/local/bin/git fetch --tags --progress https://github.com/eclipse-testing/eclipse-platform.git +refs/heads/*:refs/remotes/origin/*
10:07:00  > /usr/local/bin/git rev-parse origin/master^{commit} # timeout=10
10:07:00 Checking out Revision b9b440d025b3d0f60066d0c8a49426f4be62fec2 (origin/master)
10:07:00  > /usr/local/bin/git config core.sparsecheckout # timeout=10
10:07:00  > /usr/local/bin/git checkout -f b9b440d025b3d0f60066d0c8a49426f4be62fec2
10:07:00 Commit message: "Update RCPTT to 2.3 to support Eclipse 4.8"
10:07:00  > /usr/local/bin/git rev-list --no-walk b9b440d025b3d0f60066d0c8a49426f4be62fec2 # timeout=10
10:07:00 Starting xvnc
10:07:00 [workspace] $ Xvnc :844 -geometry 1024x768 -depth 24 -ac -SecurityTypes none -noreset
10:07:00 [workspace] $ /bin/sh -xe /tmp/genie.rcptt/jenkins4539190468293636548.sh
10:07:00 + echo Metacity: 20848
10:07:00 Metacity: 20848
10:07:00 + cd /home/hudson/genie.rcptt/.jenkins/jobs/EclipsePlatform/workspace
10:07:00 + /usr/bin/metacity --replace --sm-disable
10:07:00 + cp /home/hudson/genie.rcptt/.jenkins/jobs/EclipsePlatform/workspace/pom.xml /home/hudson/genie.rcptt/.jenkins/jobs/EclipsePlatform/workspace/pom_old.xml
10:07:00 
10:07:00 Xvnc TigerVNC 1.4.3 - built ??? ?? ???? ??:??:??
10:07:00 Copyright (C) 1999-2015 TigerVNC Team and many others (see README.txt)
10:07:00 See http://www.tigervnc.org for information on TigerVNC.
10:07:00 Underlying X server release 11502000, The X.Org Foundation
10:07:00 
10:07:00 Initializing built-in extension VNC-EXTENSION
10:07:00 Initializing built-in extension Generic Event Extension
10:07:00 Initializing built-in extension SHAPE
10:07:00 Initializing built-in extension MIT-SHM
10:07:00 Initializing built-in extension XInputExtension
10:07:00 Initializing built-in extension XTEST
10:07:00 Initializing built-in extension BIG-REQUESTS
10:07:00 Initializing built-in extension SYNC
10:07:00 Initializing built-in extension XKEYBOARD
10:07:00 Initializing built-in extension XC-MISC
10:07:00 Initializing built-in extension XFIXES
10:07:00 Initializing built-in extension RENDER
10:07:00 Initializing built-in extension RANDR
10:07:00 Initializing built-in extension COMPOSITE
10:07:00 Initializing built-in extension DAMAGE
10:07:00 Initializing built-in extension MIT-SCREEN-SAVER
10:07:00 Initializing built-in extension DOUBLE-BUFFER
10:07:00 Initializing built-in extension RECORD
10:07:00 Initializing built-in extension DPMS
10:07:00 Initializing built-in extension Present
10:07:00 Initializing built-in extension X-Resource
10:07:00 Initializing built-in extension XVideo
10:07:00 Initializing built-in extension XVideo-MotionCompensation
10:07:00 Initializing built-in extension GLX
10:07:00 
10:07:00 Mon Feb 19 10:07:00 2018
10:07:00  vncext:      VNC extension running!
10:07:00  vncext:      Listening for VNC connections on all interface(s), port 6744
10:07:00  vncext:      created VNC server for screen 0
10:07:00 + bash /home/hudson/genie.rcptt/.jenkins/jobs/EclipsePlatform/workspace/update-build.sh INTEGRATION
10:07:00 [dix] Could not init font path element /usr/share/fonts/TTF/, removing from list!
10:07:00 [dix] Could not init font path element /usr/share/fonts/OTF/, removing from list!
10:07:00 LATEST=[I20171225-2000]
10:07:00 CURRENT=[I20170822-2000]
10:07:00 + /shared/common/apache-maven-latest/bin/mvn clean verify -B -f /home/hudson/genie.rcptt/.jenkins/jobs/EclipsePlatform/workspace/pom.xml
10:07:00 Picked up JAVA_TOOL_OPTIONS: -Xmx2G -Djava.io.tmpdir=/tmp/genie.rcptt
10:07:03 [INFO] Scanning for projects...
10:07:03 [INFO] Downloading from rcptt-releases: https://repo.eclipse.org/content/repositories/rcptt-releases/org/eclipse/rcptt/rcptt-maven-plugin/2.3.0-SNAPSHOT/maven-metadata.xml
10:07:03 [INFO] Downloading from rcptt-snapshots: https://repo.eclipse.org/content/repositories/rcptt-snapshots/org/eclipse/rcptt/rcptt-maven-plugin/2.3.0-SNAPSHOT/maven-metadata.xml
10:07:04 [INFO] Downloaded from rcptt-snapshots: https://repo.eclipse.org/content/repositories/rcptt-snapshots/org/eclipse/rcptt/rcptt-maven-plugin/2.3.0-SNAPSHOT/maven-metadata.xml (791 B at 1.2 kB/s)
10:07:04 [INFO] Downloading from rcptt-snapshots: https://repo.eclipse.org/content/repositories/rcptt-snapshots/org/eclipse/rcptt/rcptt-maven-modules/2.3.0-SNAPSHOT/maven-metadata.xml
10:07:04 [INFO] Downloading from rcptt-releases: https://repo.eclipse.org/content/repositories/rcptt-releases/org/eclipse/rcptt/rcptt-maven-modules/2.3.0-SNAPSHOT/maven-metadata.xml
10:07:04 [INFO] Downloaded from rcptt-snapshots: https://repo.eclipse.org/content/repositories/rcptt-snapshots/org/eclipse/rcptt/rcptt-maven-modules/2.3.0-SNAPSHOT/maven-metadata.xml (617 B at 16 kB/s)
10:07:04 [INFO] Downloading from rcptt-releases: https://repo.eclipse.org/content/repositories/rcptt-releases/org/eclipse/rcptt/rcptt-maven-util/2.3.0-SNAPSHOT/maven-metadata.xml
10:07:04 [INFO] Downloading from rcptt-snapshots: https://repo.eclipse.org/content/repositories/rcptt-snapshots/org/eclipse/rcptt/rcptt-maven-util/2.3.0-SNAPSHOT/maven-metadata.xml
10:07:04 [INFO] Downloaded from rcptt-snapshots: https://repo.eclipse.org/content/repositories/rcptt-snapshots/org/eclipse/rcptt/rcptt-maven-util/2.3.0-SNAPSHOT/maven-metadata.xml (789 B at 12 kB/s)
10:07:05 [INFO] 
10:07:05 [INFO] ------------------------------------------------------------------------
10:07:05 [INFO] Building e4.platform.tests.runner 1.0.0-SNAPSHOT
10:07:05 [INFO] ------------------------------------------------------------------------
10:07:05 [INFO] Downloading from rcptt-releases: https://repo.eclipse.org/content/repositories/rcptt-releases/org/apache/maven/plugins/maven-install-plugin/maven-metadata.xml
10:07:05 [INFO] Downloading from rcptt-snapshots: https://repo.eclipse.org/content/repositories/rcptt-snapshots/org/apache/maven/plugins/maven-install-plugin/maven-metadata.xml
10:07:05 [INFO] Downloading from rcptt-releases: https://repo.eclipse.org/content/repositories/rcptt-releases/org/apache/maven/plugins/maven-deploy-plugin/maven-metadata.xml
10:07:05 [INFO] Downloading from rcptt-snapshots: https://repo.eclipse.org/content/repositories/rcptt-snapshots/org/apache/maven/plugins/maven-deploy-plugin/maven-metadata.xml
10:07:05 [INFO] 
10:07:05 [INFO] --- maven-clean-plugin:2.5:clean (default-clean) @ e4.platform.tests.runner ---
10:07:05 [INFO] Deleting /home/hudson/genie.rcptt/.jenkins/jobs/EclipsePlatform/workspace/target
10:07:09 [INFO] 
10:07:09 [INFO] --- rcptt-maven-plugin:2.3.0-SNAPSHOT:resources (default-resources) @ e4.platform.tests.runner ---
10:07:09 [INFO] Downloading artifact from http://download.eclipse.org/eclipse/downloads/drops4/I20171225-2000/eclipse-platform-I20171225-2000-linux-gtk-x86_64.tar.gz...
10:07:09 [INFO] Downloading from rcptt-releases: https://repo.eclipse.org/content/repositories/rcptt-releases/org/eclipse/rcptt/runner/rcptt.runner/2.3.0-SNAPSHOT/
10:07:09 [INFO] Downloading from rcptt-snapshots: https://repo.eclipse.org/content/repositories/rcptt-snapshots/org/eclipse/rcptt/runner/rcptt.runner/2.3.0-SNAPSHOT/
10:07:10 [WARNING] Could not validate integrity of download from https://repo.eclipse.org/content/repositories/rcptt-snapshots/org/eclipse/rcptt/runner/rcptt.runner/2.3.0-SNAPSHOT/: Checksum validation failed, no checksums available
10:07:10 [WARNING] Checksum validation failed, no checksums available from rcptt-snapshots for https://repo.eclipse.org/content/repositories/rcptt-snapshots/org/eclipse/rcptt/runner/rcptt.runner/2.3.0-SNAPSHOT/
10:07:10 [INFO] Downloaded from rcptt-snapshots: https://repo.eclipse.org/content/repositories/rcptt-snapshots/org/eclipse/rcptt/runner/rcptt.runner/2.3.0-SNAPSHOT/ (89 kB at 170 kB/s)
10:07:10 [INFO] Resolving artifact org.eclipse.rcptt.runner:rcptt.runner:zip:2.3.0-SNAPSHOT, this may take a while ...
10:07:10 [INFO] Downloading from rcptt-snapshots: https://repo.eclipse.org/content/repositories/rcptt-snapshots/org/eclipse/rcptt/runner/rcptt.runner/2.3.0-SNAPSHOT/maven-metadata.xml
10:07:10 [INFO] Downloading from rcptt-releases: https://repo.eclipse.org/content/repositories/rcptt-releases/org/eclipse/rcptt/runner/rcptt.runner/2.3.0-SNAPSHOT/maven-metadata.xml
10:07:10 [INFO] Downloaded from rcptt-snapshots: https://repo.eclipse.org/content/repositories/rcptt-snapshots/org/eclipse/rcptt/runner/rcptt.runner/2.3.0-SNAPSHOT/maven-metadata.xml (792 B at 17 kB/s)
10:07:10 [INFO] Downloading from rcptt-snapshots: https://repo.eclipse.org/content/repositories/rcptt-snapshots/org/eclipse/rcptt/runner/rcptt.runner/2.3.0-SNAPSHOT/rcptt.runner-2.3.0-20180219.004919-257.zip
10:07:17 [INFO] Downloaded from rcptt-snapshots: https://repo.eclipse.org/content/repositories/rcptt-snapshots/org/eclipse/rcptt/runner/rcptt.runner/2.3.0-SNAPSHOT/rcptt.runner-2.3.0-20180219.004919-257.zip (156 MB at 24 MB/s)
10:07:19 [INFO] Artifact org.eclipse.rcptt.runner:rcptt.runner:zip:2.3.0-SNAPSHOT is resolved to /opt/public/hipp/homes/genie.rcptt/.m2/repository/org/eclipse/rcptt/runner/rcptt.runner/2.3.0-SNAPSHOT/rcptt.runner-2.3.0-SNAPSHOT.zip
10:07:19 [INFO] Extracting AUT to /home/hudson/genie.rcptt/.jenkins/jobs/EclipsePlatform/workspace/target/aut
10:07:19 [INFO] Expanding: /home/hudson/genie.rcptt/.jenkins/jobs/EclipsePlatform/workspace/target/eclipse-platform-I20171225-2000-linux-gtk-x86_64.tar.gz into /home/hudson/genie.rcptt/.jenkins/jobs/EclipsePlatform/workspace/target/aut
10:07:22 [INFO] Extracting RCPTT runner to /home/hudson/genie.rcptt/.jenkins/jobs/EclipsePlatform/workspace/target/runner
10:07:25 [INFO] Copying project contents to target directory...
10:07:26 [INFO] 
10:07:26 [INFO] --- rcptt-maven-plugin:2.3.0-SNAPSHOT:execute (default-execute) @ e4.platform.tests.runner ---
10:07:26 [INFO] Runner command line is /bin/sh -c cd /home/hudson/genie.rcptt/.jenkins/jobs/EclipsePlatform/workspace/target/runner/eclipse && /opt/public/common/java/oracle/jdk1.8.0_162_x64/jre/bin/java -Xms128m -Xmx256m -Dorg.eclipse.rcptt.runner.returnTestFailure=true -jar /home/hudson/genie.rcptt/.jenkins/jobs/EclipsePlatform/workspace/target/runner/eclipse/plugins/org.eclipse.equinox.launcher_1.4.0.v20161219-1356.jar -application org.eclipse.rcptt.runner.headless -runnerPlatform swt -data /home/hudson/genie.rcptt/.jenkins/jobs/EclipsePlatform/workspace/target/runner-workspace -aut /home/hudson/genie.rcptt/.jenkins/jobs/EclipsePlatform/workspace/target/aut/eclipse -autWsPrefix /home/hudson/genie.rcptt/.jenkins/jobs/EclipsePlatform/workspace/target/aut-ws- -autConsolePrefix /home/hudson/genie.rcptt/.jenkins/jobs/EclipsePlatform/workspace/target/results/aut-console- -q7report /home/hudson/genie.rcptt/.jenkins/jobs/EclipsePlatform/workspace/target/results/e4.platform.tests.runner.report -htmlReport /home/hudson/genie.rcptt/.jenkins/jobs/EclipsePlatform/workspace/target/results/e4.platform.tests.runner.html -junitReport /home/hudson/genie.rcptt/.jenkins/jobs/EclipsePlatform/workspace/target/surefire-reports/TEST-e4.platform.tests.runner.xml -import /home/hudson/genie.rcptt/.jenkins/jobs/EclipsePlatform/workspace/target/projects/e4.platform.tests.runner -testOptions execTimeout=7200 -timeout 7200 -shutdownListenerPort 9267
10:07:26 [INFO] The execution timeout is set to 7200 seconds
10:07:26 [ERROR] Picked up JAVA_TOOL_OPTIONS: -Xmx2G -Djava.io.tmpdir=/tmp/genie.rcptt
10:07:42 [INFO] Started at Mon Feb 19 10:07:42 EST 2018
10:07:42 [INFO] RCPTT Runner version: 2.3.0
10:07:43 [INFO] Initializing target platform...
10:07:43 [INFO] Begin task: Create AUT configuration
10:07:43 [INFO] progress: Resolving Target Contents...
10:07:43 [INFO] progress: Reading plug-ins
10:07:44 [INFO] progress: Fetching p2.index from platform:/plugin/org.eclipse.rcptt.updates.runtime.e4x/q7/
10:07:44 [INFO] progress: Adding repository platform:///plugin/org.eclipse.rcptt.updates.runtime.e4x/q7/
10:07:44 [INFO] progress: Fetching content.jar from platform:/plugin/org.eclipse.rcptt.updates.runtime.e4x/q7/
10:07:45 [INFO] progress: Fetching p2.index from platform:/plugin/org.eclipse.rcptt.updates.runtime.e4x/q7/
10:07:45 [INFO] progress: Adding repository platform:///plugin/org.eclipse.rcptt.updates.runtime.e4x/q7/
10:07:45 [INFO] progress: Fetching content.jar from platform:/plugin/org.eclipse.rcptt.updates.runtime.e4x/q7/
10:07:45 [INFO] progress: Fetching p2.index from platform:/plugin/org.eclipse.rcptt.updates.runtime.e4x/q7/
10:07:45 [INFO] progress: Adding repository platform:///plugin/org.eclipse.rcptt.updates.runtime.e4x/q7/
10:07:45 [INFO] progress: Fetching artifacts.jar from platform:/plugin/org.eclipse.rcptt.updates.runtime.e4x/q7/
10:07:48 [INFO] progress: Downloading org.antlr.runtime
10:07:49 [INFO] progress: Adding repository platform:///plugin/org.eclipse.rcptt.updates.aspectj.e44x/dependencies/
10:07:49 [INFO] progress: Fetching content.jar from platform:/plugin/org.eclipse.rcptt.updates.aspectj.e44x/dependencies/
10:07:50 [INFO] progress: Adding repository platform:///plugin/org.eclipse.rcptt.updates.aspectj.e44x/dependencies/
10:07:50 [INFO] progress: Fetching artifacts.jar from platform:/plugin/org.eclipse.rcptt.updates.aspectj.e44x/dependencies/
10:07:50 [INFO] progress: Downloading org.aspectj.runtime
10:07:50 [INFO] progress: Downloading org.eclipse.equinox.weaving.hook
10:07:50 [INFO] progress: Downloading org.eclipse.equinox.weaving.aspectj
10:07:50 [INFO] progress: Downloading org.aspectj.weaver
10:07:50 [INFO] progress: Adding repository platform:///plugin/org.eclipse.rcptt.updates.kepler/dependencies/
10:07:50 [INFO] progress: Fetching content.jar from platform:/plugin/org.eclipse.rcptt.updates.kepler/dependencies/
10:07:50 [INFO] progress: Adding repository platform:///plugin/org.eclipse.rcptt.updates.kepler/dependencies/
10:07:50 [INFO] progress: Fetching artifacts.jar from platform:/plugin/org.eclipse.rcptt.updates.kepler/dependencies/
10:07:50 [INFO] progress: Downloading org.eclipse.emf.converter
10:07:50 [INFO] progress: Downloading org.eclipse.emf.ecore.change
10:07:50 [INFO] progress: Downloading org.eclipse.emf.mapping.ecore2ecore
10:07:50 [INFO] progress: Downloading org.eclipse.emf.transaction.ui
10:07:50 [INFO] progress: Downloading org.eclipse.emf.validation
10:07:50 [INFO] progress: Downloading org.eclipse.emf.codegen.ecore
10:07:50 [INFO] progress: Downloading org.eclipse.emf.mapping.ecore.editor
10:07:50 [INFO] progress: Downloading org.eclipse.emf.validation_root
10:07:50 [INFO] progress: Downloading org.eclipse.emf
10:07:50 [INFO] progress: Downloading org.eclipse.emf.ecore.change.edit
10:07:50 [INFO] progress: Downloading org.eclipse.emf.importer.ecore
10:07:51 [INFO] progress: Downloading org.eclipse.emf.codegen.ui
10:07:51 [INFO] progress: Downloading org.eclipse.emf.mapping.ecore2ecore.editor
10:07:51 [INFO] progress: Downloading org.eclipse.emf.ecore.xmi
10:07:51 [INFO] progress: Downloading org.eclipse.emf.mapping.ui
10:07:51 [INFO] progress: Downloading org.eclipse.emf.databinding.edit
10:07:51 [INFO] progress: Downloading org.eclipse.emf.mapping
10:07:51 [INFO] progress: Downloading org.eclipse.emf.ecore
10:07:51 [INFO] progress: Downloading org.eclipse.emf.codegen.ecore.ui
10:07:51 [INFO] progress: Downloading org.eclipse.emf.importer
10:07:51 [INFO] progress: Downloading org.eclipse.emf.mapping.ecore2xml.ui
10:07:51 [INFO] progress: Downloading org.eclipse.emf.databinding
10:07:51 [INFO] progress: Downloading org.eclipse.emf
10:07:51 [INFO] progress: Downloading org.eclipse.emf.ecore.edit
10:07:51 [INFO] progress: Downloading org.eclipse.emf.validation.ui
10:07:51 [INFO] progress: Downloading org.eclipse.emf.databinding
10:07:51 [INFO] progress: Downloading org.eclipse.emf.transaction
10:07:51 [INFO] progress: Downloading org.eclipse.emf.ecore.editor
10:07:51 [INFO] progress: Downloading org.eclipse.emf.codegen.ecore
10:07:51 [INFO] progress: Downloading org.eclipse.emf.common.ui
10:07:51 [INFO] progress: Downloading org.eclipse.emf.mapping.ecore2xml
10:07:51 [INFO] progress: Downloading org.eclipse.emf.mapping.ecore
10:07:51 [INFO] progress: Downloading org.eclipse.emf.ecore
10:07:51 [INFO] progress: Downloading org.eclipse.emf.mapping
10:07:51 [INFO] progress: Downloading org.eclipse.emf.edit.ui
10:07:51 [INFO] progress: Downloading org.eclipse.emf.exporter
10:07:51 [INFO] progress: Downloading org.eclipse.emf.mapping.ui
10:07:51 [INFO] progress: Downloading org.eclipse.emf.converter
10:07:51 [INFO] progress: Downloading org.eclipse.emf.transaction
10:07:51 [INFO] progress: Downloading org.eclipse.emf.transaction_root
10:07:51 [INFO] progress: Downloading org.eclipse.emf.databinding.edit
10:07:51 [INFO] progress: Downloading org.eclipse.emf.ecore.edit
10:07:51 [INFO] progress: Downloading org.eclipse.emf.validation
10:07:51 [INFO] progress: Downloading org.eclipse.emf.importer.rose
10:07:51 [INFO] progress: Downloading org.eclipse.emf.edit.ui
10:07:51 [INFO] progress: Downloading org.eclipse.emf.ant
10:07:52 [INFO] progress: Downloading org.eclipse.emf.importer.java
10:07:52 [INFO] progress: Downloading org.eclipse.emf.codegen.ecore.ui
10:07:52 [INFO] progress: Downloading org.eclipse.emf.edit
10:07:52 [INFO] progress: Downloading org.eclipse.emf.common.ui
10:07:52 [INFO] progress: Downloading org.eclipse.emf.codegen
10:07:52 [INFO] progress: Downloading org.eclipse.emf.common
10:07:52 [INFO] progress: Downloading org.eclipse.emf.ecore.editor
10:07:52 [INFO] progress: Downloading org.eclipse.emf.mapping.ecore
10:07:52 [INFO] progress: Downloading org.eclipse.emf.mapping.ecore.editor
10:07:52 [INFO] progress: Downloading org.eclipse.emf.validation.ui.ide
10:07:52 [INFO] progress: Downloading org.eclipse.emf.common
10:07:52 [INFO] progress: Downloading org.eclipse.emf.edit
10:07:52 [INFO] progress: Downloading org.eclipse.emf.codegen
10:07:52 [INFO] progress: Downloading org.eclipse.emf.codegen.ui
10:07:52 [INFO] progress: Adding repository platform:///plugin/org.eclipse.rcptt.updates.extra/dependencies/
10:07:52 [INFO] progress: Fetching content.jar from platform:/plugin/org.eclipse.rcptt.updates.extra/dependencies/
10:07:52 [INFO] progress: Adding repository platform:///plugin/org.eclipse.rcptt.updates.extra/dependencies/
10:07:52 [INFO] progress: Fetching artifacts.jar from platform:/plugin/org.eclipse.rcptt.updates.extra/dependencies/
10:07:52 [INFO] progress: Downloading org.apache.poi.ooxml
10:07:52 [INFO] progress: Downloading org.apache.xmlbeans
10:07:52 [INFO] progress: Downloading org.apache.poi.ooxml.schemas
10:07:52 [INFO] progress: Downloading org.dom4j
10:07:53 [INFO] progress: Downloading org.apache.poi
10:07:54 [INFO] progress: Resolving Target Contents...
10:07:54 [INFO] progress: Reading plug-ins
10:07:54 [INFO] progress: Fetching p2.index from platform:/plugin/org.eclipse.rcptt.updates.runtime.e4x/q7/
10:07:54 [INFO] progress: Fetching content.jar from platform:/plugin/org.eclipse.rcptt.updates.runtime.e4x/q7/
10:07:54 [INFO] progress: Fetching content.jar from platform:/plugin/org.eclipse.rcptt.updates.aspectj.e44x/dependencies/
10:07:54 [INFO] progress: Fetching content.jar from platform:/plugin/org.eclipse.rcptt.updates.kepler/dependencies/
10:07:54 [INFO] progress: Fetching content.jar from platform:/plugin/org.eclipse.rcptt.updates.extra/dependencies/
10:07:55 [INFO] progress: Fetching p2.index from platform:/plugin/org.eclipse.rcptt.updates.runtime.e4x/q7/
10:07:55 [INFO] progress: Fetching artifacts.jar from platform:/plugin/org.eclipse.rcptt.updates.runtime.e4x/q7/
10:07:55 [INFO] progress: Fetching artifacts.jar from platform:/plugin/org.eclipse.rcptt.updates.kepler/dependencies/
10:07:55 [INFO] progress: Fetching artifacts.jar from platform:/plugin/org.eclipse.rcptt.updates.aspectj.e44x/dependencies/
10:07:55 [INFO] progress: Fetching artifacts.jar from platform:/plugin/org.eclipse.rcptt.updates.extra/dependencies/
10:07:55 [INFO] progress: Downloading org.eclipse.emf.validation_root
10:07:55 [INFO] progress: Downloading org.eclipse.emf.transaction_root
10:07:55 [INFO] progress: Installing org.eclipse.emf.ecore.change
10:07:55 [INFO] progress: Installing org.eclipse.rcptt.verifications.time
10:07:55 [INFO] progress: Installing org.eclipse.rcptt.ecl.data.apache.poi.impl
10:07:55 [INFO] progress: Installing org.eclipse.rcptt.runtime.feature.group
10:07:55 [INFO] progress: Installing org.eclipse.rcptt.ecl.core
10:07:55 [INFO] progress: Installing org.eclipse.emf.ecore.xmi
10:07:55 [INFO] progress: Installing org.eclipse.rcptt.tesla.recording.aspects.gmf
10:07:55 [INFO] progress: Installing org.eclipse.emf.mapping.feature.jar
10:07:55 [INFO] progress: Installing org.dom4j
10:07:55 [INFO] progress: Installing org.eclipse.rcptt.tesla.recording.aspects.gef
10:07:55 [INFO] progress: Installing org.eclipse.rcptt.tesla.recording.workbench.texteditor
10:07:55 [INFO] progress: Installing org.eclipse.rcptt.tesla.recording.jface.text
10:07:55 [INFO] progress: Installing org.eclipse.emf.importer
10:07:55 [INFO] progress: Installing org.eclipse.emf.mapping.ecore2xml.ui
10:07:55 [INFO] progress: Installing org.eclipse.rcptt.core.swt
10:07:55 [INFO] progress: Installing org.eclipse.emf.ecore.edit
10:07:55 [INFO] progress: Installing org.eclipse.rcptt.tesla.workbench.texteditor.aspects
10:07:55 [INFO] progress: Installing org.eclipse.rcptt.tesla.variables
10:07:55 [INFO] progress: Installing org.eclipse.rcptt.tesla.recording.aspects.jface
10:07:55 [INFO] progress: Installing org.eclipse.emf.edit.feature.group
10:07:55 [INFO] progress: Installing org.eclipse.rcptt.tesla.gef.aspects
10:07:55 [INFO] progress: Installing org.eclipse.rcptt.verifications.time.impl
10:07:55 [INFO] progress: Installing org.eclipse.emf.transaction
10:07:55 [INFO] progress: Installing org.eclipse.emf.codegen.ecore.feature.jar
10:07:55 [INFO] progress: Installing org.eclipse.emf.mapping.ecore.editor.feature.group
10:07:55 [INFO] progress: Installing org.eclipse.emf.common.ui.feature.jar
10:07:55 [INFO] progress: Installing org.eclipse.rcptt.ecl.debug.runtime
10:07:55 [INFO] progress: Installing org.eclipse.rcptt.tesla.ecl
10:07:55 [INFO] progress: Installing org.eclipse.emf.ecore.edit.feature.group
10:07:55 [INFO] progress: Installing org.eclipse.rcptt.tesla.ui.ide
10:07:55 [INFO] progress: Installing org.eclipse.rcptt.ecl.operations
10:07:55 [INFO] progress: Installing org.eclipse.rcptt.util
10:07:55 [INFO] progress: Installing org.eclipse.rcptt.core.ecl.debug
10:07:55 [INFO] progress: Installing org.eclipse.rcptt.tesla.recording.core.ecl
10:07:55 [INFO] progress: Installing org.eclipse.rcptt.tesla.jface.databinding.aspects
10:07:55 [INFO] progress: Installing org.eclipse.rcptt.tesla.ecl.feature.group
10:07:55 [INFO] progress: Installing org.eclipse.rcptt.tesla.jface.aspects
10:07:55 [INFO] progress: Installing org.eclipse.emf.transaction.feature.jar
10:07:55 [INFO] progress: Installing org.eclipse.emf.ecore.edit.feature.jar
10:07:55 [INFO] progress: Installing org.eclipse.emf.validation
10:07:55 [INFO] progress: Installing org.eclipse.emf.edit.ui
10:07:55 [INFO] progress: Installing org.eclipse.rcptt.core.swt.win32
10:07:55 [INFO] progress: Installing org.eclipse.emf.edit.feature.jar
10:07:55 [INFO] progress: Installing org.eclipse.rcptt.ecl.platform.feature.jar
10:07:55 [INFO] progress: Installing org.eclipse.equinox.weaving.aspectj
10:07:55 [INFO] progress: Installing org.eclipse.rcptt.tesla.jface.databinding.observable.aspects
10:07:55 [INFO] progress: Installing org.eclipse.emf.validation.ui.ide
10:07:55 [INFO] progress: Installing org.eclipse.emf.edit
10:07:55 [INFO] progress: Installing org.eclipse.emf.converter.feature.group
10:07:55 [INFO] progress: Installing org.eclipse.emf.databinding.edit.feature.group
10:07:55 [INFO] progress: Installing org.eclipse.emf.transaction.ui
10:07:55 [INFO] progress: Installing org.eclipse.emf.validation.feature.jar
10:07:55 [INFO] progress: Installing org.eclipse.emf.codegen.ecore
10:07:55 [INFO] progress: Installing org.eclipse.rcptt.ecl.server.feature.group
10:07:55 [INFO] progress: Installing org.eclipse.rcptt.ctx.debug.impl
10:07:55 [INFO] progress: Installing org.eclipse.rcptt.tesla.recording.aspects.draw2d
10:07:55 [INFO] progress: Installing org.eclipse.rcptt.ctx.preferences
10:07:55 [INFO] progress: Installing org.eclipse.emf.common.ui.feature.group
10:07:55 [INFO] progress: Installing org.eclipse.rcptt.tesla.canvas
10:07:55 [INFO] progress: Installing org.apache.poi.ooxml.schemas
10:07:55 [INFO] progress: Installing org.eclipse.emf.ecore.change.edit
10:07:55 [INFO] progress: Installing org.eclipse.rcptt.core.launching
10:07:55 [INFO] progress: Installing org.eclipse.emf.mapping.ecore2ecore.editor
10:07:55 [INFO] progress: Installing org.antlr.runtime
10:07:55 [INFO] progress: Installing org.eclipse.rcptt.tesla.ecl.runtime.feature.group
10:07:55 [INFO] progress: Installing org.eclipse.rcptt.ctx.workbench.aspect
10:07:55 [INFO] progress: Installing org.eclipse.emf.databinding.edit
10:07:55 [INFO] progress: Installing org.eclipse.rcptt.tesla.recording.swt
10:07:55 [INFO] progress: Installing org.eclipse.rcptt.watson.runtime.feature.group
10:07:55 [INFO] progress: Installing org.eclipse.rcptt.tesla.feature.group
10:07:55 [INFO] progress: Installing org.eclipse.rcptt.verifications.log
10:07:55 [INFO] progress: Installing org.eclipse.rcptt.verifications.tree.impl
10:07:55 [INFO] progress: Installing org.eclipse.emf.edit.ui.feature.group
10:07:55 [INFO] progress: Installing org.eclipse.emf
10:07:55 [INFO] progress: Installing org.eclipse.rcptt.ecl.data
10:07:55 [INFO] progress: Installing org.eclipse.emf.validation.ui
10:07:55 [INFO] progress: Installing org.eclipse.rcptt.tesla.ui.ide.aspects
10:07:55 [INFO] progress: Installing org.eclipse.emf.codegen.ecore.feature.group
10:07:55 [INFO] progress: Installing org.apache.xmlbeans
10:07:55 [INFO] progress: Installing org.eclipse.emf.mapping.ecore.feature.jar
10:07:55 [INFO] progress: Installing org.eclipse.rcptt.ecl.data.apache.poi
10:07:55 [INFO] progress: Installing 201801240750.Default
10:07:55 [INFO] progress: Installing org.eclipse.emf.mapping.feature.group
10:07:55 [INFO] progress: Installing org.eclipse.rcptt.tesla.gmf
10:07:55 [INFO] progress: Installing org.eclipse.equinox.weaving.hook
10:07:55 [INFO] progress: Installing org.eclipse.rcptt.verifications.log.impl
10:07:55 [INFO] progress: Installing org.eclipse.emf.edit.ui.feature.jar
10:07:55 [INFO] progress: Installing org.eclipse.emf.mapping.ui
10:07:55 [INFO] progress: Installing org.eclipse.rcptt.watson.feature.group
10:07:55 [INFO] progress: Installing org.eclipse.rcptt.tesla.recording.aspects.workbench.texteditor
10:07:55 [INFO] progress: Installing org.eclipse.rcptt.core.ecl.core
10:07:55 [INFO] progress: Installing org.eclipse.rcptt.verifications.resources
10:07:55 [INFO] progress: Installing org.eclipse.emf.importer.java
10:07:55 [INFO] progress: Installing org.eclipse.rcptt.resources.impl
10:07:55 [INFO] progress: Installing org.eclipse.rcptt.tesla.recording.gef
10:07:55 [INFO] progress: Installing org.eclipse.emf.codegen.feature.jar
10:07:55 [INFO] progress: Installing org.eclipse.emf.common
10:07:55 [INFO] progress: Installing org.eclipse.rcptt.verifications
10:07:55 [INFO] progress: Installing org.eclipse.emf.mapping.ecore
10:07:55 [INFO] progress: Installing org.eclipse.emf.mapping.ecore.editor.feature.jar
10:07:55 [INFO] progress: Installing org.eclipse.rcptt.ctx.script
10:07:55 [INFO] progress: Installing org.eclipse.emf.common.feature.jar
10:07:55 [INFO] progress: Installing org.eclipse.rcptt.ecl.filesystem
10:07:55 [INFO] progress: Installing org.eclipse.rcptt.ctx.resources.impl
10:07:55 [INFO] progress: Installing org.eclipse.rcptt.expandbar
10:07:55 [INFO] progress: Installing org.eclipse.rcptt.tesla.ecl.feature.jar
10:07:55 [INFO] progress: Installing org.eclipse.emf.mapping.ecore2ecore
10:07:55 [INFO] progress: Installing org.eclipse.rcptt.tesla.runtime.feature.jar
10:07:55 [INFO] progress: Installing org.eclipse.rcptt.tesla.workbench.texteditor
10:07:55 [INFO] progress: Installing org.eclipse.rcptt.ctx.workbench.impl
10:07:55 [INFO] progress: Installing org.eclipse.rcptt.resources
10:07:55 [INFO] progress: Installing org.eclipse.rcptt.verifications.text.impl
10:07:55 [INFO] progress: Installing org.eclipse.rcptt.tesla.recording.aspects.forms
10:07:55 [INFO] progress: Installing org.eclipse.emf.mapping.ecore.editor
10:07:55 [INFO] progress: Installing org.eclipse.emf.validation_root
10:07:55 [INFO] progress: Installing org.eclipse.rcptt.tesla.gmf.aspects
10:07:55 [INFO] progress: Installing org.eclipse.emf.feature.jar
10:07:55 [INFO] progress: Installing org.eclipse.rcptt.ecl.client.tcp
10:07:55 [INFO] progress: Installing org.eclipse.rcptt.tesla.core
10:07:55 [INFO] progress: Installing org.eclipse.rcptt.ecl.platform.ui.feature.group
10:07:55 [INFO] progress: Installing org.eclipse.emf.importer.ecore
10:07:55 [INFO] progress: Installing org.eclipse.rcptt.core
10:07:55 [INFO] progress: Installing org.eclipse.rcptt.watson.aspects.swt
10:07:55 [INFO] progress: Installing org.eclipse.rcptt.ecl.platform.feature.group
10:07:55 [INFO] progress: Installing org.eclipse.emf.codegen.ecore.ui.feature.group
10:07:55 [INFO] progress: Installing org.eclipse.rcptt.verifications.resources.impl
10:07:55 [INFO] progress: Installing org.eclipse.rcptt.ctx.filesystem.impl
10:07:55 [INFO] progress: Installing org.eclipse.emf.codegen.ecore.ui.feature.jar
10:07:55 [INFO] progress: Installing org.eclipse.rcptt.verifications.tree
10:07:55 [INFO] progress: Installing org.eclipse.rcptt.tesla.core.context
10:07:55 [INFO] progress: Installing org.eclipse.rcptt.watson.jface
10:07:55 [INFO] progress: Installing org.eclipse.rcptt.tesla.feature.jar
10:07:55 [INFO] progress: Installing org.eclipse.rcptt.watson.jobs
10:07:55 [INFO] progress: Installing org.eclipse.rcptt.ecl.platform
10:07:55 [INFO] progress: Installing org.eclipse.rcptt.ecl.dispatch
10:07:55 [INFO] progress: Installing org.eclipse.rcptt.ctx.filesystem
10:07:55 [INFO] progress: Installing org.eclipse.rcptt.tesla.core.am
10:07:55 [INFO] progress: Installing org.eclipse.rcptt.tesla.recording.draw2d
10:07:55 [INFO] progress: Installing org.eclipse.rcptt.ecl.server.feature.jar
10:07:55 [INFO] progress: Installing org.eclipse.rcptt.ctx.debug
10:07:55 [INFO] progress: Installing org.eclipse.emf.feature.group
10:07:55 [INFO] progress: Installing org.eclipse.rcptt.ecl.doc
10:07:55 [INFO] progress: Installing org.eclipse.emf.mapping.ecore2xml
10:07:55 [INFO] progress: Installing org.eclipse.rcptt.forms.impl
10:07:55 [INFO] progress: Installing org.eclipse.emf.mapping
10:07:55 [INFO] progress: Installing org.eclipse.emf.exporter
10:07:55 [INFO] progress: Installing org.eclipse.rcptt.tesla.recording.aspects.workbench
10:07:55 [INFO] progress: Installing org.eclipse.rcptt.reporting
10:07:55 [INFO] progress: Installing org.eclipse.emf.converter.feature.jar
10:07:55 [INFO] progress: Installing org.eclipse.rcptt.tesla.runtime.feature.group
10:07:55 [INFO] progress: Installing org.eclipse.rcptt.tesla.swt.fragment
10:07:55 [INFO] progress: Installing org.eclipse.emf.transaction_root
10:07:55 [INFO] progress: Installing org.eclipse.emf.databinding.edit.feature.jar
10:07:55 [INFO] progress: Installing org.eclipse.rcptt.tesla.jface.text.reconciler.aspects
10:07:55 [INFO] progress: Installing org.eclipse.rcptt.ecl.perf
10:07:55 [INFO] progress: Installing org.eclipse.emf.ant
10:07:55 [INFO] progress: Installing org.aspectj.runtime
10:07:55 [INFO] progress: Installing org.eclipse.emf.codegen.ecore.ui
10:07:55 [INFO] progress: Installing org.eclipse.rcptt.runtime.feature.jar
10:07:55 [INFO] progress: Installing org.apache.poi
10:07:55 [INFO] progress: Installing org.eclipse.rcptt.ctx.group
10:07:55 [INFO] progress: Installing org.eclipse.rcptt.tesla.jdt.aspects
10:07:55 [INFO] progress: Installing org.eclipse.emf.transaction.feature.group
10:07:55 [INFO] progress: Installing org.eclipse.rcptt.ctx.resources
10:07:55 [INFO] progress: Installing org.eclipse.emf.codegen
10:07:55 [INFO] progress: Installing org.eclipse.rcptt.tesla.workbench.aspects.e4x
10:07:55 [INFO] progress: Installing org.eclipse.emf.codegen.ui
10:07:55 [INFO] progress: Installing org.eclipse.emf.converter
10:07:55 [INFO] progress: Installing org.eclipse.rcptt.ecl.core.feature.group
10:07:55 [INFO] progress: Installing org.eclipse.emf.ecore.feature.group
10:07:55 [INFO] progress: Installing org.eclipse.rcptt.ctx.workbench
10:07:55 [INFO] progress: Installing org.eclipse.emf.mapping.ecore.feature.group
10:07:55 [INFO] progress: Installing org.eclipse.rcptt.tesla.recording.aspects.swt
10:07:55 [INFO] progress: Installing org.eclipse.rcptt.tesla.swt.e4x
10:07:55 [INFO] progress: Installing org.eclipse.emf.mapping.ui.feature.group
10:07:55 [INFO] progress: Installing org.eclipse.rcptt.tesla.recording.core
10:07:55 [INFO] progress: Installing org.eclipse.rcptt.tesla.swt
10:07:55 [INFO] progress: Installing org.eclipse.rcptt.logging
10:07:55 [INFO] progress: Installing org.eclipse.rcptt.ecl.interop
10:07:55 [INFO] progress: Installing org.eclipse.rcptt.tesla.swt.aspects
10:07:55 [INFO] progress: Installing org.eclipse.emf.codegen.feature.group
10:07:55 [INFO] progress: Installing org.eclipse.emf.codegen.ui.feature.jar
10:07:55 [INFO] progress: Installing org.eclipse.emf.ecore.editor.feature.group
10:07:55 [INFO] progress: Installing org.eclipse.emf.mapping.ui.feature.jar
10:07:55 [INFO] progress: Installing org.apache.poi.ooxml
10:07:55 [INFO] progress: Installing org.eclipse.rcptt.util.swt
10:07:55 [INFO] progress: Installing org.eclipse.rcptt.tesla.ecl.impl
10:07:55 [INFO] progress: Installing org.eclipse.rcptt.ctx.group.impl
10:07:55 [INFO] progress: Installing org.eclipse.rcptt.ecl.platform.ui.feature.jar
10:07:55 [INFO] progress: Installing org.eclipse.rcptt.tesla.jface.text
10:07:55 [INFO] progress: Installing org.eclipse.emf.ecore
10:07:55 [INFO] progress: Installing org.eclipse.rcptt.watson.runtime.feature.jar
10:07:55 [INFO] progress: Installing org.eclipse.rcptt.tesla.ecl.runtime.feature.jar
10:07:55 [INFO] progress: Installing org.eclipse.emf.common.feature.group
10:07:55 [INFO] progress: Installing org.eclipse.rcptt.tesla.recording.canvas
10:07:55 [INFO] progress: Installing org.eclipse.rcptt.tesla.jface.databinding
10:07:55 [INFO] progress: Installing org.eclipse.emf.databinding
10:07:55 [INFO] progress: Installing org.eclipse.emf.databinding.feature.group
10:07:55 [INFO] progress: Installing org.eclipse.rcptt.tesla.jobs.aspects
10:07:55 [INFO] progress: Installing org.eclipse.rcptt.watson.core
10:07:55 [INFO] progress: Installing org.eclipse.rcptt.expandbar.runtime
10:07:55 [INFO] progress: Installing org.eclipse.emf.databinding.feature.jar
10:07:55 [INFO] progress: Installing org.eclipse.rcptt.tesla.recording.gmf
10:07:55 [INFO] progress: Installing org.eclipse.emf.ecore.editor.feature.jar
10:07:55 [INFO] progress: Installing org.eclipse.rcptt.ecl.parser
10:07:55 [INFO] progress: Installing org.eclipse.rcptt.tesla.gef
10:07:55 [INFO] progress: Installing org.eclipse.rcptt.ctx.parameters.impl
10:07:55 [INFO] progress: Installing org.eclipse.rcptt.tesla.recording.aspects.jface.text
10:07:55 [INFO] progress: Installing org.eclipse.emf.ecore.feature.jar
10:07:55 [INFO] progress: Installing org.aspectj.weaver
10:07:55 [INFO] progress: Installing org.eclipse.emf.codegen.ui.feature.group
10:07:55 [INFO] progress: Installing org.eclipse.rcptt.ctx.preferences.aspects
10:07:55 [INFO] progress: Installing org.eclipse.rcptt.watson.aspects.jobs
10:07:55 [INFO] progress: Installing org.eclipse.rcptt.ecl.platform.ui
10:07:55 [INFO] progress: Installing org.eclipse.rcptt.ecl.core.feature.jar
10:07:55 [INFO] progress: Installing org.eclipse.emf.validation.feature.group
10:07:55 [INFO] progress: Installing org.eclipse.rcptt.ctx.parameters
10:07:55 [INFO] progress: Installing org.eclipse.rcptt.ctx.script.impl
10:07:55 [INFO] progress: Installing org.eclipse.rcptt.runtime.ui
10:07:55 [INFO] progress: Installing org.eclipse.rcptt.tesla.jface.text.aspects
10:07:55 [INFO] progress: Installing org.eclipse.rcptt.verifications.text
10:07:55 [INFO] progress: Installing org.eclipse.emf.importer.rose
10:07:55 [INFO] progress: Installing org.eclipse.rcptt.tesla.properties.view
10:07:55 [INFO] progress: Installing org.eclipse.rcptt.core.scenario
10:07:55 [INFO] progress: Installing org.eclipse.rcptt.tesla.jdt
10:07:55 [INFO] progress: Installing org.eclipse.rcptt.watson.feature.jar
10:07:55 [INFO] progress: Installing org.eclipse.emf.common.ui
10:07:55 [INFO] progress: Installing org.eclipse.emf.ecore.editor
10:07:55 [INFO] progress: Installing org.eclipse.rcptt.tesla.jface.fragment
10:07:55 [INFO] progress: Installing org.eclipse.rcptt.ecl.server.tcp
10:07:55 [INFO] progress: Installing org.eclipse.rcptt.core.swt.win64
10:07:55 [INFO] progress: Installing org.eclipse.rcptt.util.resources
10:07:55 [INFO] progress: Installing org.eclipse.rcptt.ctx.preferences.impl
10:07:55 [INFO] progress: Downloading org.eclipse.emf.validation_root
10:07:55 [INFO] progress: Downloading org.eclipse.emf.transaction_root
10:07:55 [INFO] progress: Preparing to commit the provisioning operation.
10:07:55 [INFO] progress: Committing the provisioning operation.
10:07:56 [INFO] progress: Reading plug-ins
10:07:57 [INFO] Target platform is valid.
10:07:57 [INFO] Looking for tests...
10:07:57 [INFO] Existing projects in workspace:
10:07:57 [INFO]     <none>
10:07:57 [INFO] Importing projects to workspace:
10:07:57 [INFO] Refreshing projects:
10:07:57 [INFO]     /home/hudson/genie.rcptt/.jenkins/jobs/EclipsePlatform/workspace/target/projects/e4.platform.tests.runner... OK
10:07:57 [INFO] Refreshing projects:
10:07:57 [INFO]     EclipsePlatformTests... OK
10:07:57 [INFO] Searching for tests in projects:
10:07:57 [INFO]     EclipsePlatformTests... 
10:07:58 [INFO] -- Testcase is skipped by tag "skipExecution" -- Quick Access Search Bar.test
10:07:58 [INFO] -- Testcase is skipped by tag "skipExecution" -- Close Others Editors.test
10:07:58 [INFO] -- Testcase is skipped by tag "skipExecution" -- Open Perspective by Typing into Quick Access bar.test
10:07:58 [INFO] Complete OK
10:07:58 [INFO] Testcase Artifacts:79
10:07:58 [INFO] AUT-0:Launching
10:07:59 [INFO] AUT-0:Product: org.eclipse.platform.ide
10:07:59 [INFO] AUT-0:Application: org.eclipse.ui.ide.workbench
10:07:59 [INFO] AUT-0:Architecture: x86_64
10:07:59 [INFO] 64bit arch is selected because AUT uses launcher library
10:07:59 [INFO] 	"plugins/org.eclipse.equinox.launcher.gtk.linux.x86_64_1.1.700.v20171213-1416" specified in config file: eclipse.ini
10:07:59 [INFO] /home/hudson/genie.rcptt/.jenkins/jobs/EclipsePlatform/workspace/target/aut-ws-0: AUT arguments: -os ${target.os} -arch ${target.arch} -consoleLog
10:07:59 [INFO] /home/hudson/genie.rcptt/.jenkins/jobs/EclipsePlatform/workspace/target/aut-ws-0: AUT VM arguments: -Dosgi.requiredJavaVersion=1.8 -Dosgi.dataAreaRequiresExplicitInit=true -Xms40m -Xmx512m -XX:MaxPermSize=128m
10:08:23 [INFO] Pass 1 (79) processed. 0 failed. spent: 0:10, 4:16 mins remaining. Add Associated Task. time: 10362ms 
10:08:29 [INFO] Pass 2 (79) processed. 0 failed. spent: 0:16, 5:04 mins remaining. Add Bookmark To File. time: 5216ms 
10:08:34 [INFO] Pass 3 (79) processed. 0 failed. spent: 0:21, 5:15 mins remaining. Add New Bookmark. time: 5445ms 
10:08:41 [INFO] Pass 4 (79) processed. 0 failed. spent: 0:28, 5:45 mins remaining. Add New Task. time: 5985ms 
10:08:47 [INFO] Pass 5 (79) processed. 0 failed. spent: 0:34, 5:54 mins remaining. Bug 268350 - [Compatibility] Cannot Open Files by Dragging. time: 6229ms 
10:08:53 [INFO] Pass 6 (79) processed. 0 failed. spent: 0:40, 6:00 mins remaining. Bug 394336 - Close menu item is disabled even when current editor is activated. time: 5582ms 
10:08:59 [INFO] Pass 7 (79) processed. 0 failed. spent: 0:46, 6:02 mins remaining. Bug 396418 - Save changes in File. time: 5352ms 
10:09:07 [INFO] Pass 8 (79) processed. 0 failed. spent: 0:54, 6:18 mins remaining. Bug 88788 - Back/Forward keys and mouse buttons don't work with Eclipse. time: 8385ms 
10:09:14 [INFO] Pass 9 (79) processed. 0 failed. spent: 1:01, 6:22 mins remaining. Close And Open Project. time: 6467ms 
10:09:17 [INFO] Pass 10 (79) processed. 0 failed. spent: 1:04, 6:02 mins remaining. Close Editor By X Button. time: 3211ms 
10:09:40 [INFO] Pass 11 (79) processed. 0 failed. spent: 1:27, 7:28 mins remaining. Close Opened Editors Automatically. time: 22377ms 
10:09:47 [INFO] Pass 12 (79) processed. 0 failed. spent: 1:35, 7:27 mins remaining. Compare With Each Other. time: 7331ms 
10:09:53 [INFO] Pass 13 (79) processed. 0 failed. spent: 1:40, 7:13 mins remaining. Convert Uppercase to Lowercase. time: 5337ms 
10:10:02 [INFO] Pass 14 (79) processed. 0 failed. spent: 1:49, 7:16 mins remaining. Copy From Left To Right At Comparing. time: 8090ms 
10:10:10 [INFO] Pass 15 (79) processed. 0 failed. spent: 1:57, 7:13 mins remaining. Copy From Right To Left At Comparing. time: 8003ms 
10:10:15 [INFO] Pass 16 (79) processed. 0 failed. spent: 2:02, 7:00 mins remaining. Copy Line Up Or Down. time: 4780ms 
10:10:22 [INFO] Pass 17 (79) processed. 0 failed. spent: 2:09, 6:54 mins remaining. Copy Paste Text From One File To Another. time: 6584ms 
10:10:27 [INFO] Pass 18 (79) processed. 0 failed. spent: 2:14, 6:42 mins remaining. Copy Resource By Ctrl+Drag. time: 4876ms 
10:10:32 [INFO] Fail 19 (79) processed. 1 failed. spent: 2:19, 6:30 mins remaining. Create Folder With Invalid Name. time: 4395ms  Cause: Assertion of text failed: expected:<* is an invalid character in resource name '*'.> but was:<Create a new folder resource.>.
10:10:38 [INFO] Pass 20 (79) processed. 1 failed. spent: 2:25, 6:22 mins remaining. Create New Folder. time: 5752ms 
10:10:41 [INFO] Pass 21 (79) processed. 1 failed. spent: 2:28, 6:06 mins remaining. Create New Project Using the New Button . time: 3220ms 
10:10:46 [INFO] Pass 22 (79) processed. 1 failed. spent: 2:33, 5:57 mins remaining. Create New Project. time: 4301ms 
10:10:52 [INFO] Pass 23 (79) processed. 1 failed. spent: 2:39, 5:49 mins remaining. Create Path Variable. time: 6384ms 
10:10:59 [INFO] Pass 24 (79) processed. 1 failed. spent: 2:46, 5:44 mins remaining. Create Project Reference. time: 6677ms 
10:11:04 [INFO] Fail 25 (79) processed. 2 failed. spent: 2:51, 5:35 mins remaining. Create Project With Invalid Name. time: 4130ms  Cause: Assertion of text failed: expected:<* is an invalid character in resource name '*'.> but was:<Create a new project resource.>.
10:11:10 [INFO] Pass 26 (79) processed. 2 failed. spent: 2:57, 5:28 mins remaining. Ctrl+E to Switch Editors. time: 6251ms 
10:11:15 [INFO] Fail 27 (79) processed. 3 failed. spent: 3:02, 5:20 mins remaining. Customize Perspective. time: 4622ms  Cause: The Button "OK" could not be found.
10:11:21 [INFO] Fail 28 (79) processed. 4 failed. spent: 3:09, 5:15 mins remaining. Delete Bookmark From Bookmarks View. time: 5679ms  Cause: The Button "Yes" could not be found.
10:11:26 [INFO] Fail 29 (79) processed. 5 failed. spent: 3:13, 5:05 mins remaining. Delete Completed Tasks. time: 4233ms  Cause: The Button "Yes" could not be found.
10:11:30 [INFO] Pass 30 (79) processed. 5 failed. spent: 3:17, 4:55 mins remaining. Delete Project. time: 3643ms 
10:11:35 [INFO] Pass 31 (79) processed. 5 failed. spent: 3:22, 4:47 mins remaining. Drag One Folder Into Another. time: 4875ms 
10:11:41 [INFO] Pass 32 (79) processed. 5 failed. spent: 3:28, 4:41 mins remaining. Emacs Key Binding Actions - Delete from coursor position to the end of line. time: 5529ms 
10:11:51 [INFO] Pass 33 (79) processed. 5 failed. spent: 3:38, 4:40 mins remaining. Export Resource To File System With Saving Directory Structure. time: 9293ms 
10:11:58 [INFO] Pass 34 (79) processed. 5 failed. spent: 3:45, 4:35 mins remaining. Export Resource To File System. time: 7210ms 
10:12:08 [INFO] Pass 35 (79) processed. 5 failed. spent: 3:55, 4:33 mins remaining. Export Resource With Overwritting Existing Files. time: 9685ms 
10:12:13 [INFO] Pass 36 (79) processed. 5 failed. spent: 4:00, 4:38 mins remaining. Faster Workspace Navigation. time: 4953ms 
10:12:22 [INFO] Pass 37 (79) processed. 5 failed. spent: 4:09, 4:21 mins remaining. Filtering At Exporting Resource To File System. time: 8345ms 
10:12:31 [INFO] Pass 38 (79) processed. 5 failed. spent: 4:18, 4:18 mins remaining. Filtering Files At Last Modified Date. time: 8666ms 
10:12:39 [INFO] Pass 39 (79) processed. 5 failed. spent: 4:26, 4:13 mins remaining. Filtering Files In Project At Name. time: 8436ms 
10:12:50 [INFO] Pass 40 (79) processed. 5 failed. spent: 4:37, 4:23 mins remaining. Filtering Files In Project At Read Only Property. time: 9988ms 
10:12:57 [INFO] Pass 41 (79) processed. 5 failed. spent: 4:44, 4:04 mins remaining. Filtering Files At File Length. time: 7397ms 
10:13:11 [INFO] Pass 42 (79) processed. 5 failed. spent: 4:58, 4:03 mins remaining. Filtering Files or Folders At Location. time: 13224ms 
10:13:21 [INFO] Pass 43 (79) processed. 5 failed. spent: 5:08, 3:59 mins remaining. Filtering Folders In Project At Name. time: 9531ms 
10:13:30 [INFO] Pass 44 (79) processed. 5 failed. spent: 5:17, 3:54 mins remaining. Folder Name Should Appear By Default As Parent Folder. time: 8738ms 
10:13:35 [INFO] Pass 45 (79) processed. 5 failed. spent: 5:23, 3:46 mins remaining. Hide Closed Project In Project Explorer. time: 5344ms 
10:13:40 [INFO] Pass 46 (79) processed. 5 failed. spent: 5:28, 3:38 mins remaining. Hide .* resources In Project Explorer. time: 4772ms 
10:13:43 [INFO] Pass 47 (79) processed. 5 failed. spent: 5:31, 3:29 mins remaining. Hide toolbar. time: 2794ms 
10:13:50 [INFO] Pass 48 (79) processed. 5 failed. spent: 5:38, 3:22 mins remaining. Import Duplicate Project. time: 6524ms 
10:13:59 [INFO] Pass 49 (79) processed. 5 failed. spent: 5:46, 3:16 mins remaining. Import Existing Project Into Workspace. time: 8335ms 
10:14:08 [INFO] Pass 50 (79) processed. 5 failed. spent: 5:55, 3:11 mins remaining. Import Project With Copying Into Workspace. time: 8663ms 
10:14:15 [INFO] Pass 51 (79) processed. 5 failed. spent: 6:02, 3:04 mins remaining. Import Resource From Archive File. time: 6136ms 
10:14:22 [INFO] Pass 52 (79) processed. 5 failed. spent: 6:09, 2:57 mins remaining. Import Resource From File System. time: 6689ms 
10:14:27 [INFO] Pass 53 (79) processed. 5 failed. spent: 6:14, 2:50 mins remaining. Move Line Up Or Down. time: 4498ms 
10:14:32 [INFO] Pass 54 (79) processed. 5 failed. spent: 6:19, 2:42 mins remaining. Navigate - Show In. time: 5161ms 
10:14:37 [INFO] Pass 55 (79) processed. 5 failed. spent: 6:24, 2:34 mins remaining. Navigate -Open With. time: 4738ms 
10:14:42 [INFO] Pass 56 (79) processed. 5 failed. spent: 6:29, 2:27 mins remaining. Navigate Backward. time: 4845ms 
10:14:48 [INFO] Pass 57 (79) processed. 5 failed. spent: 6:35, 2:20 mins remaining. Open Editor Using Drag And Drop. time: 5931ms 
10:14:57 [INFO] Pass 58 (79) processed. 5 failed. spent: 6:44, 2:14 mins remaining. Open Editors With a Single Click. time: 8419ms 
10:15:01 [INFO] Fail 59 (79) processed. 6 failed. spent: 6:48, 2:07 mins remaining. Open File From Associated Task. time: 4266ms  Cause: The Button "Yes" could not be found.
10:15:07 [INFO] Pass 60 (79) processed. 6 failed. spent: 6:54, 2:00 mins remaining. Open File Through Bookmark. time: 5799ms 
10:15:12 [INFO] Pass 61 (79) processed. 6 failed. spent: 6:59, 1:53 mins remaining. Open Perspective With Open Perspective Button. time: 4845ms 
10:15:16 [INFO] Pass 62 (79) processed. 6 failed. spent: 7:03, 1:45 mins remaining. Open Perspective from Window-Open Perspective menu. time: 3407ms 
10:15:40 [INFO] Pass 63 (79) processed. 6 failed. spent: 7:27, 1:43 mins remaining. Open Perspective in New Window. time: 21928ms 
10:15:45 [INFO] Pass 64 (79) processed. 6 failed. spent: 7:32, 1:35 mins remaining. Open Second Editor Instance. time: 4739ms 
10:15:51 [INFO] Pass 65 (79) processed. 6 failed. spent: 7:38, 1:28 mins remaining. Open Untitled File. time: 6286ms 
10:15:58 [INFO] Pass 66 (79) processed. 6 failed. spent: 7:45, 1:22 mins remaining. Remove Bookmark From File Editor. time: 6518ms 
10:16:04 [INFO] Pass 67 (79) processed. 6 failed. spent: 7:51, 1:15 mins remaining. Rename Folder. time: 5679ms 
10:16:08 [INFO] Fail 68 (79) processed. 7 failed. spent: 7:55, 1:07 mins remaining. Reset Prespective. time: 2929ms  Cause: The Button "Yes" could not be found.
10:16:15 [INFO] Pass 69 (79) processed. 7 failed. spent: 8:02, 1:01 mins remaining. Restore Defaults In Resource Filters. time: 6577ms 
10:16:20 [INFO] Fail 70 (79) processed. 8 failed. spent: 8:07, 0:54 mins remaining. Revert Perspective to Original Layout. time: 5317ms  Cause: The TabFolder "[]" could not be found.
10:16:27 [INFO] Pass 71 (79) processed. 8 failed. spent: 8:14, 0:47 mins remaining. Save Perspective. time: 6581ms 
10:16:34 [INFO] Pass 72 (79) processed. 8 failed. spent: 8:21, 0:40 mins remaining. Search Replace From Search View. time: 6406ms 
10:16:39 [INFO] Pass 73 (79) processed. 8 failed. spent: 8:26, 0:33 mins remaining. Set Default Perspective In Preference. time: 5079ms 
10:16:45 [INFO] Pass 74 (79) processed. 8 failed. spent: 8:32, 0:26 mins remaining. Try to Create Same-Named Folder. time: 5360ms 
10:16:50 [INFO] Fail 75 (79) processed. 9 failed. spent: 8:37, 0:20 mins remaining. Turn off Menu Item. time: 5142ms  Cause: The Button "OK" could not be found.
10:16:57 [INFO] Pass 76 (79) processed. 9 failed. spent: 8:44, 0:13 mins remaining. Undo\Redo In Editor. time: 6631ms 
10:17:03 [INFO] Pass 77 (79) processed. 9 failed. spent: 8:50, 0:06 mins remaining. Usaved Editor Tab Should Have Asterisk. time: 5172ms 
10:17:08 [INFO] Pass 78 (79) processed. 9 failed. spent: 8:55, 0:00 mins remaining. Use Ctrl+PgUp to Switch Between Editors. time: 5223ms 
10:17:14 [INFO] Pass 79 (79) processed. 9 failed. spent: 9:01, 0:00 mins remaining. View All Keyboard Shortcuts. time: 5438ms 
10:17:14 [INFO] Failed Tests:
10:17:14 [INFO] Turn off Menu Item
10:17:14 [INFO] Customize Perspective
10:17:14 [INFO] Delete Completed Tasks
10:17:14 [INFO] Open File From Associated Task
10:17:14 [INFO] Create Project With Invalid Name
10:17:14 [INFO] Reset Prespective
10:17:14 [INFO] Delete Bookmark From Bookmarks View
10:17:14 [INFO] Create Folder With Invalid Name
10:17:14 [INFO] Revert Perspective to Original Layout
10:17:14 [INFO] Process terminated. Shut down AUTs
10:17:18 [INFO] Runner exit code is: 56
10:17:18 [INFO] ------------------------------------------------------------------------
10:17:18 [INFO] BUILD FAILURE
10:17:18 [INFO] ------------------------------------------------------------------------
10:17:18 [INFO] Total time: 10:15 min
10:17:18 [INFO] Finished at: 2018-02-19T10:17:18-05:00
10:17:18 [INFO] Final Memory: 13M/1342M
10:17:18 [INFO] ------------------------------------------------------------------------
10:17:18 [ERROR] Failed to execute goal org.eclipse.rcptt:rcptt-maven-plugin:2.3.0-SNAPSHOT:execute (default-execute) on project e4.platform.tests.runner: There are test failures -> [Help 1]
10:17:18 [ERROR] 
10:17:18 [ERROR] To see the full stack trace of the errors, re-run Maven with the -e switch.
10:17:18 [ERROR] Re-run Maven using the -X switch to enable full debug logging.
10:17:18 [ERROR] 
10:17:18 [ERROR] For more information about the errors and possible solutions, please read the following articles:
10:17:18 [ERROR] [Help 1] http://cwiki.apache.org/confluence/display/MAVEN/MojoFailureException
10:17:18 java.net.ConnectException: Connection refused (Connection refused)
10:17:18 [INFO] Process terminated. Send shutdown request to RCPTT runner.
10:17:18 + true
10:17:18 + mv /home/hudson/genie.rcptt/.jenkins/jobs/EclipsePlatform/workspace/pom_old.xml /home/hudson/genie.rcptt/.jenkins/jobs/EclipsePlatform/workspace/pom.xml
10:17:18 Taking screenshot.
10:17:18 [workspace] $ echo $XAUTHORITY
10:17:18 /home/hudson/genie.rcptt/.jenkins/jobs/EclipsePlatform/workspace/.Xauthority-3803942659247685299
10:17:18 [workspace] $ ls -l $XAUTHORITY
10:17:18 -rw-rw-r-- 1 genie.rcptt technology.rcptt 0 Feb 19 10:07 /home/hudson/genie.rcptt/.jenkins/jobs/EclipsePlatform/workspace/.Xauthority-3803942659247685299
10:17:18 [workspace] $ import -window root -display :844 screenshot.jpg
10:17:18 Terminating xvnc.
10:17:18 Recording test results
10:17:18 Build step 'Publish JUnit test result report' changed build result to UNSTABLE
10:17:18 Archiving artifacts
10:17:18 Started calculate disk usage of build
10:17:18 Finished Calculation of disk usage of build in 0 seconds
10:17:18 Started calculate disk usage of workspace
10:17:19 Finished Calculation of disk usage of workspace in 0 seconds
10:17:19 Finished: UNSTABLE