FailedConsole Output

Started by timer
Cleaning the workspace because project is configured to clean the workspace before each build.
[locks-and-latches] Checking to see if we really have the locks
[locks-and-latches] Have all the locks, build can start
[workspace] $ /bin/sh -xe /tmp/genie.rap/hudson8101709668213635735.sh
+ echo 'Checking out build projects'
Checking out build projects
+ git clone git://git.eclipse.org/gitroot/rap/incubator/org.eclipse.rap.incubator.releng.git releng
Cloning into 'releng'...
[workspace] $ /bin/sh -xe /tmp/genie.rap/hudson3773682454184659387.sh
+ export COMPONENT_NAME=richtext
+ COMPONENT_NAME=richtext
+ releng/releng/org.eclipse.rap.incubator.releng/scripts/build.sh richtext N
***********************************************************************
Workspace location: /home/hudson/genie.rap/.hudson/jobs/rap-head-incubator-richtext/workspace
Maven path: /opt/public/common/apache-maven-3.2.1/bin/mvn
Eclipse location: /shared/rt/rap/build-runtimes/eclipse
Signing location: /opt/public/download-staging.priv/rt/rap
Git base URL: git://git.eclipse.org/gitroot/rap
Git incubator base URL: git://git.eclipse.org/gitroot/rap/incubator
Git branch: master
Releng Git branch: master
RAP Runtime p2 repository: http://download.eclipse.org/rt/rap/nightly/runtime/
p2 repository base path: /shared/rt/rap/incubator/nightly
Number of p2 repositories to keep: 5
Local Maven repository location: /shared/rt/rap/m2/repository
***********************************************************************
Running build.sh
RAP component name: richtext
Repository name: org.eclipse.rap.incubator.richtext
Build project path: releng/org.eclipse.rap.richtext.build
Build type: N
Sign Profile: 
RAP Runtime library: http://download.eclipse.org/rt/rap/nightly/runtime/
Remove directory /shared/rt/rap/m2/repository/.cache
Remove directory /shared/rt/rap/m2/repository/.meta
Remove directory /shared/rt/rap/m2/repository/p2
Git clone of releng repository git://git.eclipse.org/gitroot/rap/incubator/org.eclipse.rap.incubator.releng into /home/hudson/genie.rap/.hudson/jobs/rap-head-incubator-richtext/workspace
Cloning into 'org.eclipse.rap.incubator.releng'...
Git clone of git://git.eclipse.org/gitroot/rap/incubator/org.eclipse.rap.incubator.richtext into /home/hudson/genie.rap/.hudson/jobs/rap-head-incubator-richtext/workspace
Cloning into 'org.eclipse.rap.incubator.richtext'...
Starting build in /home/hudson/genie.rap/.hudson/jobs/rap-head-incubator-richtext/workspace/org.eclipse.rap.incubator.richtext/releng/org.eclipse.rap.richtext.build
[INFO] Error stacktraces are turned on.
[INFO] Scanning for projects...
[WARNING] No explicit target runtime environment configuration. Build is platform dependent.
[WARNING] No explicit target runtime environment configuration. Build is platform dependent.
[WARNING] No explicit target runtime environment configuration. Build is platform dependent.
[WARNING] No explicit target runtime environment configuration. Build is platform dependent.
[WARNING] No explicit target runtime environment configuration. Build is platform dependent.
[WARNING] No explicit target runtime environment configuration. Build is platform dependent.
[INFO] Computing target platform for MavenProject: org.eclipse.rap.incubator:org.eclipse.rap.addons.ckeditor:0.2.0-SNAPSHOT @ /jobs/genie.rap/rap-head-incubator-richtext/workspace/org.eclipse.rap.incubator.richtext/bundles/org.eclipse.rap.addons.ckeditor/pom.xml
[INFO] Adding repository http://download.eclipse.org/rt/rap/nightly/runtime
[INFO] Fetching content.jar from http://download.eclipse.org/rt/rap/nightly/runtime/ (0B of 41.35kB at 0B/s)
[INFO] Adding repository http://build.eclipse.org/rt/rap/base-platforms/2.3/extra-dependencies
[INFO] Fetching content.jar from http://build.eclipse.org/rt/rap/base-platforms/2.3/extra-dependencies/ (0B of 4.3kB at 0B/s)
[INFO] Fetching p2.index from http://download.eclipse.org/tools/orbit/downloads/drops/R20140114142710/repository/ (0B at 0B/s)
[INFO] Adding repository http://download.eclipse.org/tools/orbit/downloads/drops/R20140114142710/repository
[INFO] Fetching content.jar from http://download.eclipse.org/tools/orbit/downloads/drops/R20140114142710/repository/ (0B of 174.16kB at 0B/s)
[INFO] Adding repository http://build.eclipse.org/rt/rap/incubator/nightly/fileupload
[INFO] Fetching content.jar from http://build.eclipse.org/rt/rap/incubator/nightly/fileupload/ (0B of 8.3kB at 0B/s)
[INFO] Adding repository http://build.eclipse.org/rt/rap/incubator/nightly/clientscripting
[INFO] Fetching content.jar from http://build.eclipse.org/rt/rap/incubator/nightly/clientscripting/ (0B of 9.55kB at 0B/s)
[INFO] Fetching p2.index from http://download.eclipse.org/cbi/updates/license/ (0B at 0B/s)
[INFO] Adding repository http://download.eclipse.org/cbi/updates/license
[INFO] Fetching compositeContent.jar from http://download.eclipse.org/cbi/updates/license/ (0B of 414B at 0B/s)
[INFO] Fetching content.jar from http://download.eclipse.org/cbi/updates/license/1.0.0.v20131003-1638/ (0B of 3.87kB at 0B/s)
[INFO] Fetching content.jar from http://download.eclipse.org/cbi/updates/license/1.0.1.v20140414-1359/ (0B of 3.83kB at 0B/s)
[INFO] Resolving dependencies of MavenProject: org.eclipse.rap.incubator:org.eclipse.rap.addons.ckeditor:0.2.0-SNAPSHOT @ /jobs/genie.rap/rap-head-incubator-richtext/workspace/org.eclipse.rap.incubator.richtext/bundles/org.eclipse.rap.addons.ckeditor/pom.xml
[INFO] Fetching javax.servlet_3.1.0.v201410161800.jar.pack.gz from http://download.eclipse.org/rt/rap/nightly/runtime/plugins/ (0B of 60.2kB at 0B/s)
[INFO] Fetching org.eclipse.rap.rwt_3.1.0.20160115-1138.jar.pack.gz from http://download.eclipse.org/rt/rap/nightly/runtime/plugins/ (0B of 1.21MB at 0B/s)
[INFO] Resolving class path of MavenProject: org.eclipse.rap.incubator:org.eclipse.rap.addons.ckeditor:0.2.0-SNAPSHOT @ /jobs/genie.rap/rap-head-incubator-richtext/workspace/org.eclipse.rap.incubator.richtext/bundles/org.eclipse.rap.addons.ckeditor/pom.xml
[INFO] Computing target platform for MavenProject: org.eclipse.rap.incubator:org.eclipse.rap.addons.ckeditor.test:0.2.0-SNAPSHOT @ /jobs/genie.rap/rap-head-incubator-richtext/workspace/org.eclipse.rap.incubator.richtext/tests/org.eclipse.rap.addons.ckeditor.test/pom.xml
[INFO] Resolving dependencies of MavenProject: org.eclipse.rap.incubator:org.eclipse.rap.addons.ckeditor.test:0.2.0-SNAPSHOT @ /jobs/genie.rap/rap-head-incubator-richtext/workspace/org.eclipse.rap.incubator.richtext/tests/org.eclipse.rap.addons.ckeditor.test/pom.xml
[INFO] Fetching org.junit_4.12.0.v201504281640.jar.pack.gz from http://download.eclipse.org/rt/rap/nightly/runtime/plugins/ (0B of 283.72kB at 0B/s)
[INFO] Fetching org.mockito.mockito-all_1.9.5.jar from http://build.eclipse.org/rt/rap/base-platforms/2.3/extra-dependencies/plugins/ (0B of 1.51MB at 0B/s)
[INFO] Fetching org.eclipse.rap.rwt.testfixture_3.1.0.20160115-1140.jar.pack.gz from http://download.eclipse.org/rt/rap/nightly/runtime/plugins/ (0B of 35.06kB at 0B/s)
[INFO] Fetching org.eclipse.rap.rwt.testfixture_3.1.0.20160115-1140.jar from http://download.eclipse.org/rt/rap/nightly/runtime/plugins/ (0B of 80.07kB at 0B/s)
[WARNING] Some attempts to read artifact osgi.bundle,org.eclipse.rap.rwt.testfixture,3.1.0.20160115-1140 failed:
[WARNING]    An error occurred while transferring artifact packed: osgi.bundle,org.eclipse.rap.rwt.testfixture,3.1.0.20160115-1140 from repository http://download.eclipse.org/rt/rap/nightly/runtime:
[WARNING]       Problems downloading artifact: osgi.bundle,org.eclipse.rap.rwt.testfixture,3.1.0.20160115-1140.:
[WARNING]          Unpacking fails because intermediate file is empty: /home/hudson/genie.rap/.hudson/jobs/rap-head-incubator-richtext/workspace/tmp/work6183250152681197347/p2.optimizers.incoming5126740448564244857.jar
[INFO] Fetching org.hamcrest.core_1.3.0.v201303031735.jar.pack.gz from http://download.eclipse.org/rt/rap/nightly/runtime/plugins/ (0B of 19.33kB at 0B/s)
[INFO] Resolving class path of MavenProject: org.eclipse.rap.incubator:org.eclipse.rap.addons.ckeditor.test:0.2.0-SNAPSHOT @ /jobs/genie.rap/rap-head-incubator-richtext/workspace/org.eclipse.rap.incubator.richtext/tests/org.eclipse.rap.addons.ckeditor.test/pom.xml
[INFO] Computing target platform for MavenProject: org.eclipse.rap.incubator:org.eclipse.rap.demo.ckeditor:0.2.0-SNAPSHOT @ /jobs/genie.rap/rap-head-incubator-richtext/workspace/org.eclipse.rap.incubator.richtext/examples/org.eclipse.rap.demo.ckeditor/pom.xml
[INFO] Resolving dependencies of MavenProject: org.eclipse.rap.incubator:org.eclipse.rap.demo.ckeditor:0.2.0-SNAPSHOT @ /jobs/genie.rap/rap-head-incubator-richtext/workspace/org.eclipse.rap.incubator.richtext/examples/org.eclipse.rap.demo.ckeditor/pom.xml
[INFO] Fetching org.eclipse.osgi_3.10.200.v20151207-2221.jar.pack.gz from http://download.eclipse.org/rt/rap/nightly/runtime/plugins/ (0B of 414.24kB at 0B/s)
[INFO] Resolving class path of MavenProject: org.eclipse.rap.incubator:org.eclipse.rap.demo.ckeditor:0.2.0-SNAPSHOT @ /jobs/genie.rap/rap-head-incubator-richtext/workspace/org.eclipse.rap.incubator.richtext/examples/org.eclipse.rap.demo.ckeditor/pom.xml
[INFO] Computing target platform for MavenProject: org.eclipse.rap.incubator:org.eclipse.rap.examples.pages.ckeditor:0.2.0-SNAPSHOT @ /jobs/genie.rap/rap-head-incubator-richtext/workspace/org.eclipse.rap.incubator.richtext/examples/org.eclipse.rap.examples.pages.ckeditor/pom.xml
[INFO] Resolving dependencies of MavenProject: org.eclipse.rap.incubator:org.eclipse.rap.examples.pages.ckeditor:0.2.0-SNAPSHOT @ /jobs/genie.rap/rap-head-incubator-richtext/workspace/org.eclipse.rap.incubator.richtext/examples/org.eclipse.rap.examples.pages.ckeditor/pom.xml
[INFO] Fetching org.eclipse.rap.examples_3.1.0.20160115-1140.jar.pack.gz from http://download.eclipse.org/rt/rap/nightly/runtime/plugins/ (0B of 35.37kB at 0B/s)
[INFO] Fetching org.eclipse.rap.examples_3.1.0.20160115-1140.jar from http://download.eclipse.org/rt/rap/nightly/runtime/plugins/ (0B of 56.71kB at 0B/s)
[WARNING] Some attempts to read artifact osgi.bundle,org.eclipse.rap.examples,3.1.0.20160115-1140 failed:
[WARNING]    An error occurred while transferring artifact packed: osgi.bundle,org.eclipse.rap.examples,3.1.0.20160115-1140 from repository http://download.eclipse.org/rt/rap/nightly/runtime:
[WARNING]       Problems downloading artifact: osgi.bundle,org.eclipse.rap.examples,3.1.0.20160115-1140.:
[WARNING]          Unpacking fails because intermediate file is empty: /home/hudson/genie.rap/.hudson/jobs/rap-head-incubator-richtext/workspace/tmp/work8610960192459636902/p2.optimizers.incoming6588425278285795785.jar
[INFO] Resolving class path of MavenProject: org.eclipse.rap.incubator:org.eclipse.rap.examples.pages.ckeditor:0.2.0-SNAPSHOT @ /jobs/genie.rap/rap-head-incubator-richtext/workspace/org.eclipse.rap.incubator.richtext/examples/org.eclipse.rap.examples.pages.ckeditor/pom.xml
[INFO] Computing target platform for MavenProject: org.eclipse.rap.incubator:org.eclipse.rap.richtext.feature:0.2.0-SNAPSHOT @ /jobs/genie.rap/rap-head-incubator-richtext/workspace/org.eclipse.rap.incubator.richtext/features/org.eclipse.rap.richtext.feature/pom.xml
[INFO] Resolving dependencies of MavenProject: org.eclipse.rap.incubator:org.eclipse.rap.richtext.feature:0.2.0-SNAPSHOT @ /jobs/genie.rap/rap-head-incubator-richtext/workspace/org.eclipse.rap.incubator.richtext/features/org.eclipse.rap.richtext.feature/pom.xml
[INFO] Fetching org.eclipse.license_1.0.1.v20140414-1359.jar from http://download.eclipse.org/cbi/updates/license/1.0.1.v20140414-1359/features/ (0B of 18.64kB at 0B/s)
[INFO] Resolving class path of MavenProject: org.eclipse.rap.incubator:org.eclipse.rap.richtext.feature:0.2.0-SNAPSHOT @ /jobs/genie.rap/rap-head-incubator-richtext/workspace/org.eclipse.rap.incubator.richtext/features/org.eclipse.rap.richtext.feature/pom.xml
[INFO] Computing target platform for MavenProject: org.eclipse.rap.incubator:org.eclipse.rap.richtext-repository:0.2.0-SNAPSHOT @ /jobs/genie.rap/rap-head-incubator-richtext/workspace/org.eclipse.rap.incubator.richtext/releng/org.eclipse.rap.richtext.build/repository/pom.xml
[INFO] Resolving dependencies of MavenProject: org.eclipse.rap.incubator:org.eclipse.rap.richtext-repository:0.2.0-SNAPSHOT @ /jobs/genie.rap/rap-head-incubator-richtext/workspace/org.eclipse.rap.incubator.richtext/releng/org.eclipse.rap.richtext.build/repository/pom.xml
[INFO] Resolving class path of MavenProject: org.eclipse.rap.incubator:org.eclipse.rap.richtext-repository:0.2.0-SNAPSHOT @ /jobs/genie.rap/rap-head-incubator-richtext/workspace/org.eclipse.rap.incubator.richtext/releng/org.eclipse.rap.richtext.build/repository/pom.xml
[INFO] ------------------------------------------------------------------------
[INFO] Reactor Build Order:
[INFO] 
[INFO] org.eclipse.rap.addons.ckeditor
[INFO] org.eclipse.rap.addons.ckeditor.test
[INFO] org.eclipse.rap.demo.ckeditor
[INFO] org.eclipse.rap.examples.pages.ckeditor
[INFO] org.eclipse.rap.richtext.feature
[INFO] org.eclipse.rap.richtext-repository
[INFO] org.eclipse.rap.richtext.build
[INFO] 
[INFO] Using the builder org.apache.maven.lifecycle.internal.builder.singlethreaded.SingleThreadedBuilder with a thread count of 1
[INFO]                                                                         
[INFO] ------------------------------------------------------------------------
[INFO] Building org.eclipse.rap.addons.ckeditor 0.2.0-SNAPSHOT
[INFO] ------------------------------------------------------------------------
[INFO] 
[INFO] --- maven-clean-plugin:2.5:clean (default-clean) @ org.eclipse.rap.addons.ckeditor ---
[INFO] 
[INFO] --- tycho-packaging-plugin:0.20.0:build-qualifier (default-build-qualifier) @ org.eclipse.rap.addons.ckeditor ---
[INFO] The project's OSGi version is 0.2.0.20150623-1041
[INFO] 
[INFO] --- tycho-packaging-plugin:0.20.0:validate-id (default-validate-id) @ org.eclipse.rap.addons.ckeditor ---
[INFO] 
[INFO] --- tycho-packaging-plugin:0.20.0:validate-version (default-validate-version) @ org.eclipse.rap.addons.ckeditor ---
[INFO] 
[INFO] --- maven-resources-plugin:2.4.3:resources (default-resources) @ org.eclipse.rap.addons.ckeditor ---
[INFO] Using 'UTF-8' encoding to copy filtered resources.
[INFO] skip non existing resourceDirectory /jobs/genie.rap/rap-head-incubator-richtext/workspace/org.eclipse.rap.incubator.richtext/bundles/org.eclipse.rap.addons.ckeditor/src/main/resources
[INFO] 
[INFO] --- tycho-compiler-plugin:0.20.0:compile (default-compile) @ org.eclipse.rap.addons.ckeditor ---
[INFO] Compiling 1 source file to /jobs/genie.rap/rap-head-incubator-richtext/workspace/org.eclipse.rap.incubator.richtext/bundles/org.eclipse.rap.addons.ckeditor/target/classes
[INFO] 
[INFO] --- maven-resources-plugin:2.4.3:testResources (default-testResources) @ org.eclipse.rap.addons.ckeditor ---
[INFO] Using 'UTF-8' encoding to copy filtered resources.
[INFO] skip non existing resourceDirectory /jobs/genie.rap/rap-head-incubator-richtext/workspace/org.eclipse.rap.incubator.richtext/bundles/org.eclipse.rap.addons.ckeditor/src/test/resources
[INFO] 
[INFO] --- maven-surefire-plugin:2.15:test (test) @ org.eclipse.rap.addons.ckeditor ---
[INFO] 
[INFO] --- tycho-source-plugin:0.20.0:plugin-source (plugin-source) @ org.eclipse.rap.addons.ckeditor ---
[WARNING] bundle localization file /jobs/genie.rap/rap-head-incubator-richtext/workspace/org.eclipse.rap.incubator.richtext/bundles/org.eclipse.rap.addons.ckeditor/plugin.properties not found
[INFO] Building jar: /jobs/genie.rap/rap-head-incubator-richtext/workspace/org.eclipse.rap.incubator.richtext/bundles/org.eclipse.rap.addons.ckeditor/target/org.eclipse.rap.addons.ckeditor-0.2.0-SNAPSHOT-sources.jar
[INFO] 
[INFO] --- tycho-packaging-plugin:0.20.0:package-plugin (default-package-plugin) @ org.eclipse.rap.addons.ckeditor ---
[INFO] Building jar: /jobs/genie.rap/rap-head-incubator-richtext/workspace/org.eclipse.rap.incubator.richtext/bundles/org.eclipse.rap.addons.ckeditor/target/org.eclipse.rap.addons.ckeditor-0.2.0-SNAPSHOT.jar
[INFO] 
[INFO] --- tycho-p2-plugin:0.20.0:p2-metadata-default (default-p2-metadata-default) @ org.eclipse.rap.addons.ckeditor ---
[INFO] MavenProject: org.eclipse.rap.incubator:org.eclipse.rap.addons.ckeditor:0.2.0-SNAPSHOT @ /jobs/genie.rap/rap-head-incubator-richtext/workspace/org.eclipse.rap.incubator.richtext/bundles/org.eclipse.rap.addons.ckeditor/pom.xml
    The main artifact has been replaced with the baseline version.
    The following attached artifacts have been replaced with the baseline version: [sources]

[INFO]                                                                         
[INFO] ------------------------------------------------------------------------
[INFO] Building org.eclipse.rap.addons.ckeditor.test 0.2.0-SNAPSHOT
[INFO] ------------------------------------------------------------------------
[INFO] 
[INFO] --- maven-clean-plugin:2.5:clean (default-clean) @ org.eclipse.rap.addons.ckeditor.test ---
[INFO] 
[INFO] --- tycho-packaging-plugin:0.20.0:build-qualifier (default-build-qualifier) @ org.eclipse.rap.addons.ckeditor.test ---
[INFO] The project's OSGi version is 0.2.0.20150623-1041
[INFO] 
[INFO] --- tycho-packaging-plugin:0.20.0:validate-id (default-validate-id) @ org.eclipse.rap.addons.ckeditor.test ---
[INFO] 
[INFO] --- tycho-packaging-plugin:0.20.0:validate-version (default-validate-version) @ org.eclipse.rap.addons.ckeditor.test ---
[INFO] 
[INFO] --- maven-resources-plugin:2.4.3:resources (default-resources) @ org.eclipse.rap.addons.ckeditor.test ---
[INFO] Using 'UTF-8' encoding to copy filtered resources.
[INFO] skip non existing resourceDirectory /jobs/genie.rap/rap-head-incubator-richtext/workspace/org.eclipse.rap.incubator.richtext/tests/org.eclipse.rap.addons.ckeditor.test/src/main/resources
[INFO] 
[INFO] --- tycho-compiler-plugin:0.20.0:compile (default-compile) @ org.eclipse.rap.addons.ckeditor.test ---
[INFO] Compiling 1 source file to /jobs/genie.rap/rap-head-incubator-richtext/workspace/org.eclipse.rap.incubator.richtext/tests/org.eclipse.rap.addons.ckeditor.test/target/classes
[INFO] 
[INFO] --- maven-resources-plugin:2.4.3:testResources (default-testResources) @ org.eclipse.rap.addons.ckeditor.test ---
[INFO] Using 'UTF-8' encoding to copy filtered resources.
[INFO] skip non existing resourceDirectory /jobs/genie.rap/rap-head-incubator-richtext/workspace/org.eclipse.rap.incubator.richtext/tests/org.eclipse.rap.addons.ckeditor.test/src/test/resources
[INFO] 
[INFO] --- maven-surefire-plugin:2.15:test (test) @ org.eclipse.rap.addons.ckeditor.test ---
[INFO] Surefire report directory: /jobs/genie.rap/rap-head-incubator-richtext/workspace/org.eclipse.rap.incubator.richtext/tests/org.eclipse.rap.addons.ckeditor.test/target/surefire-reports

-------------------------------------------------------
 T E S T S
-------------------------------------------------------
Running org.eclipse.rap.addons.ckeditor.CKEditor_Test
Tests run: 1, Failures: 0, Errors: 1, Skipped: 0, Time elapsed: 0.049 sec <<< FAILURE! - in org.eclipse.rap.addons.ckeditor.CKEditor_Test
initializationError(org.eclipse.rap.addons.ckeditor.CKEditor_Test)  Time elapsed: 0.01 sec  <<< ERROR!
java.lang.UnsupportedClassVersionError: org/eclipse/rap/rwt/testfixture/TestContext : Unsupported major.minor version 52.0
	at java.lang.ClassLoader.defineClass1(Native Method)
	at java.lang.ClassLoader.defineClass(ClassLoader.java:800)
	at java.security.SecureClassLoader.defineClass(SecureClassLoader.java:142)
	at java.net.URLClassLoader.defineClass(URLClassLoader.java:449)
	at java.net.URLClassLoader.access$100(URLClassLoader.java:71)
	at java.net.URLClassLoader$1.run(URLClassLoader.java:361)
	at java.net.URLClassLoader$1.run(URLClassLoader.java:355)
	at java.security.AccessController.doPrivileged(Native Method)
	at java.net.URLClassLoader.findClass(URLClassLoader.java:354)
	at java.lang.ClassLoader.loadClass(ClassLoader.java:425)
	at sun.misc.Launcher$AppClassLoader.loadClass(Launcher.java:308)
	at java.lang.ClassLoader.loadClass(ClassLoader.java:358)
	at java.lang.Class.getDeclaredFields0(Native Method)
	at java.lang.Class.privateGetDeclaredFields(Class.java:2509)
	at java.lang.Class.getDeclaredFields(Class.java:1819)
	at org.junit.runners.model.TestClass.<init>(TestClass.java:49)
	at org.junit.runners.ParentRunner.<init>(ParentRunner.java:75)
	at org.junit.runners.BlockJUnit4ClassRunner.<init>(BlockJUnit4ClassRunner.java:57)
	at org.junit.internal.builders.JUnit4Builder.runnerForClass(JUnit4Builder.java:10)
	at org.junit.runners.model.RunnerBuilder.safeRunnerForClass(RunnerBuilder.java:59)
	at org.junit.internal.builders.AllDefaultPossibilitiesBuilder.runnerForClass(AllDefaultPossibilitiesBuilder.java:26)
	at org.junit.runners.model.RunnerBuilder.safeRunnerForClass(RunnerBuilder.java:59)
	at org.junit.internal.requests.ClassRequest.getRunner(ClassRequest.java:26)
	at org.apache.maven.surefire.junit4.JUnit4Provider.execute(JUnit4Provider.java:262)
	at org.apache.maven.surefire.junit4.JUnit4Provider.executeTestSet(JUnit4Provider.java:153)
	at org.apache.maven.surefire.junit4.JUnit4Provider.invoke(JUnit4Provider.java:124)
	at org.apache.maven.surefire.booter.ForkedBooter.invokeProviderInSameClassLoader(ForkedBooter.java:200)
	at org.apache.maven.surefire.booter.ForkedBooter.runSuitesInProcess(ForkedBooter.java:153)
	at org.apache.maven.surefire.booter.ForkedBooter.main(ForkedBooter.java:103)


Results :

Tests in error: 
  CKEditor_Test.initializationError » UnsupportedClassVersion org/eclipse/rap/rw...

Tests run: 1, Failures: 0, Errors: 1, Skipped: 0

[INFO] ------------------------------------------------------------------------
[INFO] Reactor Summary:
[INFO] 
[INFO] org.eclipse.rap.addons.ckeditor ................... SUCCESS [  8.774 s]
[INFO] org.eclipse.rap.addons.ckeditor.test .............. FAILURE [  0.795 s]
[INFO] org.eclipse.rap.demo.ckeditor ..................... SKIPPED
[INFO] org.eclipse.rap.examples.pages.ckeditor ........... SKIPPED
[INFO] org.eclipse.rap.richtext.feature .................. SKIPPED
[INFO] org.eclipse.rap.richtext-repository ............... SKIPPED
[INFO] org.eclipse.rap.richtext.build .................... SKIPPED
[INFO] ------------------------------------------------------------------------
[INFO] BUILD FAILURE
[INFO] ------------------------------------------------------------------------
[INFO] Total time: 25.062 s
[INFO] Finished at: 2016-01-20T20:28:01-05:00
[INFO] Final Memory: 67M/1932M
[INFO] ------------------------------------------------------------------------
[ERROR] Failed to execute goal org.apache.maven.plugins:maven-surefire-plugin:2.15:test (test) on project org.eclipse.rap.addons.ckeditor.test: There are test failures.
[ERROR] 
[ERROR] Please refer to /jobs/genie.rap/rap-head-incubator-richtext/workspace/org.eclipse.rap.incubator.richtext/tests/org.eclipse.rap.addons.ckeditor.test/target/surefire-reports for the individual test results.
[ERROR] -> [Help 1]
org.apache.maven.lifecycle.LifecycleExecutionException: Failed to execute goal org.apache.maven.plugins:maven-surefire-plugin:2.15:test (test) on project org.eclipse.rap.addons.ckeditor.test: There are test failures.

Please refer to /jobs/genie.rap/rap-head-incubator-richtext/workspace/org.eclipse.rap.incubator.richtext/tests/org.eclipse.rap.addons.ckeditor.test/target/surefire-reports for the individual test results.
	at org.apache.maven.lifecycle.internal.MojoExecutor.execute(MojoExecutor.java:212)
	at org.apache.maven.lifecycle.internal.MojoExecutor.execute(MojoExecutor.java:153)
	at org.apache.maven.lifecycle.internal.MojoExecutor.execute(MojoExecutor.java:145)
	at org.apache.maven.lifecycle.internal.LifecycleModuleBuilder.buildProject(LifecycleModuleBuilder.java:108)
	at org.apache.maven.lifecycle.internal.LifecycleModuleBuilder.buildProject(LifecycleModuleBuilder.java:76)
	at org.apache.maven.lifecycle.internal.builder.singlethreaded.SingleThreadedBuilder.build(SingleThreadedBuilder.java:51)
	at org.apache.maven.lifecycle.internal.LifecycleStarter.execute(LifecycleStarter.java:116)
	at org.apache.maven.DefaultMaven.doExecute(DefaultMaven.java:361)
	at org.apache.maven.DefaultMaven.execute(DefaultMaven.java:155)
	at org.apache.maven.cli.MavenCli.execute(MavenCli.java:584)
	at org.apache.maven.cli.MavenCli.doMain(MavenCli.java:213)
	at org.apache.maven.cli.MavenCli.main(MavenCli.java:157)
	at sun.reflect.NativeMethodAccessorImpl.invoke0(Native Method)
	at sun.reflect.NativeMethodAccessorImpl.invoke(NativeMethodAccessorImpl.java:57)
	at sun.reflect.DelegatingMethodAccessorImpl.invoke(DelegatingMethodAccessorImpl.java:43)
	at java.lang.reflect.Method.invoke(Method.java:606)
	at org.codehaus.plexus.classworlds.launcher.Launcher.launchEnhanced(Launcher.java:289)
	at org.codehaus.plexus.classworlds.launcher.Launcher.launch(Launcher.java:229)
	at org.codehaus.plexus.classworlds.launcher.Launcher.mainWithExitCode(Launcher.java:415)
	at org.codehaus.plexus.classworlds.launcher.Launcher.main(Launcher.java:356)
Caused by: org.apache.maven.plugin.MojoFailureException: There are test failures.

Please refer to /jobs/genie.rap/rap-head-incubator-richtext/workspace/org.eclipse.rap.incubator.richtext/tests/org.eclipse.rap.addons.ckeditor.test/target/surefire-reports for the individual test results.
	at org.apache.maven.plugin.surefire.SurefireHelper.reportExecution(SurefireHelper.java:82)
	at org.apache.maven.plugin.surefire.SurefirePlugin.handleSummary(SurefirePlugin.java:169)
	at org.apache.maven.plugin.surefire.AbstractSurefireMojo.executeAfterPreconditionsChecked(AbstractSurefireMojo.java:777)
	at org.apache.maven.plugin.surefire.AbstractSurefireMojo.execute(AbstractSurefireMojo.java:645)
	at org.apache.maven.plugin.DefaultBuildPluginManager.executeMojo(DefaultBuildPluginManager.java:133)
	at org.apache.maven.lifecycle.internal.MojoExecutor.execute(MojoExecutor.java:208)
	... 19 more
[ERROR] 
[ERROR] Re-run Maven using the -X switch to enable full debug logging.
[ERROR] 
[ERROR] For more information about the errors and possible solutions, please read the following articles:
[ERROR] [Help 1] http://cwiki.apache.org/confluence/display/MAVEN/MojoFailureException
[ERROR] 
[ERROR] After correcting the problems, you can resume the build with the command
[ERROR]   mvn <goals> -rf :org.eclipse.rap.addons.ckeditor.test
Maven exited with error code  + 1
[locks-and-latches] Releasing all the locks
[locks-and-latches] All the locks released
Archiving artifacts
Recording test results
Sending e-mails to: rsternberg@eclipsesource.com mknauer@eclipsesource.com ivan@eclipsesource.com tbuschto@eclipsesource.com
Finished: FAILURE