FailedConsole Output

Skipping 230 KB.. Full Log
rwt/js/rwt/html/ImagePreloader.js	1663
/jobs/genie.rap/rap-3.1-runtime/workspace/org.eclipse.rap/bundles/org.eclipse.rap.rwt/js/rwt/widgets/util/Layout.js	391
/jobs/genie.rap/rap-3.1-runtime/workspace/org.eclipse.rap/bundles/org.eclipse.rap.rwt/js/rwt/widgets/base/HorizontalBoxLayout.js	96
/jobs/genie.rap/rap-3.1-runtime/workspace/org.eclipse.rap/bundles/org.eclipse.rap.rwt/js/rwt/widgets/base/Spinner.js	8756
/jobs/genie.rap/rap-3.1-runtime/workspace/org.eclipse.rap/bundles/org.eclipse.rap.rwt/js/rwt/widgets/base/BasicText.js	10077
/jobs/genie.rap/rap-3.1-runtime/workspace/org.eclipse.rap/bundles/org.eclipse.rap.rwt/js/rwt/widgets/base/VerticalBoxLayout.js	144
/jobs/genie.rap/rap-3.1-runtime/workspace/org.eclipse.rap/bundles/org.eclipse.rap.rwt/js/rwt/util/Range.js	922
/jobs/genie.rap/rap-3.1-runtime/workspace/org.eclipse.rap/bundles/org.eclipse.rap.rwt/js/rwt/widgets/TabFolder.js	1202
/jobs/genie.rap/rap-3.1-runtime/workspace/org.eclipse.rap/bundles/org.eclipse.rap.rwt/js/rwt/widgets/util/RadioManager.js	1829
/jobs/genie.rap/rap-3.1-runtime/workspace/org.eclipse.rap/bundles/org.eclipse.rap.rwt/js/rwt/widgets/base/TabFolderBar.js	457
/jobs/genie.rap/rap-3.1-runtime/workspace/org.eclipse.rap/bundles/org.eclipse.rap.rwt/js/rwt/widgets/base/TabFolderPane.js	296
/jobs/genie.rap/rap-3.1-runtime/workspace/org.eclipse.rap/bundles/org.eclipse.rap.rwt/js/rwt/widgets/base/Popup.js	3474
/jobs/genie.rap/rap-3.1-runtime/workspace/org.eclipse.rap/bundles/org.eclipse.rap.rwt/js/rwt/widgets/util/PopupManager.js	348
/jobs/genie.rap/rap-3.1-runtime/workspace/org.eclipse.rap/bundles/org.eclipse.rap.rwt/js/rwt/widgets/util/SelectionManager.js	12198
/jobs/genie.rap/rap-3.1-runtime/workspace/org.eclipse.rap/bundles/org.eclipse.rap.rwt/js/rwt/widgets/util/Selection.js	808
/jobs/genie.rap/rap-3.1-runtime/workspace/org.eclipse.rap/bundles/org.eclipse.rap.rwt/js/rwt/widgets/util/ScrollBarsActivator.js	2535
/jobs/genie.rap/rap-3.1-runtime/workspace/org.eclipse.rap/bundles/org.eclipse.rap.rwt/js/rwt/widgets/base/AbstractSlider.js	9961
/jobs/genie.rap/rap-3.1-runtime/workspace/org.eclipse.rap/bundles/org.eclipse.rap.rwt/js/rwt/widgets/base/ScrollBar.js	2880
/jobs/genie.rap/rap-3.1-runtime/workspace/org.eclipse.rap/bundles/org.eclipse.rap.rwt/js/rwt/html/ImagePreloaderSystem.js	1426
/jobs/genie.rap/rap-3.1-runtime/workspace/org.eclipse.rap/bundles/org.eclipse.rap.rwt/js/rwt/html/Iframes.js	350
/jobs/genie.rap/rap-3.1-runtime/workspace/org.eclipse.rap/bundles/org.eclipse.rap.rwt/js/rwt/remote/Request.js	1878
/jobs/genie.rap/rap-3.1-runtime/workspace/org.eclipse.rap/bundles/org.eclipse.rap.rwt/js/rwt/widgets/util/ToolTipManager.js	1886
/jobs/genie.rap/rap-3.1-runtime/workspace/org.eclipse.rap/bundles/org.eclipse.rap.rwt/js/rwt/client/FileUploader.js	731
/jobs/genie.rap/rap-3.1-runtime/workspace/org.eclipse.rap/bundles/org.eclipse.rap.rwt/js/rwt/remote/handler/FileUploaderHandler.js	157
/jobs/genie.rap/rap-3.1-runtime/workspace/org.eclipse.rap/bundles/org.eclipse.rap.rwt/js/rwt/client/BrowserNavigation.js	2030
/jobs/genie.rap/rap-3.1-runtime/workspace/org.eclipse.rap/bundles/org.eclipse.rap.rwt/js/rwt/remote/handler/BrowserNavigationHandler.js	244
/jobs/genie.rap/rap-3.1-runtime/workspace/org.eclipse.rap/bundles/org.eclipse.rap.rwt/js/rwt/event/DragAndDropHandler.js	8052
/jobs/genie.rap/rap-3.1-runtime/workspace/org.eclipse.rap/bundles/org.eclipse.rap.rwt/js/rwt/event/DragEvent.js	1495
/jobs/genie.rap/rap-3.1-runtime/workspace/org.eclipse.rap/bundles/org.eclipse.rap.rwt/js/rwt/widgets/base/Iframe.js	5433
/jobs/genie.rap/rap-3.1-runtime/workspace/org.eclipse.rap/bundles/org.eclipse.rap.rwt/js/rwt/widgets/util/MResizable.js	5013
/jobs/genie.rap/rap-3.1-runtime/workspace/org.eclipse.rap/bundles/org.eclipse.rap.rwt/js/rwt/widgets/base/ResizablePopup.js	639
/jobs/genie.rap/rap-3.1-runtime/workspace/org.eclipse.rap/bundles/org.eclipse.rap.rwt/js/rwt/widgets/base/Window.js	13236
/jobs/genie.rap/rap-3.1-runtime/workspace/org.eclipse.rap/bundles/org.eclipse.rap.rwt/js/rwt/widgets/base/HorizontalSpacer.js	209
/jobs/genie.rap/rap-3.1-runtime/workspace/org.eclipse.rap/bundles/org.eclipse.rap.rwt/js/rwt/widgets/util/WindowManager.js	1060
/jobs/genie.rap/rap-3.1-runtime/workspace/org.eclipse.rap/bundles/org.eclipse.rap.rwt/js/rwt/widgets/MenuItemSeparator.js	784
/jobs/genie.rap/rap-3.1-runtime/workspace/org.eclipse.rap/bundles/org.eclipse.rap.rwt/js/rwt/widgets/base/TabFolderPage.js	497
/jobs/genie.rap/rap-3.1-runtime/workspace/org.eclipse.rap/bundles/org.eclipse.rap.rwt/js/rwt/runtime/ErrorHandler.js	7901
/jobs/genie.rap/rap-3.1-runtime/workspace/org.eclipse.rap/bundles/org.eclipse.rap.rwt/js/rwt/widgets/util/CellRendererRegistry.js	2674
/jobs/genie.rap/rap-3.1-runtime/workspace/org.eclipse.rap/bundles/org.eclipse.rap.rwt/js/rwt/widgets/base/GridRowContainer.js	7762
/jobs/genie.rap/rap-3.1-runtime/workspace/org.eclipse.rap/bundles/org.eclipse.rap.rwt/js/rwt/widgets/util/GridRowContainerWrapper.js	4457
/jobs/genie.rap/rap-3.1-runtime/workspace/org.eclipse.rap/bundles/org.eclipse.rap.rwt/js/rwt/widgets/util/GridUtil.js	883
/jobs/genie.rap/rap-3.1-runtime/workspace/org.eclipse.rap/bundles/org.eclipse.rap.rwt/js/rwt/widgets/util/GridRowLayout.js	3493
/jobs/genie.rap/rap-3.1-runtime/workspace/org.eclipse.rap/bundles/org.eclipse.rap.rwt/js/rwt/widgets/util/GridSynchronizer.js	3082
/jobs/genie.rap/rap-3.1-runtime/workspace/org.eclipse.rap/bundles/org.eclipse.rap.rwt/js/rwt/widgets/base/GridRow.js	19272
/jobs/genie.rap/rap-3.1-runtime/workspace/org.eclipse.rap/bundles/org.eclipse.rap.rwt/js/rwt/widgets/Menu.js	10553
/jobs/genie.rap/rap-3.1-runtime/workspace/org.eclipse.rap/bundles/org.eclipse.rap.rwt/js/rwt/remote/handler/MenuHandler.js	928
/jobs/genie.rap/rap-3.1-runtime/workspace/org.eclipse.rap/bundles/org.eclipse.rap.rwt/js/rwt/remote/EventUtil.js	4930
/jobs/genie.rap/rap-3.1-runtime/workspace/org.eclipse.rap/bundles/org.eclipse.rap.rwt/js/rwt/widgets/util/ToolTipConfig.js	2176
/jobs/genie.rap/rap-3.1-runtime/workspace/org.eclipse.rap/bundles/org.eclipse.rap.rwt/js/rwt/widgets/base/WidgetToolTip.js	11640
/jobs/genie.rap/rap-3.1-runtime/workspace/org.eclipse.rap/bundles/org.eclipse.rap.rwt/js/rwt/theme/ThemeStore.js	6930
/jobs/genie.rap/rap-3.1-runtime/workspace/org.eclipse.rap/bundles/org.eclipse.rap.rwt/js/rwt/remote/handler/ThemeStoreHandler.js	700
/jobs/genie.rap/rap-3.1-runtime/workspace/org.eclipse.rap/bundles/org.eclipse.rap.rwt/js/rwt/widgets/base/MultiCellWidget.js	11748
/jobs/genie.rap/rap-3.1-runtime/workspace/org.eclipse.rap/bundles/org.eclipse.rap.rwt/js/rwt/widgets/TabItem.js	3515
/jobs/genie.rap/rap-3.1-runtime/workspace/org.eclipse.rap/bundles/org.eclipse.rap.rwt/js/rwt/widgets/ListItem.js	953
/jobs/genie.rap/rap-3.1-runtime/workspace/org.eclipse.rap/bundles/org.eclipse.rap.rwt/js/rwt/widgets/util/MenuManager.js	1040
/jobs/genie.rap/rap-3.1-runtime/workspace/org.eclipse.rap/bundles/org.eclipse.rap.rwt/js/rwt/widgets/MenuItem.js	5805
/jobs/genie.rap/rap-3.1-runtime/workspace/org.eclipse.rap/bundles/org.eclipse.rap.rwt/js/rwt/remote/handler/MenuItemHandler.js	1389
/jobs/genie.rap/rap-3.1-runtime/workspace/org.eclipse.rap/bundles/org.eclipse.rap.rwt/js/rwt/widgets/util/RadioButtonUtil.js	1562
/jobs/genie.rap/rap-3.1-runtime/workspace/org.eclipse.rap/bundles/org.eclipse.rap.rwt/js/rwt/widgets/MenuBar.js	4912
/jobs/genie.rap/rap-3.1-runtime/workspace/org.eclipse.rap/bundles/org.eclipse.rap.rwt/js/rwt/remote/DNDSupport.js	11870
/jobs/genie.rap/rap-3.1-runtime/workspace/org.eclipse.rap/bundles/org.eclipse.rap.rwt/js/rwt/widgets/DragSource.js	445
/jobs/genie.rap/rap-3.1-runtime/workspace/org.eclipse.rap/bundles/org.eclipse.rap.rwt/js/rwt/widgets/DropTarget.js	2023
/jobs/genie.rap/rap-3.1-runtime/workspace/org.eclipse.rap/bundles/org.eclipse.rap.rwt/js/rwt/remote/handler/DropTargetHandler.js	669
/jobs/genie.rap/rap-3.1-runtime/workspace/org.eclipse.rap/bundles/org.eclipse.rap.rwt/js/rwt/remote/handler/DragSourceHandler.js	472
/jobs/genie.rap/rap-3.1-runtime/workspace/org.eclipse.rap/bundles/org.eclipse.rap.rwt/js/rwt/theme/ThemeValues.js	2223
/jobs/genie.rap/rap-3.1-runtime/workspace/org.eclipse.rap/bundles/org.eclipse.rap.rwt/js/rwt/widgets/Grid.js	26859
/jobs/genie.rap/rap-3.1-runtime/workspace/org.eclipse.rap/bundles/org.eclipse.rap.rwt/js/rwt/remote/handler/ScrollBarHandler.js	1028
/jobs/genie.rap/rap-3.1-runtime/workspace/org.eclipse.rap/bundles/org.eclipse.rap.rwt/js/rwt/remote/handler/GridHandler.js	2355
/jobs/genie.rap/rap-3.1-runtime/workspace/org.eclipse.rap/bundles/org.eclipse.rap.rwt/js/rwt/widgets/GridItem.js	11590
/jobs/genie.rap/rap-3.1-runtime/workspace/org.eclipse.rap/bundles/org.eclipse.rap.rwt/js/rwt/remote/handler/GridItemHandler.js	1475
/jobs/genie.rap/rap-3.1-runtime/workspace/org.eclipse.rap/bundles/org.eclipse.rap.rwt/js/rwt/widgets/util/GridDNDFeedback.js	4499
/jobs/genie.rap/rap-3.1-runtime/workspace/org.eclipse.rap/bundles/org.eclipse.rap.rwt/js/rwt/widgets/util/GridCellToolTipSupport.js	1645
/jobs/genie.rap/rap-3.1-runtime/workspace/org.eclipse.rap/bundles/org.eclipse.rap.rwt/js/rwt/widgets/base/GridHeader.js	7206
/jobs/genie.rap/rap-3.1-runtime/workspace/org.eclipse.rap/bundles/org.eclipse.rap.rwt/js/rwt/widgets/GridColumn.js	4473
/jobs/genie.rap/rap-3.1-runtime/workspace/org.eclipse.rap/bundles/org.eclipse.rap.rwt/js/rwt/widgets/base/GridColumnLabel.js	5638
/jobs/genie.rap/rap-3.1-runtime/workspace/org.eclipse.rap/bundles/org.eclipse.rap.rwt/js/rwt/remote/handler/GridColumnHandler.js	844
/jobs/genie.rap/rap-3.1-runtime/workspace/org.eclipse.rap/bundles/org.eclipse.rap.rwt/js/rwt/remote/handler/GridColumnGroupHandler.js	439
/jobs/genie.rap/rap-3.1-runtime/workspace/org.eclipse.rap/bundles/org.eclipse.rap.rwt/js/rwt/widgets/Browser.js	5463
/jobs/genie.rap/rap-3.1-runtime/workspace/org.eclipse.rap/bundles/org.eclipse.rap.rwt/js/rwt/remote/handler/BrowserHandler.js	1131
/jobs/genie.rap/rap-3.1-runtime/workspace/org.eclipse.rap/bundles/org.eclipse.rap.rwt/js/rwt/widgets/ExternalBrowser.js	516
/jobs/genie.rap/rap-3.1-runtime/workspace/org.eclipse.rap/bundles/org.eclipse.rap.rwt/js/rwt/remote/handler/ExternalBrowserHandler.js	573
/jobs/genie.rap/rap-3.1-runtime/workspace/org.eclipse.rap/bundles/org.eclipse.rap.rwt/js/rwt/widgets/util/FontSizeCalculation.js	2285
/jobs/genie.rap/rap-3.1-runtime/workspace/org.eclipse.rap/bundles/org.eclipse.rap.rwt/js/rwt/remote/handler/TextSizeMeasurementHandler.js	169
/jobs/genie.rap/rap-3.1-runtime/workspace/org.eclipse.rap/bundles/org.eclipse.rap.rwt/js/rwt/widgets/Label.js	1894
/jobs/genie.rap/rap-3.1-runtime/workspace/org.eclipse.rap/bundles/org.eclipse.rap.rwt/js/rwt/widgets/base/BasicButton.js	5311
/jobs/genie.rap/rap-3.1-runtime/workspace/org.eclipse.rap/bundles/org.eclipse.rap.rwt/js/rwt/widgets/ToolItem.js	4135
/jobs/genie.rap/rap-3.1-runtime/workspace/org.eclipse.rap/bundles/org.eclipse.rap.rwt/js/rwt/widgets/Group.js	2979
/jobs/genie.rap/rap-3.1-runtime/workspace/org.eclipse.rap/bundles/org.eclipse.rap.rwt/js/rwt/remote/handler/GroupHandler.js	638
/jobs/genie.rap/rap-3.1-runtime/workspace/org.eclipse.rap/bundles/org.eclipse.rap.rwt/js/rwt/widgets/Shell.js	11488
/jobs/genie.rap/rap-3.1-runtime/workspace/org.eclipse.rap/bundles/org.eclipse.rap.rwt/js/rwt/remote/handler/ShellHandler.js	1706
/jobs/genie.rap/rap-3.1-runtime/workspace/org.eclipse.rap/bundles/org.eclipse.rap.rwt/js/rwt/widgets/ProgressBar.js	3899
/jobs/genie.rap/rap-3.1-runtime/workspace/org.eclipse.rap/bundles/org.eclipse.rap.rwt/js/rwt/remote/handler/ProgressBarHandler.js	1047
/jobs/genie.rap/rap-3.1-runtime/workspace/org.eclipse.rap/bundles/org.eclipse.rap.rwt/js/rwt/widgets/Link.js	5894
/jobs/genie.rap/rap-3.1-runtime/workspace/org.eclipse.rap/bundles/org.eclipse.rap.rwt/js/rwt/remote/handler/LinkHandler.js	864
/jobs/genie.rap/rap-3.1-runtime/workspace/org.eclipse.rap/bundles/org.eclipse.rap.rwt/js/rwt/widgets/base/Scrollable.js	7762
/jobs/genie.rap/rap-3.1-runtime/workspace/org.eclipse.rap/bundles/org.eclipse.rap.rwt/js/rwt/widgets/ScrolledComposite.js	3003
/jobs/genie.rap/rap-3.1-runtime/workspace/org.eclipse.rap/bundles/org.eclipse.rap.rwt/js/rwt/remote/handler/ScrolledCompositeHandler.js	1029
/jobs/genie.rap/rap-3.1-runtime/workspace/org.eclipse.rap/bundles/org.eclipse.rap.rwt/js/rwt/widgets/ToolBar.js	2163
/jobs/genie.rap/rap-3.1-runtime/workspace/org.eclipse.rap/bundles/org.eclipse.rap.rwt/js/rwt/remote/handler/ToolBarHandler.js	627
/jobs/genie.rap/rap-3.1-runtime/workspace/org.eclipse.rap/bundles/org.eclipse.rap.rwt/js/rwt/remote/handler/ToolItemHandler.js	1423
/jobs/genie.rap/rap-3.1-runtime/workspace/org.eclipse.rap/bundles/org.eclipse.rap.rwt/js/rwt/widgets/Scale.js	7315
/jobs/genie.rap/rap-3.1-runtime/workspace/org.eclipse.rap/bundles/org.eclipse.rap.rwt/js/rwt/remote/handler/ScaleHandler.js	1009
/jobs/genie.rap/rap-3.1-runtime/workspace/org.eclipse.rap/bundles/org.eclipse.rap.rwt/js/rwt/widgets/ToolItemSeparator.js	949
/jobs/genie.rap/rap-3.1-runtime/workspace/org.eclipse.rap/bundles/org.eclipse.rap.rwt/js/rwt/theme/BorderDefinitions.js	1118
/jobs/genie.rap/rap-3.1-runtime/workspace/org.eclipse.rap/bundles/org.eclipse.rap.rwt/js/rwt/widgets/Combo.js	8575
/jobs/genie.rap/rap-3.1-runtime/workspace/org.eclipse.rap/bundles/org.eclipse.rap.rwt/js/rwt/remote/handler/ComboHandler.js	1095
/jobs/genie.rap/rap-3.1-runtime/workspace/org.eclipse.rap/bundles/org.eclipse.rap.rwt/js/rwt/widgets/util/FocusIndicator.js	2713
/jobs/genie.rap/rap-3.1-runtime/workspace/org.eclipse.rap/bundles/org.eclipse.rap.rwt/js/rwt/remote/handler/GCHandler.js	477
/jobs/genie.rap/rap-3.1-runtime/workspace/org.eclipse.rap/bundles/org.eclipse.rap.rwt/js/rwt/widgets/GC.js	5324
/jobs/genie.rap/rap-3.1-runtime/workspace/org.eclipse.rap/bundles/org.eclipse.rap.rwt/js/rwt/remote/handler/CompositeHandler.js	955
/jobs/genie.rap/rap-3.1-runtime/workspace/org.eclipse.rap/bundles/org.eclipse.rap.rwt/js/rwt/widgets/Composite.js	681
/jobs/genie.rap/rap-3.1-runtime/workspace/org.eclipse.rap/bundles/org.eclipse.rap.rwt/js/rwt/widgets/Sash.js	5163
/jobs/genie.rap/rap-3.1-runtime/workspace/org.eclipse.rap/bundles/org.eclipse.rap.rwt/js/rwt/remote/handler/SashHandler.js	791
/jobs/genie.rap/rap-3.1-runtime/workspace/org.eclipse.rap/bundles/org.eclipse.rap.rwt/js/rwt/remote/handler/CanvasHandler.js	1404
/jobs/genie.rap/rap-3.1-runtime/workspace/org.eclipse.rap/bundles/org.eclipse.rap.rwt/js/rwt/widgets/List.js	8520
/jobs/genie.rap/rap-3.1-runtime/workspace/org.eclipse.rap/bundles/org.eclipse.rap.rwt/js/rwt/remote/handler/ListHandler.js	1352
/jobs/genie.rap/rap-3.1-runtime/workspace/org.eclipse.rap/bundles/org.eclipse.rap.rwt/js/rwt/widgets/util/TabUtil.js	2299
/jobs/genie.rap/rap-3.1-runtime/workspace/org.eclipse.rap/bundles/org.eclipse.rap.rwt/js/rwt/remote/handler/TabFolderHandler.js	946
/jobs/genie.rap/rap-3.1-runtime/workspace/org.eclipse.rap/bundles/org.eclipse.rap.rwt/js/rwt/remote/handler/TabItemHandler.js	1148
/jobs/genie.rap/rap-3.1-runtime/workspace/org.eclipse.rap/bundles/org.eclipse.rap.rwt/js/rwt/widgets/base/Calendar.js	9518
/jobs/genie.rap/rap-3.1-runtime/workspace/org.eclipse.rap/bundles/org.eclipse.rap.rwt/js/rwt/widgets/CoolItem.js	3025
/jobs/genie.rap/rap-3.1-runtime/workspace/org.eclipse.rap/bundles/org.eclipse.rap.rwt/js/rwt/remote/handler/CoolItemHandler.js	646
/jobs/genie.rap/rap-3.1-runtime/workspace/org.eclipse.rap/bundles/org.eclipse.rap.rwt/js/rwt/widgets/Button.js	2919
/jobs/genie.rap/rap-3.1-runtime/workspace/org.eclipse.rap/bundles/org.eclipse.rap.rwt/js/rwt/remote/handler/ButtonHandler.js	1422
/jobs/genie.rap/rap-3.1-runtime/workspace/org.eclipse.rap/bundles/org.eclipse.rap.rwt/js/rwt/widgets/FileUpload.js	5286
/jobs/genie.rap/rap-3.1-runtime/workspace/org.eclipse.rap/bundles/org.eclipse.rap.rwt/js/rwt/remote/handler/FileUploadHandler.js	842
/jobs/genie.rap/rap-3.1-runtime/workspace/org.eclipse.rap/bundles/org.eclipse.rap.rwt/js/rwt/widgets/Slider.js	3238
/jobs/genie.rap/rap-3.1-runtime/workspace/org.eclipse.rap/bundles/org.eclipse.rap.rwt/js/rwt/remote/handler/SliderHandler.js	717
/jobs/genie.rap/rap-3.1-runtime/workspace/org.eclipse.rap/bundles/org.eclipse.rap.rwt/js/rwt/widgets/Spinner.js	5671
/jobs/genie.rap/rap-3.1-runtime/workspace/org.eclipse.rap/bundles/org.eclipse.rap.rwt/js/rwt/remote/handler/SpinnerHandler.js	1520
/jobs/genie.rap/rap-3.1-runtime/workspace/org.eclipse.rap/bundles/org.eclipse.rap.rwt/js/rwt/widgets/DateTimeTime.js	8898
/jobs/genie.rap/rap-3.1-runtime/workspace/org.eclipse.rap/bundles/org.eclipse.rap.rwt/js/rwt/widgets/DateTimeDate.js	17752
/jobs/genie.rap/rap-3.1-runtime/workspace/org.eclipse.rap/bundles/org.eclipse.rap.rwt/js/rwt/widgets/DateTimeCalendar.js	2083
/jobs/genie.rap/rap-3.1-runtime/workspace/org.eclipse.rap/bundles/org.eclipse.rap.rwt/js/rwt/remote/handler/DateTimeHandler.js	1406
/jobs/genie.rap/rap-3.1-runtime/workspace/org.eclipse.rap/bundles/org.eclipse.rap.rwt/js/rwt/widgets/ExpandItem.js	1990
/jobs/genie.rap/rap-3.1-runtime/workspace/org.eclipse.rap/bundles/org.eclipse.rap.rwt/js/rwt/remote/handler/ExpandItemHandler.js	623
/jobs/genie.rap/rap-3.1-runtime/workspace/org.eclipse.rap/bundles/org.eclipse.rap.rwt/js/rwt/widgets/ExpandBar.js	961
/jobs/genie.rap/rap-3.1-runtime/workspace/org.eclipse.rap/bundles/org.eclipse.rap.rwt/js/rwt/remote/handler/ExpandBarHandler.js	759
/jobs/genie.rap/rap-3.1-runtime/workspace/org.eclipse.rap/bundles/org.eclipse.rap.rwt/js/rwt/widgets/Text.js	9947
/jobs/genie.rap/rap-3.1-runtime/workspace/org.eclipse.rap/bundles/org.eclipse.rap.rwt/js/rwt/remote/handler/TextHandler.js	1468
/jobs/genie.rap/rap-3.1-runtime/workspace/org.eclipse.rap/bundles/org.eclipse.rap.rwt/js/rwt/widgets/Separator.js	690
/jobs/genie.rap/rap-3.1-runtime/workspace/org.eclipse.rap/bundles/org.eclipse.rap.rwt/js/rwt/remote/handler/SeparatorHandler.js	845
/jobs/genie.rap/rap-3.1-runtime/workspace/org.eclipse.rap/bundles/org.eclipse.rap.rwt/js/rwt/widgets/ControlDecorator.js	901
/jobs/genie.rap/rap-3.1-runtime/workspace/org.eclipse.rap/bundles/org.eclipse.rap.rwt/js/rwt/remote/handler/ControlDecoratorHandler.js	703
/jobs/genie.rap/rap-3.1-runtime/workspace/org.eclipse.rap/bundles/org.eclipse.rap.rwt/js/rwt/runtime/MobileWebkitSupport.js	10963
/jobs/genie.rap/rap-3.1-runtime/workspace/org.eclipse.rap/bundles/org.eclipse.rap.rwt/js/rwt/widgets/ToolTip.js	3693
/jobs/genie.rap/rap-3.1-runtime/workspace/org.eclipse.rap/bundles/org.eclipse.rap.rwt/js/rwt/remote/handler/ToolTipHandler.js	882
/jobs/genie.rap/rap-3.1-runtime/workspace/org.eclipse.rap/bundles/org.eclipse.rap.rwt/js/rwt/remote/WidgetManager.js	1161
/jobs/genie.rap/rap-3.1-runtime/workspace/org.eclipse.rap/bundles/org.eclipse.rap.rwt/js/rwt/remote/MessageProcessor.js	4795
/jobs/genie.rap/rap-3.1-runtime/workspace/org.eclipse.rap/bundles/org.eclipse.rap.rwt/js/rwt/remote/MessageWriter.js	1090
/jobs/genie.rap/rap-3.1-runtime/workspace/org.eclipse.rap/bundles/org.eclipse.rap.rwt/js/rwt/client/ServerPush.js	1662
/jobs/genie.rap/rap-3.1-runtime/workspace/org.eclipse.rap/bundles/org.eclipse.rap.rwt/js/rwt/remote/handler/ServerPushHandler.js	153
/jobs/genie.rap/rap-3.1-runtime/workspace/org.eclipse.rap/bundles/org.eclipse.rap.rwt/js/rwt/remote/Connection.js	4809
/jobs/genie.rap/rap-3.1-runtime/workspace/org.eclipse.rap/bundles/org.eclipse.rap.rwt/js/rwt/widgets/CTabItem.js	4922
/jobs/genie.rap/rap-3.1-runtime/workspace/org.eclipse.rap/bundles/org.eclipse.rap.rwt/js/rwt/remote/handler/CTabItemHandler.js	1033
/jobs/genie.rap/rap-3.1-runtime/workspace/org.eclipse.rap/bundles/org.eclipse.rap.rwt/js/rwt/widgets/CTabFolder.js	10629
/jobs/genie.rap/rap-3.1-runtime/workspace/org.eclipse.rap/bundles/org.eclipse.rap.rwt/js/rwt/remote/handler/CTabFolderHandler.js	2076
/jobs/genie.rap/rap-3.1-runtime/workspace/org.eclipse.rap/bundles/org.eclipse.rap.rwt/js/rwt/remote/RemoteObject.js	610
/jobs/genie.rap/rap-3.1-runtime/workspace/org.eclipse.rap/bundles/org.eclipse.rap.rwt/js/rwt/remote/RemoteObjectFactory.js	616
/jobs/genie.rap/rap-3.1-runtime/workspace/org.eclipse.rap/bundles/org.eclipse.rap.rwt/js/rwt/remote/KeyEventSupport.js	4960
/jobs/genie.rap/rap-3.1-runtime/workspace/org.eclipse.rap/bundles/org.eclipse.rap.rwt/js/rwt/client/JavaScriptExecutor.js	219
/jobs/genie.rap/rap-3.1-runtime/workspace/org.eclipse.rap/bundles/org.eclipse.rap.rwt/js/rwt/remote/handler/ConnectionMessagesHandler.js	258
/jobs/genie.rap/rap-3.1-runtime/workspace/org.eclipse.rap/bundles/org.eclipse.rap.rwt/js/rwt/client/ClientMessages.js	718
/jobs/genie.rap/rap-3.1-runtime/workspace/org.eclipse.rap/bundles/org.eclipse.rap.rwt/js/rwt/remote/handler/ClientMessagesHandler.js	166
/jobs/genie.rap/rap-3.1-runtime/workspace/org.eclipse.rap/bundles/org.eclipse.rap.rwt/js/rwt/remote/handler/JavaScriptExecutorHandler.js	267
/jobs/genie.rap/rap-3.1-runtime/workspace/org.eclipse.rap/bundles/org.eclipse.rap.rwt/js/rwt/client/UrlLauncher.js	718
/jobs/genie.rap/rap-3.1-runtime/workspace/org.eclipse.rap/bundles/org.eclipse.rap.rwt/js/rwt/remote/handler/UrlLauncherHandler.js	212
/jobs/genie.rap/rap-3.1-runtime/workspace/org.eclipse.rap/bundles/org.eclipse.rap.rwt/js/rwt/client/JavaScriptLoader.js	526
/jobs/genie.rap/rap-3.1-runtime/workspace/org.eclipse.rap/bundles/org.eclipse.rap.rwt/js/rwt/remote/handler/JavaScriptLoaderHandler.js	149
/jobs/genie.rap/rap-3.1-runtime/workspace/org.eclipse.rap/bundles/org.eclipse.rap.rwt/js/rwt/client/ClientFileLoader.js	499
/jobs/genie.rap/rap-3.1-runtime/workspace/org.eclipse.rap/bundles/org.eclipse.rap.rwt/js/rwt/remote/handler/ClientFileLoaderHandler.js	149
/jobs/genie.rap/rap-3.1-runtime/workspace/org.eclipse.rap/bundles/org.eclipse.rap.rwt/js/rwt/runtime/System.js	3479
/jobs/genie.rap/rap-3.1-runtime/workspace/org.eclipse.rap/bundles/org.eclipse.rap.rwt/js/rwt/widgets/util/MnemonicHandler.js	4242
/jobs/genie.rap/rap-3.1-runtime/workspace/org.eclipse.rap/bundles/org.eclipse.rap.rwt/js/rap.js	857
/jobs/genie.rap/rap-3.1-runtime/workspace/org.eclipse.rap/bundles/org.eclipse.rap.rwt/js/SWT.js	1510
/jobs/genie.rap/rap-3.1-runtime/workspace/org.eclipse.rap/bundles/org.eclipse.rap.rwt/js/rwt/scripting/EventBinding.js	2091
/jobs/genie.rap/rap-3.1-runtime/workspace/org.eclipse.rap/bundles/org.eclipse.rap.rwt/js/rwt/scripting/EventProxy.js	2890
/jobs/genie.rap/rap-3.1-runtime/workspace/org.eclipse.rap/bundles/org.eclipse.rap.rwt/js/rwt/scripting/FunctionFactory.js	525
/jobs/genie.rap/rap-3.1-runtime/workspace/org.eclipse.rap/bundles/org.eclipse.rap.rwt/js/rwt/scripting/CompositeProxy.js	408
/jobs/genie.rap/rap-3.1-runtime/workspace/org.eclipse.rap/bundles/org.eclipse.rap.rwt/js/rwt/scripting/Synchronizer.js	2000
/jobs/genie.rap/rap-3.1-runtime/workspace/org.eclipse.rap/bundles/org.eclipse.rap.rwt/js/rwt/scripting/WidgetProxyFactory.js	2035
/jobs/genie.rap/rap-3.1-runtime/workspace/org.eclipse.rap/bundles/org.eclipse.rap.rwt/js/rwt/remote/handler/FunctionHandler.js	228
/jobs/genie.rap/rap-3.1-runtime/workspace/org.eclipse.rap/bundles/org.eclipse.rap.rwt/js/rwt/widgets/util/Template.js	6520
/jobs/genie.rap/rap-3.1-runtime/workspace/org.eclipse.rap/bundles/org.eclipse.rap.rwt/js/rwt/widgets/util/TemplateRenderer.js	680
/jobs/genie.rap/rap-3.1-runtime/workspace/org.eclipse.rap/bundles/org.eclipse.rap.rwt/js/rwt/widgets/DropDown.js	12117
/jobs/genie.rap/rap-3.1-runtime/workspace/org.eclipse.rap/bundles/org.eclipse.rap.rwt/js/rwt/widgets/util/DropDownSynchronizer.js	711
/jobs/genie.rap/rap-3.1-runtime/workspace/org.eclipse.rap/bundles/org.eclipse.rap.rwt/js/rwt/remote/handler/DropDownHandler.js	623
Replaced 539 strings
Compressed 264 files in 322 ms
Result size: 894510 bytes
[INFO] 
[INFO] --- maven-resources-plugin:2.4.3:resources (default-resources) @ org.eclipse.rap.rwt ---
[INFO] Using 'UTF-8' encoding to copy filtered resources.
[INFO] skip non existing resourceDirectory /jobs/genie.rap/rap-3.1-runtime/workspace/org.eclipse.rap/bundles/org.eclipse.rap.rwt/src/main/resources
[INFO] 
[INFO] --- tycho-compiler-plugin:0.25.0:compile (default-compile) @ org.eclipse.rap.rwt ---
[INFO] Compiling 815 source files to /jobs/genie.rap/rap-3.1-runtime/workspace/org.eclipse.rap/bundles/org.eclipse.rap.rwt/target/classes
[INFO] 
[INFO] --- maven-resources-plugin:2.4.3:testResources (default-testResources) @ org.eclipse.rap.rwt ---
[INFO] Using 'UTF-8' encoding to copy filtered resources.
[INFO] skip non existing resourceDirectory /jobs/genie.rap/rap-3.1-runtime/workspace/org.eclipse.rap/bundles/org.eclipse.rap.rwt/src/test/resources
[INFO] 
[INFO] --- maven-surefire-plugin:2.17:test (test) @ org.eclipse.rap.rwt ---
[INFO] 
[INFO] --- animal-sniffer-maven-plugin:1.14:check (ensure-java-1.7-class-library) @ org.eclipse.rap.rwt ---
[INFO] Checking unresolved references to org.codehaus.mojo.signature:java17:1.0
[INFO] 
[INFO] --- tycho-source-plugin:0.25.0:plugin-source (plugin-source) @ org.eclipse.rap.rwt ---
[INFO] Building jar: /jobs/genie.rap/rap-3.1-runtime/workspace/org.eclipse.rap/bundles/org.eclipse.rap.rwt/target/org.eclipse.rap.rwt-3.1.2-SNAPSHOT-sources.jar
[INFO] 
[INFO] --- target-platform-configuration:0.25.0:target-platform (default-target-platform) @ org.eclipse.rap.rwt ---
[INFO] 
[INFO] --- tycho-packaging-plugin:0.25.0:package-plugin (default-package-plugin) @ org.eclipse.rap.rwt ---
[INFO] Building jar: /jobs/genie.rap/rap-3.1-runtime/workspace/org.eclipse.rap/bundles/org.eclipse.rap.rwt/target/org.eclipse.rap.rwt-3.1.2-SNAPSHOT.jar
[INFO] 
[INFO] --- tycho-p2-plugin:0.25.0:p2-metadata-default (default-p2-metadata-default) @ org.eclipse.rap.rwt ---
[INFO] No baseline version MavenProject: org.eclipse.rap:org.eclipse.rap.rwt:3.1.2-SNAPSHOT @ /jobs/genie.rap/rap-3.1-runtime/workspace/org.eclipse.rap/bundles/org.eclipse.rap.rwt/pom.xml
[INFO]                                                                         
[INFO] ------------------------------------------------------------------------
[INFO] Building org.eclipse.rap.fileupload 3.1.2-SNAPSHOT
[INFO] ------------------------------------------------------------------------
[INFO] 
[INFO] --- maven-clean-plugin:2.5:clean (default-clean) @ org.eclipse.rap.fileupload ---
[INFO] 
[INFO] --- tycho-packaging-plugin:0.25.0:build-qualifier (default-build-qualifier) @ org.eclipse.rap.fileupload ---
[INFO] The project's OSGi version is 3.1.2.20161108-1505
[INFO] 
[INFO] --- tycho-packaging-plugin:0.25.0:validate-id (default-validate-id) @ org.eclipse.rap.fileupload ---
[INFO] 
[INFO] --- tycho-packaging-plugin:0.25.0:validate-version (default-validate-version) @ org.eclipse.rap.fileupload ---
[INFO] 
[INFO] --- maven-resources-plugin:2.4.3:resources (default-resources) @ org.eclipse.rap.fileupload ---
[INFO] Using 'UTF-8' encoding to copy filtered resources.
[INFO] skip non existing resourceDirectory /jobs/genie.rap/rap-3.1-runtime/workspace/org.eclipse.rap/bundles/org.eclipse.rap.fileupload/src/main/resources
[INFO] 
[INFO] --- tycho-compiler-plugin:0.25.0:compile (default-compile) @ org.eclipse.rap.fileupload ---
[INFO] Compiling 12 source files to /jobs/genie.rap/rap-3.1-runtime/workspace/org.eclipse.rap/bundles/org.eclipse.rap.fileupload/target/classes
[INFO] 
[INFO] --- maven-resources-plugin:2.4.3:testResources (default-testResources) @ org.eclipse.rap.fileupload ---
[INFO] Using 'UTF-8' encoding to copy filtered resources.
[INFO] skip non existing resourceDirectory /jobs/genie.rap/rap-3.1-runtime/workspace/org.eclipse.rap/bundles/org.eclipse.rap.fileupload/src/test/resources
[INFO] 
[INFO] --- maven-surefire-plugin:2.17:test (test) @ org.eclipse.rap.fileupload ---
[INFO] 
[INFO] --- animal-sniffer-maven-plugin:1.14:check (ensure-java-1.7-class-library) @ org.eclipse.rap.fileupload ---
[INFO] Checking unresolved references to org.codehaus.mojo.signature:java17:1.0
[INFO] 
[INFO] --- tycho-source-plugin:0.25.0:plugin-source (plugin-source) @ org.eclipse.rap.fileupload ---
[INFO] Building jar: /jobs/genie.rap/rap-3.1-runtime/workspace/org.eclipse.rap/bundles/org.eclipse.rap.fileupload/target/org.eclipse.rap.fileupload-3.1.2-SNAPSHOT-sources.jar
[INFO] 
[INFO] --- target-platform-configuration:0.25.0:target-platform (default-target-platform) @ org.eclipse.rap.fileupload ---
[INFO] 
[INFO] --- tycho-packaging-plugin:0.25.0:package-plugin (default-package-plugin) @ org.eclipse.rap.fileupload ---
[INFO] Building jar: /jobs/genie.rap/rap-3.1-runtime/workspace/org.eclipse.rap/bundles/org.eclipse.rap.fileupload/target/org.eclipse.rap.fileupload-3.1.2-SNAPSHOT.jar
[INFO] 
[INFO] --- tycho-p2-plugin:0.25.0:p2-metadata-default (default-p2-metadata-default) @ org.eclipse.rap.fileupload ---
[INFO] No baseline version MavenProject: org.eclipse.rap:org.eclipse.rap.fileupload:3.1.2-SNAPSHOT @ /jobs/genie.rap/rap-3.1-runtime/workspace/org.eclipse.rap/bundles/org.eclipse.rap.fileupload/pom.xml
[INFO]                                                                         
[INFO] ------------------------------------------------------------------------
[INFO] Building org.eclipse.rap.filedialog 3.1.2-SNAPSHOT
[INFO] ------------------------------------------------------------------------
[INFO] 
[INFO] --- maven-clean-plugin:2.5:clean (default-clean) @ org.eclipse.rap.filedialog ---
[INFO] 
[INFO] --- tycho-packaging-plugin:0.25.0:build-qualifier (default-build-qualifier) @ org.eclipse.rap.filedialog ---
[INFO] The project's OSGi version is 3.1.2.20161108-1505
[INFO] 
[INFO] --- tycho-packaging-plugin:0.25.0:validate-id (default-validate-id) @ org.eclipse.rap.filedialog ---
[INFO] 
[INFO] --- tycho-packaging-plugin:0.25.0:validate-version (default-validate-version) @ org.eclipse.rap.filedialog ---
[INFO] 
[INFO] --- maven-resources-plugin:2.4.3:resources (default-resources) @ org.eclipse.rap.filedialog ---
[INFO] Using 'UTF-8' encoding to copy filtered resources.
[INFO] skip non existing resourceDirectory /jobs/genie.rap/rap-3.1-runtime/workspace/org.eclipse.rap/bundles/org.eclipse.rap.filedialog/src/main/resources
[INFO] 
[INFO] --- tycho-compiler-plugin:0.25.0:compile (default-compile) @ org.eclipse.rap.filedialog ---
[INFO] Compiling 9 source files to /jobs/genie.rap/rap-3.1-runtime/workspace/org.eclipse.rap/bundles/org.eclipse.rap.filedialog/target/classes
[INFO] 
[INFO] --- maven-resources-plugin:2.4.3:testResources (default-testResources) @ org.eclipse.rap.filedialog ---
[INFO] Using 'UTF-8' encoding to copy filtered resources.
[INFO] skip non existing resourceDirectory /jobs/genie.rap/rap-3.1-runtime/workspace/org.eclipse.rap/bundles/org.eclipse.rap.filedialog/src/test/resources
[INFO] 
[INFO] --- maven-surefire-plugin:2.17:test (test) @ org.eclipse.rap.filedialog ---
[INFO] 
[INFO] --- animal-sniffer-maven-plugin:1.14:check (ensure-java-1.7-class-library) @ org.eclipse.rap.filedialog ---
[INFO] Checking unresolved references to org.codehaus.mojo.signature:java17:1.0
[INFO] 
[INFO] --- tycho-source-plugin:0.25.0:plugin-source (plugin-source) @ org.eclipse.rap.filedialog ---
[INFO] Building jar: /jobs/genie.rap/rap-3.1-runtime/workspace/org.eclipse.rap/bundles/org.eclipse.rap.filedialog/target/org.eclipse.rap.filedialog-3.1.2-SNAPSHOT-sources.jar
[INFO] 
[INFO] --- target-platform-configuration:0.25.0:target-platform (default-target-platform) @ org.eclipse.rap.filedialog ---
[INFO] 
[INFO] --- tycho-packaging-plugin:0.25.0:package-plugin (default-package-plugin) @ org.eclipse.rap.filedialog ---
[INFO] Building jar: /jobs/genie.rap/rap-3.1-runtime/workspace/org.eclipse.rap/bundles/org.eclipse.rap.filedialog/target/org.eclipse.rap.filedialog-3.1.2-SNAPSHOT.jar
[INFO] 
[INFO] --- tycho-p2-plugin:0.25.0:p2-metadata-default (default-p2-metadata-default) @ org.eclipse.rap.filedialog ---
[INFO] No baseline version MavenProject: org.eclipse.rap:org.eclipse.rap.filedialog:3.1.2-SNAPSHOT @ /jobs/genie.rap/rap-3.1-runtime/workspace/org.eclipse.rap/bundles/org.eclipse.rap.filedialog/pom.xml
[INFO]                                                                         
[INFO] ------------------------------------------------------------------------
[INFO] Building org.eclipse.rap.jface 3.1.2-SNAPSHOT
[INFO] ------------------------------------------------------------------------
[INFO] 
[INFO] --- maven-clean-plugin:2.5:clean (default-clean) @ org.eclipse.rap.jface ---
[INFO] 
[INFO] --- tycho-packaging-plugin:0.25.0:build-qualifier (default-build-qualifier) @ org.eclipse.rap.jface ---
[INFO] The project's OSGi version is 3.1.2.20161108-1505
[INFO] 
[INFO] --- tycho-packaging-plugin:0.25.0:validate-id (default-validate-id) @ org.eclipse.rap.jface ---
[INFO] 
[INFO] --- tycho-packaging-plugin:0.25.0:validate-version (default-validate-version) @ org.eclipse.rap.jface ---
[INFO] 
[INFO] --- maven-resources-plugin:2.4.3:resources (default-resources) @ org.eclipse.rap.jface ---
[INFO] Using 'UTF-8' encoding to copy filtered resources.
[INFO] skip non existing resourceDirectory /jobs/genie.rap/rap-3.1-runtime/workspace/org.eclipse.rap/bundles/org.eclipse.rap.jface/src/main/resources
[INFO] 
[INFO] --- tycho-compiler-plugin:0.25.0:compile (default-compile) @ org.eclipse.rap.jface ---
[INFO] Compiling 387 source files to /jobs/genie.rap/rap-3.1-runtime/workspace/org.eclipse.rap/bundles/org.eclipse.rap.jface/target/classes
[INFO] 
[INFO] --- maven-resources-plugin:2.4.3:testResources (default-testResources) @ org.eclipse.rap.jface ---
[INFO] Using 'UTF-8' encoding to copy filtered resources.
[INFO] skip non existing resourceDirectory /jobs/genie.rap/rap-3.1-runtime/workspace/org.eclipse.rap/bundles/org.eclipse.rap.jface/src/test/resources
[INFO] 
[INFO] --- maven-surefire-plugin:2.17:test (test) @ org.eclipse.rap.jface ---
[INFO] 
[INFO] --- animal-sniffer-maven-plugin:1.14:check (ensure-java-1.7-class-library) @ org.eclipse.rap.jface ---
[INFO] Checking unresolved references to org.codehaus.mojo.signature:java17:1.0
[INFO] 
[INFO] --- tycho-source-plugin:0.25.0:plugin-source (plugin-source) @ org.eclipse.rap.jface ---
[INFO] Building jar: /jobs/genie.rap/rap-3.1-runtime/workspace/org.eclipse.rap/bundles/org.eclipse.rap.jface/target/org.eclipse.rap.jface-3.1.2-SNAPSHOT-sources.jar
[INFO] 
[INFO] --- target-platform-configuration:0.25.0:target-platform (default-target-platform) @ org.eclipse.rap.jface ---
[INFO] 
[INFO] --- tycho-packaging-plugin:0.25.0:package-plugin (default-package-plugin) @ org.eclipse.rap.jface ---
[INFO] Building jar: /jobs/genie.rap/rap-3.1-runtime/workspace/org.eclipse.rap/bundles/org.eclipse.rap.jface/target/org.eclipse.rap.jface-3.1.2-SNAPSHOT.jar
[INFO] 
[INFO] --- tycho-p2-plugin:0.25.0:p2-metadata-default (default-p2-metadata-default) @ org.eclipse.rap.jface ---
[INFO] No baseline version MavenProject: org.eclipse.rap:org.eclipse.rap.jface:3.1.2-SNAPSHOT @ /jobs/genie.rap/rap-3.1-runtime/workspace/org.eclipse.rap/bundles/org.eclipse.rap.jface/pom.xml
[INFO]                                                                         
[INFO] ------------------------------------------------------------------------
[INFO] Building org.eclipse.rap.jface.databinding 3.1.2-SNAPSHOT
[INFO] ------------------------------------------------------------------------
[INFO] 
[INFO] --- maven-clean-plugin:2.5:clean (default-clean) @ org.eclipse.rap.jface.databinding ---
[INFO] 
[INFO] --- tycho-packaging-plugin:0.25.0:build-qualifier (default-build-qualifier) @ org.eclipse.rap.jface.databinding ---
[INFO] The project's OSGi version is 3.1.2.20161108-1505
[INFO] 
[INFO] --- tycho-packaging-plugin:0.25.0:validate-id (default-validate-id) @ org.eclipse.rap.jface.databinding ---
[INFO] 
[INFO] --- tycho-packaging-plugin:0.25.0:validate-version (default-validate-version) @ org.eclipse.rap.jface.databinding ---
[INFO] 
[INFO] --- maven-resources-plugin:2.4.3:resources (default-resources) @ org.eclipse.rap.jface.databinding ---
[INFO] Using 'UTF-8' encoding to copy filtered resources.
[INFO] skip non existing resourceDirectory /jobs/genie.rap/rap-3.1-runtime/workspace/org.eclipse.rap/bundles/org.eclipse.rap.jface.databinding/src/main/resources
[INFO] 
[INFO] --- tycho-compiler-plugin:0.25.0:compile (default-compile) @ org.eclipse.rap.jface.databinding ---
[INFO] Compiling 164 source files to /jobs/genie.rap/rap-3.1-runtime/workspace/org.eclipse.rap/bundles/org.eclipse.rap.jface.databinding/target/classes
[INFO] 
[INFO] --- maven-resources-plugin:2.4.3:testResources (default-testResources) @ org.eclipse.rap.jface.databinding ---
[INFO] Using 'UTF-8' encoding to copy filtered resources.
[INFO] skip non existing resourceDirectory /jobs/genie.rap/rap-3.1-runtime/workspace/org.eclipse.rap/bundles/org.eclipse.rap.jface.databinding/src/test/resources
[INFO] 
[INFO] --- maven-surefire-plugin:2.17:test (test) @ org.eclipse.rap.jface.databinding ---
[INFO] 
[INFO] --- animal-sniffer-maven-plugin:1.14:check (ensure-java-1.7-class-library) @ org.eclipse.rap.jface.databinding ---
[INFO] Checking unresolved references to org.codehaus.mojo.signature:java17:1.0
[INFO] 
[INFO] --- tycho-source-plugin:0.25.0:plugin-source (plugin-source) @ org.eclipse.rap.jface.databinding ---
[INFO] Building jar: /jobs/genie.rap/rap-3.1-runtime/workspace/org.eclipse.rap/bundles/org.eclipse.rap.jface.databinding/target/org.eclipse.rap.jface.databinding-3.1.2-SNAPSHOT-sources.jar
[INFO] 
[INFO] --- target-platform-configuration:0.25.0:target-platform (default-target-platform) @ org.eclipse.rap.jface.databinding ---
[INFO] 
[INFO] --- tycho-packaging-plugin:0.25.0:package-plugin (default-package-plugin) @ org.eclipse.rap.jface.databinding ---
[INFO] Building jar: /jobs/genie.rap/rap-3.1-runtime/workspace/org.eclipse.rap/bundles/org.eclipse.rap.jface.databinding/target/org.eclipse.rap.jface.databinding-3.1.2-SNAPSHOT.jar
[INFO] 
[INFO] --- tycho-p2-plugin:0.25.0:p2-metadata-default (default-p2-metadata-default) @ org.eclipse.rap.jface.databinding ---
[INFO] No baseline version MavenProject: org.eclipse.rap:org.eclipse.rap.jface.databinding:3.1.2-SNAPSHOT @ /jobs/genie.rap/rap-3.1-runtime/workspace/org.eclipse.rap/bundles/org.eclipse.rap.jface.databinding/pom.xml
[INFO]                                                                         
[INFO] ------------------------------------------------------------------------
[INFO] Building org.eclipse.rap.nebula.widgets.grid 3.1.2-SNAPSHOT
[INFO] ------------------------------------------------------------------------
[INFO] 
[INFO] --- maven-clean-plugin:2.5:clean (default-clean) @ org.eclipse.rap.nebula.widgets.grid ---
[INFO] 
[INFO] --- tycho-packaging-plugin:0.25.0:build-qualifier (default-build-qualifier) @ org.eclipse.rap.nebula.widgets.grid ---
[INFO] The project's OSGi version is 3.1.2.20161108-1505
[INFO] 
[INFO] --- tycho-packaging-plugin:0.25.0:validate-id (default-validate-id) @ org.eclipse.rap.nebula.widgets.grid ---
[INFO] 
[INFO] --- tycho-packaging-plugin:0.25.0:validate-version (default-validate-version) @ org.eclipse.rap.nebula.widgets.grid ---
[INFO] 
[INFO] --- maven-resources-plugin:2.4.3:resources (default-resources) @ org.eclipse.rap.nebula.widgets.grid ---
[INFO] Using 'UTF-8' encoding to copy filtered resources.
[INFO] skip non existing resourceDirectory /jobs/genie.rap/rap-3.1-runtime/workspace/org.eclipse.rap/bundles/org.eclipse.rap.nebula.widgets.grid/src/main/resources
[INFO] 
[INFO] --- tycho-compiler-plugin:0.25.0:compile (default-compile) @ org.eclipse.rap.nebula.widgets.grid ---
[INFO] Compiling 20 source files to /jobs/genie.rap/rap-3.1-runtime/workspace/org.eclipse.rap/bundles/org.eclipse.rap.nebula.widgets.grid/target/classes
[INFO] 
[INFO] --- maven-resources-plugin:2.4.3:testResources (default-testResources) @ org.eclipse.rap.nebula.widgets.grid ---
[INFO] Using 'UTF-8' encoding to copy filtered resources.
[INFO] skip non existing resourceDirectory /jobs/genie.rap/rap-3.1-runtime/workspace/org.eclipse.rap/bundles/org.eclipse.rap.nebula.widgets.grid/src/test/resources
[INFO] 
[INFO] --- maven-surefire-plugin:2.17:test (test) @ org.eclipse.rap.nebula.widgets.grid ---
[INFO] 
[INFO] --- animal-sniffer-maven-plugin:1.14:check (ensure-java-1.7-class-library) @ org.eclipse.rap.nebula.widgets.grid ---
[INFO] Checking unresolved references to org.codehaus.mojo.signature:java17:1.0
[INFO] 
[INFO] --- tycho-source-plugin:0.25.0:plugin-source (plugin-source) @ org.eclipse.rap.nebula.widgets.grid ---
[INFO] Building jar: /jobs/genie.rap/rap-3.1-runtime/workspace/org.eclipse.rap/bundles/org.eclipse.rap.nebula.widgets.grid/target/org.eclipse.rap.nebula.widgets.grid-3.1.2-SNAPSHOT-sources.jar
[INFO] 
[INFO] --- target-platform-configuration:0.25.0:target-platform (default-target-platform) @ org.eclipse.rap.nebula.widgets.grid ---
[INFO] 
[INFO] --- tycho-packaging-plugin:0.25.0:package-plugin (default-package-plugin) @ org.eclipse.rap.nebula.widgets.grid ---
[INFO] Building jar: /jobs/genie.rap/rap-3.1-runtime/workspace/org.eclipse.rap/bundles/org.eclipse.rap.nebula.widgets.grid/target/org.eclipse.rap.nebula.widgets.grid-3.1.2-SNAPSHOT.jar
[INFO] 
[INFO] --- tycho-p2-plugin:0.25.0:p2-metadata-default (default-p2-metadata-default) @ org.eclipse.rap.nebula.widgets.grid ---
[INFO] No baseline version MavenProject: org.eclipse.rap:org.eclipse.rap.nebula.widgets.grid:3.1.2-SNAPSHOT @ /jobs/genie.rap/rap-3.1-runtime/workspace/org.eclipse.rap/bundles/org.eclipse.rap.nebula.widgets.grid/pom.xml
[INFO]                                                                         
[INFO] ------------------------------------------------------------------------
[INFO] Building org.eclipse.rap.nebula.jface.gridviewer 3.1.2-SNAPSHOT
[INFO] ------------------------------------------------------------------------
[INFO] 
[INFO] --- maven-clean-plugin:2.5:clean (default-clean) @ org.eclipse.rap.nebula.jface.gridviewer ---
[INFO] 
[INFO] --- tycho-packaging-plugin:0.25.0:build-qualifier (default-build-qualifier) @ org.eclipse.rap.nebula.jface.gridviewer ---
[INFO] The project's OSGi version is 3.1.2.20161108-1505
[INFO] 
[INFO] --- tycho-packaging-plugin:0.25.0:validate-id (default-validate-id) @ org.eclipse.rap.nebula.jface.gridviewer ---
[INFO] 
[INFO] --- tycho-packaging-plugin:0.25.0:validate-version (default-validate-version) @ org.eclipse.rap.nebula.jface.gridviewer ---
[INFO] 
[INFO] --- maven-resources-plugin:2.4.3:resources (default-resources) @ org.eclipse.rap.nebula.jface.gridviewer ---
[INFO] Using 'UTF-8' encoding to copy filtered resources.
[INFO] skip non existing resourceDirectory /jobs/genie.rap/rap-3.1-runtime/workspace/org.eclipse.rap/bundles/org.eclipse.rap.nebula.jface.gridviewer/src/main/resources
[INFO] 
[INFO] --- tycho-compiler-plugin:0.25.0:compile (default-compile) @ org.eclipse.rap.nebula.jface.gridviewer ---
[INFO] Compiling 9 source files to /jobs/genie.rap/rap-3.1-runtime/workspace/org.eclipse.rap/bundles/org.eclipse.rap.nebula.jface.gridviewer/target/classes
[INFO] 
[INFO] --- maven-resources-plugin:2.4.3:testResources (default-testResources) @ org.eclipse.rap.nebula.jface.gridviewer ---
[INFO] Using 'UTF-8' encoding to copy filtered resources.
[INFO] skip non existing resourceDirectory /jobs/genie.rap/rap-3.1-runtime/workspace/org.eclipse.rap/bundles/org.eclipse.rap.nebula.jface.gridviewer/src/test/resources
[INFO] 
[INFO] --- maven-surefire-plugin:2.17:test (test) @ org.eclipse.rap.nebula.jface.gridviewer ---
[INFO] 
[INFO] --- animal-sniffer-maven-plugin:1.14:check (ensure-java-1.7-class-library) @ org.eclipse.rap.nebula.jface.gridviewer ---
[INFO] Checking unresolved references to org.codehaus.mojo.signature:java17:1.0
[INFO] 
[INFO] --- tycho-source-plugin:0.25.0:plugin-source (plugin-source) @ org.eclipse.rap.nebula.jface.gridviewer ---
[INFO] Building jar: /jobs/genie.rap/rap-3.1-runtime/workspace/org.eclipse.rap/bundles/org.eclipse.rap.nebula.jface.gridviewer/target/org.eclipse.rap.nebula.jface.gridviewer-3.1.2-SNAPSHOT-sources.jar
[INFO] 
[INFO] --- target-platform-configuration:0.25.0:target-platform (default-target-platform) @ org.eclipse.rap.nebula.jface.gridviewer ---
[INFO] 
[INFO] --- tycho-packaging-plugin:0.25.0:package-plugin (default-package-plugin) @ org.eclipse.rap.nebula.jface.gridviewer ---
[INFO] Building jar: /jobs/genie.rap/rap-3.1-runtime/workspace/org.eclipse.rap/bundles/org.eclipse.rap.nebula.jface.gridviewer/target/org.eclipse.rap.nebula.jface.gridviewer-3.1.2-SNAPSHOT.jar
[INFO] 
[INFO] --- tycho-p2-plugin:0.25.0:p2-metadata-default (default-p2-metadata-default) @ org.eclipse.rap.nebula.jface.gridviewer ---
[INFO] No baseline version MavenProject: org.eclipse.rap:org.eclipse.rap.nebula.jface.gridviewer:3.1.2-SNAPSHOT @ /jobs/genie.rap/rap-3.1-runtime/workspace/org.eclipse.rap/bundles/org.eclipse.rap.nebula.jface.gridviewer/pom.xml
[INFO]                                                                         
[INFO] ------------------------------------------------------------------------
[INFO] Building org.eclipse.rap.nebula.widgets.richtext 3.1.2-SNAPSHOT
[INFO] ------------------------------------------------------------------------
[INFO] 
[INFO] --- maven-clean-plugin:2.5:clean (default-clean) @ org.eclipse.rap.nebula.widgets.richtext ---
[INFO] 
[INFO] --- tycho-packaging-plugin:0.25.0:build-qualifier (default-build-qualifier) @ org.eclipse.rap.nebula.widgets.richtext ---
[INFO] The project's OSGi version is 3.1.2.20161108-1505
[INFO] 
[INFO] --- tycho-packaging-plugin:0.25.0:validate-id (default-validate-id) @ org.eclipse.rap.nebula.widgets.richtext ---
[INFO] 
[INFO] --- tycho-packaging-plugin:0.25.0:validate-version (default-validate-version) @ org.eclipse.rap.nebula.widgets.richtext ---
[INFO] 
[INFO] --- maven-resources-plugin:2.4.3:resources (default-resources) @ org.eclipse.rap.nebula.widgets.richtext ---
[INFO] Using 'UTF-8' encoding to copy filtered resources.
[INFO] skip non existing resourceDirectory /jobs/genie.rap/rap-3.1-runtime/workspace/org.eclipse.rap/bundles/org.eclipse.rap.nebula.widgets.richtext/src/main/resources
[INFO] 
[INFO] --- tycho-compiler-plugin:0.25.0:compile (default-compile) @ org.eclipse.rap.nebula.widgets.richtext ---
[INFO] Compiling 2 source files to /jobs/genie.rap/rap-3.1-runtime/workspace/org.eclipse.rap/bundles/org.eclipse.rap.nebula.widgets.richtext/target/classes
[INFO] 
[INFO] --- maven-resources-plugin:2.4.3:testResources (default-testResources) @ org.eclipse.rap.nebula.widgets.richtext ---
[INFO] Using 'UTF-8' encoding to copy filtered resources.
[INFO] skip non existing resourceDirectory /jobs/genie.rap/rap-3.1-runtime/workspace/org.eclipse.rap/bundles/org.eclipse.rap.nebula.widgets.richtext/src/test/resources
[INFO] 
[INFO] --- maven-surefire-plugin:2.17:test (test) @ org.eclipse.rap.nebula.widgets.richtext ---
[INFO] 
[INFO] --- animal-sniffer-maven-plugin:1.14:check (ensure-java-1.7-class-library) @ org.eclipse.rap.nebula.widgets.richtext ---
[INFO] Checking unresolved references to org.codehaus.mojo.signature:java17:1.0
[INFO] 
[INFO] --- tycho-source-plugin:0.25.0:plugin-source (plugin-source) @ org.eclipse.rap.nebula.widgets.richtext ---
[INFO] Building jar: /jobs/genie.rap/rap-3.1-runtime/workspace/org.eclipse.rap/bundles/org.eclipse.rap.nebula.widgets.richtext/target/org.eclipse.rap.nebula.widgets.richtext-3.1.2-SNAPSHOT-sources.jar
[INFO] 
[INFO] --- target-platform-configuration:0.25.0:target-platform (default-target-platform) @ org.eclipse.rap.nebula.widgets.richtext ---
[INFO] 
[INFO] --- tycho-packaging-plugin:0.25.0:package-plugin (default-package-plugin) @ org.eclipse.rap.nebula.widgets.richtext ---
[INFO] Building jar: /jobs/genie.rap/rap-3.1-runtime/workspace/org.eclipse.rap/bundles/org.eclipse.rap.nebula.widgets.richtext/target/org.eclipse.rap.nebula.widgets.richtext-3.1.2-SNAPSHOT.jar
[INFO] 
[INFO] --- tycho-p2-plugin:0.25.0:p2-metadata-default (default-p2-metadata-default) @ org.eclipse.rap.nebula.widgets.richtext ---
[INFO] No baseline version MavenProject: org.eclipse.rap:org.eclipse.rap.nebula.widgets.richtext:3.1.2-SNAPSHOT @ /jobs/genie.rap/rap-3.1-runtime/workspace/org.eclipse.rap/bundles/org.eclipse.rap.nebula.widgets.richtext/pom.xml
[INFO]                                                                         
[INFO] ------------------------------------------------------------------------
[INFO] Building org.eclipse.rap.rwt.osgi 3.1.2-SNAPSHOT
[INFO] ------------------------------------------------------------------------
[INFO] 
[INFO] --- maven-clean-plugin:2.5:clean (default-clean) @ org.eclipse.rap.rwt.osgi ---
[INFO] 
[INFO] --- tycho-packaging-plugin:0.25.0:build-qualifier (default-build-qualifier) @ org.eclipse.rap.rwt.osgi ---
[INFO] The project's OSGi version is 3.1.2.20161108-1505
[INFO] 
[INFO] --- tycho-packaging-plugin:0.25.0:validate-id (default-validate-id) @ org.eclipse.rap.rwt.osgi ---
[INFO] 
[INFO] --- tycho-packaging-plugin:0.25.0:validate-version (default-validate-version) @ org.eclipse.rap.rwt.osgi ---
[INFO] 
[INFO] --- maven-resources-plugin:2.4.3:resources (default-resources) @ org.eclipse.rap.rwt.osgi ---
[INFO] Using 'UTF-8' encoding to copy filtered resources.
[INFO] skip non existing resourceDirectory /jobs/genie.rap/rap-3.1-runtime/workspace/org.eclipse.rap/bundles/org.eclipse.rap.rwt.osgi/src/main/resources
[INFO] 
[INFO] --- tycho-compiler-plugin:0.25.0:compile (default-compile) @ org.eclipse.rap.rwt.osgi ---
[INFO] Compiling 13 source files to /jobs/genie.rap/rap-3.1-runtime/workspace/org.eclipse.rap/bundles/org.eclipse.rap.rwt.osgi/target/classes
[INFO] 
[INFO] --- maven-resources-plugin:2.4.3:testResources (default-testResources) @ org.eclipse.rap.rwt.osgi ---
[INFO] Using 'UTF-8' encoding to copy filtered resources.
[INFO] skip non existing resourceDirectory /jobs/genie.rap/rap-3.1-runtime/workspace/org.eclipse.rap/bundles/org.eclipse.rap.rwt.osgi/src/test/resources
[INFO] 
[INFO] --- maven-surefire-plugin:2.17:test (test) @ org.eclipse.rap.rwt.osgi ---
[INFO] 
[INFO] --- animal-sniffer-maven-plugin:1.14:check (ensure-java-1.7-class-library) @ org.eclipse.rap.rwt.osgi ---
[INFO] Checking unresolved references to org.codehaus.mojo.signature:java17:1.0
[INFO] 
[INFO] --- tycho-source-plugin:0.25.0:plugin-source (plugin-source) @ org.eclipse.rap.rwt.osgi ---
[INFO] Building jar: /jobs/genie.rap/rap-3.1-runtime/workspace/org.eclipse.rap/bundles/org.eclipse.rap.rwt.osgi/target/org.eclipse.rap.rwt.osgi-3.1.2-SNAPSHOT-sources.jar
[INFO] 
[INFO] --- target-platform-configuration:0.25.0:target-platform (default-target-platform) @ org.eclipse.rap.rwt.osgi ---
[INFO] 
[INFO] --- tycho-packaging-plugin:0.25.0:package-plugin (default-package-plugin) @ org.eclipse.rap.rwt.osgi ---
[INFO] Building jar: /jobs/genie.rap/rap-3.1-runtime/workspace/org.eclipse.rap/bundles/org.eclipse.rap.rwt.osgi/target/org.eclipse.rap.rwt.osgi-3.1.2-SNAPSHOT.jar
[INFO] 
[INFO] --- tycho-p2-plugin:0.25.0:p2-metadata-default (default-p2-metadata-default) @ org.eclipse.rap.rwt.osgi ---
[INFO] No baseline version MavenProject: org.eclipse.rap:org.eclipse.rap.rwt.osgi:3.1.2-SNAPSHOT @ /jobs/genie.rap/rap-3.1-runtime/workspace/org.eclipse.rap/bundles/org.eclipse.rap.rwt.osgi/pom.xml
[INFO]                                                                         
[INFO] ------------------------------------------------------------------------
[INFO] Building org.eclipse.rap.ui.workbench 3.1.2-SNAPSHOT
[INFO] ------------------------------------------------------------------------
[INFO] 
[INFO] --- maven-clean-plugin:2.5:clean (default-clean) @ org.eclipse.rap.ui.workbench ---
[INFO] 
[INFO] --- tycho-packaging-plugin:0.25.0:build-qualifier (default-build-qualifier) @ org.eclipse.rap.ui.workbench ---
[INFO] The project's OSGi version is 3.1.2.20161108-1505
[INFO] 
[INFO] --- tycho-packaging-plugin:0.25.0:validate-id (default-validate-id) @ org.eclipse.rap.ui.workbench ---
[INFO] 
[INFO] --- tycho-packaging-plugin:0.25.0:validate-version (default-validate-version) @ org.eclipse.rap.ui.workbench ---
[INFO] 
[INFO] --- maven-resources-plugin:2.4.3:resources (default-resources) @ org.eclipse.rap.ui.workbench ---
[INFO] Using 'UTF-8' encoding to copy filtered resources.
[INFO] skip non existing resourceDirectory /jobs/genie.rap/rap-3.1-runtime/workspace/org.eclipse.rap/bundles/org.eclipse.rap.ui.workbench/src/main/resources
[INFO] 
[INFO] --- tycho-compiler-plugin:0.25.0:compile (default-compile) @ org.eclipse.rap.ui.workbench ---
[INFO] Compiling 1371 source files to /jobs/genie.rap/rap-3.1-runtime/workspace/org.eclipse.rap/bundles/org.eclipse.rap.ui.workbench/target/classes
[INFO] 
[INFO] --- maven-resources-plugin:2.4.3:testResources (default-testResources) @ org.eclipse.rap.ui.workbench ---
[INFO] Using 'UTF-8' encoding to copy filtered resources.
[INFO] skip non existing resourceDirectory /jobs/genie.rap/rap-3.1-runtime/workspace/org.eclipse.rap/bundles/org.eclipse.rap.ui.workbench/src/test/resources
[INFO] 
[INFO] --- maven-surefire-plugin:2.17:test (test) @ org.eclipse.rap.ui.workbench ---
[INFO] 
[INFO] --- animal-sniffer-maven-plugin:1.14:check (ensure-java-1.7-class-library) @ org.eclipse.rap.ui.workbench ---
[INFO] Checking unresolved references to org.codehaus.mojo.signature:java17:1.0
[INFO] 
[INFO] --- tycho-source-plugin:0.25.0:plugin-source (plugin-source) @ org.eclipse.rap.ui.workbench ---
[INFO] Building jar: /jobs/genie.rap/rap-3.1-runtime/workspace/org.eclipse.rap/bundles/org.eclipse.rap.ui.workbench/target/org.eclipse.rap.ui.workbench-3.1.2-SNAPSHOT-sources.jar
[INFO] 
[INFO] --- target-platform-configuration:0.25.0:target-platform (default-target-platform) @ org.eclipse.rap.ui.workbench ---
[INFO] 
[INFO] --- tycho-packaging-plugin:0.25.0:package-plugin (default-package-plugin) @ org.eclipse.rap.ui.workbench ---
[INFO] Building jar: /jobs/genie.rap/rap-3.1-runtime/workspace/org.eclipse.rap/bundles/org.eclipse.rap.ui.workbench/target/org.eclipse.rap.ui.workbench-3.1.2-SNAPSHOT.jar
[INFO] 
[INFO] --- tycho-p2-plugin:0.25.0:p2-metadata-default (default-p2-metadata-default) @ org.eclipse.rap.ui.workbench ---
[INFO] No baseline version MavenProject: org.eclipse.rap:org.eclipse.rap.ui.workbench:3.1.2-SNAPSHOT @ /jobs/genie.rap/rap-3.1-runtime/workspace/org.eclipse.rap/bundles/org.eclipse.rap.ui.workbench/pom.xml
[INFO]                                                                         
[INFO] ------------------------------------------------------------------------
[INFO] Building org.eclipse.rap.ui 3.1.2-SNAPSHOT
[INFO] ------------------------------------------------------------------------
[INFO] 
[INFO] --- maven-clean-plugin:2.5:clean (default-clean) @ org.eclipse.rap.ui ---
[INFO] 
[INFO] --- tycho-packaging-plugin:0.25.0:build-qualifier (default-build-qualifier) @ org.eclipse.rap.ui ---
[INFO] The project's OSGi version is 3.1.2.20161108-1505
[INFO] 
[INFO] --- tycho-packaging-plugin:0.25.0:validate-id (default-validate-id) @ org.eclipse.rap.ui ---
[INFO] 
[INFO] --- tycho-packaging-plugin:0.25.0:validate-version (default-validate-version) @ org.eclipse.rap.ui ---
[INFO] 
[INFO] --- maven-resources-plugin:2.4.3:resources (default-resources) @ org.eclipse.rap.ui ---
[INFO] Using 'UTF-8' encoding to copy filtered resources.
[INFO] skip non existing resourceDirectory /jobs/genie.rap/rap-3.1-runtime/workspace/org.eclipse.rap/bundles/org.eclipse.rap.ui/src/main/resources
[INFO] 
[INFO] --- tycho-compiler-plugin:0.25.0:compile (default-compile) @ org.eclipse.rap.ui ---
[INFO] Compiling 4 source files to /jobs/genie.rap/rap-3.1-runtime/workspace/org.eclipse.rap/bundles/org.eclipse.rap.ui/target/classes
[INFO] 
[INFO] --- maven-resources-plugin:2.4.3:testResources (default-testResources) @ org.eclipse.rap.ui ---
[INFO] Using 'UTF-8' encoding to copy filtered resources.
[INFO] skip non existing resourceDirectory /jobs/genie.rap/rap-3.1-runtime/workspace/org.eclipse.rap/bundles/org.eclipse.rap.ui/src/test/resources
[INFO] 
[INFO] --- maven-surefire-plugin:2.17:test (test) @ org.eclipse.rap.ui ---
[INFO] 
[INFO] --- animal-sniffer-maven-plugin:1.14:check (ensure-java-1.7-class-library) @ org.eclipse.rap.ui ---
[INFO] Checking unresolved references to org.codehaus.mojo.signature:java17:1.0
[INFO] 
[INFO] --- tycho-source-plugin:0.25.0:plugin-source (plugin-source) @ org.eclipse.rap.ui ---
[INFO] Building jar: /jobs/genie.rap/rap-3.1-runtime/workspace/org.eclipse.rap/bundles/org.eclipse.rap.ui/target/org.eclipse.rap.ui-3.1.2-SNAPSHOT-sources.jar
[INFO] 
[INFO] --- target-platform-configuration:0.25.0:target-platform (default-target-platform) @ org.eclipse.rap.ui ---
[INFO] 
[INFO] --- tycho-packaging-plugin:0.25.0:package-plugin (default-package-plugin) @ org.eclipse.rap.ui ---
[INFO] Building jar: /jobs/genie.rap/rap-3.1-runtime/workspace/org.eclipse.rap/bundles/org.eclipse.rap.ui/target/org.eclipse.rap.ui-3.1.2-SNAPSHOT.jar
[INFO] 
[INFO] --- tycho-p2-plugin:0.25.0:p2-metadata-default (default-p2-metadata-default) @ org.eclipse.rap.ui ---
[INFO] No baseline version MavenProject: org.eclipse.rap:org.eclipse.rap.ui:3.1.2-SNAPSHOT @ /jobs/genie.rap/rap-3.1-runtime/workspace/org.eclipse.rap/bundles/org.eclipse.rap.ui/pom.xml
[INFO]                                                                         
[INFO] ------------------------------------------------------------------------
[INFO] Building org.eclipse.rap.ui.forms 3.1.2-SNAPSHOT
[INFO] ------------------------------------------------------------------------
[INFO] 
[INFO] --- maven-clean-plugin:2.5:clean (default-clean) @ org.eclipse.rap.ui.forms ---
[INFO] 
[INFO] --- tycho-packaging-plugin:0.25.0:build-qualifier (default-build-qualifier) @ org.eclipse.rap.ui.forms ---
[INFO] The project's OSGi version is 3.1.2.20161108-1505
[INFO] 
[INFO] --- tycho-packaging-plugin:0.25.0:validate-id (default-validate-id) @ org.eclipse.rap.ui.forms ---
[INFO] 
[INFO] --- tycho-packaging-plugin:0.25.0:validate-version (default-validate-version) @ org.eclipse.rap.ui.forms ---
[INFO] 
[INFO] --- maven-resources-plugin:2.4.3:resources (default-resources) @ org.eclipse.rap.ui.forms ---
[INFO] Using 'UTF-8' encoding to copy filtered resources.
[INFO] skip non existing resourceDirectory /jobs/genie.rap/rap-3.1-runtime/workspace/org.eclipse.rap/bundles/org.eclipse.rap.ui.forms/src/main/resources
[INFO] 
[INFO] --- tycho-compiler-plugin:0.25.0:compile (default-compile) @ org.eclipse.rap.ui.forms ---
[INFO] Compiling 98 source files to /jobs/genie.rap/rap-3.1-runtime/workspace/org.eclipse.rap/bundles/org.eclipse.rap.ui.forms/target/classes
[INFO] 
[INFO] --- maven-resources-plugin:2.4.3:testResources (default-testResources) @ org.eclipse.rap.ui.forms ---
[INFO] Using 'UTF-8' encoding to copy filtered resources.
[INFO] skip non existing resourceDirectory /jobs/genie.rap/rap-3.1-runtime/workspace/org.eclipse.rap/bundles/org.eclipse.rap.ui.forms/src/test/resources
[INFO] 
[INFO] --- maven-surefire-plugin:2.17:test (test) @ org.eclipse.rap.ui.forms ---
[INFO] 
[INFO] --- animal-sniffer-maven-plugin:1.14:check (ensure-java-1.7-class-library) @ org.eclipse.rap.ui.forms ---
[INFO] Checking unresolved references to org.codehaus.mojo.signature:java17:1.0
[INFO] 
[INFO] --- tycho-source-plugin:0.25.0:plugin-source (plugin-source) @ org.eclipse.rap.ui.forms ---
[INFO] Building jar: /jobs/genie.rap/rap-3.1-runtime/workspace/org.eclipse.rap/bundles/org.eclipse.rap.ui.forms/target/org.eclipse.rap.ui.forms-3.1.2-SNAPSHOT-sources.jar
[INFO] 
[INFO] --- target-platform-configuration:0.25.0:target-platform (default-target-platform) @ org.eclipse.rap.ui.forms ---
[INFO] 
[INFO] --- tycho-packaging-plugin:0.25.0:package-plugin (default-package-plugin) @ org.eclipse.rap.ui.forms ---
[INFO] Building jar: /jobs/genie.rap/rap-3.1-runtime/workspace/org.eclipse.rap/bundles/org.eclipse.rap.ui.forms/target/org.eclipse.rap.ui.forms-3.1.2-SNAPSHOT.jar
[INFO] 
[INFO] --- tycho-p2-plugin:0.25.0:p2-metadata-default (default-p2-metadata-default) @ org.eclipse.rap.ui.forms ---
[INFO] No baseline version MavenProject: org.eclipse.rap:org.eclipse.rap.ui.forms:3.1.2-SNAPSHOT @ /jobs/genie.rap/rap-3.1-runtime/workspace/org.eclipse.rap/bundles/org.eclipse.rap.ui.forms/pom.xml
[INFO]                                                                         
[INFO] ------------------------------------------------------------------------
[INFO] Building org.eclipse.rap.ui.cheatsheets 3.1.2-SNAPSHOT
[INFO] ------------------------------------------------------------------------
[INFO] 
[INFO] --- maven-clean-plugin:2.5:clean (default-clean) @ org.eclipse.rap.ui.cheatsheets ---
[INFO] 
[INFO] --- tycho-packaging-plugin:0.25.0:build-qualifier (default-build-qualifier) @ org.eclipse.rap.ui.cheatsheets ---
[INFO] The project's OSGi version is 3.1.2.20161108-1505
[INFO] 
[INFO] --- tycho-packaging-plugin:0.25.0:validate-id (default-validate-id) @ org.eclipse.rap.ui.cheatsheets ---
[INFO] 
[INFO] --- tycho-packaging-plugin:0.25.0:validate-version (default-validate-version) @ org.eclipse.rap.ui.cheatsheets ---
[INFO] 
[INFO] --- maven-resources-plugin:2.4.3:resources (default-resources) @ org.eclipse.rap.ui.cheatsheets ---
[INFO] Using 'UTF-8' encoding to copy filtered resources.
[INFO] skip non existing resourceDirectory /jobs/genie.rap/rap-3.1-runtime/workspace/org.eclipse.rap/bundles/org.eclipse.rap.ui.cheatsheets/src/main/resources
[INFO] 
[INFO] --- tycho-compiler-plugin:0.25.0:compile (default-compile) @ org.eclipse.rap.ui.cheatsheets ---
[INFO] Compiling 124 source files to /jobs/genie.rap/rap-3.1-runtime/workspace/org.eclipse.rap/bundles/org.eclipse.rap.ui.cheatsheets/target/classes
[INFO] 
[INFO] --- maven-resources-plugin:2.4.3:testResources (default-testResources) @ org.eclipse.rap.ui.cheatsheets ---
[INFO] Using 'UTF-8' encoding to copy filtered resources.
[INFO] skip non existing resourceDirectory /jobs/genie.rap/rap-3.1-runtime/workspace/org.eclipse.rap/bundles/org.eclipse.rap.ui.cheatsheets/src/test/resources
[INFO] 
[INFO] --- maven-surefire-plugin:2.17:test (test) @ org.eclipse.rap.ui.cheatsheets ---
[INFO] 
[INFO] --- animal-sniffer-maven-plugin:1.14:check (ensure-java-1.7-class-library) @ org.eclipse.rap.ui.cheatsheets ---
[INFO] Checking unresolved references to org.codehaus.mojo.signature:java17:1.0
[INFO] 
[INFO] --- tycho-source-plugin:0.25.0:plugin-source (plugin-source) @ org.eclipse.rap.ui.cheatsheets ---
[INFO] Building jar: /jobs/genie.rap/rap-3.1-runtime/workspace/org.eclipse.rap/bundles/org.eclipse.rap.ui.cheatsheets/target/org.eclipse.rap.ui.cheatsheets-3.1.2-SNAPSHOT-sources.jar
[INFO] 
[INFO] --- target-platform-configuration:0.25.0:target-platform (default-target-platform) @ org.eclipse.rap.ui.cheatsheets ---
[INFO] 
[INFO] --- tycho-packaging-plugin:0.25.0:package-plugin (default-package-plugin) @ org.eclipse.rap.ui.cheatsheets ---
[INFO] Building jar: /jobs/genie.rap/rap-3.1-runtime/workspace/org.eclipse.rap/bundles/org.eclipse.rap.ui.cheatsheets/target/org.eclipse.rap.ui.cheatsheets-3.1.2-SNAPSHOT.jar
[INFO] 
[INFO] --- tycho-p2-plugin:0.25.0:p2-metadata-default (default-p2-metadata-default) @ org.eclipse.rap.ui.cheatsheets ---
[INFO] No baseline version MavenProject: org.eclipse.rap:org.eclipse.rap.ui.cheatsheets:3.1.2-SNAPSHOT @ /jobs/genie.rap/rap-3.1-runtime/workspace/org.eclipse.rap/bundles/org.eclipse.rap.ui.cheatsheets/pom.xml
[INFO]                                                                         
[INFO] ------------------------------------------------------------------------
[INFO] Building org.eclipse.rap.ui.views 3.1.2-SNAPSHOT
[INFO] ------------------------------------------------------------------------
[INFO] 
[INFO] --- maven-clean-plugin:2.5:clean (default-clean) @ org.eclipse.rap.ui.views ---
[INFO] 
[INFO] --- tycho-packaging-plugin:0.25.0:build-qualifier (default-build-qualifier) @ org.eclipse.rap.ui.views ---
[INFO] The project's OSGi version is 3.1.2.20161108-1505
[INFO] 
[INFO] --- tycho-packaging-plugin:0.25.0:validate-id (default-validate-id) @ org.eclipse.rap.ui.views ---
[INFO] 
[INFO] --- tycho-packaging-plugin:0.25.0:validate-version (default-validate-version) @ org.eclipse.rap.ui.views ---
[INFO] 
[INFO] --- maven-resources-plugin:2.4.3:resources (default-resources) @ org.eclipse.rap.ui.views ---
[INFO] Using 'UTF-8' encoding to copy filtered resources.
[INFO] skip non existing resourceDirectory /jobs/genie.rap/rap-3.1-runtime/workspace/org.eclipse.rap/bundles/org.eclipse.rap.ui.views/src/main/resources
[INFO] 
[INFO] --- tycho-compiler-plugin:0.25.0:compile (default-compile) @ org.eclipse.rap.ui.views ---
[INFO] Compiling 33 source files to /jobs/genie.rap/rap-3.1-runtime/workspace/org.eclipse.rap/bundles/org.eclipse.rap.ui.views/target/classes
[INFO] 
[INFO] --- maven-resources-plugin:2.4.3:testResources (default-testResources) @ org.eclipse.rap.ui.views ---
[INFO] Using 'UTF-8' encoding to copy filtered resources.
[INFO] skip non existing resourceDirectory /jobs/genie.rap/rap-3.1-runtime/workspace/org.eclipse.rap/bundles/org.eclipse.rap.ui.views/src/test/resources
[INFO] 
[INFO] --- maven-surefire-plugin:2.17:test (test) @ org.eclipse.rap.ui.views ---
[INFO] 
[INFO] --- animal-sniffer-maven-plugin:1.14:check (ensure-java-1.7-class-library) @ org.eclipse.rap.ui.views ---
[INFO] Checking unresolved references to org.codehaus.mojo.signature:java17:1.0
[INFO] 
[INFO] --- tycho-source-plugin:0.25.0:plugin-source (plugin-source) @ org.eclipse.rap.ui.views ---
[INFO] Building jar: /jobs/genie.rap/rap-3.1-runtime/workspace/org.eclipse.rap/bundles/org.eclipse.rap.ui.views/target/org.eclipse.rap.ui.views-3.1.2-SNAPSHOT-sources.jar
[INFO] 
[INFO] --- target-platform-configuration:0.25.0:target-platform (default-target-platform) @ org.eclipse.rap.ui.views ---
[INFO] 
[INFO] --- tycho-packaging-plugin:0.25.0:package-plugin (default-package-plugin) @ org.eclipse.rap.ui.views ---
[INFO] Building jar: /jobs/genie.rap/rap-3.1-runtime/workspace/org.eclipse.rap/bundles/org.eclipse.rap.ui.views/target/org.eclipse.rap.ui.views-3.1.2-SNAPSHOT.jar
[INFO] 
[INFO] --- tycho-p2-plugin:0.25.0:p2-metadata-default (default-p2-metadata-default) @ org.eclipse.rap.ui.views ---
[INFO] No baseline version MavenProject: org.eclipse.rap:org.eclipse.rap.ui.views:3.1.2-SNAPSHOT @ /jobs/genie.rap/rap-3.1-runtime/workspace/org.eclipse.rap/bundles/org.eclipse.rap.ui.views/pom.xml
[INFO]                                                                         
[INFO] ------------------------------------------------------------------------
[INFO] Building org.eclipse.rap.demo.controls 3.1.2-SNAPSHOT
[INFO] ------------------------------------------------------------------------
[INFO] 
[INFO] --- maven-clean-plugin:2.5:clean (default-clean) @ org.eclipse.rap.demo.controls ---
[INFO] 
[INFO] --- tycho-packaging-plugin:0.25.0:build-qualifier (default-build-qualifier) @ org.eclipse.rap.demo.controls ---
[INFO] The project's OSGi version is 3.1.2.20161111-1312
[INFO] 
[INFO] --- tycho-packaging-plugin:0.25.0:validate-id (default-validate-id) @ org.eclipse.rap.demo.controls ---
[INFO] 
[INFO] --- tycho-packaging-plugin:0.25.0:validate-version (default-validate-version) @ org.eclipse.rap.demo.controls ---
[INFO] 
[INFO] --- maven-resources-plugin:2.4.3:resources (default-resources) @ org.eclipse.rap.demo.controls ---
[INFO] Using 'UTF-8' encoding to copy filtered resources.
[INFO] skip non existing resourceDirectory /jobs/genie.rap/rap-3.1-runtime/workspace/org.eclipse.rap/examples/org.eclipse.rap.demo.controls/src/main/resources
[INFO] 
[INFO] --- tycho-compiler-plugin:0.25.0:compile (default-compile) @ org.eclipse.rap.demo.controls ---
[INFO] Compiling 64 source files to /jobs/genie.rap/rap-3.1-runtime/workspace/org.eclipse.rap/examples/org.eclipse.rap.demo.controls/target/classes
[INFO] 
[INFO] --- maven-resources-plugin:2.4.3:testResources (default-testResources) @ org.eclipse.rap.demo.controls ---
[INFO] Using 'UTF-8' encoding to copy filtered resources.
[INFO] skip non existing resourceDirectory /jobs/genie.rap/rap-3.1-runtime/workspace/org.eclipse.rap/examples/org.eclipse.rap.demo.controls/src/test/resources
[INFO] 
[INFO] --- maven-surefire-plugin:2.17:test (test) @ org.eclipse.rap.demo.controls ---
[INFO] 
[INFO] --- animal-sniffer-maven-plugin:1.14:check (ensure-java-1.7-class-library) @ org.eclipse.rap.demo.controls ---
[INFO] Checking unresolved references to org.codehaus.mojo.signature:java17:1.0
[INFO] 
[INFO] --- tycho-source-plugin:0.25.0:plugin-source (plugin-source) @ org.eclipse.rap.demo.controls ---
[INFO] Building jar: /jobs/genie.rap/rap-3.1-runtime/workspace/org.eclipse.rap/examples/org.eclipse.rap.demo.controls/target/org.eclipse.rap.demo.controls-3.1.2-SNAPSHOT-sources.jar
[INFO] 
[INFO] --- target-platform-configuration:0.25.0:target-platform (default-target-platform) @ org.eclipse.rap.demo.controls ---
[INFO] 
[INFO] --- tycho-packaging-plugin:0.25.0:package-plugin (default-package-plugin) @ org.eclipse.rap.demo.controls ---
[INFO] Building jar: /jobs/genie.rap/rap-3.1-runtime/workspace/org.eclipse.rap/examples/org.eclipse.rap.demo.controls/target/org.eclipse.rap.demo.controls-3.1.2-SNAPSHOT.jar
[INFO] 
[INFO] --- tycho-p2-plugin:0.25.0:p2-metadata-default (default-p2-metadata-default) @ org.eclipse.rap.demo.controls ---
[INFO] No baseline version MavenProject: org.eclipse.rap:org.eclipse.rap.demo.controls:3.1.2-SNAPSHOT @ /jobs/genie.rap/rap-3.1-runtime/workspace/org.eclipse.rap/examples/org.eclipse.rap.demo.controls/pom.xml
[INFO]                                                                         
[INFO] ------------------------------------------------------------------------
[INFO] Building org.eclipse.rap.demo.databinding 3.1.2-SNAPSHOT
[INFO] ------------------------------------------------------------------------
[INFO] 
[INFO] --- maven-clean-plugin:2.5:clean (default-clean) @ org.eclipse.rap.demo.databinding ---
[INFO] 
[INFO] --- tycho-packaging-plugin:0.25.0:build-qualifier (default-build-qualifier) @ org.eclipse.rap.demo.databinding ---
[INFO] The project's OSGi version is 3.1.2.20161108-1505
[INFO] 
[INFO] --- tycho-packaging-plugin:0.25.0:validate-id (default-validate-id) @ org.eclipse.rap.demo.databinding ---
[INFO] 
[INFO] --- tycho-packaging-plugin:0.25.0:validate-version (default-validate-version) @ org.eclipse.rap.demo.databinding ---
[INFO] 
[INFO] --- maven-resources-plugin:2.4.3:resources (default-resources) @ org.eclipse.rap.demo.databinding ---
[INFO] Using 'UTF-8' encoding to copy filtered resources.
[INFO] skip non existing resourceDirectory /jobs/genie.rap/rap-3.1-runtime/workspace/org.eclipse.rap/examples/org.eclipse.rap.demo.databinding/src/main/resources
[INFO] 
[INFO] --- tycho-compiler-plugin:0.25.0:compile (default-compile) @ org.eclipse.rap.demo.databinding ---
[INFO] Compiling 11 source files to /jobs/genie.rap/rap-3.1-runtime/workspace/org.eclipse.rap/examples/org.eclipse.rap.demo.databinding/target/classes
[INFO] 
[INFO] --- maven-resources-plugin:2.4.3:testResources (default-testResources) @ org.eclipse.rap.demo.databinding ---
[INFO] Using 'UTF-8' encoding to copy filtered resources.
[INFO] skip non existing resourceDirectory /jobs/genie.rap/rap-3.1-runtime/workspace/org.eclipse.rap/examples/org.eclipse.rap.demo.databinding/src/test/resources
[INFO] 
[INFO] --- maven-surefire-plugin:2.17:test (test) @ org.eclipse.rap.demo.databinding ---
[INFO] 
[INFO] --- animal-sniffer-maven-plugin:1.14:check (ensure-java-1.7-class-library) @ org.eclipse.rap.demo.databinding ---
[INFO] Checking unresolved references to org.codehaus.mojo.signature:java17:1.0
[INFO] 
[INFO] --- tycho-source-plugin:0.25.0:plugin-source (plugin-source) @ org.eclipse.rap.demo.databinding ---
[INFO] Building jar: /jobs/genie.rap/rap-3.1-runtime/workspace/org.eclipse.rap/examples/org.eclipse.rap.demo.databinding/target/org.eclipse.rap.demo.databinding-3.1.2-SNAPSHOT-sources.jar
[INFO] 
[INFO] --- target-platform-configuration:0.25.0:target-platform (default-target-platform) @ org.eclipse.rap.demo.databinding ---
[INFO] 
[INFO] --- tycho-packaging-plugin:0.25.0:package-plugin (default-package-plugin) @ org.eclipse.rap.demo.databinding ---
[INFO] Building jar: /jobs/genie.rap/rap-3.1-runtime/workspace/org.eclipse.rap/examples/org.eclipse.rap.demo.databinding/target/org.eclipse.rap.demo.databinding-3.1.2-SNAPSHOT.jar
[INFO] 
[INFO] --- tycho-p2-plugin:0.25.0:p2-metadata-default (default-p2-metadata-default) @ org.eclipse.rap.demo.databinding ---
[INFO] No baseline version MavenProject: org.eclipse.rap:org.eclipse.rap.demo.databinding:3.1.2-SNAPSHOT @ /jobs/genie.rap/rap-3.1-runtime/workspace/org.eclipse.rap/examples/org.eclipse.rap.demo.databinding/pom.xml
[INFO]                                                                         
[INFO] ------------------------------------------------------------------------
[INFO] Building org.eclipse.rap.demo 3.1.2-SNAPSHOT
[INFO] ------------------------------------------------------------------------
[INFO] 
[INFO] --- maven-clean-plugin:2.5:clean (default-clean) @ org.eclipse.rap.demo ---
[INFO] 
[INFO] --- tycho-packaging-plugin:0.25.0:build-qualifier (default-build-qualifier) @ org.eclipse.rap.demo ---
[INFO] The project's OSGi version is 3.1.2.20161108-1505
[INFO] 
[INFO] --- tycho-packaging-plugin:0.25.0:validate-id (default-validate-id) @ org.eclipse.rap.demo ---
[INFO] 
[INFO] --- tycho-packaging-plugin:0.25.0:validate-version (default-validate-version) @ org.eclipse.rap.demo ---
[INFO] 
[INFO] --- maven-resources-plugin:2.4.3:resources (default-resources) @ org.eclipse.rap.demo ---
[INFO] Using 'UTF-8' encoding to copy filtered resources.
[INFO] skip non existing resourceDirectory /jobs/genie.rap/rap-3.1-runtime/workspace/org.eclipse.rap/examples/org.eclipse.rap.demo/src/main/resources
[INFO] 
[INFO] --- tycho-compiler-plugin:0.25.0:compile (default-compile) @ org.eclipse.rap.demo ---
[INFO] Compiling 44 source files to /jobs/genie.rap/rap-3.1-runtime/workspace/org.eclipse.rap/examples/org.eclipse.rap.demo/target/classes
[INFO] 
[INFO] --- maven-resources-plugin:2.4.3:testResources (default-testResources) @ org.eclipse.rap.demo ---
[INFO] Using 'UTF-8' encoding to copy filtered resources.
[INFO] skip non existing resourceDirectory /jobs/genie.rap/rap-3.1-runtime/workspace/org.eclipse.rap/examples/org.eclipse.rap.demo/src/test/resources
[INFO] 
[INFO] --- maven-surefire-plugin:2.17:test (test) @ org.eclipse.rap.demo ---
[INFO] 
[INFO] --- animal-sniffer-maven-plugin:1.14:check (ensure-java-1.7-class-library) @ org.eclipse.rap.demo ---
[INFO] Checking unresolved references to org.codehaus.mojo.signature:java17:1.0
[INFO] 
[INFO] --- tycho-source-plugin:0.25.0:plugin-source (plugin-source) @ org.eclipse.rap.demo ---
[INFO] Building jar: /jobs/genie.rap/rap-3.1-runtime/workspace/org.eclipse.rap/examples/org.eclipse.rap.demo/target/org.eclipse.rap.demo-3.1.2-SNAPSHOT-sources.jar
[INFO] 
[INFO] --- target-platform-configuration:0.25.0:target-platform (default-target-platform) @ org.eclipse.rap.demo ---
[INFO] 
[INFO] --- tycho-packaging-plugin:0.25.0:package-plugin (default-package-plugin) @ org.eclipse.rap.demo ---
[INFO] Building jar: /jobs/genie.rap/rap-3.1-runtime/workspace/org.eclipse.rap/examples/org.eclipse.rap.demo/target/org.eclipse.rap.demo-3.1.2-SNAPSHOT.jar
[INFO] 
[INFO] --- tycho-p2-plugin:0.25.0:p2-metadata-default (default-p2-metadata-default) @ org.eclipse.rap.demo ---
[INFO] No baseline version MavenProject: org.eclipse.rap:org.eclipse.rap.demo:3.1.2-SNAPSHOT @ /jobs/genie.rap/rap-3.1-runtime/workspace/org.eclipse.rap/examples/org.eclipse.rap.demo/pom.xml
[INFO]                                                                         
[INFO] ------------------------------------------------------------------------
[INFO] Building org.eclipse.rap.design.example 3.1.2-SNAPSHOT
[INFO] ------------------------------------------------------------------------
[INFO] 
[INFO] --- maven-clean-plugin:2.5:clean (default-clean) @ org.eclipse.rap.design.example ---
[INFO] 
[INFO] --- tycho-packaging-plugin:0.25.0:build-qualifier (default-build-qualifier) @ org.eclipse.rap.design.example ---
[INFO] The project's OSGi version is 3.1.2.20161108-1505
[INFO] 
[INFO] --- tycho-packaging-plugin:0.25.0:validate-id (default-validate-id) @ org.eclipse.rap.design.example ---
[INFO] 
[INFO] --- tycho-packaging-plugin:0.25.0:validate-version (default-validate-version) @ org.eclipse.rap.design.example ---
[INFO] 
[INFO] --- maven-resources-plugin:2.4.3:resources (default-resources) @ org.eclipse.rap.design.example ---
[INFO] Using 'UTF-8' encoding to copy filtered resources.
[INFO] skip non existing resourceDirectory /jobs/genie.rap/rap-3.1-runtime/workspace/org.eclipse.rap/examples/org.eclipse.rap.design.example/src/main/resources
[INFO] 
[INFO] --- tycho-compiler-plugin:0.25.0:compile (default-compile) @ org.eclipse.rap.design.example ---
[INFO] Compiling 42 source files to /jobs/genie.rap/rap-3.1-runtime/workspace/org.eclipse.rap/examples/org.eclipse.rap.design.example/target/classes
[INFO] 
[INFO] --- maven-resources-plugin:2.4.3:testResources (default-testResources) @ org.eclipse.rap.design.example ---
[INFO] Using 'UTF-8' encoding to copy filtered resources.
[INFO] skip non existing resourceDirectory /jobs/genie.rap/rap-3.1-runtime/workspace/org.eclipse.rap/examples/org.eclipse.rap.design.example/src/test/resources
[INFO] 
[INFO] --- maven-surefire-plugin:2.17:test (test) @ org.eclipse.rap.design.example ---
[INFO] 
[INFO] --- animal-sniffer-maven-plugin:1.14:check (ensure-java-1.7-class-library) @ org.eclipse.rap.design.example ---
[INFO] Checking unresolved references to org.codehaus.mojo.signature:java17:1.0
[INFO] 
[INFO] --- tycho-source-plugin:0.25.0:plugin-source (plugin-source) @ org.eclipse.rap.design.example ---
[INFO] Building jar: /jobs/genie.rap/rap-3.1-runtime/workspace/org.eclipse.rap/examples/org.eclipse.rap.design.example/target/org.eclipse.rap.design.example-3.1.2-SNAPSHOT-sources.jar
[INFO] 
[INFO] --- target-platform-configuration:0.25.0:target-platform (default-target-platform) @ org.eclipse.rap.design.example ---
[INFO] 
[INFO] --- tycho-packaging-plugin:0.25.0:package-plugin (default-package-plugin) @ org.eclipse.rap.design.example ---
[INFO] Building jar: /jobs/genie.rap/rap-3.1-runtime/workspace/org.eclipse.rap/examples/org.eclipse.rap.design.example/target/org.eclipse.rap.design.example-3.1.2-SNAPSHOT.jar
[INFO] 
[INFO] --- tycho-p2-plugin:0.25.0:p2-metadata-default (default-p2-metadata-default) @ org.eclipse.rap.design.example ---
[INFO] No baseline version MavenProject: org.eclipse.rap:org.eclipse.rap.design.example:3.1.2-SNAPSHOT @ /jobs/genie.rap/rap-3.1-runtime/workspace/org.eclipse.rap/examples/org.eclipse.rap.design.example/pom.xml
[INFO]                                                                         
[INFO] ------------------------------------------------------------------------
[INFO] Building org.eclipse.rap.examples 3.1.2-SNAPSHOT
[INFO] ------------------------------------------------------------------------
[INFO] 
[INFO] --- maven-clean-plugin:2.5:clean (default-clean) @ org.eclipse.rap.examples ---
[INFO] 
[INFO] --- tycho-packaging-plugin:0.25.0:build-qualifier (default-build-qualifier) @ org.eclipse.rap.examples ---
[INFO] The project's OSGi version is 3.1.2.20161108-1505
[INFO] 
[INFO] --- tycho-packaging-plugin:0.25.0:validate-id (default-validate-id) @ org.eclipse.rap.examples ---
[INFO] 
[INFO] --- tycho-packaging-plugin:0.25.0:validate-version (default-validate-version) @ org.eclipse.rap.examples ---
[INFO] 
[INFO] --- maven-resources-plugin:2.4.3:resources (default-resources) @ org.eclipse.rap.examples ---
[INFO] Using 'UTF-8' encoding to copy filtered resources.
[INFO] skip non existing resourceDirectory /jobs/genie.rap/rap-3.1-runtime/workspace/org.eclipse.rap/examples/org.eclipse.rap.examples/src/main/resources
[INFO] 
[INFO] --- tycho-compiler-plugin:0.25.0:compile (default-compile) @ org.eclipse.rap.examples ---
[INFO] Compiling 13 source files to /jobs/genie.rap/rap-3.1-runtime/workspace/org.eclipse.rap/examples/org.eclipse.rap.examples/target/classes
[INFO] 
[INFO] --- maven-resources-plugin:2.4.3:testResources (default-testResources) @ org.eclipse.rap.examples ---
[INFO] Using 'UTF-8' encoding to copy filtered resources.
[INFO] skip non existing resourceDirectory /jobs/genie.rap/rap-3.1-runtime/workspace/org.eclipse.rap/examples/org.eclipse.rap.examples/src/test/resources
[INFO] 
[INFO] --- maven-surefire-plugin:2.17:test (test) @ org.eclipse.rap.examples ---
[INFO] 
[INFO] --- animal-sniffer-maven-plugin:1.14:check (ensure-java-1.7-class-library) @ org.eclipse.rap.examples ---
[INFO] Checking unresolved references to org.codehaus.mojo.signature:java17:1.0
[INFO] 
[INFO] --- tycho-source-plugin:0.25.0:plugin-source (plugin-source) @ org.eclipse.rap.examples ---
[INFO] Building jar: /jobs/genie.rap/rap-3.1-runtime/workspace/org.eclipse.rap/examples/org.eclipse.rap.examples/target/org.eclipse.rap.examples-3.1.2-SNAPSHOT-sources.jar
[INFO] 
[INFO] --- target-platform-configuration:0.25.0:target-platform (default-target-platform) @ org.eclipse.rap.examples ---
[INFO] 
[INFO] --- tycho-packaging-plugin:0.25.0:package-plugin (default-package-plugin) @ org.eclipse.rap.examples ---
[INFO] Building jar: /jobs/genie.rap/rap-3.1-runtime/workspace/org.eclipse.rap/examples/org.eclipse.rap.examples/target/org.eclipse.rap.examples-3.1.2-SNAPSHOT.jar
[INFO] 
[INFO] --- tycho-p2-plugin:0.25.0:p2-metadata-default (default-p2-metadata-default) @ org.eclipse.rap.examples ---
[INFO] No baseline version MavenProject: org.eclipse.rap:org.eclipse.rap.examples:3.1.2-SNAPSHOT @ /jobs/genie.rap/rap-3.1-runtime/workspace/org.eclipse.rap/examples/org.eclipse.rap.examples/pom.xml
[INFO]                                                                         
[INFO] ------------------------------------------------------------------------
[INFO] Building org.eclipse.rap.examples.pages 3.1.2-SNAPSHOT
[INFO] ------------------------------------------------------------------------
[INFO] 
[INFO] --- maven-clean-plugin:2.5:clean (default-clean) @ org.eclipse.rap.examples.pages ---
[INFO] 
[INFO] --- tycho-packaging-plugin:0.25.0:build-qualifier (default-build-qualifier) @ org.eclipse.rap.examples.pages ---
[INFO] The project's OSGi version is 3.1.2.20161108-1505
[INFO] 
[INFO] --- tycho-packaging-plugin:0.25.0:validate-id (default-validate-id) @ org.eclipse.rap.examples.pages ---
[INFO] 
[INFO] --- tycho-packaging-plugin:0.25.0:validate-version (default-validate-version) @ org.eclipse.rap.examples.pages ---
[INFO] 
[INFO] --- maven-resources-plugin:2.4.3:resources (default-resources) @ org.eclipse.rap.examples.pages ---
[INFO] Using 'UTF-8' encoding to copy filtered resources.
[INFO] skip non existing resourceDirectory /jobs/genie.rap/rap-3.1-runtime/workspace/org.eclipse.rap/examples/org.eclipse.rap.examples.pages/src/main/resources
[INFO] 
[INFO] --- tycho-compiler-plugin:0.25.0:compile (default-compile) @ org.eclipse.rap.examples.pages ---
[INFO] Compiling 32 source files to /jobs/genie.rap/rap-3.1-runtime/workspace/org.eclipse.rap/examples/org.eclipse.rap.examples.pages/target/classes
[INFO] 
[INFO] --- maven-resources-plugin:2.4.3:testResources (default-testResources) @ org.eclipse.rap.examples.pages ---
[INFO] Using 'UTF-8' encoding to copy filtered resources.
[INFO] skip non existing resourceDirectory /jobs/genie.rap/rap-3.1-runtime/workspace/org.eclipse.rap/examples/org.eclipse.rap.examples.pages/src/test/resources
[INFO] 
[INFO] --- maven-surefire-plugin:2.17:test (test) @ org.eclipse.rap.examples.pages ---
[INFO] 
[INFO] --- animal-sniffer-maven-plugin:1.14:check (ensure-java-1.7-class-library) @ org.eclipse.rap.examples.pages ---
[INFO] Checking unresolved references to org.codehaus.mojo.signature:java17:1.0
[INFO] 
[INFO] --- tycho-source-plugin:0.25.0:plugin-source (plugin-source) @ org.eclipse.rap.examples.pages ---
[INFO] Building jar: /jobs/genie.rap/rap-3.1-runtime/workspace/org.eclipse.rap/examples/org.eclipse.rap.examples.pages/target/org.eclipse.rap.examples.pages-3.1.2-SNAPSHOT-sources.jar
[INFO] 
[INFO] --- target-platform-configuration:0.25.0:target-platform (default-target-platform) @ org.eclipse.rap.examples.pages ---
[INFO] 
[INFO] --- tycho-packaging-plugin:0.25.0:package-plugin (default-package-plugin) @ org.eclipse.rap.examples.pages ---
[INFO] Building jar: /jobs/genie.rap/rap-3.1-runtime/workspace/org.eclipse.rap/examples/org.eclipse.rap.examples.pages/target/org.eclipse.rap.examples.pages-3.1.2-SNAPSHOT.jar
[INFO] 
[INFO] --- tycho-p2-plugin:0.25.0:p2-metadata-default (default-p2-metadata-default) @ org.eclipse.rap.examples.pages ---
[INFO] No baseline version MavenProject: org.eclipse.rap:org.eclipse.rap.examples.pages:3.1.2-SNAPSHOT @ /jobs/genie.rap/rap-3.1-runtime/workspace/org.eclipse.rap/examples/org.eclipse.rap.examples.pages/pom.xml
[INFO]                                                                         
[INFO] ------------------------------------------------------------------------
[INFO] Building org.eclipse.rap.filedialog.demo.examples 3.1.2-SNAPSHOT
[INFO] ------------------------------------------------------------------------
[INFO] 
[INFO] --- maven-clean-plugin:2.5:clean (default-clean) @ org.eclipse.rap.filedialog.demo.examples ---
[INFO] 
[INFO] --- tycho-packaging-plugin:0.25.0:build-qualifier (default-build-qualifier) @ org.eclipse.rap.filedialog.demo.examples ---
[INFO] The project's OSGi version is 3.1.2.20161108-1505
[INFO] 
[INFO] --- tycho-packaging-plugin:0.25.0:validate-id (default-validate-id) @ org.eclipse.rap.filedialog.demo.examples ---
[INFO] 
[INFO] --- tycho-packaging-plugin:0.25.0:validate-version (default-validate-version) @ org.eclipse.rap.filedialog.demo.examples ---
[INFO] 
[INFO] --- maven-resources-plugin:2.4.3:resources (default-resources) @ org.eclipse.rap.filedialog.demo.examples ---
[INFO] Using 'UTF-8' encoding to copy filtered resources.
[INFO] skip non existing resourceDirectory /jobs/genie.rap/rap-3.1-runtime/workspace/org.eclipse.rap/examples/org.eclipse.rap.filedialog.demo.examples/src/main/resources
[INFO] 
[INFO] --- tycho-compiler-plugin:0.25.0:compile (default-compile) @ org.eclipse.rap.filedialog.demo.examples ---
[INFO] Compiling 3 source files to /jobs/genie.rap/rap-3.1-runtime/workspace/org.eclipse.rap/examples/org.eclipse.rap.filedialog.demo.examples/target/classes
[INFO] 
[INFO] --- maven-resources-plugin:2.4.3:testResources (default-testResources) @ org.eclipse.rap.filedialog.demo.examples ---
[INFO] Using 'UTF-8' encoding to copy filtered resources.
[INFO] skip non existing resourceDirectory /jobs/genie.rap/rap-3.1-runtime/workspace/org.eclipse.rap/examples/org.eclipse.rap.filedialog.demo.examples/src/test/resources
[INFO] 
[INFO] --- maven-surefire-plugin:2.17:test (test) @ org.eclipse.rap.filedialog.demo.examples ---
[INFO] 
[INFO] --- animal-sniffer-maven-plugin:1.14:check (ensure-java-1.7-class-library) @ org.eclipse.rap.filedialog.demo.examples ---
[INFO] Checking unresolved references to org.codehaus.mojo.signature:java17:1.0
[INFO] 
[INFO] --- tycho-source-plugin:0.25.0:plugin-source (plugin-source) @ org.eclipse.rap.filedialog.demo.examples ---
[INFO] Building jar: /jobs/genie.rap/rap-3.1-runtime/workspace/org.eclipse.rap/examples/org.eclipse.rap.filedialog.demo.examples/target/org.eclipse.rap.filedialog.demo.examples-3.1.2-SNAPSHOT-sources.jar
[INFO] 
[INFO] --- target-platform-configuration:0.25.0:target-platform (default-target-platform) @ org.eclipse.rap.filedialog.demo.examples ---
[INFO] 
[INFO] --- tycho-packaging-plugin:0.25.0:package-plugin (default-package-plugin) @ org.eclipse.rap.filedialog.demo.examples ---
[INFO] Building jar: /jobs/genie.rap/rap-3.1-runtime/workspace/org.eclipse.rap/examples/org.eclipse.rap.filedialog.demo.examples/target/org.eclipse.rap.filedialog.demo.examples-3.1.2-SNAPSHOT.jar
[INFO] 
[INFO] --- tycho-p2-plugin:0.25.0:p2-metadata-default (default-p2-metadata-default) @ org.eclipse.rap.filedialog.demo.examples ---
[INFO] No baseline version MavenProject: org.eclipse.rap:org.eclipse.rap.filedialog.demo.examples:3.1.2-SNAPSHOT @ /jobs/genie.rap/rap-3.1-runtime/workspace/org.eclipse.rap/examples/org.eclipse.rap.filedialog.demo.examples/pom.xml
[INFO]                                                                         
[INFO] ------------------------------------------------------------------------
[INFO] Building org.eclipse.rap.nebula.widgets.grid.demo.examples 3.1.2-SNAPSHOT
[INFO] ------------------------------------------------------------------------
[INFO] 
[INFO] --- maven-clean-plugin:2.5:clean (default-clean) @ org.eclipse.rap.nebula.widgets.grid.demo.examples ---
[INFO] 
[INFO] --- tycho-packaging-plugin:0.25.0:build-qualifier (default-build-qualifier) @ org.eclipse.rap.nebula.widgets.grid.demo.examples ---
[INFO] The project's OSGi version is 3.1.2.20161108-1505
[INFO] 
[INFO] --- tycho-packaging-plugin:0.25.0:validate-id (default-validate-id) @ org.eclipse.rap.nebula.widgets.grid.demo.examples ---
[INFO] 
[INFO] --- tycho-packaging-plugin:0.25.0:validate-version (default-validate-version) @ org.eclipse.rap.nebula.widgets.grid.demo.examples ---
[INFO] 
[INFO] --- maven-resources-plugin:2.4.3:resources (default-resources) @ org.eclipse.rap.nebula.widgets.grid.demo.examples ---
[INFO] Using 'UTF-8' encoding to copy filtered resources.
[INFO] skip non existing resourceDirectory /jobs/genie.rap/rap-3.1-runtime/workspace/org.eclipse.rap/examples/org.eclipse.rap.nebula.widgets.grid.demo.examples/src/main/resources
[INFO] 
[INFO] --- tycho-compiler-plugin:0.25.0:compile (default-compile) @ org.eclipse.rap.nebula.widgets.grid.demo.examples ---
[INFO] Compiling 3 source files to /jobs/genie.rap/rap-3.1-runtime/workspace/org.eclipse.rap/examples/org.eclipse.rap.nebula.widgets.grid.demo.examples/target/classes
[INFO] 
[INFO] --- maven-resources-plugin:2.4.3:testResources (default-testResources) @ org.eclipse.rap.nebula.widgets.grid.demo.examples ---
[INFO] Using 'UTF-8' encoding to copy filtered resources.
[INFO] skip non existing resourceDirectory /jobs/genie.rap/rap-3.1-runtime/workspace/org.eclipse.rap/examples/org.eclipse.rap.nebula.widgets.grid.demo.examples/src/test/resources
[INFO] 
[INFO] --- maven-surefire-plugin:2.17:test (test) @ org.eclipse.rap.nebula.widgets.grid.demo.examples ---
[INFO] 
[INFO] --- animal-sniffer-maven-plugin:1.14:check (ensure-java-1.7-class-library) @ org.eclipse.rap.nebula.widgets.grid.demo.examples ---
[INFO] Checking unresolved references to org.codehaus.mojo.signature:java17:1.0
[INFO] 
[INFO] --- tycho-source-plugin:0.25.0:plugin-source (plugin-source) @ org.eclipse.rap.nebula.widgets.grid.demo.examples ---
[INFO] Building jar: /jobs/genie.rap/rap-3.1-runtime/workspace/org.eclipse.rap/examples/org.eclipse.rap.nebula.widgets.grid.demo.examples/target/org.eclipse.rap.nebula.widgets.grid.demo.examples-3.1.2-SNAPSHOT-sources.jar
[INFO] 
[INFO] --- target-platform-configuration:0.25.0:target-platform (default-target-platform) @ org.eclipse.rap.nebula.widgets.grid.demo.examples ---
[INFO] 
[INFO] --- tycho-packaging-plugin:0.25.0:package-plugin (default-package-plugin) @ org.eclipse.rap.nebula.widgets.grid.demo.examples ---
[INFO] Building jar: /jobs/genie.rap/rap-3.1-runtime/workspace/org.eclipse.rap/examples/org.eclipse.rap.nebula.widgets.grid.demo.examples/target/org.eclipse.rap.nebula.widgets.grid.demo.examples-3.1.2-SNAPSHOT.jar
[INFO] 
[INFO] --- tycho-p2-plugin:0.25.0:p2-metadata-default (default-p2-metadata-default) @ org.eclipse.rap.nebula.widgets.grid.demo.examples ---
[INFO] No baseline version MavenProject: org.eclipse.rap:org.eclipse.rap.nebula.widgets.grid.demo.examples:3.1.2-SNAPSHOT @ /jobs/genie.rap/rap-3.1-runtime/workspace/org.eclipse.rap/examples/org.eclipse.rap.nebula.widgets.grid.demo.examples/pom.xml
[INFO]                                                                         
[INFO] ------------------------------------------------------------------------
[INFO] Building org.eclipse.rap.nebula.widgets.richtext.demo.examples 3.1.2-SNAPSHOT
[INFO] ------------------------------------------------------------------------
[INFO] 
[INFO] --- maven-clean-plugin:2.5:clean (default-clean) @ org.eclipse.rap.nebula.widgets.richtext.demo.examples ---
[INFO] 
[INFO] --- tycho-packaging-plugin:0.25.0:build-qualifier (default-build-qualifier) @ org.eclipse.rap.nebula.widgets.richtext.demo.examples ---
[INFO] The project's OSGi version is 3.1.2.20161108-1505
[INFO] 
[INFO] --- tycho-packaging-plugin:0.25.0:validate-id (default-validate-id) @ org.eclipse.rap.nebula.widgets.richtext.demo.examples ---
[INFO] 
[INFO] --- tycho-packaging-plugin:0.25.0:validate-version (default-validate-version) @ org.eclipse.rap.nebula.widgets.richtext.demo.examples ---
[INFO] 
[INFO] --- maven-resources-plugin:2.4.3:resources (default-resources) @ org.eclipse.rap.nebula.widgets.richtext.demo.examples ---
[INFO] Using 'UTF-8' encoding to copy filtered resources.
[INFO] skip non existing resourceDirectory /jobs/genie.rap/rap-3.1-runtime/workspace/org.eclipse.rap/examples/org.eclipse.rap.nebula.widgets.richtext.demo.examples/src/main/resources
[INFO] 
[INFO] --- tycho-compiler-plugin:0.25.0:compile (default-compile) @ org.eclipse.rap.nebula.widgets.richtext.demo.examples ---
[INFO] Compiling 3 source files to /jobs/genie.rap/rap-3.1-runtime/workspace/org.eclipse.rap/examples/org.eclipse.rap.nebula.widgets.richtext.demo.examples/target/classes
[INFO] 
[INFO] --- maven-resources-plugin:2.4.3:testResources (default-testResources) @ org.eclipse.rap.nebula.widgets.richtext.demo.examples ---
[INFO] Using 'UTF-8' encoding to copy filtered resources.
[INFO] skip non existing resourceDirectory /jobs/genie.rap/rap-3.1-runtime/workspace/org.eclipse.rap/examples/org.eclipse.rap.nebula.widgets.richtext.demo.examples/src/test/resources
[INFO] 
[INFO] --- maven-surefire-plugin:2.17:test (test) @ org.eclipse.rap.nebula.widgets.richtext.demo.examples ---
[INFO] 
[INFO] --- animal-sniffer-maven-plugin:1.14:check (ensure-java-1.7-class-library) @ org.eclipse.rap.nebula.widgets.richtext.demo.examples ---
[INFO] Checking unresolved references to org.codehaus.mojo.signature:java17:1.0
[INFO] 
[INFO] --- tycho-source-plugin:0.25.0:plugin-source (plugin-source) @ org.eclipse.rap.nebula.widgets.richtext.demo.examples ---
[INFO] Building jar: /jobs/genie.rap/rap-3.1-runtime/workspace/org.eclipse.rap/examples/org.eclipse.rap.nebula.widgets.richtext.demo.examples/target/org.eclipse.rap.nebula.widgets.richtext.demo.examples-3.1.2-SNAPSHOT-sources.jar
[INFO] 
[INFO] --- target-platform-configuration:0.25.0:target-platform (default-target-platform) @ org.eclipse.rap.nebula.widgets.richtext.demo.examples ---
[INFO] 
[INFO] --- tycho-packaging-plugin:0.25.0:package-plugin (default-package-plugin) @ org.eclipse.rap.nebula.widgets.richtext.demo.examples ---
[INFO] Building jar: /jobs/genie.rap/rap-3.1-runtime/workspace/org.eclipse.rap/examples/org.eclipse.rap.nebula.widgets.richtext.demo.examples/target/org.eclipse.rap.nebula.widgets.richtext.demo.examples-3.1.2-SNAPSHOT.jar
[INFO] 
[INFO] --- tycho-p2-plugin:0.25.0:p2-metadata-default (default-p2-metadata-default) @ org.eclipse.rap.nebula.widgets.richtext.demo.examples ---
[INFO] No baseline version MavenProject: org.eclipse.rap:org.eclipse.rap.nebula.widgets.richtext.demo.examples:3.1.2-SNAPSHOT @ /jobs/genie.rap/rap-3.1-runtime/workspace/org.eclipse.rap/examples/org.eclipse.rap.nebula.widgets.richtext.demo.examples/pom.xml
[INFO]                                                                         
[INFO] ------------------------------------------------------------------------
[INFO] Building org.eclipse.rap.rwt.testfixture 3.1.2-SNAPSHOT
[INFO] ------------------------------------------------------------------------
[INFO] 
[INFO] --- maven-clean-plugin:2.5:clean (default-clean) @ org.eclipse.rap.rwt.testfixture ---
[INFO] 
[INFO] --- tycho-packaging-plugin:0.25.0:build-qualifier (default-build-qualifier) @ org.eclipse.rap.rwt.testfixture ---
[INFO] The project's OSGi version is 3.1.2.20161108-1505
[INFO] 
[INFO] --- tycho-packaging-plugin:0.25.0:validate-id (default-validate-id) @ org.eclipse.rap.rwt.testfixture ---
[INFO] 
[INFO] --- tycho-packaging-plugin:0.25.0:validate-version (default-validate-version) @ org.eclipse.rap.rwt.testfixture ---
[INFO] 
[INFO] --- maven-resources-plugin:2.4.3:resources (default-resources) @ org.eclipse.rap.rwt.testfixture ---
[INFO] Using 'UTF-8' encoding to copy filtered resources.
[INFO] skip non existing resourceDirectory /jobs/genie.rap/rap-3.1-runtime/workspace/org.eclipse.rap/tests/org.eclipse.rap.rwt.testfixture/src/main/resources
[INFO] 
[INFO] --- tycho-compiler-plugin:0.25.0:compile (default-compile) @ org.eclipse.rap.rwt.testfixture ---
[INFO] Compiling 23 source files to /jobs/genie.rap/rap-3.1-runtime/workspace/org.eclipse.rap/tests/org.eclipse.rap.rwt.testfixture/target/classes
[INFO] 
[INFO] --- maven-resources-plugin:2.4.3:testResources (default-testResources) @ org.eclipse.rap.rwt.testfixture ---
[INFO] Using 'UTF-8' encoding to copy filtered resources.
[INFO] skip non existing resourceDirectory /jobs/genie.rap/rap-3.1-runtime/workspace/org.eclipse.rap/tests/org.eclipse.rap.rwt.testfixture/src/test/resources
[INFO] 
[INFO] --- maven-surefire-plugin:2.17:test (test) @ org.eclipse.rap.rwt.testfixture ---
[INFO] 
[INFO] --- animal-sniffer-maven-plugin:1.14:check (ensure-java-1.7-class-library) @ org.eclipse.rap.rwt.testfixture ---
[INFO] Checking unresolved references to org.codehaus.mojo.signature:java17:1.0
[INFO] 
[INFO] --- tycho-source-plugin:0.25.0:plugin-source (plugin-source) @ org.eclipse.rap.rwt.testfixture ---
[INFO] Building jar: /jobs/genie.rap/rap-3.1-runtime/workspace/org.eclipse.rap/tests/org.eclipse.rap.rwt.testfixture/target/org.eclipse.rap.rwt.testfixture-3.1.2-SNAPSHOT-sources.jar
[INFO] 
[INFO] --- target-platform-configuration:0.25.0:target-platform (default-target-platform) @ org.eclipse.rap.rwt.testfixture ---
[INFO] 
[INFO] --- tycho-packaging-plugin:0.25.0:package-plugin (default-package-plugin) @ org.eclipse.rap.rwt.testfixture ---
[INFO] Building jar: /jobs/genie.rap/rap-3.1-runtime/workspace/org.eclipse.rap/tests/org.eclipse.rap.rwt.testfixture/target/org.eclipse.rap.rwt.testfixture-3.1.2-SNAPSHOT.jar
[INFO] 
[INFO] --- tycho-p2-plugin:0.25.0:p2-metadata-default (default-p2-metadata-default) @ org.eclipse.rap.rwt.testfixture ---
[INFO] No baseline version MavenProject: org.eclipse.rap:org.eclipse.rap.rwt.testfixture:3.1.2-SNAPSHOT @ /jobs/genie.rap/rap-3.1-runtime/workspace/org.eclipse.rap/tests/org.eclipse.rap.rwt.testfixture/pom.xml
[INFO]                                                                         
[INFO] ------------------------------------------------------------------------
[INFO] Building org.eclipse.rap.filedialog.test 3.1.2-SNAPSHOT
[INFO] ------------------------------------------------------------------------
[INFO] 
[INFO] --- maven-clean-plugin:2.5:clean (default-clean) @ org.eclipse.rap.filedialog.test ---
[INFO] 
[INFO] --- tycho-packaging-plugin:0.25.0:build-qualifier (default-build-qualifier) @ org.eclipse.rap.filedialog.test ---
[INFO] The project's OSGi version is 3.1.2.20161108-1505
[INFO] 
[INFO] --- tycho-packaging-plugin:0.25.0:validate-id (default-validate-id) @ org.eclipse.rap.filedialog.test ---
[INFO] 
[INFO] --- tycho-packaging-plugin:0.25.0:validate-version (default-validate-version) @ org.eclipse.rap.filedialog.test ---
[INFO] 
[INFO] --- maven-resources-plugin:2.4.3:resources (default-resources) @ org.eclipse.rap.filedialog.test ---
[INFO] Using 'UTF-8' encoding to copy filtered resources.
[INFO] skip non existing resourceDirectory /jobs/genie.rap/rap-3.1-runtime/workspace/org.eclipse.rap/tests/org.eclipse.rap.filedialog.test/src/main/resources
[INFO] 
[INFO] --- tycho-compiler-plugin:0.25.0:compile (default-compile) @ org.eclipse.rap.filedialog.test ---
[INFO] Compiling 6 source files to /jobs/genie.rap/rap-3.1-runtime/workspace/org.eclipse.rap/tests/org.eclipse.rap.filedialog.test/target/classes
[INFO] 
[INFO] --- maven-resources-plugin:2.4.3:testResources (default-testResources) @ org.eclipse.rap.filedialog.test ---
[INFO] Using 'UTF-8' encoding to copy filtered resources.
[INFO] skip non existing resourceDirectory /jobs/genie.rap/rap-3.1-runtime/workspace/org.eclipse.rap/tests/org.eclipse.rap.filedialog.test/src/test/resources
[INFO] 
[INFO] --- maven-surefire-plugin:2.17:test (test) @ org.eclipse.rap.filedialog.test ---
[INFO] Surefire report directory: /jobs/genie.rap/rap-3.1-runtime/workspace/org.eclipse.rap/tests/org.eclipse.rap.filedialog.test/target/surefire-reports

-------------------------------------------------------
 T E S T S
-------------------------------------------------------
Running org.eclipse.swt.internal.widgets.UploaderWidget_Test
Tests run: 4, Failures: 0, Errors: 0, Skipped: 0, Time elapsed: 0.171 sec - in org.eclipse.swt.internal.widgets.UploaderWidget_Test
Running org.eclipse.swt.internal.widgets.UploadPanel_Test
Tests run: 4, Failures: 0, Errors: 0, Skipped: 0, Time elapsed: 0.526 sec - in org.eclipse.swt.internal.widgets.UploadPanel_Test
Running org.eclipse.swt.internal.widgets.FileUploadRunnable_Test
Tests run: 24, Failures: 0, Errors: 0, Skipped: 0, Time elapsed: 1.413 sec - in org.eclipse.swt.internal.widgets.FileUploadRunnable_Test
Running org.eclipse.swt.internal.widgets.ProgressCollector_Test
Tests run: 8, Failures: 0, Errors: 0, Skipped: 0, Time elapsed: 0.155 sec - in org.eclipse.swt.internal.widgets.ProgressCollector_Test
Running org.eclipse.swt.widgets.FileDialog_Test
Tests run: 31, Failures: 0, Errors: 0, Skipped: 0, Time elapsed: 0.614 sec - in org.eclipse.swt.widgets.FileDialog_Test
Running org.eclipse.swt.internal.widgets.UploaderService_Test
Tests run: 1, Failures: 0, Errors: 0, Skipped: 0, Time elapsed: 0.015 sec - in org.eclipse.swt.internal.widgets.UploaderService_Test

Results :

Tests run: 72, Failures: 0, Errors: 0, Skipped: 0

[INFO] 
[INFO] --- animal-sniffer-maven-plugin:1.14:check (ensure-java-1.7-class-library) @ org.eclipse.rap.filedialog.test ---
[INFO] Checking unresolved references to org.codehaus.mojo.signature:java17:1.0
[INFO] 
[INFO] --- tycho-source-plugin:0.25.0:plugin-source (plugin-source) @ org.eclipse.rap.filedialog.test ---
[INFO] Building jar: /jobs/genie.rap/rap-3.1-runtime/workspace/org.eclipse.rap/tests/org.eclipse.rap.filedialog.test/target/org.eclipse.rap.filedialog.test-3.1.2-SNAPSHOT-sources.jar
[INFO] 
[INFO] --- target-platform-configuration:0.25.0:target-platform (default-target-platform) @ org.eclipse.rap.filedialog.test ---
[INFO] 
[INFO] --- tycho-packaging-plugin:0.25.0:package-plugin (default-package-plugin) @ org.eclipse.rap.filedialog.test ---
[INFO] Building jar: /jobs/genie.rap/rap-3.1-runtime/workspace/org.eclipse.rap/tests/org.eclipse.rap.filedialog.test/target/org.eclipse.rap.filedialog.test-3.1.2-SNAPSHOT.jar
[INFO] 
[INFO] --- tycho-p2-plugin:0.25.0:p2-metadata-default (default-p2-metadata-default) @ org.eclipse.rap.filedialog.test ---
[INFO] No baseline version MavenProject: org.eclipse.rap:org.eclipse.rap.filedialog.test:3.1.2-SNAPSHOT @ /jobs/genie.rap/rap-3.1-runtime/workspace/org.eclipse.rap/tests/org.eclipse.rap.filedialog.test/pom.xml
[INFO]                                                                         
[INFO] ------------------------------------------------------------------------
[INFO] Building org.eclipse.rap.fileupload.test 3.1.2-SNAPSHOT
[INFO] ------------------------------------------------------------------------
[INFO] 
[INFO] --- maven-clean-plugin:2.5:clean (default-clean) @ org.eclipse.rap.fileupload.test ---
[INFO] 
[INFO] --- tycho-packaging-plugin:0.25.0:build-qualifier (default-build-qualifier) @ org.eclipse.rap.fileupload.test ---
[INFO] The project's OSGi version is 3.1.2.20161108-1505
[INFO] 
[INFO] --- tycho-packaging-plugin:0.25.0:validate-id (default-validate-id) @ org.eclipse.rap.fileupload.test ---
[INFO] 
[INFO] --- tycho-packaging-plugin:0.25.0:validate-version (default-validate-version) @ org.eclipse.rap.fileupload.test ---
[INFO] 
[INFO] --- maven-resources-plugin:2.4.3:resources (default-resources) @ org.eclipse.rap.fileupload.test ---
[INFO] Using 'UTF-8' encoding to copy filtered resources.
[INFO] skip non existing resourceDirectory /jobs/genie.rap/rap-3.1-runtime/workspace/org.eclipse.rap/tests/org.eclipse.rap.fileupload.test/src/main/resources
[INFO] 
[INFO] --- tycho-compiler-plugin:0.25.0:compile (default-compile) @ org.eclipse.rap.fileupload.test ---
[INFO] Compiling 12 source files to /jobs/genie.rap/rap-3.1-runtime/workspace/org.eclipse.rap/tests/org.eclipse.rap.fileupload.test/target/classes
[INFO] 
[INFO] --- maven-resources-plugin:2.4.3:testResources (default-testResources) @ org.eclipse.rap.fileupload.test ---
[INFO] Using 'UTF-8' encoding to copy filtered resources.
[INFO] skip non existing resourceDirectory /jobs/genie.rap/rap-3.1-runtime/workspace/org.eclipse.rap/tests/org.eclipse.rap.fileupload.test/src/test/resources
[INFO] 
[INFO] --- maven-surefire-plugin:2.17:test (test) @ org.eclipse.rap.fileupload.test ---
[INFO] Surefire report directory: /jobs/genie.rap/rap-3.1-runtime/workspace/org.eclipse.rap/tests/org.eclipse.rap.fileupload.test/target/surefire-reports

-------------------------------------------------------
 T E S T S
-------------------------------------------------------
Running org.eclipse.rap.fileupload.DiskFileUploadReceiver_Test
Tests run: 7, Failures: 0, Errors: 0, Skipped: 0, Time elapsed: 0.044 sec - in org.eclipse.rap.fileupload.DiskFileUploadReceiver_Test
Running org.eclipse.rap.fileupload.test.CommonsFileUpload_Test
Tests run: 3, Failures: 0, Errors: 0, Skipped: 0, Time elapsed: 0.039 sec - in org.eclipse.rap.fileupload.test.CommonsFileUpload_Test
Running org.eclipse.rap.fileupload.internal.FileUploadHandlerStore_Test
Tests run: 8, Failures: 0, Errors: 0, Skipped: 0, Time elapsed: 0.594 sec - in org.eclipse.rap.fileupload.internal.FileUploadHandlerStore_Test
Running org.eclipse.rap.fileupload.internal.FileUploadProcessor_Test
Tests run: 9, Failures: 0, Errors: 0, Skipped: 0, Time elapsed: 0.24 sec - in org.eclipse.rap.fileupload.internal.FileUploadProcessor_Test
Running org.eclipse.rap.fileupload.internal.FileUploadServiceHandler_Test
Tests run: 14, Failures: 0, Errors: 0, Skipped: 0, Time elapsed: 0.208 sec - in org.eclipse.rap.fileupload.internal.FileUploadServiceHandler_Test
Running org.eclipse.rap.fileupload.FileUploadHandler_Test
Tests run: 17, Failures: 0, Errors: 0, Skipped: 0, Time elapsed: 0.267 sec - in org.eclipse.rap.fileupload.FileUploadHandler_Test
Running org.eclipse.rap.fileupload.FileUploadEvent_Test
Tests run: 5, Failures: 0, Errors: 0, Skipped: 0, Time elapsed: 0.059 sec - in org.eclipse.rap.fileupload.FileUploadEvent_Test

Results :

Tests run: 63, Failures: 0, Errors: 0, Skipped: 0

[INFO] 
[INFO] --- animal-sniffer-maven-plugin:1.14:check (ensure-java-1.7-class-library) @ org.eclipse.rap.fileupload.test ---
[INFO] Checking unresolved references to org.codehaus.mojo.signature:java17:1.0
[INFO] 
[INFO] --- tycho-source-plugin:0.25.0:plugin-source (plugin-source) @ org.eclipse.rap.fileupload.test ---
[INFO] Building jar: /jobs/genie.rap/rap-3.1-runtime/workspace/org.eclipse.rap/tests/org.eclipse.rap.fileupload.test/target/org.eclipse.rap.fileupload.test-3.1.2-SNAPSHOT-sources.jar
[INFO] 
[INFO] --- target-platform-configuration:0.25.0:target-platform (default-target-platform) @ org.eclipse.rap.fileupload.test ---
[INFO] 
[INFO] --- tycho-packaging-plugin:0.25.0:package-plugin (default-package-plugin) @ org.eclipse.rap.fileupload.test ---
[INFO] Building jar: /jobs/genie.rap/rap-3.1-runtime/workspace/org.eclipse.rap/tests/org.eclipse.rap.fileupload.test/target/org.eclipse.rap.fileupload.test-3.1.2-SNAPSHOT.jar
[INFO] 
[INFO] --- tycho-p2-plugin:0.25.0:p2-metadata-default (default-p2-metadata-default) @ org.eclipse.rap.fileupload.test ---
[INFO] No baseline version MavenProject: org.eclipse.rap:org.eclipse.rap.fileupload.test:3.1.2-SNAPSHOT @ /jobs/genie.rap/rap-3.1-runtime/workspace/org.eclipse.rap/tests/org.eclipse.rap.fileupload.test/pom.xml
[INFO]                                                                         
[INFO] ------------------------------------------------------------------------
[INFO] Building org.eclipse.rap.nebula.widgets.grid.test 3.1.2-SNAPSHOT
[INFO] ------------------------------------------------------------------------
[INFO] 
[INFO] --- maven-clean-plugin:2.5:clean (default-clean) @ org.eclipse.rap.nebula.widgets.grid.test ---
[INFO] 
[INFO] --- tycho-packaging-plugin:0.25.0:build-qualifier (default-build-qualifier) @ org.eclipse.rap.nebula.widgets.grid.test ---
[INFO] The project's OSGi version is 3.1.2.20161108-1505
[INFO] 
[INFO] --- tycho-packaging-plugin:0.25.0:validate-id (default-validate-id) @ org.eclipse.rap.nebula.widgets.grid.test ---
[INFO] 
[INFO] --- tycho-packaging-plugin:0.25.0:validate-version (default-validate-version) @ org.eclipse.rap.nebula.widgets.grid.test ---
[INFO] 
[INFO] --- maven-resources-plugin:2.4.3:resources (default-resources) @ org.eclipse.rap.nebula.widgets.grid.test ---
[INFO] Using 'UTF-8' encoding to copy filtered resources.
[INFO] skip non existing resourceDirectory /jobs/genie.rap/rap-3.1-runtime/workspace/org.eclipse.rap/tests/org.eclipse.rap.nebula.widgets.grid.test/src/main/resources
[INFO] 
[INFO] --- tycho-compiler-plugin:0.25.0:compile (default-compile) @ org.eclipse.rap.nebula.widgets.grid.test ---
[INFO] Compiling 14 source files to /jobs/genie.rap/rap-3.1-runtime/workspace/org.eclipse.rap/tests/org.eclipse.rap.nebula.widgets.grid.test/target/classes
[INFO] 
[INFO] --- maven-resources-plugin:2.4.3:testResources (default-testResources) @ org.eclipse.rap.nebula.widgets.grid.test ---
[INFO] Using 'UTF-8' encoding to copy filtered resources.
[INFO] skip non existing resourceDirectory /jobs/genie.rap/rap-3.1-runtime/workspace/org.eclipse.rap/tests/org.eclipse.rap.nebula.widgets.grid.test/src/test/resources
[INFO] 
[INFO] --- maven-surefire-plugin:2.17:test (test) @ org.eclipse.rap.nebula.widgets.grid.test ---
[INFO] Surefire report directory: /jobs/genie.rap/rap-3.1-runtime/workspace/org.eclipse.rap/tests/org.eclipse.rap.nebula.widgets.grid.test/target/surefire-reports

-------------------------------------------------------
 T E S T S
-------------------------------------------------------
Running org.eclipse.nebula.widgets.grid.internal.GridItemData_Test
Tests run: 10, Failures: 0, Errors: 0, Skipped: 0, Time elapsed: 0.722 sec - in org.eclipse.nebula.widgets.grid.internal.GridItemData_Test
Running org.eclipse.nebula.widgets.grid.internal.gridcolumnkit.GridColumnLCA_Test
Tests run: 70, Failures: 0, Errors: 0, Skipped: 0, Time elapsed: 1.196 sec - in org.eclipse.nebula.widgets.grid.internal.gridcolumnkit.GridColumnLCA_Test
Running org.eclipse.nebula.widgets.grid.GridColumn_Test
Tests run: 96, Failures: 0, Errors: 0, Skipped: 0, Time elapsed: 1.346 sec - in org.eclipse.nebula.widgets.grid.GridColumn_Test
Running org.eclipse.nebula.widgets.grid.internal.griditemkit.GridItemOperationHandler_Test
Tests run: 4, Failures: 0, Errors: 0, Skipped: 0, Time elapsed: 0.052 sec - in org.eclipse.nebula.widgets.grid.internal.griditemkit.GridItemOperationHandler_Test
Running org.eclipse.nebula.widgets.grid.Grid_Test
Tests run: 289, Failures: 0, Errors: 0, Skipped: 0, Time elapsed: 2.906 sec - in org.eclipse.nebula.widgets.grid.Grid_Test
Running org.eclipse.nebula.widgets.grid.internal.gridkit.GridOperationHandler_Test
Tests run: 16, Failures: 0, Errors: 0, Skipped: 0, Time elapsed: 0.347 sec - in org.eclipse.nebula.widgets.grid.internal.gridkit.GridOperationHandler_Test
Running org.eclipse.nebula.widgets.grid.internal.griditemkit.GridItemLCA_Test
Tests run: 75, Failures: 0, Errors: 0, Skipped: 0, Time elapsed: 0.843 sec - in org.eclipse.nebula.widgets.grid.internal.griditemkit.GridItemLCA_Test
Running org.eclipse.nebula.widgets.grid.GridItem_Test
Tests run: 140, Failures: 0, Errors: 0, Skipped: 0, Time elapsed: 1.644 sec - in org.eclipse.nebula.widgets.grid.GridItem_Test
Running org.eclipse.nebula.widgets.grid.internal.gridcolumngroupkit.GridColumnGroupLCA_Test
Tests run: 34, Failures: 0, Errors: 0, Skipped: 0, Time elapsed: 0.449 sec - in org.eclipse.nebula.widgets.grid.internal.gridcolumngroupkit.GridColumnGroupLCA_Test
Running org.eclipse.nebula.widgets.grid.internal.gridcolumnkit.GridColumnOperationHandler_Test
Tests run: 15, Failures: 0, Errors: 0, Skipped: 0, Time elapsed: 0.213 sec - in org.eclipse.nebula.widgets.grid.internal.gridcolumnkit.GridColumnOperationHandler_Test
Running org.eclipse.nebula.widgets.grid.internal.gridcolumngroupkit.GridColumnGroupOperationHandler_Test
Tests run: 4, Failures: 0, Errors: 0, Skipped: 0, Time elapsed: 0.069 sec - in org.eclipse.nebula.widgets.grid.internal.gridcolumngroupkit.GridColumnGroupOperationHandler_Test
Running org.eclipse.nebula.widgets.grid.internal.gridkit.GridLCA_Test
Tests run: 83, Failures: 0, Errors: 0, Skipped: 0, Time elapsed: 1.232 sec - in org.eclipse.nebula.widgets.grid.internal.gridkit.GridLCA_Test
Running org.eclipse.nebula.widgets.grid.GridColumnGroup_Test
Tests run: 19, Failures: 0, Errors: 0, Skipped: 0, Time elapsed: 0.206 sec - in org.eclipse.nebula.widgets.grid.GridColumnGroup_Test

Results :

Tests run: 855, Failures: 0, Errors: 0, Skipped: 0

[INFO] 
[INFO] --- animal-sniffer-maven-plugin:1.14:check (ensure-java-1.7-class-library) @ org.eclipse.rap.nebula.widgets.grid.test ---
[INFO] Checking unresolved references to org.codehaus.mojo.signature:java17:1.0
[INFO] 
[INFO] --- tycho-source-plugin:0.25.0:plugin-source (plugin-source) @ org.eclipse.rap.nebula.widgets.grid.test ---
[INFO] Building jar: /jobs/genie.rap/rap-3.1-runtime/workspace/org.eclipse.rap/tests/org.eclipse.rap.nebula.widgets.grid.test/target/org.eclipse.rap.nebula.widgets.grid.test-3.1.2-SNAPSHOT-sources.jar
[INFO] 
[INFO] --- target-platform-configuration:0.25.0:target-platform (default-target-platform) @ org.eclipse.rap.nebula.widgets.grid.test ---
[INFO] 
[INFO] --- tycho-packaging-plugin:0.25.0:package-plugin (default-package-plugin) @ org.eclipse.rap.nebula.widgets.grid.test ---
[INFO] Building jar: /jobs/genie.rap/rap-3.1-runtime/workspace/org.eclipse.rap/tests/org.eclipse.rap.nebula.widgets.grid.test/target/org.eclipse.rap.nebula.widgets.grid.test-3.1.2-SNAPSHOT.jar
[INFO] 
[INFO] --- tycho-p2-plugin:0.25.0:p2-metadata-default (default-p2-metadata-default) @ org.eclipse.rap.nebula.widgets.grid.test ---
[INFO] No baseline version MavenProject: org.eclipse.rap:org.eclipse.rap.nebula.widgets.grid.test:3.1.2-SNAPSHOT @ /jobs/genie.rap/rap-3.1-runtime/workspace/org.eclipse.rap/tests/org.eclipse.rap.nebula.widgets.grid.test/pom.xml
[INFO]                                                                         
[INFO] ------------------------------------------------------------------------
[INFO] Building org.eclipse.rap.nebula.widgets.richtext.test 3.1.2-SNAPSHOT
[INFO] ------------------------------------------------------------------------
[INFO] 
[INFO] --- maven-clean-plugin:2.5:clean (default-clean) @ org.eclipse.rap.nebula.widgets.richtext.test ---
[INFO] 
[INFO] --- tycho-packaging-plugin:0.25.0:build-qualifier (default-build-qualifier) @ org.eclipse.rap.nebula.widgets.richtext.test ---
[INFO] The project's OSGi version is 3.1.2.20161108-1505
[INFO] 
[INFO] --- tycho-packaging-plugin:0.25.0:validate-id (default-validate-id) @ org.eclipse.rap.nebula.widgets.richtext.test ---
[INFO] 
[INFO] --- tycho-packaging-plugin:0.25.0:validate-version (default-validate-version) @ org.eclipse.rap.nebula.widgets.richtext.test ---
[INFO] 
[INFO] --- maven-resources-plugin:2.4.3:resources (default-resources) @ org.eclipse.rap.nebula.widgets.richtext.test ---
[INFO] Using 'UTF-8' encoding to copy filtered resources.
[INFO] skip non existing resourceDirectory /jobs/genie.rap/rap-3.1-runtime/workspace/org.eclipse.rap/tests/org.eclipse.rap.nebula.widgets.richtext.test/src/main/resources
[INFO] 
[INFO] --- tycho-compiler-plugin:0.25.0:compile (default-compile) @ org.eclipse.rap.nebula.widgets.richtext.test ---
[INFO] Compiling 2 source files to /jobs/genie.rap/rap-3.1-runtime/workspace/org.eclipse.rap/tests/org.eclipse.rap.nebula.widgets.richtext.test/target/classes
[INFO] 
[INFO] --- maven-resources-plugin:2.4.3:testResources (default-testResources) @ org.eclipse.rap.nebula.widgets.richtext.test ---
[INFO] Using 'UTF-8' encoding to copy filtered resources.
[INFO] skip non existing resourceDirectory /jobs/genie.rap/rap-3.1-runtime/workspace/org.eclipse.rap/tests/org.eclipse.rap.nebula.widgets.richtext.test/src/test/resources
[INFO] 
[INFO] --- maven-surefire-plugin:2.17:test (test) @ org.eclipse.rap.nebula.widgets.richtext.test ---
[INFO] Surefire report directory: /jobs/genie.rap/rap-3.1-runtime/workspace/org.eclipse.rap/tests/org.eclipse.rap.nebula.widgets.richtext.test/target/surefire-reports

-------------------------------------------------------
 T E S T S
-------------------------------------------------------
Running org.eclipse.nebula.widgets.richtext.toolbar.ToolbarConfiguration_Test
Tests run: 6, Failures: 0, Errors: 0, Skipped: 0, Time elapsed: 0.033 sec - in org.eclipse.nebula.widgets.richtext.toolbar.ToolbarConfiguration_Test
Running org.eclipse.nebula.widgets.richtext.RichTextEditor_Test
Tests run: 16, Failures: 0, Errors: 0, Skipped: 0, Time elapsed: 0.739 sec - in org.eclipse.nebula.widgets.richtext.RichTextEditor_Test

Results :

Tests run: 22, Failures: 0, Errors: 0, Skipped: 0

[INFO] 
[INFO] --- animal-sniffer-maven-plugin:1.14:check (ensure-java-1.7-class-library) @ org.eclipse.rap.nebula.widgets.richtext.test ---
[INFO] Checking unresolved references to org.codehaus.mojo.signature:java17:1.0
[INFO] 
[INFO] --- tycho-source-plugin:0.25.0:plugin-source (plugin-source) @ org.eclipse.rap.nebula.widgets.richtext.test ---
[INFO] Building jar: /jobs/genie.rap/rap-3.1-runtime/workspace/org.eclipse.rap/tests/org.eclipse.rap.nebula.widgets.richtext.test/target/org.eclipse.rap.nebula.widgets.richtext.test-3.1.2-SNAPSHOT-sources.jar
[INFO] 
[INFO] --- target-platform-configuration:0.25.0:target-platform (default-target-platform) @ org.eclipse.rap.nebula.widgets.richtext.test ---
[INFO] 
[INFO] --- tycho-packaging-plugin:0.25.0:package-plugin (default-package-plugin) @ org.eclipse.rap.nebula.widgets.richtext.test ---
[INFO] Building jar: /jobs/genie.rap/rap-3.1-runtime/workspace/org.eclipse.rap/tests/org.eclipse.rap.nebula.widgets.richtext.test/target/org.eclipse.rap.nebula.widgets.richtext.test-3.1.2-SNAPSHOT.jar
[INFO] 
[INFO] --- tycho-p2-plugin:0.25.0:p2-metadata-default (default-p2-metadata-default) @ org.eclipse.rap.nebula.widgets.richtext.test ---
[INFO] No baseline version MavenProject: org.eclipse.rap:org.eclipse.rap.nebula.widgets.richtext.test:3.1.2-SNAPSHOT @ /jobs/genie.rap/rap-3.1-runtime/workspace/org.eclipse.rap/tests/org.eclipse.rap.nebula.widgets.richtext.test/pom.xml
[INFO]                                                                         
[INFO] ------------------------------------------------------------------------
[INFO] Building org.eclipse.rap.rwt.cluster.testfixture 3.1.2-SNAPSHOT
[INFO] ------------------------------------------------------------------------
[INFO] 
[INFO] --- maven-clean-plugin:2.5:clean (default-clean) @ org.eclipse.rap.rwt.cluster.testfixture ---
[INFO] 
[INFO] --- tycho-packaging-plugin:0.25.0:build-qualifier (default-build-qualifier) @ org.eclipse.rap.rwt.cluster.testfixture ---
[INFO] The project's OSGi version is 3.1.2.20161108-1505
[INFO] 
[INFO] --- tycho-packaging-plugin:0.25.0:validate-id (default-validate-id) @ org.eclipse.rap.rwt.cluster.testfixture ---
[INFO] 
[INFO] --- tycho-packaging-plugin:0.25.0:validate-version (default-validate-version) @ org.eclipse.rap.rwt.cluster.testfixture ---
[INFO] 
[INFO] --- maven-resources-plugin:2.4.3:resources (default-resources) @ org.eclipse.rap.rwt.cluster.testfixture ---
[INFO] Using 'UTF-8' encoding to copy filtered resources.
[INFO] skip non existing resourceDirectory /jobs/genie.rap/rap-3.1-runtime/workspace/org.eclipse.rap/tests/org.eclipse.rap.rwt.cluster.testfixture/src/main/resources
[INFO] 
[INFO] --- tycho-compiler-plugin:0.25.0:compile (default-compile) @ org.eclipse.rap.rwt.cluster.testfixture ---
[INFO] Compiling 28 source files to /jobs/genie.rap/rap-3.1-runtime/workspace/org.eclipse.rap/tests/org.eclipse.rap.rwt.cluster.testfixture/target/classes
[INFO] 
[INFO] --- maven-resources-plugin:2.4.3:testResources (default-testResources) @ org.eclipse.rap.rwt.cluster.testfixture ---
[INFO] Using 'UTF-8' encoding to copy filtered resources.
[INFO] skip non existing resourceDirectory /jobs/genie.rap/rap-3.1-runtime/workspace/org.eclipse.rap/tests/org.eclipse.rap.rwt.cluster.testfixture/src/test/resources
[INFO] 
[INFO] --- maven-surefire-plugin:2.17:test (test) @ org.eclipse.rap.rwt.cluster.testfixture ---
[INFO] 
[INFO] --- animal-sniffer-maven-plugin:1.14:check (ensure-java-1.7-class-library) @ org.eclipse.rap.rwt.cluster.testfixture ---
[INFO] Checking unresolved references to org.codehaus.mojo.signature:java17:1.0
[INFO] 
[INFO] --- tycho-source-plugin:0.25.0:plugin-source (plugin-source) @ org.eclipse.rap.rwt.cluster.testfixture ---
[WARNING] bundle localization file /jobs/genie.rap/rap-3.1-runtime/workspace/org.eclipse.rap/tests/org.eclipse.rap.rwt.cluster.testfixture/plugin.properties not found
[INFO] Building jar: /jobs/genie.rap/rap-3.1-runtime/workspace/org.eclipse.rap/tests/org.eclipse.rap.rwt.cluster.testfixture/target/org.eclipse.rap.rwt.cluster.testfixture-3.1.2-SNAPSHOT-sources.jar
[INFO] 
[INFO] --- target-platform-configuration:0.25.0:target-platform (default-target-platform) @ org.eclipse.rap.rwt.cluster.testfixture ---
[INFO] 
[INFO] --- tycho-packaging-plugin:0.25.0:package-plugin (default-package-plugin) @ org.eclipse.rap.rwt.cluster.testfixture ---
[INFO] Building jar: /jobs/genie.rap/rap-3.1-runtime/workspace/org.eclipse.rap/tests/org.eclipse.rap.rwt.cluster.testfixture/target/org.eclipse.rap.rwt.cluster.testfixture-3.1.2-SNAPSHOT.jar
[INFO] 
[INFO] --- tycho-p2-plugin:0.25.0:p2-metadata-default (default-p2-metadata-default) @ org.eclipse.rap.rwt.cluster.testfixture ---
[INFO] No baseline version MavenProject: org.eclipse.rap:org.eclipse.rap.rwt.cluster.testfixture:3.1.2-SNAPSHOT @ /jobs/genie.rap/rap-3.1-runtime/workspace/org.eclipse.rap/tests/org.eclipse.rap.rwt.cluster.testfixture/pom.xml
[INFO]                                                                         
[INFO] ------------------------------------------------------------------------
[INFO] Building org.eclipse.rap.rwt.cluster.testfixture.test 3.1.2-SNAPSHOT
[INFO] ------------------------------------------------------------------------
[INFO] 
[INFO] --- maven-clean-plugin:2.5:clean (default-clean) @ org.eclipse.rap.rwt.cluster.testfixture.test ---
[INFO] 
[INFO] --- tycho-packaging-plugin:0.25.0:build-qualifier (default-build-qualifier) @ org.eclipse.rap.rwt.cluster.testfixture.test ---
[INFO] The project's OSGi version is 3.1.2.20161108-1505
[INFO] 
[INFO] --- tycho-packaging-plugin:0.25.0:validate-id (default-validate-id) @ org.eclipse.rap.rwt.cluster.testfixture.test ---
[INFO] 
[INFO] --- tycho-packaging-plugin:0.25.0:validate-version (default-validate-version) @ org.eclipse.rap.rwt.cluster.testfixture.test ---
[INFO] 
[INFO] --- maven-resources-plugin:2.4.3:resources (default-resources) @ org.eclipse.rap.rwt.cluster.testfixture.test ---
[INFO] Using 'UTF-8' encoding to copy filtered resources.
[INFO] skip non existing resourceDirectory /jobs/genie.rap/rap-3.1-runtime/workspace/org.eclipse.rap/tests/org.eclipse.rap.rwt.cluster.testfixture.test/src/main/resources
[INFO] 
[INFO] --- tycho-compiler-plugin:0.25.0:compile (default-compile) @ org.eclipse.rap.rwt.cluster.testfixture.test ---
[INFO] Compiling 11 source files to /jobs/genie.rap/rap-3.1-runtime/workspace/org.eclipse.rap/tests/org.eclipse.rap.rwt.cluster.testfixture.test/target/classes
[INFO] 
[INFO] --- maven-resources-plugin:2.4.3:testResources (default-testResources) @ org.eclipse.rap.rwt.cluster.testfixture.test ---
[INFO] Using 'UTF-8' encoding to copy filtered resources.
[INFO] skip non existing resourceDirectory /jobs/genie.rap/rap-3.1-runtime/workspace/org.eclipse.rap/tests/org.eclipse.rap.rwt.cluster.testfixture.test/src/test/resources
[INFO] 
[INFO] --- maven-surefire-plugin:2.17:test (test) @ org.eclipse.rap.rwt.cluster.testfixture.test ---
[INFO] Surefire report directory: /jobs/genie.rap/rap-3.1-runtime/workspace/org.eclipse.rap/tests/org.eclipse.rap.rwt.cluster.testfixture.test/target/surefire-reports

-------------------------------------------------------
 T E S T S
-------------------------------------------------------
Running org.eclipse.rap.rwt.cluster.testfixture.internal.server.ServletEngineCluster_Test
May 26, 2017 8:34:05 PM org.apache.catalina.util.SessionIdGenerator createSecureRandom
INFO: Creation of SecureRandom instance for session ID generation using [SHA1PRNG] took [111] milliseconds.
Tests run: 6, Failures: 0, Errors: 0, Skipped: 0, Time elapsed: 12.272 sec - in org.eclipse.rap.rwt.cluster.testfixture.internal.server.ServletEngineCluster_Test
Running org.eclipse.rap.rwt.cluster.testfixture.internal.server.DelegatingServletEngine_Test
Tests run: 9, Failures: 0, Errors: 0, Skipped: 0, Time elapsed: 0.004 sec - in org.eclipse.rap.rwt.cluster.testfixture.internal.server.DelegatingServletEngine_Test
Running org.eclipse.rap.rwt.cluster.testfixture.internal.server.ServletEngine_Test
May 26, 2017 8:34:19 PM org.apache.catalina.core.StandardWrapperValve invoke
SEVERE: Servlet.service() for servlet [rwtServlet] in context with path [/] threw exception
java.lang.RuntimeException
	at org.eclipse.rap.rwt.cluster.testfixture.internal.server.ServletEngine_Test$1.run(ServletEngine_Test.java:115)
	at org.eclipse.rap.rwt.cluster.testfixture.test.TestEntryPoint.createUI(TestEntryPoint.java:46)
	at org.eclipse.rap.rwt.internal.lifecycle.PrepareUIRoot.execute(PrepareUIRoot.java:41)
	at org.eclipse.rap.rwt.internal.lifecycle.PhaseExecutor.execute(PhaseExecutor.java:38)
	at org.eclipse.rap.rwt.internal.lifecycle.SimpleLifeCycle.execute(SimpleLifeCycle.java:46)
	at org.eclipse.rap.rwt.internal.service.RWTMessageHandler.executeLifeCycle(RWTMessageHandler.java:57)
	at org.eclipse.rap.rwt.internal.service.RWTMessageHandler.handleMessage(RWTMessageHandler.java:41)
	at org.eclipse.rap.rwt.internal.remote.MessageChainElement.handleMessage(MessageChainElement.java:29)
	at org.eclipse.rap.rwt.internal.service.LifeCycleServiceHandler.processMessage(LifeCycleServiceHandler.java:128)
	at org.eclipse.rap.rwt.internal.service.LifeCycleServiceHandler.processUIRequest(LifeCycleServiceHandler.java:100)
	at org.eclipse.rap.rwt.internal.service.LifeCycleServiceHandler.synchronizedService(LifeCycleServiceHandler.java:75)
	at org.eclipse.rap.rwt.internal.service.LifeCycleServiceHandler.service(LifeCycleServiceHandler.java:66)
	at org.eclipse.rap.rwt.engine.RWTServlet.handleValidRequest(RWTServlet.java:135)
	at org.eclipse.rap.rwt.engine.RWTServlet.handleRequest(RWTServlet.java:117)
	at org.eclipse.rap.rwt.engine.RWTServlet.doPost(RWTServlet.java:107)
	at javax.servlet.http.HttpServlet.service(HttpServlet.java:707)
	at javax.servlet.http.HttpServlet.service(HttpServlet.java:790)
	at org.apache.catalina.core.ApplicationFilterChain.internalDoFilter(ApplicationFilterChain.java:304)
	at org.apache.catalina.core.ApplicationFilterChain.doFilter(ApplicationFilterChain.java:210)
	at org.eclipse.rap.rwt.internal.engine.RWTClusterSupport.doFilter(RWTClusterSupport.java:42)
	at org.apache.catalina.core.ApplicationFilterChain.internalDoFilter(ApplicationFilterChain.java:243)
	at org.apache.catalina.core.ApplicationFilterChain.doFilter(ApplicationFilterChain.java:210)
	at org.apache.catalina.core.StandardWrapperValve.invoke(StandardWrapperValve.java:240)
	at org.apache.catalina.core.StandardContextValve.invoke(StandardContextValve.java:164)
	at org.apache.catalina.authenticator.AuthenticatorBase.invoke(AuthenticatorBase.java:462)
	at org.apache.catalina.core.StandardHostValve.invoke(StandardHostValve.java:164)
	at org.apache.catalina.valves.ErrorReportValve.invoke(ErrorReportValve.java:100)
	at org.apache.catalina.core.StandardEngineValve.invoke(StandardEngineValve.java:118)
	at org.apache.catalina.connector.CoyoteAdapter.service(CoyoteAdapter.java:395)
	at org.apache.coyote.http11.Http11Processor.process(Http11Processor.java:250)
	at org.apache.coyote.http11.Http11Protocol$Http11ConnectionHandler.process(Http11Protocol.java:188)
	at org.apache.tomcat.util.net.JIoEndpoint$SocketProcessor.run(JIoEndpoint.java:302)
	at java.util.concurrent.ThreadPoolExecutor.runWorker(ThreadPoolExecutor.java:1142)
	at java.util.concurrent.ThreadPoolExecutor$Worker.run(ThreadPoolExecutor.java:617)
	at java.lang.Thread.run(Thread.java:745)

Tests run: 14, Failures: 0, Errors: 0, Skipped: 0, Time elapsed: 14.661 sec - in org.eclipse.rap.rwt.cluster.testfixture.internal.server.ServletEngine_Test
Running org.eclipse.rap.rwt.cluster.testfixture.client.JsonMessage_Test
Tests run: 4, Failures: 0, Errors: 0, Skipped: 0, Time elapsed: 0.001 sec - in org.eclipse.rap.rwt.cluster.testfixture.client.JsonMessage_Test
Running org.eclipse.rap.rwt.cluster.testfixture.client.RWTClient_Test
Tests run: 17, Failures: 0, Errors: 0, Skipped: 0, Time elapsed: 0.008 sec - in org.eclipse.rap.rwt.cluster.testfixture.client.RWTClient_Test
Running org.eclipse.rap.rwt.cluster.testfixture.client.Response_Test
Tests run: 9, Failures: 0, Errors: 0, Skipped: 0, Time elapsed: 0.001 sec - in org.eclipse.rap.rwt.cluster.testfixture.client.Response_Test
Running org.eclipse.rap.rwt.cluster.testfixture.internal.jetty.DatabaseServer_Test
Tests run: 7, Failures: 0, Errors: 0, Skipped: 0, Time elapsed: 0.039 sec - in org.eclipse.rap.rwt.cluster.testfixture.internal.jetty.DatabaseServer_Test
Running org.eclipse.rap.rwt.cluster.testfixture.client.HttpUrlBuilder_Test
Tests run: 4, Failures: 0, Errors: 0, Skipped: 0, Time elapsed: 0 sec - in org.eclipse.rap.rwt.cluster.testfixture.client.HttpUrlBuilder_Test

Results :

Tests run: 70, Failures: 0, Errors: 0, Skipped: 0

[INFO] 
[INFO] --- animal-sniffer-maven-plugin:1.14:check (ensure-java-1.7-class-library) @ org.eclipse.rap.rwt.cluster.testfixture.test ---
[INFO] Checking unresolved references to org.codehaus.mojo.signature:java17:1.0
[INFO] 
[INFO] --- tycho-source-plugin:0.25.0:plugin-source (plugin-source) @ org.eclipse.rap.rwt.cluster.testfixture.test ---
[WARNING] bundle localization file /jobs/genie.rap/rap-3.1-runtime/workspace/org.eclipse.rap/tests/org.eclipse.rap.rwt.cluster.testfixture.test/plugin.properties not found
[INFO] Building jar: /jobs/genie.rap/rap-3.1-runtime/workspace/org.eclipse.rap/tests/org.eclipse.rap.rwt.cluster.testfixture.test/target/org.eclipse.rap.rwt.cluster.testfixture.test-3.1.2-SNAPSHOT-sources.jar
[INFO] 
[INFO] --- target-platform-configuration:0.25.0:target-platform (default-target-platform) @ org.eclipse.rap.rwt.cluster.testfixture.test ---
[INFO] 
[INFO] --- tycho-packaging-plugin:0.25.0:package-plugin (default-package-plugin) @ org.eclipse.rap.rwt.cluster.testfixture.test ---
[INFO] Building jar: /jobs/genie.rap/rap-3.1-runtime/workspace/org.eclipse.rap/tests/org.eclipse.rap.rwt.cluster.testfixture.test/target/org.eclipse.rap.rwt.cluster.testfixture.test-3.1.2-SNAPSHOT.jar
[INFO] 
[INFO] --- tycho-p2-plugin:0.25.0:p2-metadata-default (default-p2-metadata-default) @ org.eclipse.rap.rwt.cluster.testfixture.test ---
[INFO] No baseline version MavenProject: org.eclipse.rap:org.eclipse.rap.rwt.cluster.testfixture.test:3.1.2-SNAPSHOT @ /jobs/genie.rap/rap-3.1-runtime/workspace/org.eclipse.rap/tests/org.eclipse.rap.rwt.cluster.testfixture.test/pom.xml
[INFO]                                                                         
[INFO] ------------------------------------------------------------------------
[INFO] Building org.eclipse.rap.rwt.cluster.test 3.1.2-SNAPSHOT
[INFO] ------------------------------------------------------------------------
[INFO] 
[INFO] --- maven-clean-plugin:2.5:clean (default-clean) @ org.eclipse.rap.rwt.cluster.test ---
[INFO] 
[INFO] --- tycho-packaging-plugin:0.25.0:build-qualifier (default-build-qualifier) @ org.eclipse.rap.rwt.cluster.test ---
[INFO] The project's OSGi version is 3.1.2.20161108-1505
[INFO] 
[INFO] --- tycho-packaging-plugin:0.25.0:validate-id (default-validate-id) @ org.eclipse.rap.rwt.cluster.test ---
[INFO] 
[INFO] --- tycho-packaging-plugin:0.25.0:validate-version (default-validate-version) @ org.eclipse.rap.rwt.cluster.test ---
[INFO] 
[INFO] --- maven-resources-plugin:2.4.3:resources (default-resources) @ org.eclipse.rap.rwt.cluster.test ---
[INFO] Using 'UTF-8' encoding to copy filtered resources.
[INFO] skip non existing resourceDirectory /jobs/genie.rap/rap-3.1-runtime/workspace/org.eclipse.rap/tests/org.eclipse.rap.rwt.cluster.test/src/main/resources
[INFO] 
[INFO] --- tycho-compiler-plugin:0.25.0:compile (default-compile) @ org.eclipse.rap.rwt.cluster.test ---
[INFO] Compiling 15 source files to /jobs/genie.rap/rap-3.1-runtime/workspace/org.eclipse.rap/tests/org.eclipse.rap.rwt.cluster.test/target/classes
[INFO] 
[INFO] --- maven-resources-plugin:2.4.3:testResources (default-testResources) @ org.eclipse.rap.rwt.cluster.test ---
[INFO] Using 'UTF-8' encoding to copy filtered resources.
[INFO] skip non existing resourceDirectory /jobs/genie.rap/rap-3.1-runtime/workspace/org.eclipse.rap/tests/org.eclipse.rap.rwt.cluster.test/src/test/resources
[INFO] 
[INFO] --- maven-surefire-plugin:2.17:test (test) @ org.eclipse.rap.rwt.cluster.test ---
[INFO] Surefire report directory: /jobs/genie.rap/rap-3.1-runtime/workspace/org.eclipse.rap/tests/org.eclipse.rap.rwt.cluster.test/target/surefire-reports

-------------------------------------------------------
 T E S T S
-------------------------------------------------------
Running org.eclipse.rap.rwt.cluster.test.SessionFailover_Test
May 26, 2017 8:34:44 PM org.apache.catalina.tribes.transport.nio.NioReceiver start
SEVERE: Unable to start cluster receiver
java.net.BindException: Address already in use
	at sun.nio.ch.Net.bind0(Native Method)
	at sun.nio.ch.Net.bind(Net.java:433)
	at sun.nio.ch.Net.bind(Net.java:425)
	at sun.nio.ch.ServerSocketChannelImpl.bind(ServerSocketChannelImpl.java:223)
	at sun.nio.ch.ServerSocketAdaptor.bind(ServerSocketAdaptor.java:74)
	at sun.nio.ch.ServerSocketAdaptor.bind(ServerSocketAdaptor.java:67)
	at org.apache.catalina.tribes.transport.ReceiverBase.bind(ReceiverBase.java:219)
	at org.apache.catalina.tribes.transport.nio.NioReceiver.bind(NioReceiver.java:137)
	at org.apache.catalina.tribes.transport.nio.NioReceiver.start(NioReceiver.java:107)
	at org.apache.catalina.tribes.group.ChannelCoordinator.internalStart(ChannelCoordinator.java:145)
	at org.apache.catalina.tribes.group.ChannelCoordinator.start(ChannelCoordinator.java:99)
	at org.apache.catalina.tribes.group.ChannelInterceptorBase.start(ChannelInterceptorBase.java:150)
	at org.apache.catalina.tribes.group.interceptors.MessageDispatchInterceptor.start(MessageDispatchInterceptor.java:153)
	at org.apache.catalina.tribes.group.ChannelInterceptorBase.start(ChannelInterceptorBase.java:150)
	at org.apache.catalina.tribes.group.ChannelInterceptorBase.start(ChannelInterceptorBase.java:150)
	at org.apache.catalina.tribes.group.GroupChannel.start(GroupChannel.java:416)
	at org.apache.catalina.ha.tcp.SimpleTcpCluster.startInternal(SimpleTcpCluster.java:653)
	at org.apache.catalina.util.LifecycleBase.start(LifecycleBase.java:145)
	at org.apache.catalina.core.ContainerBase.startInternal(ContainerBase.java:1024)
	at org.apache.catalina.core.StandardEngine.startInternal(StandardEngine.java:291)
	at org.apache.catalina.util.LifecycleBase.start(LifecycleBase.java:145)
	at org.apache.catalina.core.StandardService.startInternal(StandardService.java:443)
	at org.apache.catalina.util.LifecycleBase.start(LifecycleBase.java:145)
	at org.apache.catalina.core.StandardServer.startInternal(StandardServer.java:727)
	at org.apache.catalina.util.LifecycleBase.start(LifecycleBase.java:145)
	at org.apache.catalina.startup.Tomcat.start(Tomcat.java:305)
	at org.eclipse.rap.rwt.cluster.testfixture.internal.tomcat.TomcatEngine.start(TomcatEngine.java:65)
	at org.eclipse.rap.rwt.cluster.testfixture.internal.server.DelegatingServletEngine.start(DelegatingServletEngine.java:36)
	at org.eclipse.rap.rwt.cluster.testfixture.internal.tomcat.TomcatCluster.start(TomcatCluster.java:49)
	at org.eclipse.rap.rwt.cluster.test.SessionFailover_Test.initializeClient(SessionFailover_Test.java:244)
	at org.eclipse.rap.rwt.cluster.test.SessionFailover_Test.testDNDEntryPoint(SessionFailover_Test.java:210)
	at sun.reflect.NativeMethodAccessorImpl.invoke0(Native Method)
	at sun.reflect.NativeMethodAccessorImpl.invoke(NativeMethodAccessorImpl.java:62)
	at sun.reflect.DelegatingMethodAccessorImpl.invoke(DelegatingMethodAccessorImpl.java:43)
	at java.lang.reflect.Method.invoke(Method.java:498)
	at org.junit.runners.model.FrameworkMethod$1.runReflectiveCall(FrameworkMethod.java:47)
	at org.junit.internal.runners.model.ReflectiveCallable.run(ReflectiveCallable.java:12)
	at org.junit.runners.model.FrameworkMethod.invokeExplosively(FrameworkMethod.java:44)
	at org.junit.internal.runners.statements.InvokeMethod.evaluate(InvokeMethod.java:17)
	at org.junit.internal.runners.statements.RunBefores.evaluate(RunBefores.java:26)
	at org.junit.internal.runners.statements.RunAfters.evaluate(RunAfters.java:27)
	at org.junit.runners.ParentRunner.runLeaf(ParentRunner.java:271)
	at org.junit.runners.BlockJUnit4ClassRunner.runChild(BlockJUnit4ClassRunner.java:70)
	at org.junit.runners.BlockJUnit4ClassRunner.runChild(BlockJUnit4ClassRunner.java:50)
	at org.junit.runners.ParentRunner$3.run(ParentRunner.java:238)
	at org.junit.runners.ParentRunner$1.schedule(ParentRunner.java:63)
	at org.junit.runners.ParentRunner.runChildren(ParentRunner.java:236)
	at org.junit.runners.ParentRunner.access$000(ParentRunner.java:53)
	at org.junit.runners.ParentRunner$2.evaluate(ParentRunner.java:229)
	at org.junit.runners.ParentRunner.run(ParentRunner.java:309)
	at org.junit.runners.Suite.runChild(Suite.java:127)
	at org.junit.runners.Suite.runChild(Suite.java:26)
	at org.junit.runners.ParentRunner$3.run(ParentRunner.java:238)
	at org.junit.runners.ParentRunner$1.schedule(ParentRunner.java:63)
	at org.junit.runners.ParentRunner.runChildren(ParentRunner.java:236)
	at org.junit.runners.ParentRunner.access$000(ParentRunner.java:53)
	at org.junit.runners.ParentRunner$2.evaluate(ParentRunner.java:229)
	at org.junit.runners.ParentRunner.run(ParentRunner.java:309)
	at org.apache.maven.surefire.junit4.JUnit4Provider.execute(JUnit4Provider.java:264)
	at org.apache.maven.surefire.junit4.JUnit4Provider.executeTestSet(JUnit4Provider.java:153)
	at org.apache.maven.surefire.junit4.JUnit4Provider.invoke(JUnit4Provider.java:124)
	at org.apache.maven.surefire.booter.ForkedBooter.invokeProviderInSameClassLoader(ForkedBooter.java:200)
	at org.apache.maven.surefire.booter.ForkedBooter.runSuitesInProcess(ForkedBooter.java:153)
	at org.apache.maven.surefire.booter.ForkedBooter.main(ForkedBooter.java:103)

May 26, 2017 8:34:44 PM org.apache.catalina.ha.tcp.SimpleTcpCluster startInternal
SEVERE: Unable to start cluster.
org.apache.catalina.tribes.ChannelException: java.net.BindException: Address already in use; No faulty members identified.
	at org.apache.catalina.tribes.group.ChannelCoordinator.internalStart(ChannelCoordinator.java:178)
	at org.apache.catalina.tribes.group.ChannelCoordinator.start(ChannelCoordinator.java:99)
	at org.apache.catalina.tribes.group.ChannelInterceptorBase.start(ChannelInterceptorBase.java:150)
	at org.apache.catalina.tribes.group.interceptors.MessageDispatchInterceptor.start(MessageDispatchInterceptor.java:153)
	at org.apache.catalina.tribes.group.ChannelInterceptorBase.start(ChannelInterceptorBase.java:150)
	at org.apache.catalina.tribes.group.ChannelInterceptorBase.start(ChannelInterceptorBase.java:150)
	at org.apache.catalina.tribes.group.GroupChannel.start(GroupChannel.java:416)
	at org.apache.catalina.ha.tcp.SimpleTcpCluster.startInternal(SimpleTcpCluster.java:653)
	at org.apache.catalina.util.LifecycleBase.start(LifecycleBase.java:145)
	at org.apache.catalina.core.ContainerBase.startInternal(ContainerBase.java:1024)
	at org.apache.catalina.core.StandardEngine.startInternal(StandardEngine.java:291)
	at org.apache.catalina.util.LifecycleBase.start(LifecycleBase.java:145)
	at org.apache.catalina.core.StandardService.startInternal(StandardService.java:443)
	at org.apache.catalina.util.LifecycleBase.start(LifecycleBase.java:145)
	at org.apache.catalina.core.StandardServer.startInternal(StandardServer.java:727)
	at org.apache.catalina.util.LifecycleBase.start(LifecycleBase.java:145)
	at org.apache.catalina.startup.Tomcat.start(Tomcat.java:305)
	at org.eclipse.rap.rwt.cluster.testfixture.internal.tomcat.TomcatEngine.start(TomcatEngine.java:65)
	at org.eclipse.rap.rwt.cluster.testfixture.internal.server.DelegatingServletEngine.start(DelegatingServletEngine.java:36)
	at org.eclipse.rap.rwt.cluster.testfixture.internal.tomcat.TomcatCluster.start(TomcatCluster.java:49)
	at org.eclipse.rap.rwt.cluster.test.SessionFailover_Test.initializeClient(SessionFailover_Test.java:244)
	at org.eclipse.rap.rwt.cluster.test.SessionFailover_Test.testDNDEntryPoint(SessionFailover_Test.java:210)
	at sun.reflect.NativeMethodAccessorImpl.invoke0(Native Method)
	at sun.reflect.NativeMethodAccessorImpl.invoke(NativeMethodAccessorImpl.java:62)
	at sun.reflect.DelegatingMethodAccessorImpl.invoke(DelegatingMethodAccessorImpl.java:43)
	at java.lang.reflect.Method.invoke(Method.java:498)
	at org.junit.runners.model.FrameworkMethod$1.runReflectiveCall(FrameworkMethod.java:47)
	at org.junit.internal.runners.model.ReflectiveCallable.run(ReflectiveCallable.java:12)
	at org.junit.runners.model.FrameworkMethod.invokeExplosively(FrameworkMethod.java:44)
	at org.junit.internal.runners.statements.InvokeMethod.evaluate(InvokeMethod.java:17)
	at org.junit.internal.runners.statements.RunBefores.evaluate(RunBefores.java:26)
	at org.junit.internal.runners.statements.RunAfters.evaluate(RunAfters.java:27)
	at org.junit.runners.ParentRunner.runLeaf(ParentRunner.java:271)
	at org.junit.runners.BlockJUnit4ClassRunner.runChild(BlockJUnit4ClassRunner.java:70)
	at org.junit.runners.BlockJUnit4ClassRunner.runChild(BlockJUnit4ClassRunner.java:50)
	at org.junit.runners.ParentRunner$3.run(ParentRunner.java:238)
	at org.junit.runners.ParentRunner$1.schedule(ParentRunner.java:63)
	at org.junit.runners.ParentRunner.runChildren(ParentRunner.java:236)
	at org.junit.runners.ParentRunner.access$000(ParentRunner.java:53)
	at org.junit.runners.ParentRunner$2.evaluate(ParentRunner.java:229)
	at org.junit.runners.ParentRunner.run(ParentRunner.java:309)
	at org.junit.runners.Suite.runChild(Suite.java:127)
	at org.junit.runners.Suite.runChild(Suite.java:26)
	at org.junit.runners.ParentRunner$3.run(ParentRunner.java:238)
	at org.junit.runners.ParentRunner$1.schedule(ParentRunner.java:63)
	at org.junit.runners.ParentRunner.runChildren(ParentRunner.java:236)
	at org.junit.runners.ParentRunner.access$000(ParentRunner.java:53)
	at org.junit.runners.ParentRunner$2.evaluate(ParentRunner.java:229)
	at org.junit.runners.ParentRunner.run(ParentRunner.java:309)
	at org.apache.maven.surefire.junit4.JUnit4Provider.execute(JUnit4Provider.java:264)
	at org.apache.maven.surefire.junit4.JUnit4Provider.executeTestSet(JUnit4Provider.java:153)
	at org.apache.maven.surefire.junit4.JUnit4Provider.invoke(JUnit4Provider.java:124)
	at org.apache.maven.surefire.booter.ForkedBooter.invokeProviderInSameClassLoader(ForkedBooter.java:200)
	at org.apache.maven.surefire.booter.ForkedBooter.runSuitesInProcess(ForkedBooter.java:153)
	at org.apache.maven.surefire.booter.ForkedBooter.main(ForkedBooter.java:103)
Caused by: java.net.BindException: Address already in use
	at sun.nio.ch.Net.bind0(Native Method)
	at sun.nio.ch.Net.bind(Net.java:433)
	at sun.nio.ch.Net.bind(Net.java:425)
	at sun.nio.ch.ServerSocketChannelImpl.bind(ServerSocketChannelImpl.java:223)
	at sun.nio.ch.ServerSocketAdaptor.bind(ServerSocketAdaptor.java:74)
	at sun.nio.ch.ServerSocketAdaptor.bind(ServerSocketAdaptor.java:67)
	at org.apache.catalina.tribes.transport.ReceiverBase.bind(ReceiverBase.java:219)
	at org.apache.catalina.tribes.transport.nio.NioReceiver.bind(NioReceiver.java:137)
	at org.apache.catalina.tribes.transport.nio.NioReceiver.start(NioReceiver.java:107)
	at org.apache.catalina.tribes.group.ChannelCoordinator.internalStart(ChannelCoordinator.java:145)
	... 54 more

Tests run: 16, Failures: 0, Errors: 1, Skipped: 0, Time elapsed: 73.475 sec <<< FAILURE! - in org.eclipse.rap.rwt.cluster.test.SessionFailover_Test
testDNDEntryPoint[1](org.eclipse.rap.rwt.cluster.test.SessionFailover_Test)  Time elapsed: 3.784 sec  <<< ERROR!
org.apache.catalina.LifecycleException: org.apache.catalina.tribes.ChannelException: java.net.BindException: Address already in use; No faulty members identified.
	at sun.nio.ch.Net.bind0(Native Method)
	at sun.nio.ch.Net.bind(Net.java:433)
	at sun.nio.ch.Net.bind(Net.java:425)
	at sun.nio.ch.ServerSocketChannelImpl.bind(ServerSocketChannelImpl.java:223)
	at sun.nio.ch.ServerSocketAdaptor.bind(ServerSocketAdaptor.java:74)
	at sun.nio.ch.ServerSocketAdaptor.bind(ServerSocketAdaptor.java:67)
	at org.apache.catalina.tribes.transport.ReceiverBase.bind(ReceiverBase.java:219)
	at org.apache.catalina.tribes.transport.nio.NioReceiver.bind(NioReceiver.java:137)
	at org.apache.catalina.tribes.transport.nio.NioReceiver.start(NioReceiver.java:107)
	at org.apache.catalina.tribes.group.ChannelCoordinator.internalStart(ChannelCoordinator.java:145)
	at org.apache.catalina.tribes.group.ChannelCoordinator.start(ChannelCoordinator.java:99)
	at org.apache.catalina.tribes.group.ChannelInterceptorBase.start(ChannelInterceptorBase.java:150)
	at org.apache.catalina.tribes.group.interceptors.MessageDispatchInterceptor.start(MessageDispatchInterceptor.java:153)
	at org.apache.catalina.tribes.group.ChannelInterceptorBase.start(ChannelInterceptorBase.java:150)
	at org.apache.catalina.tribes.group.ChannelInterceptorBase.start(ChannelInterceptorBase.java:150)
	at org.apache.catalina.tribes.group.GroupChannel.start(GroupChannel.java:416)
	at org.apache.catalina.ha.tcp.SimpleTcpCluster.startInternal(SimpleTcpCluster.java:653)
	at org.apache.catalina.util.LifecycleBase.start(LifecycleBase.java:145)
	at org.apache.catalina.core.ContainerBase.startInternal(ContainerBase.java:1024)
	at org.apache.catalina.core.StandardEngine.startInternal(StandardEngine.java:291)
	at org.apache.catalina.util.LifecycleBase.start(LifecycleBase.java:145)
	at org.apache.catalina.core.StandardService.startInternal(StandardService.java:443)
	at org.apache.catalina.util.LifecycleBase.start(LifecycleBase.java:145)
	at org.apache.catalina.core.StandardServer.startInternal(StandardServer.java:727)
	at org.apache.catalina.util.LifecycleBase.start(LifecycleBase.java:145)
	at org.apache.catalina.startup.Tomcat.start(Tomcat.java:305)
	at org.eclipse.rap.rwt.cluster.testfixture.internal.tomcat.TomcatEngine.start(TomcatEngine.java:65)
	at org.eclipse.rap.rwt.cluster.testfixture.internal.server.DelegatingServletEngine.start(DelegatingServletEngine.java:36)
	at org.eclipse.rap.rwt.cluster.testfixture.internal.tomcat.TomcatCluster.start(TomcatCluster.java:49)
	at org.eclipse.rap.rwt.cluster.test.SessionFailover_Test.initializeClient(SessionFailover_Test.java:244)
	at org.eclipse.rap.rwt.cluster.test.SessionFailover_Test.testDNDEntryPoint(SessionFailover_Test.java:210)

Running org.eclipse.rap.rwt.cluster.test.SessionSerialization_Test
Tests run: 1, Failures: 0, Errors: 0, Skipped: 0, Time elapsed: 0.727 sec - in org.eclipse.rap.rwt.cluster.test.SessionSerialization_Test
Running org.eclipse.rap.rwt.cluster.test.SessionCleanup_Test
Tests run: 2, Failures: 0, Errors: 0, Skipped: 0, Time elapsed: 1.677 sec - in org.eclipse.rap.rwt.cluster.test.SessionCleanup_Test
Running org.eclipse.rap.rwt.cluster.test.ServerPush_Test
Tests run: 8, Failures: 0, Errors: 0, Skipped: 0, Time elapsed: 20.073 sec - in org.eclipse.rap.rwt.cluster.test.ServerPush_Test

Results :

Tests in error: 
  SessionFailover_Test.testDNDEntryPoint:210->initializeClient:244 » Lifecycle o...

Tests run: 27, Failures: 0, Errors: 1, Skipped: 0

[INFO] ------------------------------------------------------------------------
[INFO] Reactor Summary:
[INFO] 
[INFO] org.eclipse.rap.clientbuilder ...................... SUCCESS [ 16.731 s]
[INFO] org.eclipse.rap.rwt ................................ SUCCESS [  7.155 s]
[INFO] org.eclipse.rap.fileupload ......................... SUCCESS [  3.392 s]
[INFO] org.eclipse.rap.filedialog ......................... SUCCESS [  0.917 s]
[INFO] org.eclipse.rap.jface .............................. SUCCESS [  2.064 s]
[INFO] org.eclipse.rap.jface.databinding .................. SUCCESS [  1.487 s]
[INFO] org.eclipse.rap.nebula.widgets.grid ................ SUCCESS [  0.974 s]
[INFO] org.eclipse.rap.nebula.jface.gridviewer ............ SUCCESS [  1.019 s]
[INFO] org.eclipse.rap.nebula.widgets.richtext ............ SUCCESS [  1.362 s]
[INFO] org.eclipse.rap.rwt.osgi ........................... SUCCESS [  0.827 s]
[INFO] org.eclipse.rap.ui.workbench ....................... SUCCESS [  4.471 s]
[INFO] org.eclipse.rap.ui ................................. SUCCESS [  1.247 s]
[INFO] org.eclipse.rap.ui.forms ........................... SUCCESS [  1.432 s]
[INFO] org.eclipse.rap.ui.cheatsheets ..................... SUCCESS [  1.741 s]
[INFO] org.eclipse.rap.ui.views ........................... SUCCESS [  1.169 s]
[INFO] org.eclipse.rap.demo.controls ...................... SUCCESS [  1.155 s]
[INFO] org.eclipse.rap.demo.databinding ................... SUCCESS [  1.397 s]
[INFO] org.eclipse.rap.demo ............................... SUCCESS [  1.040 s]
[INFO] org.eclipse.rap.design.example ..................... SUCCESS [  1.358 s]
[INFO] org.eclipse.rap.examples ........................... SUCCESS [  0.790 s]
[INFO] org.eclipse.rap.examples.pages ..................... SUCCESS [  0.992 s]
[INFO] org.eclipse.rap.filedialog.demo.examples ........... SUCCESS [  3.042 s]
[INFO] org.eclipse.rap.nebula.widgets.grid.demo.examples .. SUCCESS [  1.439 s]
[INFO] org.eclipse.rap.nebula.widgets.richtext.demo.examples SUCCESS [  0.721 s]
[INFO] org.eclipse.rap.rwt.testfixture .................... SUCCESS [  1.273 s]
[INFO] org.eclipse.rap.filedialog.test .................... SUCCESS [  3.999 s]
[INFO] org.eclipse.rap.fileupload.test .................... SUCCESS [  2.568 s]
[INFO] org.eclipse.rap.nebula.widgets.grid.test ........... SUCCESS [ 12.950 s]
[INFO] org.eclipse.rap.nebula.widgets.richtext.test ....... SUCCESS [  1.949 s]
[INFO] org.eclipse.rap.rwt.cluster.testfixture ............ SUCCESS [  0.886 s]
[INFO] org.eclipse.rap.rwt.cluster.testfixture.test ....... SUCCESS [ 28.632 s]
[INFO] org.eclipse.rap.rwt.cluster.test ................... FAILURE [01:37 min]
[INFO] org.eclipse.rap.rwt.osgi.test ...................... SKIPPED
[INFO] org.eclipse.rap.rwt.test ........................... SKIPPED
[INFO] org.eclipse.rap.rwt.themes.test .................... SKIPPED
[INFO] org.eclipse.rap.ui.forms.test ...................... SKIPPED
[INFO] org.eclipse.rap.feature ............................ SKIPPED
[INFO] org.eclipse.rap.equinox.target.feature ............. SKIPPED
[INFO] org.eclipse.rap.examples.feature ................... SKIPPED
[INFO] org.eclipse.rap.sdk.feature ........................ SKIPPED
[INFO] org.eclipse.rap.runtime-aggregation-repository ..... SKIPPED
[INFO] RAP Runtime Build .................................. SKIPPED
[INFO] ------------------------------------------------------------------------
[INFO] BUILD FAILURE
[INFO] ------------------------------------------------------------------------
[INFO] Total time: 04:18 min
[INFO] Finished at: 2017-05-26T20:36:00-04:00
[INFO] Final Memory: 215M/4730M
[INFO] ------------------------------------------------------------------------
[INFO] o.h.m.e.h.MavenExecutionResultHandler - Build failed with exception(s)
[INFO] o.h.m.e.h.MavenExecutionResultHandler - [1] org.apache.maven.lifecycle.LifecycleExecutionException: Failed to execute goal org.apache.maven.plugins:maven-surefire-plugin:2.17:test (test) on project org.eclipse.rap.rwt.cluster.test: There are test failures.

Please refer to /jobs/genie.rap/rap-3.1-runtime/workspace/org.eclipse.rap/tests/org.eclipse.rap.rwt.cluster.test/target/surefire-reports for the individual test results.
[DEBUG] Closing connection to remote
[ERROR] Failed to execute goal org.apache.maven.plugins:maven-surefire-plugin:2.17:test (test) on project org.eclipse.rap.rwt.cluster.test: There are test failures.
[ERROR] 
[ERROR] Please refer to /jobs/genie.rap/rap-3.1-runtime/workspace/org.eclipse.rap/tests/org.eclipse.rap.rwt.cluster.test/target/surefire-reports for the individual test results.
[ERROR] -> [Help 1]
[ERROR] 
[ERROR] To see the full stack trace of the errors, re-run Maven with the -e switch.
[ERROR] Re-run Maven using the -X switch to enable full debug logging.
[ERROR] 
[ERROR] For more information about the errors and possible solutions, please read the following articles:
[ERROR] [Help 1] http://cwiki.apache.org/confluence/display/MAVEN/MojoFailureException
[ERROR] 
[ERROR] After correcting the problems, you can resume the build with the command
[ERROR]   mvn <goals> -rf :org.eclipse.rap.rwt.cluster.test
[DEBUG] Waiting for process to finish
[DEBUG] Result: 1
[locks-and-latches] Releasing all the locks
[locks-and-latches] All the locks released
Archiving artifacts
Sending e-mails to: mknauer@eclipsesource.com ivan@eclipsesource.com tbuschto@eclipsesource.com
Finished: FAILURE