FailedConsole Output

Skipping 468 KB.. Full Log
jar from http://download.eclipse.org/tools/ptp/builds/nightly/features/ (37.01kB)
[INFO] Fetching org.eclipse.ptp.rdt.sync.fortran.ui_1.0.0.201902202039.jar.pack.gz from http://download.eclipse.org/tools/ptp/builds/nightly/plugins/ (14.18kB)
[INFO] Fetching org.eclipse.ptp.rdt.sync.fortran.ui_1.0.0.201902202039.jar.pack.gz from http://download.eclipse.org/tools/ptp/builds/nightly/plugins/ (14.18kB)
[INFO] Fetching org.eclipse.ptp.rdt.sync.fortran_9.2.1.201902202039.jar from http://download.eclipse.org/tools/ptp/builds/nightly/features/ (36.91kB)
[INFO] Fetching org.eclipse.ptp.rdt.sync.fortran_9.2.1.201902202039.jar from http://download.eclipse.org/tools/ptp/builds/nightly/features/ (36.91kB)
[INFO] Fetching org.eclipse.ptp.remote_9.2.1.201902202039.jar from http://download.eclipse.org/tools/ptp/builds/nightly/features/ (36.95kB)
[INFO] Fetching org.eclipse.ptp.remote_9.2.1.201902202039.jar from http://download.eclipse.org/tools/ptp/builds/nightly/features/ (36.95kB)
[INFO] Fetching org.eclipse.tm.terminal.connector.remote_4.5.1.201811011621.jar from http://download.eclipse.org/staging/2018-12/plugins/ (38.54kB)
[INFO] Fetching org.eclipse.tm.terminal.connector.remote_4.5.1.201811011621.jar from http://download.eclipse.org/staging/2018-12/plugins/ (38.54kB)
[INFO] Fetching org.eclipse.tm.terminal.view.ui_4.5.1.201811011621.jar from http://download.eclipse.org/staging/2018-12/plugins/ (253.05kB)
[INFO] Fetching org.eclipse.tm.terminal.view.ui_4.5.1.201811011621.jar from http://download.eclipse.org/staging/2018-12/plugins/ (253.05kB)
[INFO] Fetching org.eclipse.tm.terminal.view.core_4.5.1.201811011621.jar from http://download.eclipse.org/staging/2018-12/plugins/ (41.61kB)
[INFO] Fetching org.eclipse.tm.terminal.view.core_4.5.1.201811011621.jar from http://download.eclipse.org/staging/2018-12/plugins/ (41.61kB)
[INFO] Fetching org.eclipse.ptp.remote.terminal_2.0.0.201902202039.jar.pack.gz from http://download.eclipse.org/tools/ptp/builds/nightly/plugins/ (21.14kB)
[INFO] Fetching org.eclipse.ptp.remote.terminal_2.0.0.201902202039.jar.pack.gz from http://download.eclipse.org/tools/ptp/builds/nightly/plugins/ (21.14kB)
[INFO] Fetching org.eclipse.ptp.remote.terminal_9.2.1.201902202039.jar from http://download.eclipse.org/tools/ptp/builds/nightly/features/ (36.95kB)
[INFO] Fetching org.eclipse.ptp.remote.terminal_9.2.1.201902202039.jar from http://download.eclipse.org/tools/ptp/builds/nightly/features/ (36.95kB)
[INFO] Fetching org.eclipse.ptp.rm.ibm.ll_9.2.1.201902202039.jar from http://download.eclipse.org/tools/ptp/builds/nightly/features/ (36.92kB)
[INFO] Fetching org.eclipse.ptp.rm.ibm.ll_9.2.1.201902202039.jar from http://download.eclipse.org/tools/ptp/builds/nightly/features/ (36.92kB)
[INFO] Fetching org.eclipse.ptp.rm.ibm.pe_9.2.1.201902202039.jar from http://download.eclipse.org/tools/ptp/builds/nightly/features/ (36.92kB)
[INFO] Fetching org.eclipse.ptp.rm.ibm.pe_9.2.1.201902202039.jar from http://download.eclipse.org/tools/ptp/builds/nightly/features/ (36.92kB)
[INFO] Fetching org.eclipse.ptp.rm.ibm.platform.lsf_9.2.1.201902202039.jar from http://download.eclipse.org/tools/ptp/builds/nightly/features/ (36.9kB)
[INFO] Fetching org.eclipse.ptp.rm.ibm.platform.lsf_9.2.1.201902202039.jar from http://download.eclipse.org/tools/ptp/builds/nightly/features/ (36.9kB)
[INFO] Fetching org.eclipse.ptp.rm.jaxb.contrib_9.2.1.201902202039.jar from http://download.eclipse.org/tools/ptp/builds/nightly/features/ (36.9kB)
[INFO] Fetching org.eclipse.ptp.rm.jaxb.contrib_9.2.1.201902202039.jar from http://download.eclipse.org/tools/ptp/builds/nightly/features/ (36.9kB)
[INFO] Fetching org.eclipse.ptp.rm.slurm.help_1.0.0.201902202039.jar.pack.gz from http://download.eclipse.org/tools/ptp/builds/nightly/plugins/ (728.1kB)
[INFO] Fetching org.eclipse.ptp.rm.slurm.help_1.0.0.201902202039.jar.pack.gz from http://download.eclipse.org/tools/ptp/builds/nightly/plugins/ (728.1kB)
[INFO] Fetching org.eclipse.ptp.rm.slurm_9.2.1.201902202039.jar from http://download.eclipse.org/tools/ptp/builds/nightly/features/ (36.98kB)
[INFO] Fetching org.eclipse.ptp.rm.slurm_9.2.1.201902202039.jar from http://download.eclipse.org/tools/ptp/builds/nightly/features/ (36.98kB)
[INFO] Fetching org.eclipse.rcp_4.10.0.v20181206-0815.jar.pack.gz from http://download.eclipse.org/staging/2018-12/plugins/ (9.43kB)
[INFO] Fetching org.eclipse.rcp_4.10.0.v20181206-0815.jar.pack.gz from http://download.eclipse.org/staging/2018-12/plugins/ (9.43kB)
[INFO] Fetching org.eclipse.rcp_4.10.0.v20181206-0815.jar from http://download.eclipse.org/staging/2018-12/features/ (19.11kB)
[INFO] Fetching org.eclipse.rcp_4.10.0.v20181206-0815.jar from http://download.eclipse.org/staging/2018-12/features/ (19.11kB)
[INFO] Fetching org.eclipse.rcp_root_4.10.0.v20181206-0815 from http://download.eclipse.org/staging/2018-12/binary/ (25.78kB)
[INFO] Fetching org.eclipse.rcp_root_4.10.0.v20181206-0815 from http://download.eclipse.org/staging/2018-12/binary/ (25.78kB)
[INFO] Fetching org.eclipse.remote.console_1.2.0.201803121903.jar.pack.gz from http://download.eclipse.org/staging/2018-12/plugins/ (26.37kB)
[INFO] Fetching org.eclipse.remote.console_1.2.0.201803121903.jar.pack.gz from http://download.eclipse.org/staging/2018-12/plugins/ (26.37kB)
[INFO] Fetching org.eclipse.remote.console_3.0.0.201803121903.jar from http://download.eclipse.org/staging/2018-12/features/ (31.02kB)
[INFO] Fetching org.eclipse.remote.console_3.0.0.201803121903.jar from http://download.eclipse.org/staging/2018-12/features/ (31.02kB)
[INFO] Fetching org.eclipse.remote.doc.isv_1.0.0.201803121903.jar.pack.gz from http://download.eclipse.org/staging/2018-12/plugins/ (168.85kB)
[INFO] Fetching org.eclipse.remote.doc.isv_1.0.0.201803121903.jar.pack.gz from http://download.eclipse.org/staging/2018-12/plugins/ (168.85kB)
[INFO] Fetching org.eclipse.remote.serial.core_1.0.0.201803121903.jar.pack.gz from http://download.eclipse.org/staging/2018-12/plugins/ (50.26kB)
[INFO] Fetching org.eclipse.remote.serial.core_1.0.0.201803121903.jar.pack.gz from http://download.eclipse.org/staging/2018-12/plugins/ (50.26kB)
[INFO] Fetching org.eclipse.remote.serial.ui_1.0.0.201803121903.jar.pack.gz from http://download.eclipse.org/staging/2018-12/plugins/ (55.16kB)
[INFO] Fetching org.eclipse.remote.serial.ui_1.0.0.201803121903.jar.pack.gz from http://download.eclipse.org/staging/2018-12/plugins/ (55.16kB)
[INFO] Fetching org.eclipse.remote.telnet.core_1.0.0.201803121903.jar.pack.gz from http://download.eclipse.org/staging/2018-12/plugins/ (58.82kB)
[INFO] Fetching org.eclipse.remote.telnet.core_1.0.0.201803121903.jar.pack.gz from http://download.eclipse.org/staging/2018-12/plugins/ (58.82kB)
[INFO] Fetching org.eclipse.remote.telnet.ui_1.0.0.201803121903.jar.pack.gz from http://download.eclipse.org/staging/2018-12/plugins/ (89.72kB)
[INFO] Fetching org.eclipse.remote.telnet.ui_1.0.0.201803121903.jar.pack.gz from http://download.eclipse.org/staging/2018-12/plugins/ (89.72kB)
[INFO] Fetching org.eclipse.remote_3.0.0.201803121903.jar from http://download.eclipse.org/staging/2018-12/features/ (31.08kB)
[INFO] Fetching org.eclipse.remote_3.0.0.201803121903.jar from http://download.eclipse.org/staging/2018-12/features/ (31.08kB)
[INFO] Fetching org.eclipse.remote.proxy.server.core_1.0.0.201803121903.jar.pack.gz from http://download.eclipse.org/staging/2018-12/plugins/ (19.04kB)
[INFO] Fetching org.eclipse.remote.proxy.server.core_1.0.0.201803121903.jar.pack.gz from http://download.eclipse.org/staging/2018-12/plugins/ (19.04kB)
[INFO] Fetching org.eclipse.remote.proxy.server.linux.ppc64le_1.0.0.201803121903.jar.pack.gz from http://download.eclipse.org/staging/2018-12/plugins/ (15.28MB)
[INFO] Fetching org.eclipse.remote.proxy.server.linux.ppc64le_1.0.0.201803121903.jar.pack.gz from http://download.eclipse.org/staging/2018-12/plugins/ (15.28MB)
[INFO] Fetching org.eclipse.remote.proxy.server.linux.ppc64le_1.0.0.201803121903.jar.pack.gz from http://download.eclipse.org/staging/2018-12/plugins/ (14.56MB of 15.28MB at 14.54MB/s)
[INFO] Fetching org.eclipse.remote.proxy_3.0.0.201803121903.jar from http://download.eclipse.org/staging/2018-12/features/ (31.16kB)
[INFO] Fetching org.eclipse.remote.proxy_3.0.0.201803121903.jar from http://download.eclipse.org/staging/2018-12/features/ (31.16kB)
[INFO] Fetching org.eclipse.tm.terminal.connector.remote.feature_4.5.1.201811011802.jar from http://download.eclipse.org/staging/2018-12/features/ (17.98kB)
[INFO] Fetching org.eclipse.tm.terminal.connector.remote.feature_4.5.1.201811011802.jar from http://download.eclipse.org/staging/2018-12/features/ (17.98kB)
[INFO] Fetching org.eclipse.tm.terminal.control.feature_4.5.1.201811011802.jar from http://download.eclipse.org/staging/2018-12/features/ (18.1kB)
[INFO] Fetching org.eclipse.tm.terminal.control.feature_4.5.1.201811011802.jar from http://download.eclipse.org/staging/2018-12/features/ (18.1kB)
[INFO] Fetching org.eclipse.tm.terminal.view.feature_4.5.1.201811011802.jar from http://download.eclipse.org/staging/2018-12/features/ (18.08kB)
[INFO] Fetching org.eclipse.tm.terminal.view.feature_4.5.1.201811011802.jar from http://download.eclipse.org/staging/2018-12/features/ (18.08kB)
[INFO] Fetching org.eclipse.userstorage_1.1.0.v20170526-1605.jar from http://download.eclipse.org/staging/2018-12/features/ (18.96kB)
[INFO] Fetching org.eclipse.userstorage_1.1.0.v20170526-1605.jar from http://download.eclipse.org/staging/2018-12/features/ (18.96kB)
[INFO] Fetching org.eclipse.wst.common.emf_1.2.600.v201803151712.jar.pack.gz from http://download.eclipse.org/staging/2018-12/plugins/ (77.3kB)
[INFO] Fetching org.eclipse.wst.common.emf_1.2.600.v201803151712.jar.pack.gz from http://download.eclipse.org/staging/2018-12/plugins/ (77.3kB)
[INFO] Fetching org.eclipse.wst.common.frameworks_1.2.201.v201707201954.jar.pack.gz from http://download.eclipse.org/staging/2018-12/plugins/ (43.3kB)
[INFO] Fetching org.eclipse.wst.common.frameworks_1.2.201.v201707201954.jar.pack.gz from http://download.eclipse.org/staging/2018-12/plugins/ (43.3kB)
[INFO] Fetching org.eclipse.wst.common.emfworkbench.integration_1.2.101.v201802262042.jar.pack.gz from http://download.eclipse.org/staging/2018-12/plugins/ (53.04kB)
[INFO] Fetching org.eclipse.wst.common.emfworkbench.integration_1.2.101.v201802262042.jar.pack.gz from http://download.eclipse.org/staging/2018-12/plugins/ (53.04kB)
[INFO] Fetching org.eclipse.wst.validation_1.2.701.v201810290944.jar.pack.gz from http://download.eclipse.org/staging/2018-12/plugins/ (134.38kB)
[INFO] Fetching org.eclipse.wst.validation_1.2.701.v201810290944.jar.pack.gz from http://download.eclipse.org/staging/2018-12/plugins/ (134.38kB)
[INFO] Fetching org.eclipse.wst.common.project.facet.core_1.4.400.v201808012032.jar.pack.gz from http://download.eclipse.org/staging/2018-12/plugins/ (119.04kB)
[INFO] Fetching org.eclipse.wst.common.project.facet.core_1.4.400.v201808012032.jar.pack.gz from http://download.eclipse.org/staging/2018-12/plugins/ (119.04kB)
[INFO] Fetching org.eclipse.wst.common.environment_1.0.400.v201810290944.jar.pack.gz from http://download.eclipse.org/staging/2018-12/plugins/ (20.09kB)
[INFO] Fetching org.eclipse.wst.common.environment_1.0.400.v201810290944.jar.pack.gz from http://download.eclipse.org/staging/2018-12/plugins/ (20.09kB)
[INFO] Fetching org.eclipse.wst.common.frameworks.ui_1.2.400.v201802151734.jar.pack.gz from http://download.eclipse.org/staging/2018-12/plugins/ (53.33kB)
[INFO] Fetching org.eclipse.wst.common.frameworks.ui_1.2.400.v201802151734.jar.pack.gz from http://download.eclipse.org/staging/2018-12/plugins/ (53.33kB)
[INFO] Fetching org.eclipse.wst.common.modulecore_1.3.100.v201811122225.jar.pack.gz from http://download.eclipse.org/staging/2018-12/plugins/ (130.34kB)
[INFO] Fetching org.eclipse.wst.common.modulecore_1.3.100.v201811122225.jar.pack.gz from http://download.eclipse.org/staging/2018-12/plugins/ (130.34kB)
[INFO] Fetching org.eclipse.wst.common.uriresolver_1.2.300.v201802151734.jar.pack.gz from http://download.eclipse.org/staging/2018-12/plugins/ (24.71kB)
[INFO] Fetching org.eclipse.wst.common.uriresolver_1.2.300.v201802151734.jar.pack.gz from http://download.eclipse.org/staging/2018-12/plugins/ (24.71kB)
[INFO] Fetching org.eclipse.wst.common.modulecore.ui_1.0.301.v201707201954.jar.pack.gz from http://download.eclipse.org/staging/2018-12/plugins/ (49.64kB)
[INFO] Fetching org.eclipse.wst.common.modulecore.ui_1.0.301.v201707201954.jar.pack.gz from http://download.eclipse.org/staging/2018-12/plugins/ (49.64kB)
[INFO] Fetching org.eclipse.wst.common.snippets_1.2.500.v201811170421.jar.pack.gz from http://download.eclipse.org/staging/2018-12/plugins/ (92.83kB)
[INFO] Fetching org.eclipse.wst.common.snippets_1.2.500.v201811170421.jar.pack.gz from http://download.eclipse.org/staging/2018-12/plugins/ (92.83kB)
[INFO] Fetching org.eclipse.wst.common.ui_1.1.600.v201811161824.jar.pack.gz from http://download.eclipse.org/staging/2018-12/plugins/ (55.87kB)
[INFO] Fetching org.eclipse.wst.common.ui_1.1.600.v201811161824.jar.pack.gz from http://download.eclipse.org/staging/2018-12/plugins/ (55.87kB)
[INFO] Fetching org.eclipse.wst.common_core.feature_3.10.0.v201811122225.jar from http://download.eclipse.org/staging/2018-12/features/ (30.57kB)
[INFO] Fetching org.eclipse.wst.common_core.feature_3.10.0.v201811122225.jar from http://download.eclipse.org/staging/2018-12/features/ (30.57kB)
[INFO] Fetching org.eclipse.wst.common.infopop_1.0.300.v201802151734.jar.pack.gz from http://download.eclipse.org/staging/2018-12/plugins/ (8.74kB)
[INFO] Fetching org.eclipse.wst.common.infopop_1.0.300.v201802151734.jar.pack.gz from http://download.eclipse.org/staging/2018-12/plugins/ (8.74kB)
[INFO] Fetching org.eclipse.wst.internet.cache_1.0.800.v201702270716.jar.pack.gz from http://download.eclipse.org/staging/2018-12/plugins/ (22.72kB)
[INFO] Fetching org.eclipse.wst.internet.cache_1.0.800.v201702270716.jar.pack.gz from http://download.eclipse.org/staging/2018-12/plugins/ (22.72kB)
[INFO] Fetching org.eclipse.wst.validation.ui_1.2.600.v201811122154.jar.pack.gz from http://download.eclipse.org/staging/2018-12/plugins/ (49.33kB)
[INFO] Fetching org.eclipse.wst.validation.ui_1.2.600.v201811122154.jar.pack.gz from http://download.eclipse.org/staging/2018-12/plugins/ (49.33kB)
[INFO] Fetching org.eclipse.wst.validation.infopop_1.0.300.v201309101952.jar.pack.gz from http://download.eclipse.org/staging/2018-12/plugins/ (8.59kB)
[INFO] Fetching org.eclipse.wst.validation.infopop_1.0.300.v201309101952.jar.pack.gz from http://download.eclipse.org/staging/2018-12/plugins/ (8.59kB)
[INFO] Fetching org.eclipse.wst.common_ui.feature_3.10.0.v201811170421.jar from http://download.eclipse.org/staging/2018-12/features/ (30.56kB)
[INFO] Fetching org.eclipse.wst.common_ui.feature_3.10.0.v201811170421.jar from http://download.eclipse.org/staging/2018-12/features/ (30.56kB)
[INFO] Fetching org.eclipse.wst.dtd.core_1.2.0.v201802171654.jar.pack.gz from http://download.eclipse.org/staging/2018-12/plugins/ (165.18kB)
[INFO] Fetching org.eclipse.wst.dtd.core_1.2.0.v201802171654.jar.pack.gz from http://download.eclipse.org/staging/2018-12/plugins/ (165.18kB)
[INFO] Fetching org.eclipse.wst.sse.core_1.2.100.v201810290944.jar.pack.gz from http://download.eclipse.org/staging/2018-12/plugins/ (155.06kB)
[INFO] Fetching org.eclipse.wst.sse.core_1.2.100.v201810290944.jar.pack.gz from http://download.eclipse.org/staging/2018-12/plugins/ (155.06kB)
[INFO] Fetching org.eclipse.wst.xml.core_1.2.200.v201811122127.jar.pack.gz from http://download.eclipse.org/staging/2018-12/plugins/ (254.74kB)
[INFO] Fetching org.eclipse.wst.xml.core_1.2.200.v201811122127.jar.pack.gz from http://download.eclipse.org/staging/2018-12/plugins/ (254.74kB)
[INFO] Fetching org.eclipse.wst.dtd.ui_1.1.100.v201807090620.jar.pack.gz from http://download.eclipse.org/staging/2018-12/plugins/ (89.24kB)
[INFO] Fetching org.eclipse.wst.dtd.ui_1.1.100.v201807090620.jar.pack.gz from http://download.eclipse.org/staging/2018-12/plugins/ (89.24kB)
[INFO] Fetching org.eclipse.wst.sse.ui_1.5.0.v201810290944.jar.pack.gz from http://download.eclipse.org/staging/2018-12/plugins/ (312.17kB)
[INFO] Fetching org.eclipse.wst.sse.ui_1.5.0.v201810290944.jar.pack.gz from http://download.eclipse.org/staging/2018-12/plugins/ (312.17kB)
[INFO] Fetching org.eclipse.wst.xml.ui_1.2.200.v201811192212.jar.pack.gz from http://download.eclipse.org/staging/2018-12/plugins/ (332.33kB)
[INFO] Fetching org.eclipse.wst.xml.ui_1.2.200.v201811192212.jar.pack.gz from http://download.eclipse.org/staging/2018-12/plugins/ (332.33kB)
[INFO] Fetching org.eclipse.wst.dtdeditor.doc.user_1.1.0.v201802171654.jar.pack.gz from http://download.eclipse.org/staging/2018-12/plugins/ (25.91kB)
[INFO] Fetching org.eclipse.wst.dtdeditor.doc.user_1.1.0.v201802171654.jar.pack.gz from http://download.eclipse.org/staging/2018-12/plugins/ (25.91kB)
[INFO] Fetching org.eclipse.wst.sse.doc.user_1.2.0.v201802171654.jar.pack.gz from http://download.eclipse.org/staging/2018-12/plugins/ (89.64kB)
[INFO] Fetching org.eclipse.wst.sse.doc.user_1.2.0.v201802171654.jar.pack.gz from http://download.eclipse.org/staging/2018-12/plugins/ (89.64kB)
[INFO] Fetching org.eclipse.wst.standard.schemas_1.0.800.v201711201732.jar.pack.gz from http://download.eclipse.org/staging/2018-12/plugins/ (143.3kB)
[INFO] Fetching org.eclipse.wst.standard.schemas_1.0.800.v201711201732.jar.pack.gz from http://download.eclipse.org/staging/2018-12/plugins/ (143.3kB)
[INFO] Fetching org.eclipse.wst.xsd.core_1.2.0.v201802171838.jar.pack.gz from http://download.eclipse.org/staging/2018-12/plugins/ (28.94kB)
[INFO] Fetching org.eclipse.wst.xsd.core_1.2.0.v201802171838.jar.pack.gz from http://download.eclipse.org/staging/2018-12/plugins/ (28.94kB)
[INFO] Fetching org.eclipse.wst.xml_core.feature_3.12.0.v201811122127.jar from http://download.eclipse.org/staging/2018-12/features/ (30.43kB)
[INFO] Fetching org.eclipse.wst.xml_core.feature_3.12.0.v201811122127.jar from http://download.eclipse.org/staging/2018-12/features/ (30.43kB)
[INFO] Fetching org.eclipse.wst.dtd.ui.infopop_1.0.400.v201711201733.jar.pack.gz from http://download.eclipse.org/staging/2018-12/plugins/ (9.12kB)
[INFO] Fetching org.eclipse.wst.dtd.ui.infopop_1.0.400.v201711201733.jar.pack.gz from http://download.eclipse.org/staging/2018-12/plugins/ (9.12kB)
[INFO] Fetching org.eclipse.wst.sse.ui.infopop_1.0.300.v201711201733.jar.pack.gz from http://download.eclipse.org/staging/2018-12/plugins/ (9.09kB)
[INFO] Fetching org.eclipse.wst.sse.ui.infopop_1.0.300.v201711201733.jar.pack.gz from http://download.eclipse.org/staging/2018-12/plugins/ (9.09kB)
[INFO] Fetching org.eclipse.wst.xml.ui.infopop_1.0.400.v201711201733.jar.pack.gz from http://download.eclipse.org/staging/2018-12/plugins/ (14.13kB)
[INFO] Fetching org.eclipse.wst.xml.ui.infopop_1.0.400.v201711201733.jar.pack.gz from http://download.eclipse.org/staging/2018-12/plugins/ (14.13kB)
[INFO] Fetching org.eclipse.wst.xsd.ui_1.3.200.v201811122127.jar.pack.gz from http://download.eclipse.org/staging/2018-12/plugins/ (374.58kB)
[INFO] Fetching org.eclipse.wst.xsd.ui_1.3.200.v201811122127.jar.pack.gz from http://download.eclipse.org/staging/2018-12/plugins/ (374.58kB)
[INFO] Fetching org.eclipse.wst.xml_ui.feature_3.12.0.v201811192212.jar from http://download.eclipse.org/staging/2018-12/features/ (30.51kB)
[INFO] Fetching org.eclipse.wst.xml_ui.feature_3.12.0.v201811192212.jar from http://download.eclipse.org/staging/2018-12/features/ (30.51kB)
[INFO] Fetching org.eclipse.wst.xmleditor.doc.user_1.1.0.v201802171654.jar.pack.gz from http://download.eclipse.org/staging/2018-12/plugins/ (87.83kB)
[INFO] Fetching org.eclipse.wst.xmleditor.doc.user_1.1.0.v201802171654.jar.pack.gz from http://download.eclipse.org/staging/2018-12/plugins/ (87.83kB)
[INFO] Fetching org.eclipse.wst.xsdeditor.doc.user_1.0.800.v201711201733.jar.pack.gz from http://download.eclipse.org/staging/2018-12/plugins/ (77.71kB)
[INFO] Fetching org.eclipse.wst.xsdeditor.doc.user_1.0.800.v201711201733.jar.pack.gz from http://download.eclipse.org/staging/2018-12/plugins/ (77.71kB)
[INFO] Fetching org.eclipse.wst.xml_userdoc.feature_3.10.0.v201804190136.jar from http://download.eclipse.org/staging/2018-12/features/ (30.3kB)
[INFO] Fetching org.eclipse.wst.xml_userdoc.feature_3.10.0.v201804190136.jar from http://download.eclipse.org/staging/2018-12/features/ (30.3kB)
[INFO] Fetching org.eclipse.xsd_2.16.0.v20181127-0852.jar.pack.gz from http://download.eclipse.org/staging/2018-12/plugins/ (535.85kB)
[INFO] Fetching org.eclipse.xsd_2.16.0.v20181127-0852.jar.pack.gz from http://download.eclipse.org/staging/2018-12/plugins/ (535.85kB)
[INFO] Fetching org.eclipse.xsd.edit_2.10.0.v20180706-1143.jar.pack.gz from http://download.eclipse.org/staging/2018-12/plugins/ (65.2kB)
[INFO] Fetching org.eclipse.xsd.edit_2.10.0.v20180706-1143.jar.pack.gz from http://download.eclipse.org/staging/2018-12/plugins/ (65.2kB)
[INFO] Fetching com.sun.jna_4.5.1.v20180403-1933.jar from http://download.eclipse.org/staging/2018-12/plugins/ (1.4MB)
[INFO] Fetching com.sun.jna_4.5.1.v20180403-1933.jar from http://download.eclipse.org/staging/2018-12/plugins/ (1.4MB)
[INFO] Fetching com.sun.jna.platform_4.5.1.v20180403-1933.jar from http://download.eclipse.org/staging/2018-12/plugins/ (1.14MB)
[INFO] Fetching com.sun.jna.platform_4.5.1.v20180403-1933.jar from http://download.eclipse.org/staging/2018-12/plugins/ (1.14MB)
[INFO] Fetching org.apache.httpcomponents.httpclient.win_4.5.5.v20180409-1525.jar from http://download.eclipse.org/staging/2018-12/plugins/ (30.14kB)
[INFO] Fetching org.apache.httpcomponents.httpclient.win_4.5.5.v20180409-1525.jar from http://download.eclipse.org/staging/2018-12/plugins/ (30.14kB)
[INFO] Fetching org.eclipse.compare.win32_1.2.300.v20180926-0905.jar.pack.gz from http://download.eclipse.org/staging/2018-12/plugins/ (24.46kB)
[INFO] Fetching org.eclipse.compare.win32_1.2.300.v20180926-0905.jar.pack.gz from http://download.eclipse.org/staging/2018-12/plugins/ (24.46kB)
[INFO] Fetching org.eclipse.core.resources.win32.x86_64_3.5.300.v20181030-1942.jar.pack.gz from http://download.eclipse.org/staging/2018-12/plugins/ (51.27kB)
[INFO] Fetching org.eclipse.core.resources.win32.x86_64_3.5.300.v20181030-1942.jar.pack.gz from http://download.eclipse.org/staging/2018-12/plugins/ (51.27kB)
[INFO] Fetching org.eclipse.epp.mpc.core.win32_1.7.3.v20181107-1820.jar from http://download.eclipse.org/staging/2018-12/plugins/ (12.44kB)
[INFO] Fetching org.eclipse.epp.mpc.core.win32_1.7.3.v20181107-1820.jar from http://download.eclipse.org/staging/2018-12/plugins/ (12.44kB)
[INFO] Fetching org.eclipse.ui.cocoa_1.2.100.v20180828-0838.jar.pack.gz from http://download.eclipse.org/staging/2018-12/plugins/ (7.62kB)
[INFO] Fetching org.eclipse.ui.cocoa_1.2.100.v20180828-0838.jar.pack.gz from http://download.eclipse.org/staging/2018-12/plugins/ (7.62kB)
[INFO] Resolving class path of MavenProject: org.eclipse.ptp.master:org.eclipse.ptp-product:9.2.1-SNAPSHOT @ /jobs/genie.ptp/ptp-verify-packages/workspace/org.eclipse.ptp-product/pom.xml
[WARNING] The project org.eclipse.ptp.master:org.eclipse.ptp.master:pom:9.2.1-SNAPSHOT uses prerequisites which is only intended for maven-plugin projects but not for non maven-plugin projects. For such purposes you should use the maven-enforcer-plugin. See https://maven.apache.org/enforcer/enforcer-rules/requireMavenVersion.html
[INFO] ------------------------------------------------------------------------
[INFO] Reactor Build Order:
[INFO] 
[INFO] PTP Products                                                       [pom]
[INFO] org.eclipse.ptp.rcp.sysmon                              [eclipse-plugin]
[INFO] org.eclipse.ptp.rcp.sysmon                             [eclipse-feature]
[INFO] org.eclipse.ptp.product                                [eclipse-feature]
[INFO] org.eclipse.ptp.rcp.sysmon-product                  [eclipse-repository]
[INFO] org.eclipse.ptp-product                             [eclipse-repository]
[INFO] 
[INFO] -----------< org.eclipse.ptp.master:org.eclipse.ptp.master >------------
[INFO] Building PTP Products 9.2.1-SNAPSHOT                               [1/6]
[INFO] --------------------------------[ pom ]---------------------------------
Downloading from eclipse.maven.central.mirror: https://repo.eclipse.org/content/repositories/maven_central/org/apache/maven/plugins/maven-install-plugin/2.4/maven-install-plugin-2.4.pom
Progress (1): 4.1/6.4 kB
Progress (1): 6.4 kB    
                    
Downloaded from eclipse.maven.central.mirror: https://repo.eclipse.org/content/repositories/maven_central/org/apache/maven/plugins/maven-install-plugin/2.4/maven-install-plugin-2.4.pom (6.4 kB at 160 kB/s)
Downloading from eclipse.maven.central.mirror: https://repo.eclipse.org/content/repositories/maven_central/org/apache/maven/plugins/maven-plugins/23/maven-plugins-23.pom
Progress (1): 4.1/9.2 kB
Progress (1): 7.7/9.2 kB
Progress (1): 9.2 kB    
                    
Downloaded from eclipse.maven.central.mirror: https://repo.eclipse.org/content/repositories/maven_central/org/apache/maven/plugins/maven-plugins/23/maven-plugins-23.pom (9.2 kB at 297 kB/s)
Downloading from eclipse.maven.central.mirror: https://repo.eclipse.org/content/repositories/maven_central/org/apache/maven/maven-parent/22/maven-parent-22.pom
Progress (1): 4.1/30 kB
Progress (1): 7.7/30 kB
Progress (1): 12/30 kB 
Progress (1): 16/30 kB
Progress (1): 20/30 kB
Progress (1): 24/30 kB
Progress (1): 28/30 kB
Progress (1): 30 kB   
                   
Downloaded from eclipse.maven.central.mirror: https://repo.eclipse.org/content/repositories/maven_central/org/apache/maven/maven-parent/22/maven-parent-22.pom (30 kB at 1.3 MB/s)
Downloading from eclipse.maven.central.mirror: https://repo.eclipse.org/content/repositories/maven_central/org/apache/apache/11/apache-11.pom
Progress (1): 4.1/15 kB
Progress (1): 7.7/15 kB
Progress (1): 12/15 kB 
Progress (1): 15 kB   
                   
Downloaded from eclipse.maven.central.mirror: https://repo.eclipse.org/content/repositories/maven_central/org/apache/apache/11/apache-11.pom (15 kB at 644 kB/s)
Downloading from eclipse.maven.central.mirror: https://repo.eclipse.org/content/repositories/maven_central/org/apache/maven/plugins/maven-install-plugin/2.4/maven-install-plugin-2.4.jar
Progress (1): 4.1/27 kB
Progress (1): 7.7/27 kB
Progress (1): 12/27 kB 
Progress (1): 16/27 kB
Progress (1): 20/27 kB
Progress (1): 24/27 kB
Progress (1): 27 kB   
                   
Downloaded from eclipse.maven.central.mirror: https://repo.eclipse.org/content/repositories/maven_central/org/apache/maven/plugins/maven-install-plugin/2.4/maven-install-plugin-2.4.jar (27 kB at 1.6 MB/s)
[INFO] 
[INFO] --- maven-clean-plugin:2.5:clean (default-clean) @ org.eclipse.ptp.master ---
Downloading from eclipse.maven.central.mirror: https://repo.eclipse.org/content/repositories/maven_central/org/apache/maven/maven-plugin-api/2.0.6/maven-plugin-api-2.0.6.pom
Progress (1): 1.5 kB
                    
Downloaded from eclipse.maven.central.mirror: https://repo.eclipse.org/content/repositories/maven_central/org/apache/maven/maven-plugin-api/2.0.6/maven-plugin-api-2.0.6.pom (1.5 kB at 91 kB/s)
Downloading from eclipse.maven.central.mirror: https://repo.eclipse.org/content/repositories/maven_central/org/apache/maven/maven/2.0.6/maven-2.0.6.pom
Progress (1): 4.1/9.0 kB
Progress (1): 7.7/9.0 kB
Progress (1): 9.0 kB    
                    
Downloaded from eclipse.maven.central.mirror: https://repo.eclipse.org/content/repositories/maven_central/org/apache/maven/maven/2.0.6/maven-2.0.6.pom (9.0 kB at 503 kB/s)
Downloading from eclipse.maven.central.mirror: https://repo.eclipse.org/content/repositories/maven_central/org/apache/maven/maven-parent/5/maven-parent-5.pom
Progress (1): 4.1/15 kB
Progress (1): 7.7/15 kB
Progress (1): 12/15 kB 
Progress (1): 15 kB   
                   
Downloaded from eclipse.maven.central.mirror: https://repo.eclipse.org/content/repositories/maven_central/org/apache/maven/maven-parent/5/maven-parent-5.pom (15 kB at 952 kB/s)
Downloading from eclipse.maven.central.mirror: https://repo.eclipse.org/content/repositories/maven_central/org/apache/apache/3/apache-3.pom
Progress (1): 3.4 kB
                    
Downloaded from eclipse.maven.central.mirror: https://repo.eclipse.org/content/repositories/maven_central/org/apache/apache/3/apache-3.pom (3.4 kB at 202 kB/s)
Downloading from eclipse.maven.central.mirror: https://repo.eclipse.org/content/repositories/maven_central/org/codehaus/plexus/plexus-utils/3.0/plexus-utils-3.0.pom
Progress (1): 4.1 kB
                    
Downloaded from eclipse.maven.central.mirror: https://repo.eclipse.org/content/repositories/maven_central/org/codehaus/plexus/plexus-utils/3.0/plexus-utils-3.0.pom (4.1 kB at 290 kB/s)
Downloading from eclipse.maven.central.mirror: https://repo.eclipse.org/content/repositories/maven_central/org/sonatype/spice/spice-parent/16/spice-parent-16.pom
Progress (1): 4.1/8.4 kB
Progress (1): 7.7/8.4 kB
Progress (1): 8.4 kB    
                    
Downloaded from eclipse.maven.central.mirror: https://repo.eclipse.org/content/repositories/maven_central/org/sonatype/spice/spice-parent/16/spice-parent-16.pom (8.4 kB at 464 kB/s)
Downloading from eclipse.maven.central.mirror: https://repo.eclipse.org/content/repositories/maven_central/org/apache/maven/maven-plugin-api/2.0.6/maven-plugin-api-2.0.6.jar
Downloading from eclipse.maven.central.mirror: https://repo.eclipse.org/content/repositories/maven_central/org/codehaus/plexus/plexus-utils/3.0/plexus-utils-3.0.jar
Progress (1): 4.1/13 kB
Progress (1): 7.7/13 kB
Progress (1): 12/13 kB 
Progress (1): 13 kB   
                   
Downloaded from eclipse.maven.central.mirror: https://repo.eclipse.org/content/repositories/maven_central/org/apache/maven/maven-plugin-api/2.0.6/maven-plugin-api-2.0.6.jar (13 kB at 612 kB/s)
Progress (1): 4.1/226 kB
Progress (1): 7.7/226 kB
Progress (1): 12/226 kB 
Progress (1): 16/226 kB
Progress (1): 20/226 kB
Progress (1): 24/226 kB
Progress (1): 28/226 kB
Progress (1): 32/226 kB
Progress (1): 36/226 kB
Progress (1): 40/226 kB
Progress (1): 44/226 kB
Progress (1): 48/226 kB
Progress (1): 52/226 kB
Progress (1): 56/226 kB
Progress (1): 60/226 kB
Progress (1): 64/226 kB
Progress (1): 68/226 kB
Progress (1): 72/226 kB
Progress (1): 76/226 kB
Progress (1): 80/226 kB
Progress (1): 84/226 kB
Progress (1): 88/226 kB
Progress (1): 92/226 kB
Progress (1): 96/226 kB
Progress (1): 100/226 kB
Progress (1): 104/226 kB
Progress (1): 108/226 kB
Progress (1): 112/226 kB
Progress (1): 116/226 kB
Progress (1): 120/226 kB
Progress (1): 124/226 kB
Progress (1): 128/226 kB
Progress (1): 132/226 kB
Progress (1): 136/226 kB
Progress (1): 140/226 kB
Progress (1): 144/226 kB
Progress (1): 148/226 kB
Progress (1): 152/226 kB
Progress (1): 156/226 kB
Progress (1): 160/226 kB
Progress (1): 164/226 kB
Progress (1): 168/226 kB
Progress (1): 172/226 kB
Progress (1): 176/226 kB
Progress (1): 180/226 kB
Progress (1): 184/226 kB
Progress (1): 188/226 kB
Progress (1): 192/226 kB
Progress (1): 196/226 kB
Progress (1): 200/226 kB
Progress (1): 204/226 kB
Progress (1): 208/226 kB
Progress (1): 212/226 kB
Progress (1): 216/226 kB
Progress (1): 220/226 kB
Progress (1): 224/226 kB
Progress (1): 226 kB    
                    
Downloaded from eclipse.maven.central.mirror: https://repo.eclipse.org/content/repositories/maven_central/org/codehaus/plexus/plexus-utils/3.0/plexus-utils-3.0.jar (226 kB at 4.3 MB/s)
[INFO] 
[INFO] --- tycho-source-plugin:1.3.0:plugin-source (attach-source) @ org.eclipse.ptp.master ---
[INFO] 
[INFO] --- maven-install-plugin:2.4:install (default-install) @ org.eclipse.ptp.master ---
Downloading from eclipse.maven.central.mirror: https://repo.eclipse.org/content/repositories/maven_central/org/apache/maven/maven-project/2.0.6/maven-project-2.0.6.pom
Progress (1): 2.6 kB
                    
Downloaded from eclipse.maven.central.mirror: https://repo.eclipse.org/content/repositories/maven_central/org/apache/maven/maven-project/2.0.6/maven-project-2.0.6.pom (2.6 kB at 132 kB/s)
Downloading from eclipse.maven.central.mirror: https://repo.eclipse.org/content/repositories/maven_central/org/apache/maven/maven-settings/2.0.6/maven-settings-2.0.6.pom
Progress (1): 2.0 kB
                    
Downloaded from eclipse.maven.central.mirror: https://repo.eclipse.org/content/repositories/maven_central/org/apache/maven/maven-settings/2.0.6/maven-settings-2.0.6.pom (2.0 kB at 105 kB/s)
Downloading from eclipse.maven.central.mirror: https://repo.eclipse.org/content/repositories/maven_central/org/apache/maven/maven-model/2.0.6/maven-model-2.0.6.pom
Progress (1): 3.0 kB
                    
Downloaded from eclipse.maven.central.mirror: https://repo.eclipse.org/content/repositories/maven_central/org/apache/maven/maven-model/2.0.6/maven-model-2.0.6.pom (3.0 kB at 190 kB/s)
Downloading from eclipse.maven.central.mirror: https://repo.eclipse.org/content/repositories/maven_central/org/codehaus/plexus/plexus-utils/1.4.1/plexus-utils-1.4.1.pom
Progress (1): 1.9 kB
                    
Downloaded from eclipse.maven.central.mirror: https://repo.eclipse.org/content/repositories/maven_central/org/codehaus/plexus/plexus-utils/1.4.1/plexus-utils-1.4.1.pom (1.9 kB at 119 kB/s)
Downloading from eclipse.maven.central.mirror: https://repo.eclipse.org/content/repositories/maven_central/org/codehaus/plexus/plexus/1.0.11/plexus-1.0.11.pom
Progress (1): 4.1/9.0 kB
Progress (1): 7.7/9.0 kB
Progress (1): 9.0 kB    
                    
Downloaded from eclipse.maven.central.mirror: https://repo.eclipse.org/content/repositories/maven_central/org/codehaus/plexus/plexus/1.0.11/plexus-1.0.11.pom (9.0 kB at 561 kB/s)
Downloading from eclipse.maven.central.mirror: https://repo.eclipse.org/content/repositories/maven_central/org/codehaus/plexus/plexus-container-default/1.0-alpha-9-stable-1/plexus-container-default-1.0-alpha-9-stable-1.pom
Progress (1): 3.9 kB
                    
Downloaded from eclipse.maven.central.mirror: https://repo.eclipse.org/content/repositories/maven_central/org/codehaus/plexus/plexus-container-default/1.0-alpha-9-stable-1/plexus-container-default-1.0-alpha-9-stable-1.pom (3.9 kB at 232 kB/s)
Downloading from eclipse.maven.central.mirror: https://repo.eclipse.org/content/repositories/maven_central/org/codehaus/plexus/plexus-containers/1.0.3/plexus-containers-1.0.3.pom
Progress (1): 492 B
                   
Downloaded from eclipse.maven.central.mirror: https://repo.eclipse.org/content/repositories/maven_central/org/codehaus/plexus/plexus-containers/1.0.3/plexus-containers-1.0.3.pom (492 B at 29 kB/s)
Downloading from eclipse.maven.central.mirror: https://repo.eclipse.org/content/repositories/maven_central/org/codehaus/plexus/plexus/1.0.4/plexus-1.0.4.pom
Progress (1): 4.1/5.7 kB
Progress (1): 5.7 kB    
                    
Downloaded from eclipse.maven.central.mirror: https://repo.eclipse.org/content/repositories/maven_central/org/codehaus/plexus/plexus/1.0.4/plexus-1.0.4.pom (5.7 kB at 359 kB/s)
Downloading from eclipse.maven.central.mirror: https://repo.eclipse.org/content/repositories/maven_central/junit/junit/3.8.1/junit-3.8.1.pom
Progress (1): 998 B
                   
Downloaded from eclipse.maven.central.mirror: https://repo.eclipse.org/content/repositories/maven_central/junit/junit/3.8.1/junit-3.8.1.pom (998 B at 62 kB/s)
Downloading from eclipse.maven.central.mirror: https://repo.eclipse.org/content/repositories/maven_central/org/codehaus/plexus/plexus-utils/1.0.4/plexus-utils-1.0.4.pom
Progress (1): 4.1/6.9 kB
Progress (1): 6.9 kB    
                    
Downloaded from eclipse.maven.central.mirror: https://repo.eclipse.org/content/repositories/maven_central/org/codehaus/plexus/plexus-utils/1.0.4/plexus-utils-1.0.4.pom (6.9 kB at 457 kB/s)
Downloading from eclipse.maven.central.mirror: https://repo.eclipse.org/content/repositories/maven_central/classworlds/classworlds/1.1-alpha-2/classworlds-1.1-alpha-2.pom
Progress (1): 3.1 kB
                    
Downloaded from eclipse.maven.central.mirror: https://repo.eclipse.org/content/repositories/maven_central/classworlds/classworlds/1.1-alpha-2/classworlds-1.1-alpha-2.pom (3.1 kB at 184 kB/s)
Downloading from eclipse.maven.central.mirror: https://repo.eclipse.org/content/repositories/maven_central/org/apache/maven/maven-profile/2.0.6/maven-profile-2.0.6.pom
Progress (1): 2.0 kB
                    
Downloaded from eclipse.maven.central.mirror: https://repo.eclipse.org/content/repositories/maven_central/org/apache/maven/maven-profile/2.0.6/maven-profile-2.0.6.pom (2.0 kB at 124 kB/s)
Downloading from eclipse.maven.central.mirror: https://repo.eclipse.org/content/repositories/maven_central/org/apache/maven/maven-artifact-manager/2.0.6/maven-artifact-manager-2.0.6.pom
Progress (1): 2.6 kB
                    
Downloaded from eclipse.maven.central.mirror: https://repo.eclipse.org/content/repositories/maven_central/org/apache/maven/maven-artifact-manager/2.0.6/maven-artifact-manager-2.0.6.pom (2.6 kB at 146 kB/s)
Downloading from eclipse.maven.central.mirror: https://repo.eclipse.org/content/repositories/maven_central/org/apache/maven/maven-repository-metadata/2.0.6/maven-repository-metadata-2.0.6.pom
Progress (1): 1.9 kB
                    
Downloaded from eclipse.maven.central.mirror: https://repo.eclipse.org/content/repositories/maven_central/org/apache/maven/maven-repository-metadata/2.0.6/maven-repository-metadata-2.0.6.pom (1.9 kB at 116 kB/s)
Downloading from eclipse.maven.central.mirror: https://repo.eclipse.org/content/repositories/maven_central/org/apache/maven/maven-artifact/2.0.6/maven-artifact-2.0.6.pom
Progress (1): 1.6 kB
                    
Downloaded from eclipse.maven.central.mirror: https://repo.eclipse.org/content/repositories/maven_central/org/apache/maven/maven-artifact/2.0.6/maven-artifact-2.0.6.pom (1.6 kB at 99 kB/s)
Downloading from eclipse.maven.central.mirror: https://repo.eclipse.org/content/repositories/maven_central/org/apache/maven/maven-plugin-registry/2.0.6/maven-plugin-registry-2.0.6.pom
Progress (1): 1.9 kB
                    
Downloaded from eclipse.maven.central.mirror: https://repo.eclipse.org/content/repositories/maven_central/org/apache/maven/maven-plugin-registry/2.0.6/maven-plugin-registry-2.0.6.pom (1.9 kB at 122 kB/s)
Downloading from eclipse.maven.central.mirror: https://repo.eclipse.org/content/repositories/maven_central/org/codehaus/plexus/plexus-utils/3.0.5/plexus-utils-3.0.5.pom
Progress (1): 2.5 kB
                    
Downloaded from eclipse.maven.central.mirror: https://repo.eclipse.org/content/repositories/maven_central/org/codehaus/plexus/plexus-utils/3.0.5/plexus-utils-3.0.5.pom (2.5 kB at 167 kB/s)
Downloading from eclipse.maven.central.mirror: https://repo.eclipse.org/content/repositories/maven_central/org/codehaus/plexus/plexus/3.1/plexus-3.1.pom
Progress (1): 4.1/19 kB
Progress (1): 7.7/19 kB
Progress (1): 12/19 kB 
Progress (1): 16/19 kB
Progress (1): 19 kB   
                   
Downloaded from eclipse.maven.central.mirror: https://repo.eclipse.org/content/repositories/maven_central/org/codehaus/plexus/plexus/3.1/plexus-3.1.pom (19 kB at 1.1 MB/s)
Downloading from eclipse.maven.central.mirror: https://repo.eclipse.org/content/repositories/maven_central/org/codehaus/plexus/plexus-digest/1.0/plexus-digest-1.0.pom
Progress (1): 1.1 kB
                    
Downloaded from eclipse.maven.central.mirror: https://repo.eclipse.org/content/repositories/maven_central/org/codehaus/plexus/plexus-digest/1.0/plexus-digest-1.0.pom (1.1 kB at 66 kB/s)
Downloading from eclipse.maven.central.mirror: https://repo.eclipse.org/content/repositories/maven_central/org/codehaus/plexus/plexus-components/1.1.7/plexus-components-1.1.7.pom
Progress (1): 4.1/5.0 kB
Progress (1): 5.0 kB    
                    
Downloaded from eclipse.maven.central.mirror: https://repo.eclipse.org/content/repositories/maven_central/org/codehaus/plexus/plexus-components/1.1.7/plexus-components-1.1.7.pom (5.0 kB at 311 kB/s)
Downloading from eclipse.maven.central.mirror: https://repo.eclipse.org/content/repositories/maven_central/org/codehaus/plexus/plexus/1.0.8/plexus-1.0.8.pom
Progress (1): 4.1/7.2 kB
Progress (1): 7.2 kB    
                    
Downloaded from eclipse.maven.central.mirror: https://repo.eclipse.org/content/repositories/maven_central/org/codehaus/plexus/plexus/1.0.8/plexus-1.0.8.pom (7.2 kB at 482 kB/s)
Downloading from eclipse.maven.central.mirror: https://repo.eclipse.org/content/repositories/maven_central/org/codehaus/plexus/plexus-container-default/1.0-alpha-8/plexus-container-default-1.0-alpha-8.pom
Progress (1): 4.1/7.3 kB
Progress (1): 7.3 kB    
                    
Downloaded from eclipse.maven.central.mirror: https://repo.eclipse.org/content/repositories/maven_central/org/codehaus/plexus/plexus-container-default/1.0-alpha-8/plexus-container-default-1.0-alpha-8.pom (7.3 kB at 484 kB/s)
Downloading from eclipse.maven.central.mirror: https://repo.eclipse.org/content/repositories/maven_central/org/apache/maven/maven-project/2.0.6/maven-project-2.0.6.jar
Downloading from eclipse.maven.central.mirror: https://repo.eclipse.org/content/repositories/maven_central/org/apache/maven/maven-settings/2.0.6/maven-settings-2.0.6.jar
Downloading from eclipse.maven.central.mirror: https://repo.eclipse.org/content/repositories/maven_central/org/apache/maven/maven-profile/2.0.6/maven-profile-2.0.6.jar
Downloading from eclipse.maven.central.mirror: https://repo.eclipse.org/content/repositories/maven_central/org/codehaus/plexus/plexus-container-default/1.0-alpha-9-stable-1/plexus-container-default-1.0-alpha-9-stable-1.jar
Downloading from eclipse.maven.central.mirror: https://repo.eclipse.org/content/repositories/maven_central/org/apache/maven/maven-plugin-registry/2.0.6/maven-plugin-registry-2.0.6.jar
Progress (1): 4.1/49 kB
Progress (1): 7.7/49 kB
Progress (1): 12/49 kB 
Progress (1): 16/49 kB
Progress (1): 20/49 kB
Progress (1): 24/49 kB
Progress (1): 28/49 kB
Progress (1): 32/49 kB
Progress (1): 33/49 kB
Progress (1): 37/49 kB
Progress (1): 41/49 kB
Progress (2): 41/49 kB | 4.1/116 kB
Progress (2): 45/49 kB | 4.1/116 kB
Progress (2): 45/49 kB | 7.7/116 kB
Progress (2): 49/49 kB | 7.7/116 kB
Progress (2): 49 kB | 7.7/116 kB   
Progress (2): 49 kB | 12/116 kB 
Progress (2): 49 kB | 16/116 kB
Progress (2): 49 kB | 20/116 kB
Progress (2): 49 kB | 24/116 kB
Progress (2): 49 kB | 28/116 kB
Progress (2): 49 kB | 32/116 kB
Progress (2): 49 kB | 33/116 kB
Progress (2): 49 kB | 37/116 kB
Progress (2): 49 kB | 41/116 kB
Progress (2): 49 kB | 45/116 kB
Progress (2): 49 kB | 49/116 kB
Progress (2): 49 kB | 53/116 kB
Progress (2): 49 kB | 57/116 kB
Progress (2): 49 kB | 61/116 kB
Progress (2): 49 kB | 65/116 kB
Progress (2): 49 kB | 66/116 kB
Progress (2): 49 kB | 70/116 kB
Progress (2): 49 kB | 74/116 kB
Progress (2): 49 kB | 78/116 kB
Progress (2): 49 kB | 82/116 kB
Progress (2): 49 kB | 86/116 kB
Progress (2): 49 kB | 90/116 kB
Progress (2): 49 kB | 94/116 kB
Progress (2): 49 kB | 98/116 kB
Progress (2): 49 kB | 98/116 kB
Progress (2): 49 kB | 102/116 kB
Progress (2): 49 kB | 106/116 kB
Progress (2): 49 kB | 110/116 kB
Progress (2): 49 kB | 114/116 kB
Progress (2): 49 kB | 116 kB    
Progress (3): 49 kB | 116 kB | 4.1/29 kB
Progress (3): 49 kB | 116 kB | 7.7/29 kB
Progress (3): 49 kB | 116 kB | 12/29 kB 
                                       
Downloaded from eclipse.maven.central.mirror: https://repo.eclipse.org/content/repositories/maven_central/org/apache/maven/maven-settings/2.0.6/maven-settings-2.0.6.jar (49 kB at 1.3 MB/s)
Progress (3): 116 kB | 12/29 kB | 4.1/194 kB
Progress (3): 116 kB | 16/29 kB | 4.1/194 kB
Progress (3): 116 kB | 16/29 kB | 7.7/194 kB
                                            
Downloading from eclipse.maven.central.mirror: https://repo.eclipse.org/content/repositories/maven_central/junit/junit/3.8.1/junit-3.8.1.jar
Progress (3): 116 kB | 20/29 kB | 7.7/194 kB
Progress (4): 116 kB | 20/29 kB | 7.7/194 kB | 4.1/35 kB
Progress (4): 116 kB | 24/29 kB | 7.7/194 kB | 4.1/35 kB
                                                        
Downloaded from eclipse.maven.central.mirror: https://repo.eclipse.org/content/repositories/maven_central/org/apache/maven/maven-project/2.0.6/maven-project-2.0.6.jar (116 kB at 3.0 MB/s)
Downloading from eclipse.maven.central.mirror: https://repo.eclipse.org/content/repositories/maven_central/classworlds/classworlds/1.1-alpha-2/classworlds-1.1-alpha-2.jar
Progress (3): 24/29 kB | 12/194 kB | 4.1/35 kB
Progress (3): 28/29 kB | 12/194 kB | 4.1/35 kB
Progress (3): 28/29 kB | 12/194 kB | 7.7/35 kB
Progress (3): 29 kB | 12/194 kB | 7.7/35 kB   
Progress (3): 29 kB | 16/194 kB | 7.7/35 kB
Progress (3): 29 kB | 16/194 kB | 12/35 kB 
Progress (3): 29 kB | 16/194 kB | 16/35 kB
Progress (3): 29 kB | 20/194 kB | 16/35 kB
Progress (3): 29 kB | 20/194 kB | 20/35 kB
Progress (3): 29 kB | 24/194 kB | 20/35 kB
Progress (3): 29 kB | 24/194 kB | 24/35 kB
Progress (3): 29 kB | 28/194 kB | 24/35 kB
Progress (3): 29 kB | 32/194 kB | 24/35 kB
Progress (3): 29 kB | 36/194 kB | 24/35 kB
Progress (3): 29 kB | 40/194 kB | 24/35 kB
Progress (3): 29 kB | 44/194 kB | 24/35 kB
Progress (3): 29 kB | 48/194 kB | 24/35 kB
Progress (3): 29 kB | 52/194 kB | 24/35 kB
Progress (3): 29 kB | 56/194 kB | 24/35 kB
Progress (3): 29 kB | 56/194 kB | 28/35 kB
Progress (3): 29 kB | 60/194 kB | 28/35 kB
Progress (3): 29 kB | 60/194 kB | 32/35 kB
Progress (3): 29 kB | 64/194 kB | 32/35 kB
Progress (3): 29 kB | 64/194 kB | 35 kB   
Progress (3): 29 kB | 66/194 kB | 35 kB
Progress (3): 29 kB | 70/194 kB | 35 kB
Progress (3): 29 kB | 74/194 kB | 35 kB
Progress (3): 29 kB | 78/194 kB | 35 kB
Progress (3): 29 kB | 82/194 kB | 35 kB
Progress (3): 29 kB | 86/194 kB | 35 kB
Progress (3): 29 kB | 90/194 kB | 35 kB
Progress (3): 29 kB | 94/194 kB | 35 kB
Progress (3): 29 kB | 98/194 kB | 35 kB
Progress (3): 29 kB | 102/194 kB | 35 kB
Progress (3): 29 kB | 106/194 kB | 35 kB
Progress (3): 29 kB | 110/194 kB | 35 kB
Progress (3): 29 kB | 114/194 kB | 35 kB
Progress (3): 29 kB | 118/194 kB | 35 kB
Progress (4): 29 kB | 118/194 kB | 35 kB | 4.1/38 kB
Progress (4): 29 kB | 122/194 kB | 35 kB | 4.1/38 kB
Progress (4): 29 kB | 122/194 kB | 35 kB | 7.7/38 kB
Progress (4): 29 kB | 126/194 kB | 35 kB | 7.7/38 kB
Progress (4): 29 kB | 126/194 kB | 35 kB | 12/38 kB 
Progress (4): 29 kB | 130/194 kB | 35 kB | 12/38 kB
Progress (4): 29 kB | 130/194 kB | 35 kB | 16/38 kB
Progress (4): 29 kB | 134/194 kB | 35 kB | 16/38 kB
Progress (4): 29 kB | 134/194 kB | 35 kB | 20/38 kB
Progress (4): 29 kB | 138/194 kB | 35 kB | 20/38 kB
Progress (4): 29 kB | 138/194 kB | 35 kB | 24/38 kB
Progress (4): 29 kB | 142/194 kB | 35 kB | 24/38 kB
Progress (4): 29 kB | 142/194 kB | 35 kB | 28/38 kB
                                                   
Downloaded from eclipse.maven.central.mirror: https://repo.eclipse.org/content/repositories/maven_central/org/apache/maven/maven-profile/2.0.6/maven-profile-2.0.6.jar (35 kB at 750 kB/s)
Progress (4): 29 kB | 142/194 kB | 28/38 kB | 4.1/121 kB
Progress (4): 29 kB | 142/194 kB | 32/38 kB | 4.1/121 kB
Progress (4): 29 kB | 142/194 kB | 32/38 kB | 7.7/121 kB
                                                        
Downloaded from eclipse.maven.central.mirror: https://repo.eclipse.org/content/repositories/maven_central/org/apache/maven/maven-plugin-registry/2.0.6/maven-plugin-registry-2.0.6.jar (29 kB at 603 kB/s)
Progress (3): 146/194 kB | 32/38 kB | 7.7/121 kB
                                                
Downloading from eclipse.maven.central.mirror: https://repo.eclipse.org/content/repositories/maven_central/org/apache/maven/maven-artifact-manager/2.0.6/maven-artifact-manager-2.0.6.jar
Progress (3): 146/194 kB | 32/38 kB | 12/121 kB
Progress (3): 146/194 kB | 36/38 kB | 12/121 kB
                                               
Downloading from eclipse.maven.central.mirror: https://repo.eclipse.org/content/repositories/maven_central/org/apache/maven/maven-model/2.0.6/maven-model-2.0.6.jar
Progress (3): 146/194 kB | 38 kB | 12/121 kB
Progress (3): 146/194 kB | 38 kB | 16/121 kB
Progress (3): 150/194 kB | 38 kB | 16/121 kB
Progress (3): 150/194 kB | 38 kB | 20/121 kB
Progress (3): 154/194 kB | 38 kB | 20/121 kB
Progress (3): 154/194 kB | 38 kB | 24/121 kB
Progress (3): 158/194 kB | 38 kB | 24/121 kB
Progress (3): 158/194 kB | 38 kB | 28/121 kB
Progress (3): 162/194 kB | 38 kB | 28/121 kB
Progress (3): 162/194 kB | 38 kB | 32/121 kB
Progress (3): 162/194 kB | 38 kB | 33/121 kB
Progress (3): 166/194 kB | 38 kB | 33/121 kB
Progress (3): 170/194 kB | 38 kB | 33/121 kB
Progress (3): 170/194 kB | 38 kB | 37/121 kB
Progress (3): 170/194 kB | 38 kB | 41/121 kB
Progress (3): 174/194 kB | 38 kB | 41/121 kB
Progress (3): 178/194 kB | 38 kB | 41/121 kB
Progress (3): 178/194 kB | 38 kB | 45/121 kB
Progress (3): 178/194 kB | 38 kB | 49/121 kB
Progress (3): 182/194 kB | 38 kB | 49/121 kB
Progress (3): 186/194 kB | 38 kB | 49/121 kB
Progress (3): 186/194 kB | 38 kB | 53/121 kB
Progress (3): 186/194 kB | 38 kB | 57/121 kB
Progress (3): 190/194 kB | 38 kB | 57/121 kB
Progress (3): 194/194 kB | 38 kB | 57/121 kB
Progress (3): 194/194 kB | 38 kB | 61/121 kB
Progress (3): 194 kB | 38 kB | 61/121 kB    
Progress (3): 194 kB | 38 kB | 65/121 kB
Progress (3): 194 kB | 38 kB | 66/121 kB
Progress (3): 194 kB | 38 kB | 70/121 kB
Progress (3): 194 kB | 38 kB | 74/121 kB
Progress (3): 194 kB | 38 kB | 78/121 kB
Progress (3): 194 kB | 38 kB | 82/121 kB
Progress (3): 194 kB | 38 kB | 86/121 kB
Progress (3): 194 kB | 38 kB | 90/121 kB
Progress (3): 194 kB | 38 kB | 94/121 kB
Progress (3): 194 kB | 38 kB | 98/121 kB
Progress (3): 194 kB | 38 kB | 102/121 kB
Progress (3): 194 kB | 38 kB | 106/121 kB
Progress (3): 194 kB | 38 kB | 110/121 kB
Progress (3): 194 kB | 38 kB | 114/121 kB
Progress (3): 194 kB | 38 kB | 118/121 kB
Progress (3): 194 kB | 38 kB | 121 kB    
                                     
Downloaded from eclipse.maven.central.mirror: https://repo.eclipse.org/content/repositories/maven_central/classworlds/classworlds/1.1-alpha-2/classworlds-1.1-alpha-2.jar (38 kB at 682 kB/s)
Downloading from eclipse.maven.central.mirror: https://repo.eclipse.org/content/repositories/maven_central/org/apache/maven/maven-repository-metadata/2.0.6/maven-repository-metadata-2.0.6.jar
Downloaded from eclipse.maven.central.mirror: https://repo.eclipse.org/content/repositories/maven_central/org/codehaus/plexus/plexus-container-default/1.0-alpha-9-stable-1/plexus-container-default-1.0-alpha-9-stable-1.jar (194 kB at 3.3 MB/s)
Downloading from eclipse.maven.central.mirror: https://repo.eclipse.org/content/repositories/maven_central/org/apache/maven/maven-artifact/2.0.6/maven-artifact-2.0.6.jar
Progress (2): 121 kB | 4.1/86 kB
Progress (2): 121 kB | 7.7/86 kB
Progress (2): 121 kB | 12/86 kB 
Progress (2): 121 kB | 16/86 kB
Progress (3): 121 kB | 16/86 kB | 4.1/57 kB
Progress (3): 121 kB | 20/86 kB | 4.1/57 kB
Progress (3): 121 kB | 20/86 kB | 7.7/57 kB
Progress (3): 121 kB | 24/86 kB | 7.7/57 kB
Progress (3): 121 kB | 24/86 kB | 12/57 kB 
Progress (3): 121 kB | 28/86 kB | 12/57 kB
Progress (3): 121 kB | 28/86 kB | 16/57 kB
Progress (3): 121 kB | 32/86 kB | 16/57 kB
Progress (3): 121 kB | 33/86 kB | 16/57 kB
Progress (3): 121 kB | 33/86 kB | 20/57 kB
Progress (3): 121 kB | 33/86 kB | 24/57 kB
Progress (3): 121 kB | 37/86 kB | 24/57 kB
Progress (3): 121 kB | 41/86 kB | 24/57 kB
Progress (3): 121 kB | 41/86 kB | 28/57 kB
Progress (3): 121 kB | 41/86 kB | 32/57 kB
Progress (3): 121 kB | 45/86 kB | 32/57 kB
Progress (3): 121 kB | 45/86 kB | 36/57 kB
Progress (3): 121 kB | 49/86 kB | 36/57 kB
Progress (3): 121 kB | 49/86 kB | 40/57 kB
Progress (3): 121 kB | 53/86 kB | 40/57 kB
Progress (3): 121 kB | 53/86 kB | 44/57 kB
Progress (3): 121 kB | 57/86 kB | 44/57 kB
Progress (3): 121 kB | 57/86 kB | 48/57 kB
Progress (3): 121 kB | 61/86 kB | 48/57 kB
Progress (3): 121 kB | 61/86 kB | 52/57 kB
Progress (3): 121 kB | 65/86 kB | 52/57 kB
Progress (3): 121 kB | 65/86 kB | 56/57 kB
Progress (3): 121 kB | 65/86 kB | 57 kB   
Progress (3): 121 kB | 69/86 kB | 57 kB
Progress (3): 121 kB | 73/86 kB | 57 kB
                                       
Downloaded from eclipse.maven.central.mirror: https://repo.eclipse.org/content/repositories/maven_central/junit/junit/3.8.1/junit-3.8.1.jar (121 kB at 1.7 MB/s)
Progress (2): 77/86 kB | 57 kB
                              
Downloading from eclipse.maven.central.mirror: https://repo.eclipse.org/content/repositories/maven_central/org/codehaus/plexus/plexus-utils/3.0.5/plexus-utils-3.0.5.jar
Progress (2): 81/86 kB | 57 kB
Progress (3): 81/86 kB | 57 kB | 4.1/24 kB
Progress (3): 85/86 kB | 57 kB | 4.1/24 kB
Progress (4): 85/86 kB | 57 kB | 4.1/24 kB | 4.1/87 kB
Progress (4): 85/86 kB | 57 kB | 7.7/24 kB | 4.1/87 kB
Progress (4): 85/86 kB | 57 kB | 7.7/24 kB | 7.7/87 kB
Progress (4): 86 kB | 57 kB | 7.7/24 kB | 7.7/87 kB   
Progress (4): 86 kB | 57 kB | 12/24 kB | 7.7/87 kB 
Progress (4): 86 kB | 57 kB | 12/24 kB | 12/87 kB 
Progress (4): 86 kB | 57 kB | 16/24 kB | 12/87 kB
Progress (4): 86 kB | 57 kB | 16/24 kB | 16/87 kB
Progress (4): 86 kB | 57 kB | 20/24 kB | 16/87 kB
Progress (4): 86 kB | 57 kB | 20/24 kB | 20/87 kB
Progress (4): 86 kB | 57 kB | 24/24 kB | 20/87 kB
Progress (4): 86 kB | 57 kB | 24/24 kB | 24/87 kB
Progress (4): 86 kB | 57 kB | 24 kB | 24/87 kB   
Progress (4): 86 kB | 57 kB | 24 kB | 28/87 kB
Progress (4): 86 kB | 57 kB | 24 kB | 32/87 kB
Progress (4): 86 kB | 57 kB | 24 kB | 33/87 kB
Progress (4): 86 kB | 57 kB | 24 kB | 37/87 kB
Progress (4): 86 kB | 57 kB | 24 kB | 41/87 kB
Progress (4): 86 kB | 57 kB | 24 kB | 45/87 kB
Progress (4): 86 kB | 57 kB | 24 kB | 49/87 kB
Progress (4): 86 kB | 57 kB | 24 kB | 53/87 kB
Progress (4): 86 kB | 57 kB | 24 kB | 57/87 kB
Progress (4): 86 kB | 57 kB | 24 kB | 61/87 kB
Progress (4): 86 kB | 57 kB | 24 kB | 65/87 kB
Progress (4): 86 kB | 57 kB | 24 kB | 69/87 kB
Progress (4): 86 kB | 57 kB | 24 kB | 73/87 kB
Progress (4): 86 kB | 57 kB | 24 kB | 77/87 kB
Progress (4): 86 kB | 57 kB | 24 kB | 81/87 kB
Progress (4): 86 kB | 57 kB | 24 kB | 85/87 kB
Progress (4): 86 kB | 57 kB | 24 kB | 87 kB   
                                           
Downloaded from eclipse.maven.central.mirror: https://repo.eclipse.org/content/repositories/maven_central/org/apache/maven/maven-artifact-manager/2.0.6/maven-artifact-manager-2.0.6.jar (57 kB at 744 kB/s)
Downloading from eclipse.maven.central.mirror: https://repo.eclipse.org/content/repositories/maven_central/org/codehaus/plexus/plexus-digest/1.0/plexus-digest-1.0.jar
Downloaded from eclipse.maven.central.mirror: https://repo.eclipse.org/content/repositories/maven_central/org/apache/maven/maven-model/2.0.6/maven-model-2.0.6.jar (86 kB at 1.1 MB/s)
Downloaded from eclipse.maven.central.mirror: https://repo.eclipse.org/content/repositories/maven_central/org/apache/maven/maven-repository-metadata/2.0.6/maven-repository-metadata-2.0.6.jar (24 kB at 314 kB/s)
Progress (2): 87 kB | 4.1/230 kB
Progress (2): 87 kB | 7.7/230 kB
Progress (2): 87 kB | 12/230 kB 
Progress (2): 87 kB | 16/230 kB
Progress (2): 87 kB | 20/230 kB
Progress (2): 87 kB | 24/230 kB
Progress (2): 87 kB | 28/230 kB
Progress (2): 87 kB | 32/230 kB
Progress (2): 87 kB | 33/230 kB
                               
Downloaded from eclipse.maven.central.mirror: https://repo.eclipse.org/content/repositories/maven_central/org/apache/maven/maven-artifact/2.0.6/maven-artifact-2.0.6.jar (87 kB at 1.1 MB/s)
Progress (1): 37/230 kB
Progress (1): 41/230 kB
Progress (1): 45/230 kB
Progress (1): 49/230 kB
Progress (2): 49/230 kB | 4.1/12 kB
Progress (2): 53/230 kB | 4.1/12 kB
Progress (2): 53/230 kB | 7.7/12 kB
Progress (2): 57/230 kB | 7.7/12 kB
Progress (2): 57/230 kB | 12/12 kB 
Progress (2): 57/230 kB | 12 kB   
Progress (2): 61/230 kB | 12 kB
Progress (2): 65/230 kB | 12 kB
Progress (2): 66/230 kB | 12 kB
Progress (2): 70/230 kB | 12 kB
Progress (2): 74/230 kB | 12 kB
Progress (2): 78/230 kB | 12 kB
Progress (2): 82/230 kB | 12 kB
Progress (2): 86/230 kB | 12 kB
Progress (2): 90/230 kB | 12 kB
Progress (2): 94/230 kB | 12 kB
Progress (2): 98/230 kB | 12 kB
Progress (2): 102/230 kB | 12 kB
Progress (2): 106/230 kB | 12 kB
Progress (2): 110/230 kB | 12 kB
Progress (2): 114/230 kB | 12 kB
Progress (2): 118/230 kB | 12 kB
Progress (2): 122/230 kB | 12 kB
Progress (2): 126/230 kB | 12 kB
Progress (2): 130/230 kB | 12 kB
Progress (2): 134/230 kB | 12 kB
Progress (2): 138/230 kB | 12 kB
Progress (2): 142/230 kB | 12 kB
Progress (2): 146/230 kB | 12 kB
Progress (2): 150/230 kB | 12 kB
Progress (2): 154/230 kB | 12 kB
                                
Downloaded from eclipse.maven.central.mirror: https://repo.eclipse.org/content/repositories/maven_central/org/codehaus/plexus/plexus-digest/1.0/plexus-digest-1.0.jar (12 kB at 136 kB/s)
Progress (1): 158/230 kB
Progress (1): 162/230 kB
Progress (1): 166/230 kB
Progress (1): 170/230 kB
Progress (1): 174/230 kB
Progress (1): 178/230 kB
Progress (1): 182/230 kB
Progress (1): 186/230 kB
Progress (1): 190/230 kB
Progress (1): 194/230 kB
Progress (1): 198/230 kB
Progress (1): 202/230 kB
Progress (1): 206/230 kB
Progress (1): 210/230 kB
Progress (1): 214/230 kB
Progress (1): 218/230 kB
Progress (1): 222/230 kB
Progress (1): 226/230 kB
Progress (1): 230/230 kB
Progress (1): 230 kB    
                    
Downloaded from eclipse.maven.central.mirror: https://repo.eclipse.org/content/repositories/maven_central/org/codehaus/plexus/plexus-utils/3.0.5/plexus-utils-3.0.5.jar (230 kB at 2.4 MB/s)
[INFO] Installing /jobs/genie.ptp/ptp-verify-packages/workspace/pom.xml to /home/hudson/genie.ptp/.jenkins/jobs/ptp-verify-packages/workspace/.repository/org/eclipse/ptp/master/org.eclipse.ptp.master/9.2.1-SNAPSHOT/org.eclipse.ptp.master-9.2.1-SNAPSHOT.pom
[INFO] 
[INFO] ---------< org.eclipse.ptp.master:org.eclipse.ptp.rcp.sysmon >----------
[INFO] Building org.eclipse.ptp.rcp.sysmon 1.0.0-SNAPSHOT                 [2/6]
[INFO] ---------------------------[ eclipse-plugin ]---------------------------
[INFO] 
[INFO] --- maven-clean-plugin:2.5:clean (default-clean) @ org.eclipse.ptp.rcp.sysmon ---
[INFO] 
[INFO] --- tycho-packaging-plugin:1.3.0:build-qualifier (default-build-qualifier) @ org.eclipse.ptp.rcp.sysmon ---
[INFO] The project's OSGi version is 1.0.0.201902251846
[INFO] 
[INFO] --- tycho-packaging-plugin:1.3.0:validate-id (default-validate-id) @ org.eclipse.ptp.rcp.sysmon ---
[INFO] 
[INFO] --- tycho-packaging-plugin:1.3.0:validate-version (default-validate-version) @ org.eclipse.ptp.rcp.sysmon ---
[INFO] 
[INFO] --- maven-resources-plugin:2.4.1:resources (default-resources) @ org.eclipse.ptp.rcp.sysmon ---
Downloading from eclipse.maven.central.mirror: https://repo.eclipse.org/content/repositories/maven_central/org/codehaus/plexus/plexus-utils/1.5.15/plexus-utils-1.5.15.pom
Progress (1): 4.1/6.8 kB
Progress (1): 6.8 kB    
                    
Downloaded from eclipse.maven.central.mirror: https://repo.eclipse.org/content/repositories/maven_central/org/codehaus/plexus/plexus-utils/1.5.15/plexus-utils-1.5.15.pom (6.8 kB at 380 kB/s)
Downloading from eclipse.maven.central.mirror: https://repo.eclipse.org/content/repositories/maven_central/org/codehaus/plexus/plexus/2.0.2/plexus-2.0.2.pom
Progress (1): 4.1/12 kB
Progress (1): 7.7/12 kB
Progress (1): 12 kB    
                   
Downloaded from eclipse.maven.central.mirror: https://repo.eclipse.org/content/repositories/maven_central/org/codehaus/plexus/plexus/2.0.2/plexus-2.0.2.pom (12 kB at 683 kB/s)
Downloading from eclipse.maven.central.mirror: https://repo.eclipse.org/content/repositories/maven_central/org/apache/maven/shared/maven-filtering/1.0-beta-3/maven-filtering-1.0-beta-3.pom
Progress (1): 4.1/5.5 kB
Progress (1): 5.5 kB    
                    
Downloaded from eclipse.maven.central.mirror: https://repo.eclipse.org/content/repositories/maven_central/org/apache/maven/shared/maven-filtering/1.0-beta-3/maven-filtering-1.0-beta-3.pom (5.5 kB at 324 kB/s)
Downloading from eclipse.maven.central.mirror: https://repo.eclipse.org/content/repositories/maven_central/org/apache/maven/shared/maven-shared-components/11/maven-shared-components-11.pom
Progress (1): 4.1/8.3 kB
Progress (1): 7.7/8.3 kB
Progress (1): 8.3 kB    
                    
Downloaded from eclipse.maven.central.mirror: https://repo.eclipse.org/content/repositories/maven_central/org/apache/maven/shared/maven-shared-components/11/maven-shared-components-11.pom (8.3 kB at 491 kB/s)
Downloading from eclipse.maven.central.mirror: https://repo.eclipse.org/content/repositories/maven_central/org/apache/maven/maven-core/2.0.6/maven-core-2.0.6.pom
Progress (1): 4.1/6.7 kB
Progress (1): 6.7 kB    
                    
Downloaded from eclipse.maven.central.mirror: https://repo.eclipse.org/content/repositories/maven_central/org/apache/maven/maven-core/2.0.6/maven-core-2.0.6.pom (6.7 kB at 373 kB/s)
Downloading from eclipse.maven.central.mirror: https://repo.eclipse.org/content/repositories/maven_central/org/apache/maven/maven-plugin-parameter-documenter/2.0.6/maven-plugin-parameter-documenter-2.0.6.pom
Progress (1): 1.9 kB
                    
Downloaded from eclipse.maven.central.mirror: https://repo.eclipse.org/content/repositories/maven_central/org/apache/maven/maven-plugin-parameter-documenter/2.0.6/maven-plugin-parameter-documenter-2.0.6.pom (1.9 kB at 112 kB/s)
Downloading from eclipse.maven.central.mirror: https://repo.eclipse.org/content/repositories/maven_central/org/apache/maven/reporting/maven-reporting-api/2.0.6/maven-reporting-api-2.0.6.pom
Progress (1): 1.8 kB
                    
Downloaded from eclipse.maven.central.mirror: https://repo.eclipse.org/content/repositories/maven_central/org/apache/maven/reporting/maven-reporting-api/2.0.6/maven-reporting-api-2.0.6.pom (1.8 kB at 97 kB/s)
Downloading from eclipse.maven.central.mirror: https://repo.eclipse.org/content/repositories/maven_central/org/apache/maven/reporting/maven-reporting/2.0.6/maven-reporting-2.0.6.pom
Progress (1): 1.4 kB
                    
Downloaded from eclipse.maven.central.mirror: https://repo.eclipse.org/content/repositories/maven_central/org/apache/maven/reporting/maven-reporting/2.0.6/maven-reporting-2.0.6.pom (1.4 kB at 72 kB/s)
Downloading from eclipse.maven.central.mirror: https://repo.eclipse.org/content/repositories/maven_central/org/apache/maven/doxia/doxia-sink-api/1.0-alpha-7/doxia-sink-api-1.0-alpha-7.pom
Progress (1): 424 B
                   
Downloaded from eclipse.maven.central.mirror: https://repo.eclipse.org/content/repositories/maven_central/org/apache/maven/doxia/doxia-sink-api/1.0-alpha-7/doxia-sink-api-1.0-alpha-7.pom (424 B at 25 kB/s)
Downloading from eclipse.maven.central.mirror: https://repo.eclipse.org/content/repositories/maven_central/org/apache/maven/doxia/doxia/1.0-alpha-7/doxia-1.0-alpha-7.pom
Progress (1): 3.9 kB
                    
Downloaded from eclipse.maven.central.mirror: https://repo.eclipse.org/content/repositories/maven_central/org/apache/maven/doxia/doxia/1.0-alpha-7/doxia-1.0-alpha-7.pom (3.9 kB at 261 kB/s)
Downloading from eclipse.maven.central.mirror: https://repo.eclipse.org/content/repositories/maven_central/org/apache/maven/maven-error-diagnostics/2.0.6/maven-error-diagnostics-2.0.6.pom
Progress (1): 1.7 kB
                    
Downloaded from eclipse.maven.central.mirror: https://repo.eclipse.org/content/repositories/maven_central/org/apache/maven/maven-error-diagnostics/2.0.6/maven-error-diagnostics-2.0.6.pom (1.7 kB at 100 kB/s)
Downloading from eclipse.maven.central.mirror: https://repo.eclipse.org/content/repositories/maven_central/commons-cli/commons-cli/1.0/commons-cli-1.0.pom
Progress (1): 2.1 kB
                    
Downloaded from eclipse.maven.central.mirror: https://repo.eclipse.org/content/repositories/maven_central/commons-cli/commons-cli/1.0/commons-cli-1.0.pom (2.1 kB at 9.2 kB/s)
Downloading from eclipse.maven.central.mirror: https://repo.eclipse.org/content/repositories/maven_central/org/apache/maven/maven-plugin-descriptor/2.0.6/maven-plugin-descriptor-2.0.6.pom
Progress (1): 2.0 kB
                    
Downloaded from eclipse.maven.central.mirror: https://repo.eclipse.org/content/repositories/maven_central/org/apache/maven/maven-plugin-descriptor/2.0.6/maven-plugin-descriptor-2.0.6.pom (2.0 kB at 119 kB/s)
Downloading from eclipse.maven.central.mirror: https://repo.eclipse.org/content/repositories/maven_central/org/codehaus/plexus/plexus-interactivity-api/1.0-alpha-4/plexus-interactivity-api-1.0-alpha-4.pom
Progress (1): 4.1/7.1 kB
Progress (1): 7.1 kB    
                    
Downloaded from eclipse.maven.central.mirror: https://repo.eclipse.org/content/repositories/maven_central/org/codehaus/plexus/plexus-interactivity-api/1.0-alpha-4/plexus-interactivity-api-1.0-alpha-4.pom (7.1 kB at 417 kB/s)
Downloading from eclipse.maven.central.mirror: https://repo.eclipse.org/content/repositories/maven_central/org/apache/maven/maven-monitor/2.0.6/maven-monitor-2.0.6.pom
Progress (1): 1.3 kB
                    
Downloaded from eclipse.maven.central.mirror: https://repo.eclipse.org/content/repositories/maven_central/org/apache/maven/maven-monitor/2.0.6/maven-monitor-2.0.6.pom (1.3 kB at 66 kB/s)
Downloading from eclipse.maven.central.mirror: https://repo.eclipse.org/content/repositories/maven_central/classworlds/classworlds/1.1/classworlds-1.1.pom
Progress (1): 3.3 kB
                    
Downloaded from eclipse.maven.central.mirror: https://repo.eclipse.org/content/repositories/maven_central/classworlds/classworlds/1.1/classworlds-1.1.pom (3.3 kB at 185 kB/s)
Downloading from eclipse.maven.central.mirror: https://repo.eclipse.org/content/repositories/maven_central/org/codehaus/plexus/plexus-interpolation/1.12/plexus-interpolation-1.12.pom
Progress (1): 889 B
                   
Downloaded from eclipse.maven.central.mirror: https://repo.eclipse.org/content/repositories/maven_central/org/codehaus/plexus/plexus-interpolation/1.12/plexus-interpolation-1.12.pom (889 B at 49 kB/s)
Downloading from eclipse.maven.central.mirror: https://repo.eclipse.org/content/repositories/maven_central/org/codehaus/plexus/plexus-components/1.1.14/plexus-components-1.1.14.pom
Progress (1): 4.1/5.8 kB
Progress (1): 5.8 kB    
                    
Downloaded from eclipse.maven.central.mirror: https://repo.eclipse.org/content/repositories/maven_central/org/codehaus/plexus/plexus-components/1.1.14/plexus-components-1.1.14.pom (5.8 kB at 344 kB/s)
Downloading from eclipse.maven.central.mirror: https://repo.eclipse.org/content/repositories/maven_central/org/sonatype/plexus/plexus-build-api/0.0.4/plexus-build-api-0.0.4.pom
Progress (1): 2.9 kB
                    
Downloaded from eclipse.maven.central.mirror: https://repo.eclipse.org/content/repositories/maven_central/org/sonatype/plexus/plexus-build-api/0.0.4/plexus-build-api-0.0.4.pom (2.9 kB at 168 kB/s)
Downloading from eclipse.maven.central.mirror: https://repo.eclipse.org/content/repositories/maven_central/org/sonatype/spice/spice-parent/10/spice-parent-10.pom
Progress (1): 3.0 kB
                    
Downloaded from eclipse.maven.central.mirror: https://repo.eclipse.org/content/repositories/maven_central/org/sonatype/spice/spice-parent/10/spice-parent-10.pom (3.0 kB at 188 kB/s)
Downloading from eclipse.maven.central.mirror: https://repo.eclipse.org/content/repositories/maven_central/org/sonatype/forge/forge-parent/3/forge-parent-3.pom
Progress (1): 4.1/5.0 kB
Progress (1): 5.0 kB    
                    
Downloaded from eclipse.maven.central.mirror: https://repo.eclipse.org/content/repositories/maven_central/org/sonatype/forge/forge-parent/3/forge-parent-3.pom (5.0 kB at 296 kB/s)
Downloading from eclipse.maven.central.mirror: https://repo.eclipse.org/content/repositories/maven_central/org/codehaus/plexus/plexus-utils/1.5.8/plexus-utils-1.5.8.pom
Progress (1): 4.1/8.1 kB
Progress (1): 7.7/8.1 kB
Progress (1): 8.1 kB    
                    
Downloaded from eclipse.maven.central.mirror: https://repo.eclipse.org/content/repositories/maven_central/org/codehaus/plexus/plexus-utils/1.5.8/plexus-utils-1.5.8.pom (8.1 kB at 448 kB/s)
Downloading from eclipse.maven.central.mirror: https://repo.eclipse.org/content/repositories/maven_central/org/codehaus/plexus/plexus-interpolation/1.13/plexus-interpolation-1.13.pom
Progress (1): 890 B
                   
Downloaded from eclipse.maven.central.mirror: https://repo.eclipse.org/content/repositories/maven_central/org/codehaus/plexus/plexus-interpolation/1.13/plexus-interpolation-1.13.pom (890 B at 56 kB/s)
Downloading from eclipse.maven.central.mirror: https://repo.eclipse.org/content/repositories/maven_central/org/codehaus/plexus/plexus-components/1.1.15/plexus-components-1.1.15.pom
Progress (1): 2.8 kB
                    
Downloaded from eclipse.maven.central.mirror: https://repo.eclipse.org/content/repositories/maven_central/org/codehaus/plexus/plexus-components/1.1.15/plexus-components-1.1.15.pom (2.8 kB at 203 kB/s)
Downloading from eclipse.maven.central.mirror: https://repo.eclipse.org/content/repositories/maven_central/org/codehaus/plexus/plexus/2.0.3/plexus-2.0.3.pom
Progress (1): 4.1/15 kB
Progress (1): 7.7/15 kB
Progress (1): 12/15 kB 
Progress (1): 15 kB   
                   
Downloaded from eclipse.maven.central.mirror: https://repo.eclipse.org/content/repositories/maven_central/org/codehaus/plexus/plexus/2.0.3/plexus-2.0.3.pom (15 kB at 966 kB/s)
Downloading from eclipse.maven.central.mirror: https://repo.eclipse.org/content/repositories/maven_central/org/codehaus/plexus/plexus-utils/1.5.15/plexus-utils-1.5.15.jar
Downloading from eclipse.maven.central.mirror: https://repo.eclipse.org/content/repositories/maven_central/org/apache/maven/maven-core/2.0.6/maven-core-2.0.6.jar
Downloading from eclipse.maven.central.mirror: https://repo.eclipse.org/content/repositories/maven_central/org/apache/maven/shared/maven-filtering/1.0-beta-3/maven-filtering-1.0-beta-3.jar
Downloading from eclipse.maven.central.mirror: https://repo.eclipse.org/content/repositories/maven_central/org/apache/maven/reporting/maven-reporting-api/2.0.6/maven-reporting-api-2.0.6.jar
Downloading from eclipse.maven.central.mirror: https://repo.eclipse.org/content/repositories/maven_central/org/apache/maven/maven-plugin-parameter-documenter/2.0.6/maven-plugin-parameter-documenter-2.0.6.jar
Progress (1): 4.1/152 kB
Progress (1): 7.7/152 kB
Progress (1): 12/152 kB 
Progress (1): 16/152 kB
Progress (1): 20/152 kB
Progress (1): 24/152 kB
Progress (1): 28/152 kB
Progress (1): 32/152 kB
Progress (1): 33/152 kB
Progress (1): 37/152 kB
Progress (1): 41/152 kB
Progress (1): 45/152 kB
Progress (1): 49/152 kB
Progress (2): 49/152 kB | 4.1/228 kB
Progress (2): 53/152 kB | 4.1/228 kB
Progress (2): 53/152 kB | 7.7/228 kB
Progress (2): 57/152 kB | 7.7/228 kB
Progress (3): 57/152 kB | 7.7/228 kB | 4.1/9.9 kB
Progress (3): 61/152 kB | 7.7/228 kB | 4.1/9.9 kB
Progress (3): 61/152 kB | 7.7/228 kB | 7.7/9.9 kB
Progress (3): 65/152 kB | 7.7/228 kB | 7.7/9.9 kB
Progress (3): 65/152 kB | 7.7/228 kB | 9.9 kB    
Progress (3): 66/152 kB | 7.7/228 kB | 9.9 kB
Progress (3): 66/152 kB | 12/228 kB | 9.9 kB 
Progress (3): 70/152 kB | 12/228 kB | 9.9 kB
Progress (3): 70/152 kB | 16/228 kB | 9.9 kB
Progress (3): 74/152 kB | 16/228 kB | 9.9 kB
Progress (3): 74/152 kB | 20/228 kB | 9.9 kB
Progress (3): 78/152 kB | 20/228 kB | 9.9 kB
Progress (3): 78/152 kB | 24/228 kB | 9.9 kB
Progress (3): 82/152 kB | 24/228 kB | 9.9 kB
Progress (3): 86/152 kB | 24/228 kB | 9.9 kB
Progress (3): 86/152 kB | 28/228 kB | 9.9 kB
Progress (4): 86/152 kB | 28/228 kB | 9.9 kB | 4.1/34 kB
Progress (4): 90/152 kB | 28/228 kB | 9.9 kB | 4.1/34 kB
Progress (4): 90/152 kB | 32/228 kB | 9.9 kB | 4.1/34 kB
Progress (4): 94/152 kB | 32/228 kB | 9.9 kB | 4.1/34 kB
Progress (4): 94/152 kB | 33/228 kB | 9.9 kB | 4.1/34 kB
Progress (4): 94/152 kB | 33/228 kB | 9.9 kB | 7.7/34 kB
Progress (4): 98/152 kB | 33/228 kB | 9.9 kB | 7.7/34 kB
Progress (4): 98/152 kB | 37/228 kB | 9.9 kB | 7.7/34 kB
Progress (4): 98/152 kB | 37/228 kB | 9.9 kB | 7.7/34 kB
Progress (4): 98/152 kB | 37/228 kB | 9.9 kB | 12/34 kB 
Progress (4): 98/152 kB | 41/228 kB | 9.9 kB | 12/34 kB
Progress (4): 98/152 kB | 41/228 kB | 9.9 kB | 16/34 kB
Progress (4): 102/152 kB | 41/228 kB | 9.9 kB | 16/34 kB
Progress (4): 102/152 kB | 45/228 kB | 9.9 kB | 16/34 kB
Progress (5): 102/152 kB | 45/228 kB | 9.9 kB | 16/34 kB | 4.1/21 kB
Progress (5): 102/152 kB | 49/228 kB | 9.9 kB | 16/34 kB | 4.1/21 kB
Progress (5): 106/152 kB | 49/228 kB | 9.9 kB | 16/34 kB | 4.1/21 kB
Progress (5): 106/152 kB | 49/228 kB | 9.9 kB | 20/34 kB | 4.1/21 kB
Progress (5): 106/152 kB | 53/228 kB | 9.9 kB | 20/34 kB | 4.1/21 kB
Progress (5): 106/152 kB | 53/228 kB | 9.9 kB | 20/34 kB | 7.7/21 kB
Progress (5): 106/152 kB | 57/228 kB | 9.9 kB | 20/34 kB | 7.7/21 kB
Progress (5): 110/152 kB | 57/228 kB | 9.9 kB | 20/34 kB | 7.7/21 kB
Progress (5): 110/152 kB | 57/228 kB | 9.9 kB | 24/34 kB | 7.7/21 kB
Progress (5): 114/152 kB | 57/228 kB | 9.9 kB | 24/34 kB | 7.7/21 kB
Progress (5): 114/152 kB | 61/228 kB | 9.9 kB | 24/34 kB | 7.7/21 kB
Progress (5): 114/152 kB | 61/228 kB | 9.9 kB | 24/34 kB | 12/21 kB 
Progress (5): 114/152 kB | 65/228 kB | 9.9 kB | 24/34 kB | 12/21 kB
Progress (5): 118/152 kB | 65/228 kB | 9.9 kB | 24/34 kB | 12/21 kB
Progress (5): 118/152 kB | 65/228 kB | 9.9 kB | 28/34 kB | 12/21 kB
Progress (5): 122/152 kB | 65/228 kB | 9.9 kB | 28/34 kB | 12/21 kB
Progress (5): 122/152 kB | 66/228 kB | 9.9 kB | 28/34 kB | 12/21 kB
Progress (5): 122/152 kB | 66/228 kB | 9.9 kB | 28/34 kB | 16/21 kB
Progress (5): 126/152 kB | 66/228 kB | 9.9 kB | 28/34 kB | 16/21 kB
                                                                   
Downloaded from eclipse.maven.central.mirror: https://repo.eclipse.org/content/repositories/maven_central/org/apache/maven/reporting/maven-reporting-api/2.0.6/maven-reporting-api-2.0.6.jar (9.9 kB at 382 kB/s)
Progress (4): 126/152 kB | 66/228 kB | 32/34 kB | 16/21 kB
                                                          
Downloading from eclipse.maven.central.mirror: https://repo.eclipse.org/content/repositories/maven_central/org/apache/maven/doxia/doxia-sink-api/1.0-alpha-7/doxia-sink-api-1.0-alpha-7.jar
Progress (4): 130/152 kB | 66/228 kB | 32/34 kB | 16/21 kB
Progress (4): 130/152 kB | 66/228 kB | 32/34 kB | 20/21 kB
Progress (4): 130/152 kB | 70/228 kB | 32/34 kB | 20/21 kB
Progress (4): 134/152 kB | 70/228 kB | 32/34 kB | 20/21 kB
Progress (4): 134/152 kB | 70/228 kB | 32/34 kB | 21 kB   
Progress (4): 134/152 kB | 70/228 kB | 33/34 kB | 21 kB
Progress (4): 138/152 kB | 70/228 kB | 33/34 kB | 21 kB
Progress (4): 138/152 kB | 74/228 kB | 33/34 kB | 21 kB
Progress (4): 138/152 kB | 74/228 kB | 34 kB | 21 kB   
Progress (4): 142/152 kB | 74/228 kB | 34 kB | 21 kB
Progress (4): 142/152 kB | 78/228 kB | 34 kB | 21 kB
Progress (4): 146/152 kB | 78/228 kB | 34 kB | 21 kB
Progress (4): 146/152 kB | 82/228 kB | 34 kB | 21 kB
Progress (4): 150/152 kB | 82/228 kB | 34 kB | 21 kB
Progress (4): 152 kB | 82/228 kB | 34 kB | 21 kB    
Progress (4): 152 kB | 86/228 kB | 34 kB | 21 kB
Progress (4): 152 kB | 90/228 kB | 34 kB | 21 kB
Progress (4): 152 kB | 94/228 kB | 34 kB | 21 kB
Progress (4): 152 kB | 98/228 kB | 34 kB | 21 kB
Progress (4): 152 kB | 98/228 kB | 34 kB | 21 kB
Progress (4): 152 kB | 102/228 kB | 34 kB | 21 kB
Progress (4): 152 kB | 106/228 kB | 34 kB | 21 kB
Progress (4): 152 kB | 110/228 kB | 34 kB | 21 kB
Progress (4): 152 kB | 114/228 kB | 34 kB | 21 kB
Progress (4): 152 kB | 118/228 kB | 34 kB | 21 kB
Progress (4): 152 kB | 122/228 kB | 34 kB | 21 kB
Progress (4): 152 kB | 126/228 kB | 34 kB | 21 kB
Progress (4): 152 kB | 130/228 kB | 34 kB | 21 kB
Progress (4): 152 kB | 134/228 kB | 34 kB | 21 kB
Progress (4): 152 kB | 138/228 kB | 34 kB | 21 kB
Progress (4): 152 kB | 142/228 kB | 34 kB | 21 kB
Progress (4): 152 kB | 146/228 kB | 34 kB | 21 kB
Progress (4): 152 kB | 150/228 kB | 34 kB | 21 kB
Progress (4): 152 kB | 154/228 kB | 34 kB | 21 kB
Progress (4): 152 kB | 158/228 kB | 34 kB | 21 kB
Progress (4): 152 kB | 162/228 kB | 34 kB | 21 kB
Progress (4): 152 kB | 166/228 kB | 34 kB | 21 kB
Progress (4): 152 kB | 170/228 kB | 34 kB | 21 kB
Progress (4): 152 kB | 174/228 kB | 34 kB | 21 kB
Progress (4): 152 kB | 178/228 kB | 34 kB | 21 kB
Progress (4): 152 kB | 182/228 kB | 34 kB | 21 kB
Progress (4): 152 kB | 186/228 kB | 34 kB | 21 kB
Progress (4): 152 kB | 190/228 kB | 34 kB | 21 kB
Progress (4): 152 kB | 194/228 kB | 34 kB | 21 kB
Progress (4): 152 kB | 198/228 kB | 34 kB | 21 kB
Progress (4): 152 kB | 202/228 kB | 34 kB | 21 kB
Progress (4): 152 kB | 206/228 kB | 34 kB | 21 kB
Progress (4): 152 kB | 210/228 kB | 34 kB | 21 kB
Progress (4): 152 kB | 214/228 kB | 34 kB | 21 kB
Progress (4): 152 kB | 218/228 kB | 34 kB | 21 kB
Progress (4): 152 kB | 222/228 kB | 34 kB | 21 kB
Progress (4): 152 kB | 226/228 kB | 34 kB | 21 kB
Progress (4): 152 kB | 228 kB | 34 kB | 21 kB    
                                             
Downloaded from eclipse.maven.central.mirror: https://repo.eclipse.org/content/repositories/maven_central/org/apache/maven/maven-core/2.0.6/maven-core-2.0.6.jar (152 kB at 3.2 MB/s)
Downloading from eclipse.maven.central.mirror: https://repo.eclipse.org/content/repositories/maven_central/org/apache/maven/maven-error-diagnostics/2.0.6/maven-error-diagnostics-2.0.6.jar
Downloaded from eclipse.maven.central.mirror: https://repo.eclipse.org/content/repositories/maven_central/org/apache/maven/maven-plugin-parameter-documenter/2.0.6/maven-plugin-parameter-documenter-2.0.6.jar (21 kB at 432 kB/s)
Downloaded from eclipse.maven.central.mirror: https://repo.eclipse.org/content/repositories/maven_central/org/codehaus/plexus/plexus-utils/1.5.15/plexus-utils-1.5.15.jar (228 kB at 4.7 MB/s)
Downloaded from eclipse.maven.central.mirror: https://repo.eclipse.org/content/repositories/maven_central/org/apache/maven/shared/maven-filtering/1.0-beta-3/maven-filtering-1.0-beta-3.jar (34 kB at 702 kB/s)
Downloading from eclipse.maven.central.mirror: https://repo.eclipse.org/content/repositories/maven_central/org/codehaus/plexus/plexus-interactivity-api/1.0-alpha-4/plexus-interactivity-api-1.0-alpha-4.jar
Downloading from eclipse.maven.central.mirror: https://repo.eclipse.org/content/repositories/maven_central/commons-cli/commons-cli/1.0/commons-cli-1.0.jar
Progress (1): 4.1/5.9 kB
                        
Downloading from eclipse.maven.central.mirror: https://repo.eclipse.org/content/repositories/maven_central/org/apache/maven/maven-plugin-descriptor/2.0.6/maven-plugin-descriptor-2.0.6.jar
Progress (1): 5.9 kB
Progress (2): 5.9 kB | 4.1/14 kB
Progress (2): 5.9 kB | 7.7/14 kB
Progress (2): 5.9 kB | 12/14 kB 
Progress (2): 5.9 kB | 14 kB   
Progress (3): 5.9 kB | 14 kB | 4.1/13 kB
Progress (3): 5.9 kB | 14 kB | 7.7/13 kB
Progress (3): 5.9 kB | 14 kB | 12/13 kB 
Progress (3): 5.9 kB | 14 kB | 13 kB   
                                    
Downloaded from eclipse.maven.central.mirror: https://repo.eclipse.org/content/repositories/maven_central/org/apache/maven/doxia/doxia-sink-api/1.0-alpha-7/doxia-sink-api-1.0-alpha-7.jar (5.9 kB at 96 kB/s)
Downloading from eclipse.maven.central.mirror: https://repo.eclipse.org/content/repositories/maven_central/org/apache/maven/maven-monitor/2.0.6/maven-monitor-2.0.6.jar
Downloaded from eclipse.maven.central.mirror: https://repo.eclipse.org/content/repositories/maven_central/org/codehaus/plexus/plexus-interactivity-api/1.0-alpha-4/plexus-interactivity-api-1.0-alpha-4.jar (13 kB at 216 kB/s)
Downloading from eclipse.maven.central.mirror: https://repo.eclipse.org/content/repositories/maven_central/org/sonatype/plexus/plexus-build-api/0.0.4/plexus-build-api-0.0.4.jar
Downloaded from eclipse.maven.central.mirror: https://repo.eclipse.org/content/repositories/maven_central/org/apache/maven/maven-error-diagnostics/2.0.6/maven-error-diagnostics-2.0.6.jar (14 kB at 216 kB/s)
Downloading from eclipse.maven.central.mirror: https://repo.eclipse.org/content/repositories/maven_central/org/codehaus/plexus/plexus-interpolation/1.13/plexus-interpolation-1.13.jar
Progress (1): 4.1/30 kB
Progress (1): 7.7/30 kB
Progress (1): 12/30 kB 
Progress (1): 16/30 kB
Progress (1): 20/30 kB
Progress (1): 24/30 kB
Progress (1): 28/30 kB
Progress (1): 30 kB   
Progress (2): 30 kB | 4.1/10 kB
Progress (2): 30 kB | 7.7/10 kB
Progress (2): 30 kB | 10 kB    
Progress (3): 30 kB | 10 kB | 4.1/37 kB
Progress (3): 30 kB | 10 kB | 7.7/37 kB
Progress (3): 30 kB | 10 kB | 12/37 kB 
Progress (3): 30 kB | 10 kB | 16/37 kB
Progress (3): 30 kB | 10 kB | 20/37 kB
Progress (3): 30 kB | 10 kB | 24/37 kB
Progress (3): 30 kB | 10 kB | 28/37 kB
Progress (3): 30 kB | 10 kB | 32/37 kB
Progress (3): 30 kB | 10 kB | 33/37 kB
Progress (3): 30 kB | 10 kB | 37/37 kB
Progress (3): 30 kB | 10 kB | 37 kB   
                                   
Downloaded from eclipse.maven.central.mirror: https://repo.eclipse.org/content/repositories/maven_central/commons-cli/commons-cli/1.0/commons-cli-1.0.jar (30 kB at 407 kB/s)
Progress (3): 10 kB | 37 kB | 4.1/6.8 kB
                                        
Downloaded from eclipse.maven.central.mirror: https://repo.eclipse.org/content/repositories/maven_central/org/apache/maven/maven-monitor/2.0.6/maven-monitor-2.0.6.jar (10 kB at 135 kB/s)
Downloaded from eclipse.maven.central.mirror: https://repo.eclipse.org/content/repositories/maven_central/org/apache/maven/maven-plugin-descriptor/2.0.6/maven-plugin-descriptor-2.0.6.jar (37 kB at 479 kB/s)
Progress (1): 6.8 kB
Progress (2): 6.8 kB | 4.1/61 kB
Progress (2): 6.8 kB | 7.7/61 kB
Progress (2): 6.8 kB | 12/61 kB 
Progress (2): 6.8 kB | 16/61 kB
Progress (2): 6.8 kB | 20/61 kB
Progress (2): 6.8 kB | 24/61 kB
Progress (2): 6.8 kB | 28/61 kB
Progress (2): 6.8 kB | 32/61 kB
Progress (2): 6.8 kB | 33/61 kB
Progress (2): 6.8 kB | 37/61 kB
Progress (2): 6.8 kB | 41/61 kB
Progress (2): 6.8 kB | 45/61 kB
Progress (2): 6.8 kB | 49/61 kB
Progress (2): 6.8 kB | 53/61 kB
Progress (2): 6.8 kB | 57/61 kB
                               
Downloaded from eclipse.maven.central.mirror: https://repo.eclipse.org/content/repositories/maven_central/org/sonatype/plexus/plexus-build-api/0.0.4/plexus-build-api-0.0.4.jar (6.8 kB at 84 kB/s)
Progress (1): 61/61 kB
Progress (1): 61 kB   
                   
Downloaded from eclipse.maven.central.mirror: https://repo.eclipse.org/content/repositories/maven_central/org/codehaus/plexus/plexus-interpolation/1.13/plexus-interpolation-1.13.jar (61 kB at 710 kB/s)
[INFO] Using 'ISO-8859-1' encoding to copy filtered resources.
[INFO] skip non existing resourceDirectory /jobs/genie.ptp/ptp-verify-packages/workspace/org.eclipse.ptp.rcp.sysmon/src/main/resources
[INFO] 
[INFO] --- tycho-compiler-plugin:1.3.0:compile (default-compile) @ org.eclipse.ptp.rcp.sysmon ---
Downloading from eclipse.maven.central.mirror: https://repo.eclipse.org/content/repositories/maven_central/org/codehaus/plexus/plexus-compiler-manager/2.2/plexus-compiler-manager-2.2.pom
Progress (1): 690 B
                   
Downloaded from eclipse.maven.central.mirror: https://repo.eclipse.org/content/repositories/maven_central/org/codehaus/plexus/plexus-compiler-manager/2.2/plexus-compiler-manager-2.2.pom (690 B at 38 kB/s)
Downloading from eclipse.maven.central.mirror: https://repo.eclipse.org/content/repositories/maven_central/org/codehaus/plexus/plexus-compiler/2.2/plexus-compiler-2.2.pom
Progress (1): 3.6 kB
                    
Downloaded from eclipse.maven.central.mirror: https://repo.eclipse.org/content/repositories/maven_central/org/codehaus/plexus/plexus-compiler/2.2/plexus-compiler-2.2.pom (3.6 kB at 139 kB/s)
Downloading from eclipse.maven.central.mirror: https://repo.eclipse.org/content/repositories/maven_central/org/codehaus/plexus/plexus-components/1.3.1/plexus-components-1.3.1.pom
Progress (1): 3.1 kB
                    
Downloaded from eclipse.maven.central.mirror: https://repo.eclipse.org/content/repositories/maven_central/org/codehaus/plexus/plexus-components/1.3.1/plexus-components-1.3.1.pom (3.1 kB at 161 kB/s)
Downloading from eclipse.maven.central.mirror: https://repo.eclipse.org/content/repositories/maven_central/org/codehaus/plexus/plexus/3.3.1/plexus-3.3.1.pom
Progress (1): 4.1/20 kB
Progress (1): 7.7/20 kB
Progress (1): 12/20 kB 
Progress (1): 16/20 kB
Progress (1): 20/20 kB
Progress (1): 20 kB   
                   
Downloaded from eclipse.maven.central.mirror: https://repo.eclipse.org/content/repositories/maven_central/org/codehaus/plexus/plexus/3.3.1/plexus-3.3.1.pom (20 kB at 1.2 MB/s)
Downloading from eclipse.maven.central.mirror: https://repo.eclipse.org/content/repositories/maven_central/org/codehaus/plexus/plexus-compiler-api/2.2/plexus-compiler-api-2.2.pom
Progress (1): 865 B
                   
Downloaded from eclipse.maven.central.mirror: https://repo.eclipse.org/content/repositories/maven_central/org/codehaus/plexus/plexus-compiler-api/2.2/plexus-compiler-api-2.2.pom (865 B at 51 kB/s)
Downloading from eclipse.maven.central.mirror: https://repo.eclipse.org/content/repositories/maven_central/org/eclipse/tycho/tycho-compiler-jdt/1.3.0/tycho-compiler-jdt-1.3.0.pom
Progress (1): 2.4 kB
                    
Downloaded from eclipse.maven.central.mirror: https://repo.eclipse.org/content/repositories/maven_central/org/eclipse/tycho/tycho-compiler-jdt/1.3.0/tycho-compiler-jdt-1.3.0.pom (2.4 kB at 125 kB/s)
Downloading from eclipse.maven.central.mirror: https://repo.eclipse.org/content/repositories/maven_central/org/eclipse/tycho/tycho-lib-detector/1.3.0/tycho-lib-detector-1.3.0.pom
Progress (1): 1.6 kB
                    
Downloaded from eclipse.maven.central.mirror: https://repo.eclipse.org/content/repositories/maven_central/org/eclipse/tycho/tycho-lib-detector/1.3.0/tycho-lib-detector-1.3.0.pom (1.6 kB at 92 kB/s)
Downloading from eclipse.maven.central.mirror: https://repo.eclipse.org/content/repositories/maven_central/org/eclipse/jdt/ecj/3.15.1/ecj-3.15.1.pom
Progress (1): 1.7 kB
                    
Downloaded from eclipse.maven.central.mirror: https://repo.eclipse.org/content/repositories/maven_central/org/eclipse/jdt/ecj/3.15.1/ecj-3.15.1.pom (1.7 kB at 103 kB/s)
Downloading from eclipse.maven.central.mirror: https://repo.eclipse.org/content/repositories/maven_central/org/codehaus/plexus/plexus-compiler-manager/2.2/plexus-compiler-manager-2.2.jar
Downloading from eclipse.maven.central.mirror: https://repo.eclipse.org/content/repositories/maven_central/org/codehaus/plexus/plexus-compiler-api/2.2/plexus-compiler-api-2.2.jar
Downloading from eclipse.maven.central.mirror: https://repo.eclipse.org/content/repositories/maven_central/org/eclipse/tycho/tycho-lib-detector/1.3.0/tycho-lib-detector-1.3.0.jar
Downloading from eclipse.maven.central.mirror: https://repo.eclipse.org/content/repositories/maven_central/org/eclipse/tycho/tycho-compiler-jdt/1.3.0/tycho-compiler-jdt-1.3.0.jar
Downloading from eclipse.maven.central.mirror: https://repo.eclipse.org/content/repositories/maven_central/org/eclipse/jdt/ecj/3.15.1/ecj-3.15.1.jar
Progress (1): 4.1/18 kB
Progress (1): 7.7/18 kB
Progress (2): 7.7/18 kB | 4.1/4.6 kB
Progress (2): 12/18 kB | 4.1/4.6 kB 
Progress (2): 12/18 kB | 4.6 kB    
Progress (2): 16/18 kB | 4.6 kB
Progress (2): 18 kB | 4.6 kB   
Progress (3): 18 kB | 4.6 kB | 3.6 kB
Progress (4): 18 kB | 4.6 kB | 3.6 kB | 0/2.8 MB
Progress (4): 18 kB | 4.6 kB | 3.6 kB | 0/2.8 MB
Progress (4): 18 kB | 4.6 kB | 3.6 kB | 0/2.8 MB
Progress (4): 18 kB | 4.6 kB | 3.6 kB | 0/2.8 MB
Progress (4): 18 kB | 4.6 kB | 3.6 kB | 0/2.8 MB
Progress (4): 18 kB | 4.6 kB | 3.6 kB | 0/2.8 MB
Progress (4): 18 kB | 4.6 kB | 3.6 kB | 0/2.8 MB
Progress (4): 18 kB | 4.6 kB | 3.6 kB | 0/2.8 MB
Progress (5): 18 kB | 4.6 kB | 3.6 kB | 0/2.8 MB | 4.1/25 kB
Progress (5): 18 kB | 4.6 kB | 3.6 kB | 0/2.8 MB | 4.1/25 kB
Progress (5): 18 kB | 4.6 kB | 3.6 kB | 0/2.8 MB | 7.7/25 kB
Progress (5): 18 kB | 4.6 kB | 3.6 kB | 0/2.8 MB | 12/25 kB 
Progress (5): 18 kB | 4.6 kB | 3.6 kB | 0/2.8 MB | 16/25 kB
Progress (5): 18 kB | 4.6 kB | 3.6 kB | 0/2.8 MB | 20/25 kB
Progress (5): 18 kB | 4.6 kB | 3.6 kB | 0/2.8 MB | 24/25 kB
Progress (5): 18 kB | 4.6 kB | 3.6 kB | 0/2.8 MB | 25 kB   
                                                        
Downloaded from eclipse.maven.central.mirror: https://repo.eclipse.org/content/repositories/maven_central/org/codehaus/plexus/plexus-compiler-manager/2.2/plexus-compiler-manager-2.2.jar (4.6 kB at 152 kB/s)
Downloaded from eclipse.maven.central.mirror: https://repo.eclipse.org/content/repositories/maven_central/org/eclipse/tycho/tycho-lib-detector/1.3.0/tycho-lib-detector-1.3.0.jar (3.6 kB at 125 kB/s)
Progress (3): 18 kB | 0/2.8 MB | 25 kB
Progress (3): 18 kB | 0/2.8 MB | 25 kB
Progress (3): 18 kB | 0/2.8 MB | 25 kB
Progress (3): 18 kB | 0/2.8 MB | 25 kB
Progress (3): 18 kB | 0.1/2.8 MB | 25 kB
Progress (3): 18 kB | 0.1/2.8 MB | 25 kB
Progress (3): 18 kB | 0.1/2.8 MB | 25 kB
Progress (3): 18 kB | 0.1/2.8 MB | 25 kB
Progress (3): 18 kB | 0.1/2.8 MB | 25 kB
Progress (3): 18 kB | 0.1/2.8 MB | 25 kB
Progress (3): 18 kB | 0.1/2.8 MB | 25 kB
Progress (3): 18 kB | 0.1/2.8 MB | 25 kB
Progress (3): 18 kB | 0.1/2.8 MB | 25 kB
Progress (3): 18 kB | 0.1/2.8 MB | 25 kB
Progress (3): 18 kB | 0.1/2.8 MB | 25 kB
Progress (3): 18 kB | 0.1/2.8 MB | 25 kB
Progress (3): 18 kB | 0.1/2.8 MB | 25 kB
Progress (3): 18 kB | 0.1/2.8 MB | 25 kB
Progress (3): 18 kB | 0.1/2.8 MB | 25 kB
Progress (3): 18 kB | 0.1/2.8 MB | 25 kB
                                        
Downloaded from eclipse.maven.central.mirror: https://repo.eclipse.org/content/repositories/maven_central/org/eclipse/tycho/tycho-compiler-jdt/1.3.0/tycho-compiler-jdt-1.3.0.jar (18 kB at 498 kB/s)
Progress (2): 0.1/2.8 MB | 25 kB
Progress (2): 0.1/2.8 MB | 25 kB
                                
Downloaded from eclipse.maven.central.mirror: https://repo.eclipse.org/content/repositories/maven_central/org/codehaus/plexus/plexus-compiler-api/2.2/plexus-compiler-api-2.2.jar (25 kB at 641 kB/s)
Progress (1): 0.1/2.8 MB
Progress (1): 0.1/2.8 MB
Progress (1): 0.1/2.8 MB
Progress (1): 0.1/2.8 MB
Progress (1): 0.1/2.8 MB
Progress (1): 0.1/2.8 MB
Progress (1): 0.1/2.8 MB
Progress (1): 0.1/2.8 MB
Progress (1): 0.1/2.8 MB
Progress (1): 0.2/2.8 MB
Progress (1): 0.2/2.8 MB
Progress (1): 0.2/2.8 MB
Progress (1): 0.2/2.8 MB
Progress (1): 0.2/2.8 MB
Progress (1): 0.2/2.8 MB
Progress (1): 0.2/2.8 MB
Progress (1): 0.2/2.8 MB
Progress (1): 0.2/2.8 MB
Progress (1): 0.2/2.8 MB
Progress (1): 0.2/2.8 MB
Progress (1): 0.2/2.8 MB
Progress (1): 0.2/2.8 MB
Progress (1): 0.2/2.8 MB
Progress (1): 0.2/2.8 MB
Progress (1): 0.2/2.8 MB
Progress (1): 0.2/2.8 MB
Progress (1): 0.2/2.8 MB
Progress (1): 0.2/2.8 MB
Progress (1): 0.2/2.8 MB
Progress (1): 0.2/2.8 MB
Progress (1): 0.2/2.8 MB
Progress (1): 0.2/2.8 MB
Progress (1): 0.2/2.8 MB
Progress (1): 0.2/2.8 MB
Progress (1): 0.3/2.8 MB
Progress (1): 0.3/2.8 MB
Progress (1): 0.3/2.8 MB
Progress (1): 0.3/2.8 MB
Progress (1): 0.3/2.8 MB
Progress (1): 0.3/2.8 MB
Progress (1): 0.3/2.8 MB
Progress (1): 0.3/2.8 MB
Progress (1): 0.3/2.8 MB
Progress (1): 0.3/2.8 MB
Progress (1): 0.3/2.8 MB
Progress (1): 0.3/2.8 MB
Progress (1): 0.3/2.8 MB
Progress (1): 0.3/2.8 MB
Progress (1): 0.3/2.8 MB
Progress (1): 0.3/2.8 MB
Progress (1): 0.3/2.8 MB
Progress (1): 0.3/2.8 MB
Progress (1): 0.3/2.8 MB
Progress (1): 0.3/2.8 MB
Progress (1): 0.3/2.8 MB
Progress (1): 0.3/2.8 MB
Progress (1): 0.3/2.8 MB
Progress (1): 0.3/2.8 MB
Progress (1): 0.3/2.8 MB
Progress (1): 0.4/2.8 MB
Progress (1): 0.4/2.8 MB
Progress (1): 0.4/2.8 MB
Progress (1): 0.4/2.8 MB
Progress (1): 0.4/2.8 MB
Progress (1): 0.4/2.8 MB
Progress (1): 0.4/2.8 MB
Progress (1): 0.4/2.8 MB
Progress (1): 0.4/2.8 MB
Progress (1): 0.4/2.8 MB
Progress (1): 0.4/2.8 MB
Progress (1): 0.4/2.8 MB
Progress (1): 0.4/2.8 MB
Progress (1): 0.4/2.8 MB
Progress (1): 0.4/2.8 MB
Progress (1): 0.4/2.8 MB
Progress (1): 0.4/2.8 MB
Progress (1): 0.4/2.8 MB
Progress (1): 0.4/2.8 MB
Progress (1): 0.4/2.8 MB
Progress (1): 0.4/2.8 MB
Progress (1): 0.4/2.8 MB
Progress (1): 0.4/2.8 MB
Progress (1): 0.4/2.8 MB
Progress (1): 0.4/2.8 MB
Progress (1): 0.5/2.8 MB
Progress (1): 0.5/2.8 MB
Progress (1): 0.5/2.8 MB
Progress (1): 0.5/2.8 MB
Progress (1): 0.5/2.8 MB
Progress (1): 0.5/2.8 MB
Progress (1): 0.5/2.8 MB
Progress (1): 0.5/2.8 MB
Progress (1): 0.5/2.8 MB
Progress (1): 0.5/2.8 MB
Progress (1): 0.5/2.8 MB
Progress (1): 0.5/2.8 MB
Progress (1): 0.5/2.8 MB
Progress (1): 0.5/2.8 MB
Progress (1): 0.5/2.8 MB
Progress (1): 0.5/2.8 MB
Progress (1): 0.5/2.8 MB
Progress (1): 0.5/2.8 MB
Progress (1): 0.5/2.8 MB
Progress (1): 0.5/2.8 MB
Progress (1): 0.5/2.8 MB
Progress (1): 0.5/2.8 MB
Progress (1): 0.5/2.8 MB
Progress (1): 0.5/2.8 MB
Progress (1): 0.5/2.8 MB
Progress (1): 0.6/2.8 MB
Progress (1): 0.6/2.8 MB
Progress (1): 0.6/2.8 MB
Progress (1): 0.6/2.8 MB
Progress (1): 0.6/2.8 MB
Progress (1): 0.6/2.8 MB
Progress (1): 0.6/2.8 MB
Progress (1): 0.6/2.8 MB
Progress (1): 0.6/2.8 MB
Progress (1): 0.6/2.8 MB
Progress (1): 0.6/2.8 MB
Progress (1): 0.6/2.8 MB
Progress (1): 0.6/2.8 MB
Progress (1): 0.6/2.8 MB
Progress (1): 0.6/2.8 MB
Progress (1): 0.6/2.8 MB
Progress (1): 0.6/2.8 MB
Progress (1): 0.6/2.8 MB
Progress (1): 0.6/2.8 MB
Progress (1): 0.6/2.8 MB
Progress (1): 0.6/2.8 MB
Progress (1): 0.6/2.8 MB
Progress (1): 0.6/2.8 MB
Progress (1): 0.6/2.8 MB
Progress (1): 0.6/2.8 MB
Progress (1): 0.7/2.8 MB
Progress (1): 0.7/2.8 MB
Progress (1): 0.7/2.8 MB
Progress (1): 0.7/2.8 MB
Progress (1): 0.7/2.8 MB
Progress (1): 0.7/2.8 MB
Progress (1): 0.7/2.8 MB
Progress (1): 0.7/2.8 MB
Progress (1): 0.7/2.8 MB
Progress (1): 0.7/2.8 MB
Progress (1): 0.7/2.8 MB
Progress (1): 0.7/2.8 MB
Progress (1): 0.7/2.8 MB
Progress (1): 0.7/2.8 MB
Progress (1): 0.7/2.8 MB
Progress (1): 0.7/2.8 MB
Progress (1): 0.7/2.8 MB
Progress (1): 0.7/2.8 MB
Progress (1): 0.7/2.8 MB
Progress (1): 0.7/2.8 MB
Progress (1): 0.7/2.8 MB
Progress (1): 0.7/2.8 MB
Progress (1): 0.7/2.8 MB
Progress (1): 0.7/2.8 MB
Progress (1): 0.7/2.8 MB
Progress (1): 0.8/2.8 MB
Progress (1): 0.8/2.8 MB
Progress (1): 0.8/2.8 MB
Progress (1): 0.8/2.8 MB
Progress (1): 0.8/2.8 MB
Progress (1): 0.8/2.8 MB
Progress (1): 0.8/2.8 MB
Progress (1): 0.8/2.8 MB
Progress (1): 0.8/2.8 MB
Progress (1): 0.8/2.8 MB
Progress (1): 0.8/2.8 MB
Progress (1): 0.8/2.8 MB
Progress (1): 0.8/2.8 MB
Progress (1): 0.8/2.8 MB
Progress (1): 0.8/2.8 MB
Progress (1): 0.8/2.8 MB
Progress (1): 0.8/2.8 MB
Progress (1): 0.8/2.8 MB
Progress (1): 0.8/2.8 MB
Progress (1): 0.8/2.8 MB
Progress (1): 0.8/2.8 MB
Progress (1): 0.8/2.8 MB
Progress (1): 0.8/2.8 MB
Progress (1): 0.8/2.8 MB
Progress (1): 0.8/2.8 MB
Progress (1): 0.9/2.8 MB
Progress (1): 0.9/2.8 MB
Progress (1): 0.9/2.8 MB
Progress (1): 0.9/2.8 MB
Progress (1): 0.9/2.8 MB
Progress (1): 0.9/2.8 MB
Progress (1): 0.9/2.8 MB
Progress (1): 0.9/2.8 MB
Progress (1): 0.9/2.8 MB
Progress (1): 0.9/2.8 MB
Progress (1): 0.9/2.8 MB
Progress (1): 0.9/2.8 MB
Progress (1): 0.9/2.8 MB
Progress (1): 0.9/2.8 MB
Progress (1): 0.9/2.8 MB
Progress (1): 0.9/2.8 MB
Progress (1): 0.9/2.8 MB
Progress (1): 0.9/2.8 MB
Progress (1): 0.9/2.8 MB
Progress (1): 0.9/2.8 MB
Progress (1): 0.9/2.8 MB
Progress (1): 0.9/2.8 MB
Progress (1): 0.9/2.8 MB
Progress (1): 0.9/2.8 MB
Progress (1): 0.9/2.8 MB
Progress (1): 1.0/2.8 MB
Progress (1): 1.0/2.8 MB
Progress (1): 1.0/2.8 MB
Progress (1): 1.0/2.8 MB
Progress (1): 1.0/2.8 MB
Progress (1): 1.0/2.8 MB
Progress (1): 1.0/2.8 MB
Progress (1): 1.0/2.8 MB
Progress (1): 1.0/2.8 MB
Progress (1): 1.0/2.8 MB
Progress (1): 1.0/2.8 MB
Progress (1): 1.0/2.8 MB
Progress (1): 1.0/2.8 MB
Progress (1): 1.0/2.8 MB
Progress (1): 1.0/2.8 MB
Progress (1): 1.0/2.8 MB
Progress (1): 1.0/2.8 MB
Progress (1): 1.0/2.8 MB
Progress (1): 1.0/2.8 MB
Progress (1): 1.0/2.8 MB
Progress (1): 1.0/2.8 MB
Progress (1): 1.0/2.8 MB
Progress (1): 1.0/2.8 MB
Progress (1): 1.0/2.8 MB
Progress (1): 1.0/2.8 MB
Progress (1): 1.1/2.8 MB
Progress (1): 1.1/2.8 MB
Progress (1): 1.1/2.8 MB
Progress (1): 1.1/2.8 MB
Progress (1): 1.1/2.8 MB
Progress (1): 1.1/2.8 MB
Progress (1): 1.1/2.8 MB
Progress (1): 1.1/2.8 MB
Progress (1): 1.1/2.8 MB
Progress (1): 1.1/2.8 MB
Progress (1): 1.1/2.8 MB
Progress (1): 1.1/2.8 MB
Progress (1): 1.1/2.8 MB
Progress (1): 1.1/2.8 MB
Progress (1): 1.1/2.8 MB
Progress (1): 1.1/2.8 MB
Progress (1): 1.1/2.8 MB
Progress (1): 1.1/2.8 MB
Progress (1): 1.1/2.8 MB
Progress (1): 1.1/2.8 MB
Progress (1): 1.1/2.8 MB
Progress (1): 1.1/2.8 MB
Progress (1): 1.1/2.8 MB
Progress (1): 1.1/2.8 MB
Progress (1): 1.1/2.8 MB
Progress (1): 1.2/2.8 MB
Progress (1): 1.2/2.8 MB
Progress (1): 1.2/2.8 MB
Progress (1): 1.2/2.8 MB
Progress (1): 1.2/2.8 MB
Progress (1): 1.2/2.8 MB
Progress (1): 1.2/2.8 MB
Progress (1): 1.2/2.8 MB
Progress (1): 1.2/2.8 MB
Progress (1): 1.2/2.8 MB
Progress (1): 1.2/2.8 MB
Progress (1): 1.2/2.8 MB
Progress (1): 1.2/2.8 MB
Progress (1): 1.2/2.8 MB
Progress (1): 1.2/2.8 MB
Progress (1): 1.2/2.8 MB
Progress (1): 1.2/2.8 MB
Progress (1): 1.2/2.8 MB
Progress (1): 1.2/2.8 MB
Progress (1): 1.2/2.8 MB
Progress (1): 1.2/2.8 MB
Progress (1): 1.2/2.8 MB
Progress (1): 1.2/2.8 MB
Progress (1): 1.2/2.8 MB
Progress (1): 1.2/2.8 MB
Progress (1): 1.3/2.8 MB
Progress (1): 1.3/2.8 MB
Progress (1): 1.3/2.8 MB
Progress (1): 1.3/2.8 MB
Progress (1): 1.3/2.8 MB
Progress (1): 1.3/2.8 MB
Progress (1): 1.3/2.8 MB
Progress (1): 1.3/2.8 MB
Progress (1): 1.3/2.8 MB
Progress (1): 1.3/2.8 MB
Progress (1): 1.3/2.8 MB
Progress (1): 1.3/2.8 MB
Progress (1): 1.3/2.8 MB
Progress (1): 1.3/2.8 MB
Progress (1): 1.3/2.8 MB
Progress (1): 1.3/2.8 MB
Progress (1): 1.3/2.8 MB
Progress (1): 1.3/2.8 MB
Progress (1): 1.3/2.8 MB
Progress (1): 1.3/2.8 MB
Progress (1): 1.3/2.8 MB
Progress (1): 1.3/2.8 MB
Progress (1): 1.3/2.8 MB
Progress (1): 1.3/2.8 MB
Progress (1): 1.3/2.8 MB
Progress (1): 1.4/2.8 MB
Progress (1): 1.4/2.8 MB
Progress (1): 1.4/2.8 MB
Progress (1): 1.4/2.8 MB
Progress (1): 1.4/2.8 MB
Progress (1): 1.4/2.8 MB
Progress (1): 1.4/2.8 MB
Progress (1): 1.4/2.8 MB
Progress (1): 1.4/2.8 MB
Progress (1): 1.4/2.8 MB
Progress (1): 1.4/2.8 MB
Progress (1): 1.4/2.8 MB
Progress (1): 1.4/2.8 MB
Progress (1): 1.4/2.8 MB
Progress (1): 1.4/2.8 MB
Progress (1): 1.4/2.8 MB
Progress (1): 1.4/2.8 MB
Progress (1): 1.4/2.8 MB
Progress (1): 1.4/2.8 MB
Progress (1): 1.4/2.8 MB
Progress (1): 1.4/2.8 MB
Progress (1): 1.4/2.8 MB
Progress (1): 1.4/2.8 MB
Progress (1): 1.4/2.8 MB
Progress (1): 1.4/2.8 MB
Progress (1): 1.5/2.8 MB
Progress (1): 1.5/2.8 MB
Progress (1): 1.5/2.8 MB
Progress (1): 1.5/2.8 MB
Progress (1): 1.5/2.8 MB
Progress (1): 1.5/2.8 MB
Progress (1): 1.5/2.8 MB
Progress (1): 1.5/2.8 MB
Progress (1): 1.5/2.8 MB
Progress (1): 1.5/2.8 MB
Progress (1): 1.5/2.8 MB
Progress (1): 1.5/2.8 MB
Progress (1): 1.5/2.8 MB
Progress (1): 1.5/2.8 MB
Progress (1): 1.5/2.8 MB
Progress (1): 1.5/2.8 MB
Progress (1): 1.5/2.8 MB
Progress (1): 1.5/2.8 MB
Progress (1): 1.5/2.8 MB
Progress (1): 1.5/2.8 MB
Progress (1): 1.5/2.8 MB
Progress (1): 1.5/2.8 MB
Progress (1): 1.5/2.8 MB
Progress (1): 1.5/2.8 MB
Progress (1): 1.5/2.8 MB
Progress (1): 1.6/2.8 MB
Progress (1): 1.6/2.8 MB
Progress (1): 1.6/2.8 MB
Progress (1): 1.6/2.8 MB
Progress (1): 1.6/2.8 MB
Progress (1): 1.6/2.8 MB
Progress (1): 1.6/2.8 MB
Progress (1): 1.6/2.8 MB
Progress (1): 1.6/2.8 MB
Progress (1): 1.6/2.8 MB
Progress (1): 1.6/2.8 MB
Progress (1): 1.6/2.8 MB
Progress (1): 1.6/2.8 MB
Progress (1): 1.6/2.8 MB
Progress (1): 1.6/2.8 MB
Progress (1): 1.6/2.8 MB
Progress (1): 1.6/2.8 MB
Progress (1): 1.6/2.8 MB
Progress (1): 1.6/2.8 MB
Progress (1): 1.6/2.8 MB
Progress (1): 1.6/2.8 MB
Progress (1): 1.6/2.8 MB
Progress (1): 1.6/2.8 MB
Progress (1): 1.6/2.8 MB
Progress (1): 1.6/2.8 MB
Progress (1): 1.7/2.8 MB
Progress (1): 1.7/2.8 MB
Progress (1): 1.7/2.8 MB
Progress (1): 1.7/2.8 MB
Progress (1): 1.7/2.8 MB
Progress (1): 1.7/2.8 MB
Progress (1): 1.7/2.8 MB
Progress (1): 1.7/2.8 MB
Progress (1): 1.7/2.8 MB
Progress (1): 1.7/2.8 MB
Progress (1): 1.7/2.8 MB
Progress (1): 1.7/2.8 MB
Progress (1): 1.7/2.8 MB
Progress (1): 1.7/2.8 MB
Progress (1): 1.7/2.8 MB
Progress (1): 1.7/2.8 MB
Progress (1): 1.7/2.8 MB
Progress (1): 1.7/2.8 MB
Progress (1): 1.7/2.8 MB
Progress (1): 1.7/2.8 MB
Progress (1): 1.7/2.8 MB
Progress (1): 1.7/2.8 MB
Progress (1): 1.7/2.8 MB
Progress (1): 1.7/2.8 MB
Progress (1): 1.7/2.8 MB
Progress (1): 1.8/2.8 MB
Progress (1): 1.8/2.8 MB
Progress (1): 1.8/2.8 MB
Progress (1): 1.8/2.8 MB
Progress (1): 1.8/2.8 MB
Progress (1): 1.8/2.8 MB
Progress (1): 1.8/2.8 MB
Progress (1): 1.8/2.8 MB
Progress (1): 1.8/2.8 MB
Progress (1): 1.8/2.8 MB
Progress (1): 1.8/2.8 MB
Progress (1): 1.8/2.8 MB
Progress (1): 1.8/2.8 MB
Progress (1): 1.8/2.8 MB
Progress (1): 1.8/2.8 MB
Progress (1): 1.8/2.8 MB
Progress (1): 1.8/2.8 MB
Progress (1): 1.8/2.8 MB
Progress (1): 1.8/2.8 MB
Progress (1): 1.8/2.8 MB
Progress (1): 1.8/2.8 MB
Progress (1): 1.8/2.8 MB
Progress (1): 1.8/2.8 MB
Progress (1): 1.8/2.8 MB
Progress (1): 1.8/2.8 MB
Progress (1): 1.9/2.8 MB
Progress (1): 1.9/2.8 MB
Progress (1): 1.9/2.8 MB
Progress (1): 1.9/2.8 MB
Progress (1): 1.9/2.8 MB
Progress (1): 1.9/2.8 MB
Progress (1): 1.9/2.8 MB
Progress (1): 1.9/2.8 MB
Progress (1): 1.9/2.8 MB
Progress (1): 1.9/2.8 MB
Progress (1): 1.9/2.8 MB
Progress (1): 1.9/2.8 MB
Progress (1): 1.9/2.8 MB
Progress (1): 1.9/2.8 MB
Progress (1): 1.9/2.8 MB
Progress (1): 1.9/2.8 MB
Progress (1): 1.9/2.8 MB
Progress (1): 1.9/2.8 MB
Progress (1): 1.9/2.8 MB
Progress (1): 1.9/2.8 MB
Progress (1): 1.9/2.8 MB
Progress (1): 1.9/2.8 MB
Progress (1): 1.9/2.8 MB
Progress (1): 1.9/2.8 MB
Progress (1): 1.9/2.8 MB
Progress (1): 2.0/2.8 MB
Progress (1): 2.0/2.8 MB
Progress (1): 2.0/2.8 MB
Progress (1): 2.0/2.8 MB
Progress (1): 2.0/2.8 MB
Progress (1): 2.0/2.8 MB
Progress (1): 2.0/2.8 MB
Progress (1): 2.0/2.8 MB
Progress (1): 2.0/2.8 MB
Progress (1): 2.0/2.8 MB
Progress (1): 2.0/2.8 MB
Progress (1): 2.0/2.8 MB
Progress (1): 2.0/2.8 MB
Progress (1): 2.0/2.8 MB
Progress (1): 2.0/2.8 MB
Progress (1): 2.0/2.8 MB
Progress (1): 2.0/2.8 MB
Progress (1): 2.0/2.8 MB
Progress (1): 2.0/2.8 MB
Progress (1): 2.0/2.8 MB
Progress (1): 2.0/2.8 MB
Progress (1): 2.0/2.8 MB
Progress (1): 2.0/2.8 MB
Progress (1): 2.0/2.8 MB
Progress (1): 2.0/2.8 MB
Progress (1): 2.1/2.8 MB
Progress (1): 2.1/2.8 MB
Progress (1): 2.1/2.8 MB
Progress (1): 2.1/2.8 MB
Progress (1): 2.1/2.8 MB
Progress (1): 2.1/2.8 MB
Progress (1): 2.1/2.8 MB
Progress (1): 2.1/2.8 MB
Progress (1): 2.1/2.8 MB
Progress (1): 2.1/2.8 MB
Progress (1): 2.1/2.8 MB
Progress (1): 2.1/2.8 MB
Progress (1): 2.1/2.8 MB
Progress (1): 2.1/2.8 MB
Progress (1): 2.1/2.8 MB
Progress (1): 2.1/2.8 MB
Progress (1): 2.1/2.8 MB
Progress (1): 2.1/2.8 MB
Progress (1): 2.1/2.8 MB
Progress (1): 2.1/2.8 MB
Progress (1): 2.1/2.8 MB
Progress (1): 2.1/2.8 MB
Progress (1): 2.1/2.8 MB
Progress (1): 2.1/2.8 MB
Progress (1): 2.1/2.8 MB
Progress (1): 2.2/2.8 MB
Progress (1): 2.2/2.8 MB
Progress (1): 2.2/2.8 MB
Progress (1): 2.2/2.8 MB
Progress (1): 2.2/2.8 MB
Progress (1): 2.2/2.8 MB
Progress (1): 2.2/2.8 MB
Progress (1): 2.2/2.8 MB
Progress (1): 2.2/2.8 MB
Progress (1): 2.2/2.8 MB
Progress (1): 2.2/2.8 MB
Progress (1): 2.2/2.8 MB
Progress (1): 2.2/2.8 MB
Progress (1): 2.2/2.8 MB
Progress (1): 2.2/2.8 MB
Progress (1): 2.2/2.8 MB
Progress (1): 2.2/2.8 MB
Progress (1): 2.2/2.8 MB
Progress (1): 2.2/2.8 MB
Progress (1): 2.2/2.8 MB
Progress (1): 2.2/2.8 MB
Progress (1): 2.2/2.8 MB
Progress (1): 2.2/2.8 MB
Progress (1): 2.2/2.8 MB
Progress (1): 2.2/2.8 MB
Progress (1): 2.3/2.8 MB
Progress (1): 2.3/2.8 MB
Progress (1): 2.3/2.8 MB
Progress (1): 2.3/2.8 MB
Progress (1): 2.3/2.8 MB
Progress (1): 2.3/2.8 MB
Progress (1): 2.3/2.8 MB
Progress (1): 2.3/2.8 MB
Progress (1): 2.3/2.8 MB
Progress (1): 2.3/2.8 MB
Progress (1): 2.3/2.8 MB
Progress (1): 2.3/2.8 MB
Progress (1): 2.3/2.8 MB
Progress (1): 2.3/2.8 MB
Progress (1): 2.3/2.8 MB
Progress (1): 2.3/2.8 MB
Progress (1): 2.3/2.8 MB
Progress (1): 2.3/2.8 MB
Progress (1): 2.3/2.8 MB
Progress (1): 2.3/2.8 MB
Progress (1): 2.3/2.8 MB
Progress (1): 2.3/2.8 MB
Progress (1): 2.3/2.8 MB
Progress (1): 2.3/2.8 MB
Progress (1): 2.3/2.8 MB
Progress (1): 2.4/2.8 MB
Progress (1): 2.4/2.8 MB
Progress (1): 2.4/2.8 MB
Progress (1): 2.4/2.8 MB
Progress (1): 2.4/2.8 MB
Progress (1): 2.4/2.8 MB
Progress (1): 2.4/2.8 MB
Progress (1): 2.4/2.8 MB
Progress (1): 2.4/2.8 MB
Progress (1): 2.4/2.8 MB
Progress (1): 2.4/2.8 MB
Progress (1): 2.4/2.8 MB
Progress (1): 2.4/2.8 MB
Progress (1): 2.4/2.8 MB
Progress (1): 2.4/2.8 MB
Progress (1): 2.4/2.8 MB
Progress (1): 2.4/2.8 MB
Progress (1): 2.4/2.8 MB
Progress (1): 2.4/2.8 MB
Progress (1): 2.4/2.8 MB
Progress (1): 2.4/2.8 MB
Progress (1): 2.4/2.8 MB
Progress (1): 2.4/2.8 MB
Progress (1): 2.4/2.8 MB
Progress (1): 2.4/2.8 MB
Progress (1): 2.5/2.8 MB
Progress (1): 2.5/2.8 MB
Progress (1): 2.5/2.8 MB
Progress (1): 2.5/2.8 MB
Progress (1): 2.5/2.8 MB
Progress (1): 2.5/2.8 MB
Progress (1): 2.5/2.8 MB
Progress (1): 2.5/2.8 MB
Progress (1): 2.5/2.8 MB
Progress (1): 2.5/2.8 MB
Progress (1): 2.5/2.8 MB
Progress (1): 2.5/2.8 MB
Progress (1): 2.5/2.8 MB
Progress (1): 2.5/2.8 MB
Progress (1): 2.5/2.8 MB
Progress (1): 2.5/2.8 MB
Progress (1): 2.5/2.8 MB
Progress (1): 2.5/2.8 MB
Progress (1): 2.5/2.8 MB
Progress (1): 2.5/2.8 MB
Progress (1): 2.5/2.8 MB
Progress (1): 2.5/2.8 MB
Progress (1): 2.5/2.8 MB
Progress (1): 2.5/2.8 MB
Progress (1): 2.5/2.8 MB
Progress (1): 2.6/2.8 MB
Progress (1): 2.6/2.8 MB
Progress (1): 2.6/2.8 MB
Progress (1): 2.6/2.8 MB
Progress (1): 2.6/2.8 MB
Progress (1): 2.6/2.8 MB
Progress (1): 2.6/2.8 MB
Progress (1): 2.6/2.8 MB
Progress (1): 2.6/2.8 MB
Progress (1): 2.6/2.8 MB
Progress (1): 2.6/2.8 MB
Progress (1): 2.6/2.8 MB
Progress (1): 2.6/2.8 MB
Progress (1): 2.6/2.8 MB
Progress (1): 2.6/2.8 MB
Progress (1): 2.6/2.8 MB
Progress (1): 2.6/2.8 MB
Progress (1): 2.6/2.8 MB
Progress (1): 2.6/2.8 MB
Progress (1): 2.6/2.8 MB
Progress (1): 2.6/2.8 MB
Progress (1): 2.6/2.8 MB
Progress (1): 2.6/2.8 MB
Progress (1): 2.6/2.8 MB
Progress (1): 2.6/2.8 MB
Progress (1): 2.7/2.8 MB
Progress (1): 2.7/2.8 MB
Progress (1): 2.7/2.8 MB
Progress (1): 2.7/2.8 MB
Progress (1): 2.7/2.8 MB
Progress (1): 2.7/2.8 MB
Progress (1): 2.7/2.8 MB
Progress (1): 2.7/2.8 MB
Progress (1): 2.7/2.8 MB
Progress (1): 2.7/2.8 MB
Progress (1): 2.7/2.8 MB
Progress (1): 2.7/2.8 MB
Progress (1): 2.7/2.8 MB
Progress (1): 2.7/2.8 MB
Progress (1): 2.7/2.8 MB
Progress (1): 2.7/2.8 MB
Progress (1): 2.7/2.8 MB
Progress (1): 2.7/2.8 MB
Progress (1): 2.7/2.8 MB
Progress (1): 2.7/2.8 MB
Progress (1): 2.7/2.8 MB
Progress (1): 2.7/2.8 MB
Progress (1): 2.7/2.8 MB
Progress (1): 2.7/2.8 MB
Progress (1): 2.7/2.8 MB
Progress (1): 2.8/2.8 MB
Progress (1): 2.8/2.8 MB
Progress (1): 2.8/2.8 MB
Progress (1): 2.8/2.8 MB
Progress (1): 2.8/2.8 MB
Progress (1): 2.8/2.8 MB
Progress (1): 2.8/2.8 MB
Progress (1): 2.8/2.8 MB
Progress (1): 2.8/2.8 MB
Progress (1): 2.8/2.8 MB
Progress (1): 2.8/2.8 MB
Progress (1): 2.8/2.8 MB
Progress (1): 2.8/2.8 MB
Progress (1): 2.8/2.8 MB
Progress (1): 2.8/2.8 MB
Progress (1): 2.8/2.8 MB
Progress (1): 2.8/2.8 MB
Progress (1): 2.8 MB    
                    
Downloaded from eclipse.maven.central.mirror: https://repo.eclipse.org/content/repositories/maven_central/org/eclipse/jdt/ecj/3.15.1/ecj-3.15.1.jar (2.8 MB at 17 MB/s)
[INFO] Compiling 7 source files to /jobs/genie.ptp/ptp-verify-packages/workspace/org.eclipse.ptp.rcp.sysmon/target/classes
[INFO] 
[INFO] --- maven-resources-plugin:2.4.1:testResources (default-testResources) @ org.eclipse.ptp.rcp.sysmon ---
[INFO] Using 'ISO-8859-1' encoding to copy filtered resources.
[INFO] skip non existing resourceDirectory /jobs/genie.ptp/ptp-verify-packages/workspace/org.eclipse.ptp.rcp.sysmon/src/test/resources
[INFO] 
[INFO] --- tycho-source-plugin:1.3.0:plugin-source (attach-source) @ org.eclipse.ptp.rcp.sysmon ---
[INFO] Building jar: /jobs/genie.ptp/ptp-verify-packages/workspace/org.eclipse.ptp.rcp.sysmon/target/org.eclipse.ptp.rcp.sysmon-1.0.0-SNAPSHOT-sources.jar
[INFO] 
[INFO] --- target-platform-configuration:1.3.0:target-platform (default-target-platform) @ org.eclipse.ptp.rcp.sysmon ---
[INFO] 
[INFO] --- tycho-packaging-plugin:1.3.0:package-plugin (default-package-plugin) @ org.eclipse.ptp.rcp.sysmon ---
[INFO] Building jar: /jobs/genie.ptp/ptp-verify-packages/workspace/org.eclipse.ptp.rcp.sysmon/target/org.eclipse.ptp.rcp.sysmon-1.0.0-SNAPSHOT.jar
[INFO] 
[INFO] --- tycho-p2-plugin:1.3.0:p2-metadata-default (default-p2-metadata-default) @ org.eclipse.ptp.rcp.sysmon ---
[INFO] 
[INFO] --- maven-install-plugin:2.3.1:install (default-install) @ org.eclipse.ptp.rcp.sysmon ---
Downloading from eclipse.maven.central.mirror: https://repo.eclipse.org/content/repositories/maven_central/org/codehaus/plexus/plexus-utils/2.0.5/plexus-utils-2.0.5.pom
Progress (1): 3.3 kB
                    
Downloaded from eclipse.maven.central.mirror: https://repo.eclipse.org/content/repositories/maven_central/org/codehaus/plexus/plexus-utils/2.0.5/plexus-utils-2.0.5.pom (3.3 kB at 175 kB/s)
Downloading from eclipse.maven.central.mirror: https://repo.eclipse.org/content/repositories/maven_central/org/codehaus/plexus/plexus-utils/2.0.5/plexus-utils-2.0.5.jar
Progress (1): 4.1/223 kB
Progress (1): 7.7/223 kB
Progress (1): 12/223 kB 
Progress (1): 16/223 kB
Progress (1): 20/223 kB
Progress (1): 24/223 kB
Progress (1): 28/223 kB
Progress (1): 32/223 kB
Progress (1): 33/223 kB
Progress (1): 37/223 kB
Progress (1): 41/223 kB
Progress (1): 45/223 kB
Progress (1): 49/223 kB
Progress (1): 53/223 kB
Progress (1): 57/223 kB
Progress (1): 61/223 kB
Progress (1): 65/223 kB
Progress (1): 66/223 kB
Progress (1): 70/223 kB
Progress (1): 74/223 kB
Progress (1): 78/223 kB
Progress (1): 82/223 kB
Progress (1): 86/223 kB
Progress (1): 90/223 kB
Progress (1): 94/223 kB
Progress (1): 98/223 kB
Progress (1): 98/223 kB
Progress (1): 102/223 kB
Progress (1): 106/223 kB
Progress (1): 110/223 kB
Progress (1): 114/223 kB
Progress (1): 118/223 kB
Progress (1): 122/223 kB
Progress (1): 126/223 kB
Progress (1): 130/223 kB
Progress (1): 131/223 kB
Progress (1): 135/223 kB
Progress (1): 139/223 kB
Progress (1): 143/223 kB
Progress (1): 147/223 kB
Progress (1): 151/223 kB
Progress (1): 155/223 kB
Progress (1): 159/223 kB
Progress (1): 163/223 kB
Progress (1): 167/223 kB
Progress (1): 171/223 kB
Progress (1): 175/223 kB
Progress (1): 179/223 kB
Progress (1): 183/223 kB
Progress (1): 187/223 kB
Progress (1): 191/223 kB
Progress (1): 195/223 kB
Progress (1): 199/223 kB
Progress (1): 203/223 kB
Progress (1): 207/223 kB
Progress (1): 211/223 kB
Progress (1): 215/223 kB
Progress (1): 219/223 kB
Progress (1): 223/223 kB
Progress (1): 223 kB    
                    
Downloaded from eclipse.maven.central.mirror: https://repo.eclipse.org/content/repositories/maven_central/org/codehaus/plexus/plexus-utils/2.0.5/plexus-utils-2.0.5.jar (223 kB at 8.9 MB/s)
[INFO] Installing /jobs/genie.ptp/ptp-verify-packages/workspace/org.eclipse.ptp.rcp.sysmon/target/org.eclipse.ptp.rcp.sysmon-1.0.0-SNAPSHOT.jar to /home/hudson/genie.ptp/.jenkins/jobs/ptp-verify-packages/workspace/.repository/org/eclipse/ptp/master/org.eclipse.ptp.rcp.sysmon/1.0.0-SNAPSHOT/org.eclipse.ptp.rcp.sysmon-1.0.0-SNAPSHOT.jar
[INFO] Installing /jobs/genie.ptp/ptp-verify-packages/workspace/org.eclipse.ptp.rcp.sysmon/pom.xml to /home/hudson/genie.ptp/.jenkins/jobs/ptp-verify-packages/workspace/.repository/org/eclipse/ptp/master/org.eclipse.ptp.rcp.sysmon/1.0.0-SNAPSHOT/org.eclipse.ptp.rcp.sysmon-1.0.0-SNAPSHOT.pom
[INFO] Installing /jobs/genie.ptp/ptp-verify-packages/workspace/org.eclipse.ptp.rcp.sysmon/target/org.eclipse.ptp.rcp.sysmon-1.0.0-SNAPSHOT-sources.jar to /home/hudson/genie.ptp/.jenkins/jobs/ptp-verify-packages/workspace/.repository/org/eclipse/ptp/master/org.eclipse.ptp.rcp.sysmon/1.0.0-SNAPSHOT/org.eclipse.ptp.rcp.sysmon-1.0.0-SNAPSHOT-sources.jar
[INFO] Installing /jobs/genie.ptp/ptp-verify-packages/workspace/org.eclipse.ptp.rcp.sysmon/target/p2content.xml to /home/hudson/genie.ptp/.jenkins/jobs/ptp-verify-packages/workspace/.repository/org/eclipse/ptp/master/org.eclipse.ptp.rcp.sysmon/1.0.0-SNAPSHOT/org.eclipse.ptp.rcp.sysmon-1.0.0-SNAPSHOT-p2metadata.xml
[INFO] Installing /jobs/genie.ptp/ptp-verify-packages/workspace/org.eclipse.ptp.rcp.sysmon/target/p2artifacts.xml to /home/hudson/genie.ptp/.jenkins/jobs/ptp-verify-packages/workspace/.repository/org/eclipse/ptp/master/org.eclipse.ptp.rcp.sysmon/1.0.0-SNAPSHOT/org.eclipse.ptp.rcp.sysmon-1.0.0-SNAPSHOT-p2artifacts.xml
[INFO] 
[INFO] --- tycho-p2-plugin:1.3.0:update-local-index (default-update-local-index) @ org.eclipse.ptp.rcp.sysmon ---
[INFO] 
[INFO] --------< org.eclipse.ptp.features:org.eclipse.ptp.rcp.sysmon >---------
[INFO] Building org.eclipse.ptp.rcp.sysmon 9.2.1-SNAPSHOT                 [3/6]
[INFO] --------------------------[ eclipse-feature ]---------------------------
[INFO] 
[INFO] --- maven-clean-plugin:2.5:clean (default-clean) @ org.eclipse.ptp.rcp.sysmon ---
[INFO] 
[INFO] --- tycho-packaging-plugin:1.3.0:build-qualifier-aggregator (default-build-qualifier-aggregator) @ org.eclipse.ptp.rcp.sysmon ---
[INFO] The project's OSGi version is 9.2.1.201902251846
[INFO] 
[INFO] --- tycho-packaging-plugin:1.3.0:validate-id (default-validate-id) @ org.eclipse.ptp.rcp.sysmon ---
[INFO] 
[INFO] --- tycho-packaging-plugin:1.3.0:validate-version (default-validate-version) @ org.eclipse.ptp.rcp.sysmon ---
[INFO] 
[INFO] --- tycho-source-plugin:1.3.0:plugin-source (attach-source) @ org.eclipse.ptp.rcp.sysmon ---
[INFO] 
[INFO] --- target-platform-configuration:1.3.0:target-platform (default-target-platform) @ org.eclipse.ptp.rcp.sysmon ---
[INFO] 
[INFO] --- tycho-packaging-plugin:1.3.0:package-feature (default-package-feature) @ org.eclipse.ptp.rcp.sysmon ---
[INFO] Building jar: /jobs/genie.ptp/ptp-verify-packages/workspace/org.eclipse.ptp.rcp.sysmon-feature/target/org.eclipse.ptp.rcp.sysmon-9.2.1-SNAPSHOT.jar
[INFO] 
[INFO] --- tycho-p2-plugin:1.3.0:p2-metadata-default (default-p2-metadata-default) @ org.eclipse.ptp.rcp.sysmon ---
[INFO] 
[INFO] --- tycho-p2-plugin:1.3.0:feature-p2-metadata (default-feature-p2-metadata) @ org.eclipse.ptp.rcp.sysmon ---
[INFO] 
[INFO] --- maven-install-plugin:2.3.1:install (default-install) @ org.eclipse.ptp.rcp.sysmon ---
[INFO] Installing /jobs/genie.ptp/ptp-verify-packages/workspace/org.eclipse.ptp.rcp.sysmon-feature/target/org.eclipse.ptp.rcp.sysmon-9.2.1-SNAPSHOT.jar to /home/hudson/genie.ptp/.jenkins/jobs/ptp-verify-packages/workspace/.repository/org/eclipse/ptp/features/org.eclipse.ptp.rcp.sysmon/9.2.1-SNAPSHOT/org.eclipse.ptp.rcp.sysmon-9.2.1-SNAPSHOT.jar
[INFO] Installing /jobs/genie.ptp/ptp-verify-packages/workspace/org.eclipse.ptp.rcp.sysmon-feature/pom.xml to /home/hudson/genie.ptp/.jenkins/jobs/ptp-verify-packages/workspace/.repository/org/eclipse/ptp/features/org.eclipse.ptp.rcp.sysmon/9.2.1-SNAPSHOT/org.eclipse.ptp.rcp.sysmon-9.2.1-SNAPSHOT.pom
[INFO] Installing /jobs/genie.ptp/ptp-verify-packages/workspace/org.eclipse.ptp.rcp.sysmon-feature/target/p2content.xml to /home/hudson/genie.ptp/.jenkins/jobs/ptp-verify-packages/workspace/.repository/org/eclipse/ptp/features/org.eclipse.ptp.rcp.sysmon/9.2.1-SNAPSHOT/org.eclipse.ptp.rcp.sysmon-9.2.1-SNAPSHOT-p2metadata.xml
[INFO] Installing /jobs/genie.ptp/ptp-verify-packages/workspace/org.eclipse.ptp.rcp.sysmon-feature/target/p2artifacts.xml to /home/hudson/genie.ptp/.jenkins/jobs/ptp-verify-packages/workspace/.repository/org/eclipse/ptp/features/org.eclipse.ptp.rcp.sysmon/9.2.1-SNAPSHOT/org.eclipse.ptp.rcp.sysmon-9.2.1-SNAPSHOT-p2artifacts.xml
[INFO] 
[INFO] --- tycho-p2-plugin:1.3.0:update-local-index (default-update-local-index) @ org.eclipse.ptp.rcp.sysmon ---
[INFO] 
[INFO] ----------< org.eclipse.ptp.features:org.eclipse.ptp.product >----------
[INFO] Building org.eclipse.ptp.product 9.2.1-SNAPSHOT                    [4/6]
[INFO] --------------------------[ eclipse-feature ]---------------------------
[INFO] 
[INFO] --- maven-clean-plugin:2.5:clean (default-clean) @ org.eclipse.ptp.product ---
[INFO] 
[INFO] --- tycho-packaging-plugin:1.3.0:build-qualifier-aggregator (default-build-qualifier-aggregator) @ org.eclipse.ptp.product ---
[INFO] The project's OSGi version is 9.2.1.201902251846
[INFO] 
[INFO] --- tycho-packaging-plugin:1.3.0:validate-id (default-validate-id) @ org.eclipse.ptp.product ---
[INFO] 
[INFO] --- tycho-packaging-plugin:1.3.0:validate-version (default-validate-version) @ org.eclipse.ptp.product ---
[INFO] 
[INFO] --- tycho-source-plugin:1.3.0:plugin-source (attach-source) @ org.eclipse.ptp.product ---
[INFO] 
[INFO] --- target-platform-configuration:1.3.0:target-platform (default-target-platform) @ org.eclipse.ptp.product ---
[INFO] 
[INFO] --- tycho-packaging-plugin:1.3.0:package-feature (default-package-feature) @ org.eclipse.ptp.product ---
[INFO] Building jar: /jobs/genie.ptp/ptp-verify-packages/workspace/org.eclipse.ptp.product-feature/target/org.eclipse.ptp.product-9.2.1-SNAPSHOT.jar
[INFO] 
[INFO] --- tycho-p2-plugin:1.3.0:p2-metadata-default (default-p2-metadata-default) @ org.eclipse.ptp.product ---
[INFO] 
[INFO] --- tycho-p2-plugin:1.3.0:feature-p2-metadata (default-feature-p2-metadata) @ org.eclipse.ptp.product ---
[INFO] 
[INFO] --- maven-install-plugin:2.3.1:install (default-install) @ org.eclipse.ptp.product ---
[INFO] Installing /jobs/genie.ptp/ptp-verify-packages/workspace/org.eclipse.ptp.product-feature/target/org.eclipse.ptp.product-9.2.1-SNAPSHOT.jar to /home/hudson/genie.ptp/.jenkins/jobs/ptp-verify-packages/workspace/.repository/org/eclipse/ptp/features/org.eclipse.ptp.product/9.2.1-SNAPSHOT/org.eclipse.ptp.product-9.2.1-SNAPSHOT.jar
[INFO] Installing /jobs/genie.ptp/ptp-verify-packages/workspace/org.eclipse.ptp.product-feature/pom.xml to /home/hudson/genie.ptp/.jenkins/jobs/ptp-verify-packages/workspace/.repository/org/eclipse/ptp/features/org.eclipse.ptp.product/9.2.1-SNAPSHOT/org.eclipse.ptp.product-9.2.1-SNAPSHOT.pom
[INFO] Installing /jobs/genie.ptp/ptp-verify-packages/workspace/org.eclipse.ptp.product-feature/target/p2content.xml to /home/hudson/genie.ptp/.jenkins/jobs/ptp-verify-packages/workspace/.repository/org/eclipse/ptp/features/org.eclipse.ptp.product/9.2.1-SNAPSHOT/org.eclipse.ptp.product-9.2.1-SNAPSHOT-p2metadata.xml
[INFO] Installing /jobs/genie.ptp/ptp-verify-packages/workspace/org.eclipse.ptp.product-feature/target/p2artifacts.xml to /home/hudson/genie.ptp/.jenkins/jobs/ptp-verify-packages/workspace/.repository/org/eclipse/ptp/features/org.eclipse.ptp.product/9.2.1-SNAPSHOT/org.eclipse.ptp.product-9.2.1-SNAPSHOT-p2artifacts.xml
[INFO] 
[INFO] --- tycho-p2-plugin:1.3.0:update-local-index (default-update-local-index) @ org.eclipse.ptp.product ---
[INFO] 
[INFO] -----< org.eclipse.ptp.master:org.eclipse.ptp.rcp.sysmon-product >------
[INFO] Building org.eclipse.ptp.rcp.sysmon-product 9.2.1-SNAPSHOT         [5/6]
[INFO] -------------------------[ eclipse-repository ]-------------------------
[INFO] 
[INFO] --- maven-clean-plugin:2.5:clean (default-clean) @ org.eclipse.ptp.rcp.sysmon-product ---
[INFO] 
[INFO] --- tycho-packaging-plugin:1.3.0:build-qualifier-aggregator (default-build-qualifier-aggregator) @ org.eclipse.ptp.rcp.sysmon-product ---
[INFO] The project's OSGi version is 9.2.1.201902251846
[INFO] 
[INFO] --- maven-clean-plugin:2.5:clean (default-clean-1) @ org.eclipse.ptp.rcp.sysmon-product ---
[INFO] 
[INFO] --- maven-resources-plugin:2.4.1:resources (default-resources) @ org.eclipse.ptp.rcp.sysmon-product ---
[INFO] Using 'ISO-8859-1' encoding to copy filtered resources.
[INFO] skip non existing resourceDirectory /jobs/genie.ptp/ptp-verify-packages/workspace/org.eclipse.ptp.rcp.sysmon-product/src/main/resources
[INFO] 
[INFO] --- tycho-source-plugin:1.3.0:plugin-source (attach-source) @ org.eclipse.ptp.rcp.sysmon-product ---
[INFO] 
[INFO] --- target-platform-configuration:1.3.0:target-platform (default-target-platform) @ org.eclipse.ptp.rcp.sysmon-product ---
[INFO] 
[INFO] --- tycho-p2-publisher-plugin:1.3.0:publish-osgi-ee (default-publish-osgi-ee) @ org.eclipse.ptp.rcp.sysmon-product ---
[INFO] Published profile IUs: [a.jre.javase 10.0.0, config.a.jre.javase 10.0.0]
[INFO] Published profile IUs: [a.jre.javase 11.0.0, config.a.jre.javase 11.0.0]
[INFO] 
[INFO] --- tycho-p2-publisher-plugin:1.3.0:publish-products (default-publish-products) @ org.eclipse.ptp.rcp.sysmon-product ---
[INFO] 
[INFO] --- tycho-p2-publisher-plugin:1.3.0:publish-categories (default-publish-categories) @ org.eclipse.ptp.rcp.sysmon-product ---
[INFO] 
[INFO] --- tycho-p2-publisher-plugin:1.3.0:attach-artifacts (default-attach-artifacts) @ org.eclipse.ptp.rcp.sysmon-product ---
[INFO] 
[INFO] --- tycho-p2-repository-plugin:1.3.0:assemble-repository (default-assemble-repository) @ org.eclipse.ptp.rcp.sysmon-product ---
[INFO] 
[INFO] --- tycho-p2-repository-plugin:1.3.0:archive-repository (default-archive-repository) @ org.eclipse.ptp.rcp.sysmon-product ---
[INFO] Building zip: /jobs/genie.ptp/ptp-verify-packages/workspace/org.eclipse.ptp.rcp.sysmon-product/target/org.eclipse.ptp.rcp.sysmon-product-9.2.1-SNAPSHOT.zip
[INFO] 
[INFO] --- tycho-p2-director-plugin:1.3.0:materialize-products (materialize-products) @ org.eclipse.ptp.rcp.sysmon-product ---
[INFO] Installing product sysmon for environment linux/gtk/x86_64 to /jobs/genie.ptp/ptp-verify-packages/workspace/org.eclipse.ptp.rcp.sysmon-product/target/products/sysmon/linux/gtk/x86_64/sysmon
Installing sysmon 9.2.1.201902251846.
Operation completed in 2413 ms.
[INFO] Installing product sysmon for environment win32/win32/x86_64 to /jobs/genie.ptp/ptp-verify-packages/workspace/org.eclipse.ptp.rcp.sysmon-product/target/products/sysmon/win32/win32/x86_64/sysmon
Installing sysmon 9.2.1.201902251846.
Operation completed in 2031 ms.
[INFO] Installing product sysmon for environment macosx/cocoa/x86_64 to /jobs/genie.ptp/ptp-verify-packages/workspace/org.eclipse.ptp.rcp.sysmon-product/target/products/sysmon/macosx/cocoa/x86_64/SysMon.app
Installing sysmon 9.2.1.201902251846.
Operation completed in 2041 ms.
[INFO] 
[INFO] --- tycho-p2-director-plugin:1.3.0:archive-products (archive-products) @ org.eclipse.ptp.rcp.sysmon-product ---
[INFO] Building tar: /jobs/genie.ptp/ptp-verify-packages/workspace/org.eclipse.ptp.rcp.sysmon-product/target/products/sysmon-linux.gtk.x86_64.tar.gz
[INFO] Building zip: /jobs/genie.ptp/ptp-verify-packages/workspace/org.eclipse.ptp.rcp.sysmon-product/target/products/sysmon-win32.win32.x86_64.zip
[INFO] Building tar: /jobs/genie.ptp/ptp-verify-packages/workspace/org.eclipse.ptp.rcp.sysmon-product/target/products/sysmon-macosx.cocoa.x86_64.tar.gz
[INFO] 
[INFO] --- maven-install-plugin:2.3.1:install (default-install) @ org.eclipse.ptp.rcp.sysmon-product ---
[INFO] Installing /jobs/genie.ptp/ptp-verify-packages/workspace/org.eclipse.ptp.rcp.sysmon-product/target/org.eclipse.ptp.rcp.sysmon-product-9.2.1-SNAPSHOT.zip to /home/hudson/genie.ptp/.jenkins/jobs/ptp-verify-packages/workspace/.repository/org/eclipse/ptp/master/org.eclipse.ptp.rcp.sysmon-product/9.2.1-SNAPSHOT/org.eclipse.ptp.rcp.sysmon-product-9.2.1-SNAPSHOT.zip
[INFO] Installing /jobs/genie.ptp/ptp-verify-packages/workspace/org.eclipse.ptp.rcp.sysmon-product/pom.xml to /home/hudson/genie.ptp/.jenkins/jobs/ptp-verify-packages/workspace/.repository/org/eclipse/ptp/master/org.eclipse.ptp.rcp.sysmon-product/9.2.1-SNAPSHOT/org.eclipse.ptp.rcp.sysmon-product-9.2.1-SNAPSHOT.pom
[INFO] Installing /jobs/genie.ptp/ptp-verify-packages/workspace/org.eclipse.ptp.rcp.sysmon-product/target/p2artifacts.xml to /home/hudson/genie.ptp/.jenkins/jobs/ptp-verify-packages/workspace/.repository/org/eclipse/ptp/master/org.eclipse.ptp.rcp.sysmon-product/9.2.1-SNAPSHOT/org.eclipse.ptp.rcp.sysmon-product-9.2.1-SNAPSHOT-p2artifacts.xml
[INFO] Installing /jobs/genie.ptp/ptp-verify-packages/workspace/org.eclipse.ptp.rcp.sysmon-product/target/extraArtifacts/sysmon.executable.win32.win32.x86_64.zip to /home/hudson/genie.ptp/.jenkins/jobs/ptp-verify-packages/workspace/.repository/org/eclipse/ptp/master/org.eclipse.ptp.rcp.sysmon-product/9.2.1-SNAPSHOT/org.eclipse.ptp.rcp.sysmon-product-9.2.1-SNAPSHOT-sysmon.executable.win32.win32.x86_64.zip
[INFO] Installing /jobs/genie.ptp/ptp-verify-packages/workspace/org.eclipse.ptp.rcp.sysmon-product/target/extraArtifacts/sysmon.executable.gtk.linux.x86_64.zip to /home/hudson/genie.ptp/.jenkins/jobs/ptp-verify-packages/workspace/.repository/org/eclipse/ptp/master/org.eclipse.ptp.rcp.sysmon-product/9.2.1-SNAPSHOT/org.eclipse.ptp.rcp.sysmon-product-9.2.1-SNAPSHOT-sysmon.executable.gtk.linux.x86_64.zip
[INFO] Installing /jobs/genie.ptp/ptp-verify-packages/workspace/org.eclipse.ptp.rcp.sysmon-product/target/extraArtifacts/sysmon.executable.cocoa.macosx.x86_64.zip to /home/hudson/genie.ptp/.jenkins/jobs/ptp-verify-packages/workspace/.repository/org/eclipse/ptp/master/org.eclipse.ptp.rcp.sysmon-product/9.2.1-SNAPSHOT/org.eclipse.ptp.rcp.sysmon-product-9.2.1-SNAPSHOT-sysmon.executable.cocoa.macosx.x86_64.zip
[INFO] Installing /jobs/genie.ptp/ptp-verify-packages/workspace/org.eclipse.ptp.rcp.sysmon-product/target/p2content.xml to /home/hudson/genie.ptp/.jenkins/jobs/ptp-verify-packages/workspace/.repository/org/eclipse/ptp/master/org.eclipse.ptp.rcp.sysmon-product/9.2.1-SNAPSHOT/org.eclipse.ptp.rcp.sysmon-product-9.2.1-SNAPSHOT-p2metadata.xml
[INFO] Installing /jobs/genie.ptp/ptp-verify-packages/workspace/org.eclipse.ptp.rcp.sysmon-product/target/products/sysmon-linux.gtk.x86_64.tar.gz to /home/hudson/genie.ptp/.jenkins/jobs/ptp-verify-packages/workspace/.repository/org/eclipse/ptp/master/org.eclipse.ptp.rcp.sysmon-product/9.2.1-SNAPSHOT/org.eclipse.ptp.rcp.sysmon-product-9.2.1-SNAPSHOT-linux.gtk.x86_64.tar.gz
[INFO] Installing /jobs/genie.ptp/ptp-verify-packages/workspace/org.eclipse.ptp.rcp.sysmon-product/target/products/sysmon-win32.win32.x86_64.zip to /home/hudson/genie.ptp/.jenkins/jobs/ptp-verify-packages/workspace/.repository/org/eclipse/ptp/master/org.eclipse.ptp.rcp.sysmon-product/9.2.1-SNAPSHOT/org.eclipse.ptp.rcp.sysmon-product-9.2.1-SNAPSHOT-win32.win32.x86_64.zip
[INFO] Installing /jobs/genie.ptp/ptp-verify-packages/workspace/org.eclipse.ptp.rcp.sysmon-product/target/products/sysmon-macosx.cocoa.x86_64.tar.gz to /home/hudson/genie.ptp/.jenkins/jobs/ptp-verify-packages/workspace/.repository/org/eclipse/ptp/master/org.eclipse.ptp.rcp.sysmon-product/9.2.1-SNAPSHOT/org.eclipse.ptp.rcp.sysmon-product-9.2.1-SNAPSHOT-macosx.cocoa.x86_64.tar.gz
[INFO] 
[INFO] --- tycho-p2-plugin:1.3.0:update-local-index (default-update-local-index) @ org.eclipse.ptp.rcp.sysmon-product ---
[INFO] 
[INFO] -----------< org.eclipse.ptp.master:org.eclipse.ptp-product >-----------
[INFO] Building org.eclipse.ptp-product 9.2.1-SNAPSHOT                    [6/6]
[INFO] -------------------------[ eclipse-repository ]-------------------------
[INFO] 
[INFO] --- maven-clean-plugin:2.5:clean (default-clean) @ org.eclipse.ptp-product ---
[INFO] 
[INFO] --- tycho-packaging-plugin:1.3.0:build-qualifier-aggregator (default-build-qualifier-aggregator) @ org.eclipse.ptp-product ---
[INFO] The project's OSGi version is 9.2.1.201902251846
[INFO] 
[INFO] --- maven-clean-plugin:2.5:clean (default-clean-1) @ org.eclipse.ptp-product ---
[INFO] 
[INFO] --- maven-resources-plugin:2.4.1:resources (default-resources) @ org.eclipse.ptp-product ---
[INFO] Using 'ISO-8859-1' encoding to copy filtered resources.
[INFO] skip non existing resourceDirectory /jobs/genie.ptp/ptp-verify-packages/workspace/org.eclipse.ptp-product/src/main/resources
[INFO] 
[INFO] --- tycho-source-plugin:1.3.0:plugin-source (attach-source) @ org.eclipse.ptp-product ---
[INFO] 
[INFO] --- target-platform-configuration:1.3.0:target-platform (default-target-platform) @ org.eclipse.ptp-product ---
[INFO] 
[INFO] --- tycho-p2-publisher-plugin:1.3.0:publish-osgi-ee (default-publish-osgi-ee) @ org.eclipse.ptp-product ---
[INFO] Published profile IUs: [a.jre.javase 10.0.0, config.a.jre.javase 10.0.0]
[INFO] Published profile IUs: [a.jre.javase 11.0.0, config.a.jre.javase 11.0.0]
[INFO] 
[INFO] --- tycho-p2-publisher-plugin:1.3.0:publish-products (default-publish-products) @ org.eclipse.ptp-product ---
[INFO] 
[INFO] --- tycho-p2-publisher-plugin:1.3.0:publish-categories (default-publish-categories) @ org.eclipse.ptp-product ---
[INFO] 
[INFO] --- tycho-p2-publisher-plugin:1.3.0:attach-artifacts (default-attach-artifacts) @ org.eclipse.ptp-product ---
[INFO] 
[INFO] --- tycho-p2-repository-plugin:1.3.0:assemble-repository (default-assemble-repository) @ org.eclipse.ptp-product ---
[WARNING] Mirror tool: Problems resolving provisioning plan.: [Unable to satisfy dependency from toolinggtk.linux.x86_64org.eclipse.equinox.ds 9.2.1 to osgi.bundle; org.eclipse.equinox.ds 1.5.200.v20180827-1235.; Unable to satisfy dependency from toolinggtk.linux.x86_64org.eclipse.equinox.ds 9.2.1 to osgi.bundle; org.eclipse.equinox.ds 1.5.200.v20180827-1235.]
[WARNING] More information on the preceding warning(s) can be found here:
[WARNING] - http://wiki.eclipse.org/Tycho_Messages_Explained#Mirror_tool
[WARNING] Mirror tool: Problems resolving provisioning plan.: [Unable to satisfy dependency from toolingwin32.win32.x86_64org.eclipse.equinox.ds 9.2.1 to osgi.bundle; org.eclipse.equinox.ds 1.5.200.v20180827-1235.; Unable to satisfy dependency from toolingwin32.win32.x86_64org.eclipse.equinox.ds 9.2.1 to osgi.bundle; org.eclipse.equinox.ds 1.5.200.v20180827-1235.]
[WARNING] More information on the preceding warning(s) can be found here:
[WARNING] - http://wiki.eclipse.org/Tycho_Messages_Explained#Mirror_tool
[WARNING] Mirror tool: Problems resolving provisioning plan.: [Unable to satisfy dependency from toolingcocoa.macosx.x86_64org.eclipse.equinox.ds 9.2.1 to osgi.bundle; org.eclipse.equinox.ds 1.5.200.v20180827-1235.; Unable to satisfy dependency from toolingcocoa.macosx.x86_64org.eclipse.equinox.ds 9.2.1 to osgi.bundle; org.eclipse.equinox.ds 1.5.200.v20180827-1235.]
[WARNING] More information on the preceding warning(s) can be found here:
[WARNING] - http://wiki.eclipse.org/Tycho_Messages_Explained#Mirror_tool
[INFO] 
[INFO] --- tycho-p2-repository-plugin:1.3.0:archive-repository (default-archive-repository) @ org.eclipse.ptp-product ---
[INFO] Building zip: /jobs/genie.ptp/ptp-verify-packages/workspace/org.eclipse.ptp-product/target/org.eclipse.ptp-product-9.2.1-SNAPSHOT.zip
[INFO] 
[INFO] --- tycho-p2-director-plugin:1.3.0:materialize-products (materialize-products) @ org.eclipse.ptp-product ---
[INFO] Installing product ptp for environment linux/gtk/x86_64 to /jobs/genie.ptp/ptp-verify-packages/workspace/org.eclipse.ptp-product/target/products/ptp/linux/gtk/x86_64/eclipse
Installing ptp 9.2.1.
Installing org.eclipse.epp.mpc.feature.group 1.7.3.v20181205-1546.
Installing org.eclipse.cdt.feature.group 9.6.0.201812111211.
Installing org.eclipse.cdt.autotools.feature.group 9.6.0.201812111211.
Installing org.eclipse.cdt.bupc.feature.group 9.6.0.201811241055.
Installing org.eclipse.cdt.core.parser.upc.feature.feature.group 9.6.0.201811241055.
Installing org.eclipse.cdt.debug.ui.memory.feature.group 9.6.0.201811241055.
Installing org.eclipse.cdt.mylyn.feature.group 5.20.0.v20180905-0014.
Installing org.eclipse.cdt.platform.feature.group 9.6.0.201812111211.
Installing org.eclipse.cdt.xlc.feature.feature.group 9.6.0.201811241055.
Installing org.eclipse.egit.feature.group 5.2.0.201812061821-r.
Installing org.eclipse.jgit.feature.group 5.2.0.201812061821-r.
Installing org.eclipse.mylyn.bugzilla_feature.feature.group 3.24.2.v20180905-0003.
Installing org.eclipse.mylyn.context_feature.feature.group 3.24.2.v20180905-0014.
Installing org.eclipse.mylyn_feature.feature.group 3.24.2.v20180905-0003.
Installing org.eclipse.mylyn.ide_feature.feature.group 3.24.2.v20180905-0014.
Installing org.eclipse.mylyn.team_feature.feature.group 3.24.2.v20180905-0014.
Installing org.eclipse.mylyn.wikitext_feature.feature.group 3.0.25.201806201740.
Installing org.eclipse.ptp.feature.group 9.2.1.201902202039.
Installing org.eclipse.ptp.debug.sdm.feature.group 9.2.1.201902202039.
Installing org.eclipse.ptp.fortran.feature.group 9.2.1.201902202039.
Installing org.eclipse.ptp.pldt.upc.feature.group 9.2.1.201902202039.
Installing org.eclipse.ptp.rdt.sync.feature.group 9.2.1.201902202039.
Installing org.eclipse.ptp.remote.terminal.feature.group 9.2.1.201902202039.
Installing org.eclipse.ptp.rm.jaxb.contrib.feature.group 9.2.1.201902202039.
Installing org.eclipse.remote.feature.group 3.0.0.201803121903.
Installing org.eclipse.remote.console.feature.group 3.0.0.201803121903.
Installing org.eclipse.wst.xml_ui.feature.feature.group 3.12.0.v201811192212.
Installation failed.
Cannot complete the install because one or more required items could not be found.
 Software being installed: Eclipse for Parallel Application Developers 9.2.1 (ptp 9.2.1)
 Missing requirement: toolinggtk.linux.x86_64org.eclipse.equinox.ds 9.2.1 requires 'osgi.bundle; org.eclipse.equinox.ds 1.5.200.v20180827-1235' but it could not be found
 Cannot satisfy dependency:
  From: Eclipse for Parallel Application Developers 9.2.1 (ptp 9.2.1)
  To: org.eclipse.equinox.p2.iu; toolingptp.configuration [9.2.1,9.2.1]
 Cannot satisfy dependency:
  From: toolingptp.configuration 9.2.1
  To: org.eclipse.equinox.p2.iu; toolinggtk.linux.x86_64org.eclipse.equinox.ds [9.2.1,9.2.1]
Application failed, log file location: /jobs/genie.ptp/ptp-verify-packages/workspace/workspace/.metadata/.log
[INFO] ------------------------------------------------------------------------
[INFO] Reactor Summary:
[INFO] 
[INFO] PTP Products 9.2.1-SNAPSHOT ........................ SUCCESS [  0.991 s]
[INFO] org.eclipse.ptp.rcp.sysmon 1.0.0-SNAPSHOT .......... SUCCESS [  3.023 s]
[INFO] org.eclipse.ptp.rcp.sysmon ......................... SUCCESS [  3.780 s]
[INFO] org.eclipse.ptp.product ............................ SUCCESS [  0.121 s]
[INFO] org.eclipse.ptp.rcp.sysmon-product ................. SUCCESS [ 37.946 s]
[INFO] org.eclipse.ptp-product 9.2.1-SNAPSHOT ............. FAILURE [ 57.647 s]
[INFO] ------------------------------------------------------------------------
[INFO] BUILD FAILURE
[INFO] ------------------------------------------------------------------------
[INFO] Total time: 05:49 min
[INFO] Finished at: 2019-02-25T13:52:01-05:00
[INFO] ------------------------------------------------------------------------
[ERROR] Failed to execute goal org.eclipse.tycho:tycho-p2-director-plugin:1.3.0:materialize-products (materialize-products) on project org.eclipse.ptp-product: Installation of product ptp for environment linux/gtk/x86_64 failed: Call to p2 director application failed with exit code 13. Program arguments were: [-metadataRepository, file:/jobs/genie.ptp/ptp-verify-packages/workspace/org.eclipse.ptp-product/target/,file:/jobs/genie.ptp/ptp-verify-packages/workspace/org.eclipse.ptp-product/target/targetPlatformRepository/, -artifactRepository, file:/jobs/genie.ptp/ptp-verify-packages/workspace/org.eclipse.ptp-product/target/,file:/resolution-context-artifacts@%252Fjobs%252Fgenie.ptp%252Fptp-verify-packages%252Fworkspace%252Forg.eclipse.ptp-product,file:/jobs/genie.ptp/ptp-verify-packages/workspace/org.eclipse.ptp.product-feature/target/,file:/jobs/genie.ptp/ptp-verify-packages/workspace/org.eclipse.ptp-product/target/,file:/home/hudson/genie.ptp/.jenkins/jobs/ptp-verify-packages/workspace/.repository/, -installIU, ptp,org.eclipse.epp.mpc.feature.group,org.eclipse.cdt.feature.group,org.eclipse.cdt.autotools.feature.group,org.eclipse.cdt.bupc.feature.group,org.eclipse.cdt.core.parser.upc.feature.feature.group,org.eclipse.cdt.debug.ui.memory.feature.group,org.eclipse.cdt.mylyn.feature.group,org.eclipse.cdt.platform.feature.group,org.eclipse.cdt.xlc.feature.feature.group,org.eclipse.egit.feature.group,org.eclipse.jgit.feature.group,org.eclipse.mylyn.bugzilla_feature.feature.group,org.eclipse.mylyn.context_feature.feature.group,org.eclipse.mylyn_feature.feature.group,org.eclipse.mylyn.ide_feature.feature.group,org.eclipse.mylyn.team_feature.feature.group,org.eclipse.mylyn.wikitext_feature.feature.group,org.eclipse.ptp.feature.group,org.eclipse.ptp.debug.sdm.feature.group,org.eclipse.ptp.fortran.feature.group,org.eclipse.ptp.pldt.upc.feature.group,org.eclipse.ptp.rdt.sync.feature.group,org.eclipse.ptp.remote.terminal.feature.group,org.eclipse.ptp.rm.jaxb.contrib.feature.group,org.eclipse.remote.feature.group,org.eclipse.remote.console.feature.group,org.eclipse.wst.xml_ui.feature.feature.group, -destination, /jobs/genie.ptp/ptp-verify-packages/workspace/org.eclipse.ptp-product/target/products/ptp/linux/gtk/x86_64/eclipse, -profile, DefaultProfile, -profileProperties, org.eclipse.update.install.features=true, -roaming, -p2.os, linux, -p2.ws, gtk, -p2.arch, x86_64]. -> [Help 1]
[ERROR] 
[ERROR] To see the full stack trace of the errors, re-run Maven with the -e switch.
[ERROR] Re-run Maven using the -X switch to enable full debug logging.
[ERROR] 
[ERROR] For more information about the errors and possible solutions, please read the following articles:
[ERROR] [Help 1] http://cwiki.apache.org/confluence/display/MAVEN/MojoFailureException
[ERROR] 
[ERROR] After correcting the problems, you can resume the build with the command
[ERROR]   mvn <goals> -rf :org.eclipse.ptp-product
Build step 'Invoke top-level Maven targets' marked build as failure
Started calculate disk usage of build
Finished Calculation of disk usage of build in 0 seconds
Started calculate disk usage of workspace
Finished Calculation of disk usage of workspace in 0 seconds
Finished: FAILURE