FailedConsole Output

Skipping 252 KB.. Full Log
psePreferencesTest)  Time elapsed: 0.001 s
testNodeChangeListeners(org.eclipse.core.tests.internal.preferences.EclipsePreferencesTest)  Time elapsed: 0.001 s
testFileFormat(org.eclipse.core.tests.internal.preferences.EclipsePreferencesTest)  Time elapsed: 0.002 s
testAccept(org.eclipse.core.tests.internal.preferences.EclipsePreferencesTest)  Time elapsed: 0.001 s
testDouble(org.eclipse.core.tests.internal.preferences.EclipsePreferencesTest)  Time elapsed: 0.001 s
testLegacy(org.eclipse.core.tests.internal.preferences.EclipsePreferencesTest)  Time elapsed: 0.003 s
testParent(org.eclipse.core.tests.internal.preferences.EclipsePreferencesTest)  Time elapsed: 0 s
testRemove(org.eclipse.core.tests.internal.preferences.EclipsePreferencesTest)  Time elapsed: 0.001 s
testString(org.eclipse.core.tests.internal.preferences.EclipsePreferencesTest)  Time elapsed: 0 s
testGetSegmentCount(org.eclipse.core.tests.internal.preferences.EclipsePreferencesTest)  Time elapsed: 0 s
test_55410(org.eclipse.core.tests.internal.preferences.EclipsePreferencesTest)  Time elapsed: 0.001 s
test_60590(org.eclipse.core.tests.internal.preferences.EclipsePreferencesTest)  Time elapsed: 0 s
test_68897(org.eclipse.core.tests.internal.preferences.EclipsePreferencesTest)  Time elapsed: 0.315 s
testGet(org.eclipse.core.tests.internal.preferences.PreferencesServiceTest)  Time elapsed: 0.001 s
testExportDefaults(org.eclipse.core.tests.internal.preferences.PreferencesServiceTest)  Time elapsed: 0.001 s
testImportLegacy(org.eclipse.core.tests.internal.preferences.PreferencesServiceTest)  Time elapsed: 0.016 s
testImportExceptions(org.eclipse.core.tests.internal.preferences.PreferencesServiceTest)  Time elapsed: 0.001 s
testExportExcludes1(org.eclipse.core.tests.internal.preferences.PreferencesServiceTest)  Time elapsed: 0 s
testExportExcludes2(org.eclipse.core.tests.internal.preferences.PreferencesServiceTest)  Time elapsed: 0.001 s
testExportExcludes3(org.eclipse.core.tests.internal.preferences.PreferencesServiceTest)  Time elapsed: 0 s
testExportExcludes4(org.eclipse.core.tests.internal.preferences.PreferencesServiceTest)  Time elapsed: 0.001 s
testExportExcludes5(org.eclipse.core.tests.internal.preferences.PreferencesServiceTest)  Time elapsed: 0 s
testValidateVersions(org.eclipse.core.tests.internal.preferences.PreferencesServiceTest)  Time elapsed: 0.025 s
testMatches(org.eclipse.core.tests.internal.preferences.PreferencesServiceTest)  Time elapsed: 0.002 s
testSearchingStringBasics(org.eclipse.core.tests.internal.preferences.PreferencesServiceTest)  Time elapsed: 0.011 s
testExportWithTransfers1(org.eclipse.core.tests.internal.preferences.PreferencesServiceTest)  Time elapsed: 0.002 s
testExportWithTransfers2(org.eclipse.core.tests.internal.preferences.PreferencesServiceTest)  Time elapsed: 0.002 s
testExportWithTransfers3(org.eclipse.core.tests.internal.preferences.PreferencesServiceTest)  Time elapsed: 0.001 s
testExportWithTransfers4(org.eclipse.core.tests.internal.preferences.PreferencesServiceTest)  Time elapsed: 0.005 s
testLookupOrder(org.eclipse.core.tests.internal.preferences.PreferencesServiceTest)  Time elapsed: 0.001 s
testMatches2(org.eclipse.core.tests.internal.preferences.PreferencesServiceTest)  Time elapsed: 0.001 s
testApplyAndExportedPreferencesNotModified(org.eclipse.core.tests.internal.preferences.PreferencesServiceTest)  Time elapsed: 0.002 s
testDefaultFromInitializer(org.eclipse.core.tests.internal.preferences.PreferencesServiceTest)  Time elapsed: 0.002 s
testApplyWithTransfers(org.eclipse.core.tests.internal.preferences.PreferencesServiceTest)  Time elapsed: 0 s
testImportExportBasic(org.eclipse.core.tests.internal.preferences.PreferencesServiceTest)  Time elapsed: 0.006 s
testGetWithNodes(org.eclipse.core.tests.internal.preferences.PreferencesServiceTest)  Time elapsed: 0.001 s
testBadContext(org.eclipse.core.tests.internal.preferences.IScopeContextTest)  Time elapsed: 0 s
testGetNode(org.eclipse.core.tests.internal.preferences.IScopeContextTest)  Time elapsed: 0.001 s
testBug(org.eclipse.core.tests.internal.preferences.TestBug388004)  Time elapsed: 0 s
testBug(org.eclipse.core.tests.internal.preferences.TestBug380859)  Time elapsed: 0 s
testExportEmptyPreference(org.eclipse.core.tests.runtime.PreferenceExportTest)  Time elapsed: 0.071 s
testKeyIdentityAfterExport(org.eclipse.core.tests.runtime.PreferenceExportTest)  Time elapsed: 0.056 s
testNeedsSaving(org.eclipse.core.tests.runtime.PreferenceForwarderTest)  Time elapsed: 0.007 s
test55138(org.eclipse.core.tests.runtime.PreferenceForwarderTest)  Time elapsed: 0.002 s
testFloat(org.eclipse.core.tests.runtime.PreferenceForwarderTest)  Time elapsed: 0.001 s
testLong(org.eclipse.core.tests.runtime.PreferenceForwarderTest)  Time elapsed: 0 s
testListeners(org.eclipse.core.tests.runtime.PreferenceForwarderTest)  Time elapsed: 0.002 s
testBoolean(org.eclipse.core.tests.runtime.PreferenceForwarderTest)  Time elapsed: 0.001 s
testContains(org.eclipse.core.tests.runtime.PreferenceForwarderTest)  Time elapsed: 0 s
testConstants(org.eclipse.core.tests.runtime.PreferenceForwarderTest)  Time elapsed: 0.001 s
testListenerOnRemove(org.eclipse.core.tests.runtime.PreferenceForwarderTest)  Time elapsed: 0.003 s
testPropertyNames(org.eclipse.core.tests.runtime.PreferenceForwarderTest)  Time elapsed: 0 s
testBasics(org.eclipse.core.tests.runtime.PreferenceForwarderTest)  Time elapsed: 0.001 s
testDouble(org.eclipse.core.tests.runtime.PreferenceForwarderTest)  Time elapsed: 0.002 s
testInteger(org.eclipse.core.tests.runtime.PreferenceForwarderTest)  Time elapsed: 0 s
testString(org.eclipse.core.tests.runtime.PreferenceForwarderTest)  Time elapsed: 0.001 s
testDefaultPropertyNames(org.eclipse.core.tests.runtime.PreferenceForwarderTest)  Time elapsed: 0.001 s
testLoadStore(org.eclipse.core.tests.runtime.PreferenceForwarderTest)  Time elapsed: 0.002 s
testNeedsSaving(org.eclipse.core.tests.runtime.PreferencesTest)  Time elapsed: 0.001 s
testFloat(org.eclipse.core.tests.runtime.PreferencesTest)  Time elapsed: 0.001 s
testLong(org.eclipse.core.tests.runtime.PreferencesTest)  Time elapsed: 0 s
testListeners(org.eclipse.core.tests.runtime.PreferencesTest)  Time elapsed: 0.002 s
testBoolean(org.eclipse.core.tests.runtime.PreferencesTest)  Time elapsed: 0 s
testContains(org.eclipse.core.tests.runtime.PreferencesTest)  Time elapsed: 0 s
testListeners2(org.eclipse.core.tests.runtime.PreferencesTest)  Time elapsed: 0 s
testConstants(org.eclipse.core.tests.runtime.PreferencesTest)  Time elapsed: 0.001 s
testPropertyNames(org.eclipse.core.tests.runtime.PreferencesTest)  Time elapsed: 0 s
testBasics(org.eclipse.core.tests.runtime.PreferencesTest)  Time elapsed: 0 s
testDouble(org.eclipse.core.tests.runtime.PreferencesTest)  Time elapsed: 0.001 s
testInteger(org.eclipse.core.tests.runtime.PreferencesTest)  Time elapsed: 0 s
testString(org.eclipse.core.tests.runtime.PreferencesTest)  Time elapsed: 0 s
testDefaultPropertyNames(org.eclipse.core.tests.runtime.PreferencesTest)  Time elapsed: 0.001 s
testLoadStore(org.eclipse.core.tests.runtime.PreferencesTest)  Time elapsed: 0 s

Results:

Tests run: 296, Failures: 0, Errors: 0, Skipped: 0

[INFO] All tests passed!
[INFO] 
[INFO] --- tycho-p2-extras-plugin:1.7.0:compare-version-with-baselines (compare-attached-artifacts-with-release) @ org.eclipse.core.tests.runtime ---
[INFO] Skipped
[INFO] 
[INFO] --------------< org.eclipse.e4:org.eclipse.e4.core.tests >--------------
[INFO] Building org.eclipse.e4.core.tests 1.1.1100-SNAPSHOT             [17/18]
[INFO] ------------------------[ eclipse-test-plugin ]-------------------------
[INFO] 
[INFO] --- maven-clean-plugin:3.1.0:clean (default-clean) @ org.eclipse.e4.core.tests ---
[INFO] 
[INFO] --- tycho-packaging-plugin:1.7.0:build-qualifier (default-build-qualifier) @ org.eclipse.e4.core.tests ---
[INFO] The project's OSGi version is 1.1.1100.v20200416-0723
[INFO] 
[INFO] --- tycho-packaging-plugin:1.7.0:validate-id (default-validate-id) @ org.eclipse.e4.core.tests ---
[INFO] 
[INFO] --- tycho-packaging-plugin:1.7.0:validate-version (default-validate-version) @ org.eclipse.e4.core.tests ---
[INFO] 
[INFO] --- maven-resources-plugin:3.1.0:copy-resources (saveproperties) @ org.eclipse.e4.core.tests ---
[INFO] Using 'UTF-8' encoding to copy filtered resources.
[INFO] skip non existing resourceDirectory /home/jenkins/agent/workspace/eclipse.platform.runtime-SonarQube/tests/org.eclipse.e4.core.tests/saveproperties
[INFO] 
[INFO] --- maven-enforcer-plugin:3.0.0-M3:enforce (enforce-maven) @ org.eclipse.e4.core.tests ---
[INFO] 
[INFO] --- jacoco-maven-plugin:0.8.5:prepare-agent (jacoco-agent) @ org.eclipse.e4.core.tests ---
[INFO] tycho.testArgLine set to -javaagent:/home/jenkins/agent/workspace/eclipse.platform.runtime-SonarQube/.repository/org/jacoco/org.jacoco.agent/0.8.5/org.jacoco.agent-0.8.5-runtime.jar=destfile=/home/jenkins/agent/workspace/eclipse.platform.runtime-SonarQube/jacoco.exec,append=true
[INFO] 
[INFO] --- eclipse-cbi-plugin:1.1.8-SNAPSHOT:generate-api-build-xml (default) @ org.eclipse.e4.core.tests ---
[INFO] 
[INFO] --- maven-resources-plugin:3.1.0:resources (default-resources) @ org.eclipse.e4.core.tests ---
[INFO] Using 'UTF-8' encoding to copy filtered resources.
[INFO] skip non existing resourceDirectory /home/jenkins/agent/workspace/eclipse.platform.runtime-SonarQube/tests/org.eclipse.e4.core.tests/src/main/resources
[INFO] 
[INFO] --- maven-resources-plugin:3.1.0:resources (filter-resources) @ org.eclipse.e4.core.tests ---
[INFO] Using 'UTF-8' encoding to copy filtered resources.
[INFO] skip non existing resourceDirectory /home/jenkins/agent/workspace/eclipse.platform.runtime-SonarQube/tests/org.eclipse.e4.core.tests/src/main/resources
[INFO] 
[INFO] --- tycho-compiler-plugin:1.7.0:compile (default-compile) @ org.eclipse.e4.core.tests ---
[INFO] Compiling 88 source files to /home/jenkins/agent/workspace/eclipse.platform.runtime-SonarQube/tests/org.eclipse.e4.core.tests/target/classes
[INFO] 
[INFO] --- tycho-eclipserun-plugin:1.7.0:eclipse-run (default) @ org.eclipse.e4.core.tests ---
[INFO] 
[INFO] --- maven-resources-plugin:3.1.0:testResources (default-testResources) @ org.eclipse.e4.core.tests ---
[INFO] Using 'UTF-8' encoding to copy filtered resources.
[INFO] skip non existing resourceDirectory /home/jenkins/agent/workspace/eclipse.platform.runtime-SonarQube/tests/org.eclipse.e4.core.tests/src/test/resources
[INFO] 
[INFO] --- tycho-source-plugin:1.7.0:plugin-source (plugin-source) @ org.eclipse.e4.core.tests ---
[INFO] Building jar: /home/jenkins/agent/workspace/eclipse.platform.runtime-SonarQube/tests/org.eclipse.e4.core.tests/target/org.eclipse.e4.core.tests-1.1.1100-SNAPSHOT-sources.jar
[INFO] 
[INFO] --- target-platform-configuration:1.7.0:target-platform (default-target-platform) @ org.eclipse.e4.core.tests ---
[INFO] 
[INFO] --- tycho-packaging-plugin:1.7.0:package-plugin (default-package-plugin) @ org.eclipse.e4.core.tests ---
[INFO] Building jar: /home/jenkins/agent/workspace/eclipse.platform.runtime-SonarQube/tests/org.eclipse.e4.core.tests/target/org.eclipse.e4.core.tests-1.1.1100-SNAPSHOT.jar
[INFO] 
[INFO] --- tycho-p2-plugin:1.7.0:p2-metadata-default (default-p2-metadata-default) @ org.eclipse.e4.core.tests ---
[WARNING] No repository found at file:/noThanks.
org.eclipse.equinox.p2.core.ProvisionException: No repository found at file:/noThanks.
    at org.eclipse.equinox.internal.p2.repository.helpers.AbstractRepositoryManager.fail (AbstractRepositoryManager.java:396)
    at org.eclipse.equinox.internal.p2.repository.helpers.AbstractRepositoryManager.loadRepository (AbstractRepositoryManager.java:661)
    at org.eclipse.equinox.internal.p2.metadata.repository.MetadataRepositoryManager.loadRepository (MetadataRepositoryManager.java:110)
    at org.eclipse.tycho.p2.remote.RemoteMetadataRepositoryManager.loadRepository (RemoteMetadataRepositoryManager.java:61)
    at org.eclipse.tycho.p2.remote.RemoteMetadataRepositoryManager.loadRepository (RemoteMetadataRepositoryManager.java:53)
    at org.eclipse.tycho.p2.tools.baseline.BaselineServiceImpl.getProjectBaseline (BaselineServiceImpl.java:95)
    at org.eclipse.tycho.plugins.p2.BaselineValidator.validateAndReplace (BaselineValidator.java:88)
    at org.eclipse.tycho.plugins.p2.P2MetadataMojo.attachP2Metadata (P2MetadataMojo.java:183)
    at org.eclipse.tycho.plugins.p2.P2MetadataMojo.execute (P2MetadataMojo.java:137)
    at org.eclipse.tycho.plugins.p2.P2MetadataDefaultMojo.execute (P2MetadataDefaultMojo.java:32)
    at org.apache.maven.plugin.DefaultBuildPluginManager.executeMojo (DefaultBuildPluginManager.java:137)
    at org.apache.maven.lifecycle.internal.MojoExecutor.execute (MojoExecutor.java:210)
    at org.apache.maven.lifecycle.internal.MojoExecutor.execute (MojoExecutor.java:156)
    at org.apache.maven.lifecycle.internal.MojoExecutor.execute (MojoExecutor.java:148)
    at org.apache.maven.lifecycle.internal.LifecycleModuleBuilder.buildProject (LifecycleModuleBuilder.java:117)
    at org.apache.maven.lifecycle.internal.LifecycleModuleBuilder.buildProject (LifecycleModuleBuilder.java:81)
    at org.apache.maven.lifecycle.internal.builder.singlethreaded.SingleThreadedBuilder.build (SingleThreadedBuilder.java:56)
    at org.apache.maven.lifecycle.internal.LifecycleStarter.execute (LifecycleStarter.java:128)
    at org.apache.maven.DefaultMaven.doExecute (DefaultMaven.java:305)
    at org.apache.maven.DefaultMaven.doExecute (DefaultMaven.java:192)
    at org.apache.maven.DefaultMaven.execute (DefaultMaven.java:105)
    at org.apache.maven.cli.MavenCli.execute (MavenCli.java:957)
    at org.apache.maven.cli.MavenCli.doMain (MavenCli.java:289)
    at org.apache.maven.cli.MavenCli.main (MavenCli.java:193)
    at sun.reflect.NativeMethodAccessorImpl.invoke0 (Native Method)
    at sun.reflect.NativeMethodAccessorImpl.invoke (NativeMethodAccessorImpl.java:62)
    at sun.reflect.DelegatingMethodAccessorImpl.invoke (DelegatingMethodAccessorImpl.java:43)
    at java.lang.reflect.Method.invoke (Method.java:498)
    at org.codehaus.plexus.classworlds.launcher.Launcher.launchEnhanced (Launcher.java:282)
    at org.codehaus.plexus.classworlds.launcher.Launcher.launch (Launcher.java:225)
    at org.codehaus.plexus.classworlds.launcher.Launcher.mainWithExitCode (Launcher.java:406)
    at org.codehaus.plexus.classworlds.launcher.Launcher.main (Launcher.java:347)
[INFO] No baseline version MavenProject: org.eclipse.e4:org.eclipse.e4.core.tests:1.1.1100-SNAPSHOT @ /home/jenkins/agent/workspace/eclipse.platform.runtime-SonarQube/tests/org.eclipse.e4.core.tests/pom.xml
[INFO] 
[INFO] --- tycho-surefire-plugin:1.7.0:test (default-test) @ org.eclipse.e4.core.tests ---
[INFO] Executing Test Runtime with timeout 0, logs (if any) will be placed at: /home/jenkins/agent/workspace/eclipse.platform.runtime-SonarQube/tests/org.eclipse.e4.core.tests/target/work/data/.metadata/.log
[INFO] Command line:
	[/opt/tools/java/oracle/jdk-8/1.8.0_202/jre/bin/java, -Dosgi.noShutdown=false, -Dosgi.os=linux, -Dosgi.ws=gtk, -Dosgi.arch=x86_64, -javaagent:/home/jenkins/agent/workspace/eclipse.platform.runtime-SonarQube/.repository/org/jacoco/org.jacoco.agent/0.8.5/org.jacoco.agent-0.8.5-runtime.jar=destfile=/home/jenkins/agent/workspace/eclipse.platform.runtime-SonarQube/jacoco.exec,append=true, -Dosgi.clean=true, -ea, -jar, /home/jenkins/agent/workspace/eclipse.platform.runtime-SonarQube/.repository/p2/osgi/bundle/org.eclipse.equinox.launcher/1.5.700.v20200207-2156/org.eclipse.equinox.launcher-1.5.700.v20200207-2156.jar, -data, /home/jenkins/agent/workspace/eclipse.platform.runtime-SonarQube/tests/org.eclipse.e4.core.tests/target/work/data, -install, /home/jenkins/agent/workspace/eclipse.platform.runtime-SonarQube/tests/org.eclipse.e4.core.tests/target/work, -configuration, /home/jenkins/agent/workspace/eclipse.platform.runtime-SonarQube/tests/org.eclipse.e4.core.tests/target/work/configuration, -application, org.eclipse.tycho.surefire.osgibooter.headlesstest, -testproperties, /home/jenkins/agent/workspace/eclipse.platform.runtime-SonarQube/tests/org.eclipse.e4.core.tests/target/surefire.properties]
Running org.eclipse.e4.core.tests.CoreTestSuite
Tests run: 195, Failures: 0, Errors: 0, Skipped: 0, Time elapsed: 2.909 s - in org.eclipse.e4.core.tests.CoreTestSuite
testBug398728(org.eclipse.e4.core.internal.tests.di.extensions.ExtendedSupplierInjectionTests)  Time elapsed: 0.125 s
testBug430041(org.eclipse.e4.core.internal.tests.di.extensions.ExtendedSupplierInjectionTests)  Time elapsed: 0.004 s
testSupplierOrdering(org.eclipse.e4.core.internal.tests.di.extensions.ExtendedSupplierInjectionTests)  Time elapsed: 0.002 s
testPreferencesQualifier(org.eclipse.e4.core.internal.tests.di.extensions.InjectionPreferencesTest)  Time elapsed: 0.033 s
testPreferencesConstructor(org.eclipse.e4.core.internal.tests.di.extensions.InjectionPreferencesTest)  Time elapsed: 0.009 s
testBaseTypeConversion(org.eclipse.e4.core.internal.tests.di.extensions.InjectionPreferencesTest)  Time elapsed: 0.022 s
testAutoConversion(org.eclipse.e4.core.internal.tests.di.extensions.InjectionPreferencesTest)  Time elapsed: 0.007 s
testPreferencesQualifier(org.eclipse.e4.core.internal.tests.di.extensions.InjectionMixedSuppliersTest)  Time elapsed: 0.005 s
testEventInjection(org.eclipse.e4.core.internal.tests.di.extensions.InjectionEventTest)  Time elapsed: 0.006 s
testInjectWildCard(org.eclipse.e4.core.internal.tests.di.extensions.InjectionEventTest)  Time elapsed: 0.002 s
testInjectType(org.eclipse.e4.core.internal.tests.di.extensions.InjectionEventTest)  Time elapsed: 0.002 s
testEventInjectionUnsubscribe(org.eclipse.e4.core.internal.tests.di.extensions.InjectionEventTest)  Time elapsed: 0.171 s
testUnInject(org.eclipse.e4.core.internal.tests.di.extensions.InjectionOSGiTest)  Time elapsed: 0.024 s
testBundleInject(org.eclipse.e4.core.internal.tests.di.extensions.InjectionOSGiTest)  Time elapsed: 0.013 s
testInject(org.eclipse.e4.core.internal.tests.di.extensions.InjectionOSGiTest)  Time elapsed: 0.001 s
testInjectBCinExecute(org.eclipse.e4.core.internal.tests.di.extensions.InjectionOSGiHandlerTest)  Time elapsed: 0.002 s
testDynamicAdd(org.eclipse.e4.core.internal.tests.di.extensions.ServiceSupplierTestCase)  Time elapsed: 0.021 s
testDynamicAddRemove(org.eclipse.e4.core.internal.tests.di.extensions.ServiceSupplierTestCase)  Time elapsed: 0.002 s
testCleanup(org.eclipse.e4.core.internal.tests.di.extensions.ServiceSupplierTestCase)  Time elapsed: 0.004 s
testOptionalReferences(org.eclipse.e4.core.internal.tests.di.extensions.ServiceSupplierTestCase)  Time elapsed: 0.506 s
testInitialInject(org.eclipse.e4.core.internal.tests.di.extensions.ServiceSupplierTestCase)  Time elapsed: 0.001 s
testStaticFilter(org.eclipse.e4.core.internal.tests.di.extensions.ServiceSupplierTestCase)  Time elapsed: 0.002 s
testCreateSectionFilter(org.eclipse.e4.core.internal.tests.about.AboutTest)  Time elapsed: 0.005 s
testAppendInstalledBundles(org.eclipse.e4.core.internal.tests.about.AboutTest)  Time elapsed: 0.134 s
testSystemEnvironmentVariables(org.eclipse.e4.core.internal.tests.about.AboutTest)  Time elapsed: 0.014 s
testSystemProperties(org.eclipse.e4.core.internal.tests.about.AboutTest)  Time elapsed: 0.016 s
testMaskPassword(org.eclipse.e4.core.internal.tests.about.AboutTest)  Time elapsed: 0.009 s
testAppendUserPreferences(org.eclipse.e4.core.internal.tests.about.AboutTest)  Time elapsed: 0.005 s
testAppendInstalledFeatures(org.eclipse.e4.core.internal.tests.about.AboutTest)  Time elapsed: 0.004 s
testMultilineValue(org.eclipse.e4.core.internal.tests.about.AboutTest)  Time elapsed: 0.004 s
testInstalledFeatures(org.eclipse.e4.core.internal.tests.about.InstalledFeaturesTest)  Time elapsed: 0.006 s
testSpecialMethodOnFailure(org.eclipse.e4.core.internal.tests.di.InjectionOrderTest)  Time elapsed: 0.003 s
testSuperclassMethods(org.eclipse.e4.core.internal.tests.di.InvokeTest)  Time elapsed: 0.001 s
testPrimitiveTypes(org.eclipse.e4.core.internal.tests.di.InjectBaseTypeTest)  Time elapsed: 0.028 s
testCallMethodsWithMissingAnnotation(org.eclipse.e4.core.internal.tests.di.InvokeTestMissingAnnotation)  Time elapsed: 0.001 s
testCallMethodsWithMissingAnnotationNoExecution(org.eclipse.e4.core.internal.tests.di.InvokeTestMissingAnnotation)  Time elapsed: 0 s
testLeaks(org.eclipse.e4.core.internal.tests.di.InjectionResultLeakTest)  Time elapsed: 0.248 s
testNonCreatableInstancesAreUsedFromContext(org.eclipse.e4.core.internal.tests.di.AutoConstructWithCreatableTest)  Time elapsed: 0.002 s
testCreatableIsCreated(org.eclipse.e4.core.internal.tests.di.AutoConstructWithCreatableTest)  Time elapsed: 0.003 s
testNonCreatableInstanceAreNotCreated(org.eclipse.e4.core.internal.tests.di.AutoConstructWithCreatableTest)  Time elapsed: 0 s
testDisposeClearsNotifyOnDisposalSet(org.eclipse.e4.core.internal.tests.contexts.EclipseContextTest)  Time elapsed: 0 s
testGetCFNotAValue(org.eclipse.e4.core.internal.tests.contexts.EclipseContextTest)  Time elapsed: 0.001 s
testNullInheritance(org.eclipse.e4.core.internal.tests.contexts.EclipseContextTest)  Time elapsed: 0.001 s
testRegisterRunAndTrackTwice(org.eclipse.e4.core.internal.tests.contexts.EclipseContextTest)  Time elapsed: 0 s
testGetLocal(org.eclipse.e4.core.internal.tests.contexts.EclipseContextTest)  Time elapsed: 0.001 s
testGetCFNotAValueToParent(org.eclipse.e4.core.internal.tests.contexts.EclipseContextTest)  Time elapsed: 0.001 s
testGet(org.eclipse.e4.core.internal.tests.contexts.EclipseContextTest)  Time elapsed: 0 s
testContextFunctionOrdering(org.eclipse.e4.core.internal.tests.contexts.EclipseContextTest)  Time elapsed: 0.001 s
testRemoveValueComputationOnDispose(org.eclipse.e4.core.internal.tests.contexts.EclipseContextTest)  Time elapsed: 0 s
testContainsKey(org.eclipse.e4.core.internal.tests.contexts.EclipseContextTest)  Time elapsed: 0 s
testDisposeRemovesParentReference(org.eclipse.e4.core.internal.tests.contexts.EclipseContextTest)  Time elapsed: 0.001 s
testRunAndTrackMultipleValues(org.eclipse.e4.core.internal.tests.contexts.EclipseContextTest)  Time elapsed: 0 s
testRunAndTrack(org.eclipse.e4.core.internal.tests.contexts.EclipseContextTest)  Time elapsed: 0.001 s
testContextFunctionInParent(org.eclipse.e4.core.internal.tests.contexts.EclipseContextTest)  Time elapsed: 0.001 s
testModify(org.eclipse.e4.core.internal.tests.contexts.EclipseContextTest)  Time elapsed: 0 s
testContextSetZeroArgs(org.eclipse.e4.core.internal.tests.contexts.inject.ContextInjectionTest)  Time elapsed: 0.001 s
testInjectionAndInheritance(org.eclipse.e4.core.internal.tests.contexts.inject.ContextInjectionTest)  Time elapsed: 0.003 s
testInjectionFromParent(org.eclipse.e4.core.internal.tests.contexts.inject.ContextInjectionTest)  Time elapsed: 0.002 s
testBug374421(org.eclipse.e4.core.internal.tests.contexts.inject.ContextInjectionTest)  Time elapsed: 0 s
testContextSetOneArg(org.eclipse.e4.core.internal.tests.contexts.inject.ContextInjectionTest)  Time elapsed: 0.002 s
testInjection(org.eclipse.e4.core.internal.tests.contexts.inject.ContextInjectionTest)  Time elapsed: 0 s
testInjectionCloseOverride(org.eclipse.e4.core.internal.tests.contexts.inject.ContextInjectionTest)  Time elapsed: 0.002 s
testContextDisposedNoArg(org.eclipse.e4.core.internal.tests.contexts.inject.ContextInjectionDisposeTest)  Time elapsed: 0.001 s
testReleaseObject(org.eclipse.e4.core.internal.tests.contexts.inject.ContextInjectionDisposeTest)  Time elapsed: 0.002 s
testDisposeContext(org.eclipse.e4.core.internal.tests.contexts.inject.ContextInjectionDisposeTest)  Time elapsed: 0.001 s
testInvoke(org.eclipse.e4.core.internal.tests.contexts.inject.ContextInjectionFactoryTest)  Time elapsed: 0.002 s
testInvokeWithParameters(org.eclipse.e4.core.internal.tests.contexts.inject.ContextInjectionFactoryTest)  Time elapsed: 0 s
testConstructorInjectionBasic(org.eclipse.e4.core.internal.tests.contexts.inject.ContextInjectionFactoryTest)  Time elapsed: 0.001 s
testReplaceFunctionWithStaticValue(org.eclipse.e4.core.internal.tests.contexts.ContextDynamicTest)  Time elapsed: 0.001 s
testAddRemove(org.eclipse.e4.core.internal.tests.contexts.ContextDynamicTest)  Time elapsed: 0.001 s
testParentAddRemove(org.eclipse.e4.core.internal.tests.contexts.ContextDynamicTest)  Time elapsed: 0.001 s
testContextFunctionNullBecomeParent(org.eclipse.e4.core.internal.tests.contexts.ReparentingTest)  Time elapsed: 0 s
testInjectSwitchParentSameGrandparent(org.eclipse.e4.core.internal.tests.contexts.ReparentingTest)  Time elapsed: 0.001 s
testContextFunctionInParentAdd(org.eclipse.e4.core.internal.tests.contexts.ReparentingTest)  Time elapsed: 0 s
testContextFunctionSwitchParent_2(org.eclipse.e4.core.internal.tests.contexts.ReparentingTest)  Time elapsed: 0.003 s
testContextFunctionParentBecomeNull(org.eclipse.e4.core.internal.tests.contexts.ReparentingTest)  Time elapsed: 0 s
testContextFunctionSwitchParent(org.eclipse.e4.core.internal.tests.contexts.ReparentingTest)  Time elapsed: 0 s
testUpdateSameParent(org.eclipse.e4.core.internal.tests.contexts.ReparentingTest)  Time elapsed: 0.001 s
testRunAndTrackParentBecomeNull(org.eclipse.e4.core.internal.tests.contexts.ReparentingTest)  Time elapsed: 0 s
testRunAndTrackSwitchParent(org.eclipse.e4.core.internal.tests.contexts.ReparentingTest)  Time elapsed: 0.001 s
testBug468048_contextFunction(org.eclipse.e4.core.internal.tests.contexts.ReparentingTest)  Time elapsed: 0.001 s
testBug468048_injection(org.eclipse.e4.core.internal.tests.contexts.ReparentingTest)  Time elapsed: 0.001 s
testContextFunctionInParentRemove(org.eclipse.e4.core.internal.tests.contexts.ReparentingTest)  Time elapsed: 0 s
testUpdateSameParentCalculated(org.eclipse.e4.core.internal.tests.contexts.ReparentingTest)  Time elapsed: 0.001 s
testInjectSwitchParent(org.eclipse.e4.core.internal.tests.contexts.ReparentingTest)  Time elapsed: 0.003 s
testRunAndTrackNullBecomesParent(org.eclipse.e4.core.internal.tests.contexts.ReparentingTest)  Time elapsed: 0 s
testActiveChain(org.eclipse.e4.core.internal.tests.contexts.RunAndTrackTest)  Time elapsed: 0.002 s
testSetContextVarToEqualObject(org.eclipse.e4.core.internal.tests.contexts.RunAndTrackTest)  Time elapsed: 0.001 s
testRunAndTrackSimple(org.eclipse.e4.core.internal.tests.contexts.RunAndTrackTest)  Time elapsed: 0.001 s
testSetContextVarToOtherObject(org.eclipse.e4.core.internal.tests.contexts.RunAndTrackTest)  Time elapsed: 0 s
testRunAndTrackComplex(org.eclipse.e4.core.internal.tests.contexts.RunAndTrackTest)  Time elapsed: 0.004 s
testSetHiddenValueToRootObject(org.eclipse.e4.core.internal.tests.contexts.RunAndTrackTest)  Time elapsed: 0.001 s
testSetHiddenValueToChildObject(org.eclipse.e4.core.internal.tests.contexts.RunAndTrackTest)  Time elapsed: 0.001 s
testSetHiddenValueToObjectEqualToChild(org.eclipse.e4.core.internal.tests.contexts.RunAndTrackTest)  Time elapsed: 0 s
testSetHiddenValueToEqualRootObject(org.eclipse.e4.core.internal.tests.contexts.RunAndTrackTest)  Time elapsed: 0 s
testSetHiddenValueToDifferentObject(org.eclipse.e4.core.internal.tests.contexts.RunAndTrackTest)  Time elapsed: 0 s
testSetHiddenValueToNull(org.eclipse.e4.core.internal.tests.contexts.RunAndTrackTest)  Time elapsed: 0 s
testRemoveContextVar(org.eclipse.e4.core.internal.tests.contexts.RunAndTrackTest)  Time elapsed: 0.001 s
testSetContextVarToSameObject(org.eclipse.e4.core.internal.tests.contexts.RunAndTrackTest)  Time elapsed: 0.001 s
testRemoveHiddenVariable(org.eclipse.e4.core.internal.tests.contexts.RunAndTrackTest)  Time elapsed: 0 s
testActiveChange(org.eclipse.e4.core.internal.tests.contexts.RunAndTrackTest)  Time elapsed: 0.001 s
testParentContextDisposal(org.eclipse.e4.core.internal.tests.contexts.inject.ParentContextDisposalTest)  Time elapsed: 0.002 s
testU(org.eclipse.e4.core.internal.tests.contexts.inject.ComplexDisposalTest)  Time elapsed: 0.001 s
testV(org.eclipse.e4.core.internal.tests.contexts.inject.ComplexDisposalTest)  Time elapsed: 0.001 s
testW(org.eclipse.e4.core.internal.tests.contexts.inject.ComplexDisposalTest)  Time elapsed: 0 s
testMake(org.eclipse.e4.core.internal.tests.di.DisposeClassLinkTest)  Time elapsed: 0.001 s
testInjectedWithContext(org.eclipse.e4.core.internal.tests.di.DisposeClassLinkTest)  Time elapsed: 0.001 s
testDisposeParentFirst(org.eclipse.e4.core.internal.tests.di.DisposeClassLinkTest)  Time elapsed: 0.001 s
testDisposeParent(org.eclipse.e4.core.internal.tests.di.DisposeClassLinkTest)  Time elapsed: 0 s
testBug430041(org.eclipse.e4.core.internal.tests.di.DisposeClassLinkTest)  Time elapsed: 0.002 s
testInject(org.eclipse.e4.core.internal.tests.di.DisposeClassLinkTest)  Time elapsed: 0 s
testStaticMake(org.eclipse.e4.core.internal.tests.contexts.inject.InjectStaticContextTest)  Time elapsed: 0.003 s
testStaticInject(org.eclipse.e4.core.internal.tests.contexts.inject.InjectStaticContextTest)  Time elapsed: 0.001 s
testStaticInvoke(org.eclipse.e4.core.internal.tests.contexts.inject.InjectStaticContextTest)  Time elapsed: 0.001 s
testContextActivation(org.eclipse.e4.core.internal.tests.contexts.ActivationTest)  Time elapsed: 0.002 s
testGetActiveRATNumberOfCalls(org.eclipse.e4.core.internal.tests.contexts.ActivationTest)  Time elapsed: 0 s
testGetActive(org.eclipse.e4.core.internal.tests.contexts.ActivationTest)  Time elapsed: 0 s
testGetActiveRATNumberOfCalls2(org.eclipse.e4.core.internal.tests.contexts.ActivationTest)  Time elapsed: 0.001 s
testGetActiveRAT(org.eclipse.e4.core.internal.tests.contexts.ActivationTest)  Time elapsed: 0 s
testGetActiveBug384425(org.eclipse.e4.core.internal.tests.contexts.ActivationTest)  Time elapsed: 0.001 s
testInheritedSpecialMethods(org.eclipse.e4.core.internal.tests.contexts.inject.AnnotationsInjectionTest)  Time elapsed: 0.001 s
testPostConstruct(org.eclipse.e4.core.internal.tests.contexts.inject.AnnotationsInjectionTest)  Time elapsed: 0.001 s
testContextSetOneArg(org.eclipse.e4.core.internal.tests.contexts.inject.AnnotationsInjectionTest)  Time elapsed: 0.001 s
testOptionalInjection(org.eclipse.e4.core.internal.tests.contexts.inject.AnnotationsInjectionTest)  Time elapsed: 0.002 s
testInjection(org.eclipse.e4.core.internal.tests.contexts.inject.AnnotationsInjectionTest)  Time elapsed: 0 s
testInvoke(org.eclipse.e4.core.internal.tests.contexts.inject.AnnotationsInjectionTest)  Time elapsed: 0.001 s
testOptionalInvoke(org.eclipse.e4.core.internal.tests.contexts.inject.AnnotationsInjectionTest)  Time elapsed: 0.001 s
testFieldMethodOrder(org.eclipse.e4.core.internal.tests.contexts.inject.AnnotationsInjectionTest)  Time elapsed: 0.002 s
testPreDestroy(org.eclipse.e4.core.internal.tests.contexts.inject.AnnotationsInjectionTest)  Time elapsed: 0.001 s
testConstructorInjection(org.eclipse.e4.core.internal.tests.contexts.inject.TestConstructorInjection)  Time elapsed: 0.002 s
testServiceRemovalOnContextDispose(org.eclipse.e4.core.internal.tests.contexts.inject.ServiceContextTest)  Time elapsed: 0.002 s
testServiceInjection(org.eclipse.e4.core.internal.tests.contexts.inject.ServiceContextTest)  Time elapsed: 0.002 s
testServiceContextAsParent(org.eclipse.e4.core.internal.tests.contexts.inject.ServiceContextTest)  Time elapsed: 0.001 s
testRecursiveServiceRemoval(org.eclipse.e4.core.internal.tests.contexts.inject.ServiceContextTest)  Time elapsed: 0.004 s
testDeclarativeService(org.eclipse.e4.core.internal.tests.contexts.inject.ServiceContextTest)  Time elapsed: 0 s
testServiceExample(org.eclipse.e4.core.internal.tests.contexts.inject.ServiceContextTest)  Time elapsed: 0.007 s
testServiceAddition(org.eclipse.e4.core.internal.tests.contexts.inject.ServiceContextTest)  Time elapsed: 0.001 s
testOptionalReferences(org.eclipse.e4.core.internal.tests.contexts.inject.ServiceContextTest)  Time elapsed: 0.505 s
testServiceRanking(org.eclipse.e4.core.internal.tests.contexts.inject.ServiceContextTest)  Time elapsed: 0.503 s
testConstructorWithProvider(org.eclipse.e4.core.internal.tests.contexts.inject.ProviderInjectionTest)  Time elapsed: 0.004 s
testInvokeWithProvider(org.eclipse.e4.core.internal.tests.contexts.inject.ProviderInjectionTest)  Time elapsed: 0.001 s
testNestedUpdatesConstructor(org.eclipse.e4.core.internal.tests.contexts.inject.InjectionUpdateTest)  Time elapsed: 0.002 s
testPropagation(org.eclipse.e4.core.internal.tests.contexts.inject.InjectionUpdateTest)  Time elapsed: 0.003 s
testNestedUpdatesPostConstruct(org.eclipse.e4.core.internal.tests.contexts.inject.InjectionUpdateTest)  Time elapsed: 0.002 s
testContextDisposeCausesCompleteUninjection_Optional_False(org.eclipse.e4.core.internal.tests.contexts.inject.DisposingReferencedContextTest)  Time elapsed: 0.001 s
testContextDisposeCausesCompleteUninjection_Mandatory_False(org.eclipse.e4.core.internal.tests.contexts.inject.DisposingReferencedContextTest)  Time elapsed: 0.002 s
testContextDisposeCausesCompleteUninjection_Optional_True(org.eclipse.e4.core.internal.tests.contexts.inject.DisposingReferencedContextTest)  Time elapsed: 0 s
testContextDisposeCausesCompleteUninjection_Mandatory_True(org.eclipse.e4.core.internal.tests.contexts.inject.DisposingReferencedContextTest)  Time elapsed: 0 s
testSpecialMethodOnFailure(org.eclipse.e4.core.internal.tests.di.InjectionOrderTest)  Time elapsed: 0 s
testNoGrouping(org.eclipse.e4.core.internal.tests.contexts.inject.GroupedUpdatesTest)  Time elapsed: 0.001 s
testGrouping(org.eclipse.e4.core.internal.tests.contexts.inject.GroupedUpdatesTest)  Time elapsed: 0.002 s
testExtraDependencies(org.eclipse.e4.core.internal.tests.contexts.inject.ExtraDependenciesTest)  Time elapsed: 0.001 s
testBug315109(org.eclipse.e4.core.internal.tests.contexts.inject.ContextFunctionDynamicsTest)  Time elapsed: 0.001 s
testOverrideICF(org.eclipse.e4.core.internal.tests.contexts.inject.ContextFunctionDynamicsTest)  Time elapsed: 0.001 s
testLongChain(org.eclipse.e4.core.internal.tests.contexts.inject.ContextFunctionDynamicsTest)  Time elapsed: 0.002 s
testChangeICF(org.eclipse.e4.core.internal.tests.contexts.inject.ContextFunctionDynamicsTest)  Time elapsed: 0.002 s
testArrayInjection(org.eclipse.e4.core.internal.tests.di.InjectArraysTest)  Time elapsed: 0.001 s
testInvokationFail(org.eclipse.e4.core.internal.tests.di.InjectBridgeTest)  Time elapsed: 0.001 s
testInjection(org.eclipse.e4.core.internal.tests.di.InjectBridgeTest)  Time elapsed: 0.001 s
testInvokation(org.eclipse.e4.core.internal.tests.di.InjectBridgeTest)  Time elapsed: 0 s
testInjectionFail(org.eclipse.e4.core.internal.tests.di.InjectBridgeTest)  Time elapsed: 0 s
testStaticInvoke(org.eclipse.e4.core.internal.tests.contexts.inject.InvokeInRATTest)  Time elapsed: 0.001 s
testX(org.eclipse.e4.core.internal.tests.contexts.inject.Bug317183Test)  Time elapsed: 0 s
testY(org.eclipse.e4.core.internal.tests.contexts.inject.Bug317183Test)  Time elapsed: 0 s
testBug(org.eclipse.e4.core.internal.tests.contexts.DependenciesLeakTest)  Time elapsed: 0.001 s
testInvalidateDirectly(org.eclipse.e4.core.internal.tests.contexts.DependenciesLeakTest)  Time elapsed: 0 s
testContextActivation(org.eclipse.e4.core.internal.tests.contexts.inject.ActivationInjectionTest)  Time elapsed: 0.003 s
testActivationInjection(org.eclipse.e4.core.internal.tests.contexts.inject.ActivationInjectionTest)  Time elapsed: 0.003 s
testInjection(org.eclipse.e4.core.internal.tests.contexts.inject.ActivationInjectionTest)  Time elapsed: 0.002 s
testGenericInjection(org.eclipse.e4.core.internal.tests.contexts.inject.GenericsInjectionTest)  Time elapsed: 0.002 s
testClassGenericInjection(org.eclipse.e4.core.internal.tests.contexts.inject.GenericsInjectionTest)  Time elapsed: 0.002 s
testNamedInjection(org.eclipse.e4.core.internal.tests.contexts.inject.GenericsInjectionTest)  Time elapsed: 0.001 s
testInterfaceGenericInjection(org.eclipse.e4.core.internal.tests.contexts.inject.GenericsInjectionTest)  Time elapsed: 0 s
testNested(org.eclipse.e4.core.internal.tests.di.RecursiveObjectCreationTest)  Time elapsed: 0.002 s
testSelfInject(org.eclipse.e4.core.internal.tests.di.RecursiveObjectCreationTest)  Time elapsed: 0 s
testBundleMessagesUseDefaultLocaleForInvalidLocale(org.eclipse.e4.core.internal.tests.nls.NLSTest)  Time elapsed: 0.018 s
testSimpleMessagesUseDefaultLocaleForInvalidLocale(org.eclipse.e4.core.internal.tests.nls.NLSTest)  Time elapsed: 0.003 s
testSimpleMessagesSkipDefaultLocaleForEquinoxRoot(org.eclipse.e4.core.internal.tests.nls.NLSTest)  Time elapsed: 0.003 s
testBundleMessagesDifferentLocale(org.eclipse.e4.core.internal.tests.nls.NLSTest)  Time elapsed: 0.002 s
testSimpleMessages(org.eclipse.e4.core.internal.tests.nls.NLSTest)  Time elapsed: 0.001 s
testClassBasedResourceBundle(org.eclipse.e4.core.internal.tests.nls.NLSTest)  Time elapsed: 0.004 s
testResourcesBundleUseDefaultLocaleForInvalidLocale(org.eclipse.e4.core.internal.tests.nls.NLSTest)  Time elapsed: 0.006 s
testResourcesBundle(org.eclipse.e4.core.internal.tests.nls.NLSTest)  Time elapsed: 0.002 s
testMessages(org.eclipse.e4.core.internal.tests.nls.NLSTest)  Time elapsed: 0.004 s
testSimpleMessagesDifferentLocale(org.eclipse.e4.core.internal.tests.nls.NLSTest)  Time elapsed: 0.003 s
testClassBasedResourceBundleSkipDefaultLocaleForEquinoxRoot(org.eclipse.e4.core.internal.tests.nls.NLSTest)  Time elapsed: 0.001 s
testResourcesBundleSkipDefaultLocaleForEquinoxRoot(org.eclipse.e4.core.internal.tests.nls.NLSTest)  Time elapsed: 0 s
testBundleMessages(org.eclipse.e4.core.internal.tests.nls.NLSTest)  Time elapsed: 0 s
testMessagesSkipDefaultLocaleForEquinoxRoot(org.eclipse.e4.core.internal.tests.nls.NLSTest)  Time elapsed: 0.001 s
testBundleMessagesSkipDefaultLocaleForEquinoxRoot(org.eclipse.e4.core.internal.tests.nls.NLSTest)  Time elapsed: 0 s
testClassBasedResourceBundleUseDefaultLocaleForInvalidLocale(org.eclipse.e4.core.internal.tests.nls.NLSTest)  Time elapsed: 0.003 s
testMessagesDifferentLocale(org.eclipse.e4.core.internal.tests.nls.NLSTest)  Time elapsed: 0 s
testClassBasedResourceBundleDifferentLocale(org.eclipse.e4.core.internal.tests.nls.NLSTest)  Time elapsed: 0 s
testMessagesUseDefaultLocaleForInvalidLocale(org.eclipse.e4.core.internal.tests.nls.NLSTest)  Time elapsed: 0 s
testResourcesBundleDifferentLocale(org.eclipse.e4.core.internal.tests.nls.NLSTest)  Time elapsed: 0.001 s

Results:

Tests run: 195, Failures: 0, Errors: 0, Skipped: 0

[INFO] All tests passed!
[INFO] 
[INFO] --- tycho-p2-extras-plugin:1.7.0:compare-version-with-baselines (compare-attached-artifacts-with-release) @ org.eclipse.e4.core.tests ---
[INFO] Skipped
[INFO] 
[INFO] --------< org.eclipse.core:org.eclipse.core.contenttype.tests >---------
[INFO] Building org.eclipse.core.contenttype.tests 1.0.200-SNAPSHOT     [18/18]
[INFO] ------------------------[ eclipse-test-plugin ]-------------------------
[INFO] 
[INFO] --- maven-clean-plugin:3.1.0:clean (default-clean) @ org.eclipse.core.contenttype.tests ---
[INFO] 
[INFO] --- tycho-packaging-plugin:1.7.0:build-qualifier (default-build-qualifier) @ org.eclipse.core.contenttype.tests ---
[INFO] The project's OSGi version is 1.0.200.v20200517-1644
[INFO] 
[INFO] --- tycho-packaging-plugin:1.7.0:validate-id (default-validate-id) @ org.eclipse.core.contenttype.tests ---
[INFO] 
[INFO] --- tycho-packaging-plugin:1.7.0:validate-version (default-validate-version) @ org.eclipse.core.contenttype.tests ---
[INFO] 
[INFO] --- maven-resources-plugin:3.1.0:copy-resources (saveproperties) @ org.eclipse.core.contenttype.tests ---
[INFO] Using 'UTF-8' encoding to copy filtered resources.
[INFO] skip non existing resourceDirectory /home/jenkins/agent/workspace/eclipse.platform.runtime-SonarQube/tests/org.eclipse.core.contenttype.tests/saveproperties
[INFO] 
[INFO] --- maven-enforcer-plugin:3.0.0-M3:enforce (enforce-maven) @ org.eclipse.core.contenttype.tests ---
[INFO] 
[INFO] --- jacoco-maven-plugin:0.8.5:prepare-agent (jacoco-agent) @ org.eclipse.core.contenttype.tests ---
[INFO] tycho.testArgLine set to -javaagent:/home/jenkins/agent/workspace/eclipse.platform.runtime-SonarQube/.repository/org/jacoco/org.jacoco.agent/0.8.5/org.jacoco.agent-0.8.5-runtime.jar=destfile=/home/jenkins/agent/workspace/eclipse.platform.runtime-SonarQube/jacoco.exec,append=true
[INFO] 
[INFO] --- eclipse-cbi-plugin:1.1.8-SNAPSHOT:generate-api-build-xml (default) @ org.eclipse.core.contenttype.tests ---
[INFO] 
[INFO] --- maven-resources-plugin:3.1.0:resources (default-resources) @ org.eclipse.core.contenttype.tests ---
[INFO] Using 'UTF-8' encoding to copy filtered resources.
[INFO] skip non existing resourceDirectory /home/jenkins/agent/workspace/eclipse.platform.runtime-SonarQube/tests/org.eclipse.core.contenttype.tests/src/main/resources
[INFO] 
[INFO] --- maven-resources-plugin:3.1.0:resources (filter-resources) @ org.eclipse.core.contenttype.tests ---
[INFO] Using 'UTF-8' encoding to copy filtered resources.
[INFO] skip non existing resourceDirectory /home/jenkins/agent/workspace/eclipse.platform.runtime-SonarQube/tests/org.eclipse.core.contenttype.tests/src/main/resources
[INFO] 
[INFO] --- tycho-compiler-plugin:1.7.0:compile (default-compile) @ org.eclipse.core.contenttype.tests ---
[INFO] Compiling 3 source files to /home/jenkins/agent/workspace/eclipse.platform.runtime-SonarQube/tests/org.eclipse.core.contenttype.tests/target/classes
[INFO] 
[INFO] --- tycho-eclipserun-plugin:1.7.0:eclipse-run (default) @ org.eclipse.core.contenttype.tests ---
[INFO] 
[INFO] --- maven-resources-plugin:3.1.0:testResources (default-testResources) @ org.eclipse.core.contenttype.tests ---
[INFO] Using 'UTF-8' encoding to copy filtered resources.
[INFO] skip non existing resourceDirectory /home/jenkins/agent/workspace/eclipse.platform.runtime-SonarQube/tests/org.eclipse.core.contenttype.tests/src/test/resources
[INFO] 
[INFO] --- tycho-source-plugin:1.7.0:plugin-source (plugin-source) @ org.eclipse.core.contenttype.tests ---
[INFO] Building jar: /home/jenkins/agent/workspace/eclipse.platform.runtime-SonarQube/tests/org.eclipse.core.contenttype.tests/target/org.eclipse.core.contenttype.tests-1.0.200-SNAPSHOT-sources.jar
[INFO] 
[INFO] --- target-platform-configuration:1.7.0:target-platform (default-target-platform) @ org.eclipse.core.contenttype.tests ---
[INFO] 
[INFO] --- tycho-packaging-plugin:1.7.0:package-plugin (default-package-plugin) @ org.eclipse.core.contenttype.tests ---
[INFO] Building jar: /home/jenkins/agent/workspace/eclipse.platform.runtime-SonarQube/tests/org.eclipse.core.contenttype.tests/target/org.eclipse.core.contenttype.tests-1.0.200-SNAPSHOT.jar
[INFO] 
[INFO] --- tycho-p2-plugin:1.7.0:p2-metadata-default (default-p2-metadata-default) @ org.eclipse.core.contenttype.tests ---
[WARNING] No repository found at file:/noThanks.
org.eclipse.equinox.p2.core.ProvisionException: No repository found at file:/noThanks.
    at org.eclipse.equinox.internal.p2.repository.helpers.AbstractRepositoryManager.fail (AbstractRepositoryManager.java:396)
    at org.eclipse.equinox.internal.p2.repository.helpers.AbstractRepositoryManager.loadRepository (AbstractRepositoryManager.java:661)
    at org.eclipse.equinox.internal.p2.metadata.repository.MetadataRepositoryManager.loadRepository (MetadataRepositoryManager.java:110)
    at org.eclipse.tycho.p2.remote.RemoteMetadataRepositoryManager.loadRepository (RemoteMetadataRepositoryManager.java:61)
    at org.eclipse.tycho.p2.remote.RemoteMetadataRepositoryManager.loadRepository (RemoteMetadataRepositoryManager.java:53)
    at org.eclipse.tycho.p2.tools.baseline.BaselineServiceImpl.getProjectBaseline (BaselineServiceImpl.java:95)
    at org.eclipse.tycho.plugins.p2.BaselineValidator.validateAndReplace (BaselineValidator.java:88)
    at org.eclipse.tycho.plugins.p2.P2MetadataMojo.attachP2Metadata (P2MetadataMojo.java:183)
    at org.eclipse.tycho.plugins.p2.P2MetadataMojo.execute (P2MetadataMojo.java:137)
    at org.eclipse.tycho.plugins.p2.P2MetadataDefaultMojo.execute (P2MetadataDefaultMojo.java:32)
    at org.apache.maven.plugin.DefaultBuildPluginManager.executeMojo (DefaultBuildPluginManager.java:137)
    at org.apache.maven.lifecycle.internal.MojoExecutor.execute (MojoExecutor.java:210)
    at org.apache.maven.lifecycle.internal.MojoExecutor.execute (MojoExecutor.java:156)
    at org.apache.maven.lifecycle.internal.MojoExecutor.execute (MojoExecutor.java:148)
    at org.apache.maven.lifecycle.internal.LifecycleModuleBuilder.buildProject (LifecycleModuleBuilder.java:117)
    at org.apache.maven.lifecycle.internal.LifecycleModuleBuilder.buildProject (LifecycleModuleBuilder.java:81)
    at org.apache.maven.lifecycle.internal.builder.singlethreaded.SingleThreadedBuilder.build (SingleThreadedBuilder.java:56)
    at org.apache.maven.lifecycle.internal.LifecycleStarter.execute (LifecycleStarter.java:128)
    at org.apache.maven.DefaultMaven.doExecute (DefaultMaven.java:305)
    at org.apache.maven.DefaultMaven.doExecute (DefaultMaven.java:192)
    at org.apache.maven.DefaultMaven.execute (DefaultMaven.java:105)
    at org.apache.maven.cli.MavenCli.execute (MavenCli.java:957)
    at org.apache.maven.cli.MavenCli.doMain (MavenCli.java:289)
    at org.apache.maven.cli.MavenCli.main (MavenCli.java:193)
    at sun.reflect.NativeMethodAccessorImpl.invoke0 (Native Method)
    at sun.reflect.NativeMethodAccessorImpl.invoke (NativeMethodAccessorImpl.java:62)
    at sun.reflect.DelegatingMethodAccessorImpl.invoke (DelegatingMethodAccessorImpl.java:43)
    at java.lang.reflect.Method.invoke (Method.java:498)
    at org.codehaus.plexus.classworlds.launcher.Launcher.launchEnhanced (Launcher.java:282)
    at org.codehaus.plexus.classworlds.launcher.Launcher.launch (Launcher.java:225)
    at org.codehaus.plexus.classworlds.launcher.Launcher.mainWithExitCode (Launcher.java:406)
    at org.codehaus.plexus.classworlds.launcher.Launcher.main (Launcher.java:347)
[INFO] No baseline version MavenProject: org.eclipse.core:org.eclipse.core.contenttype.tests:1.0.200-SNAPSHOT @ /home/jenkins/agent/workspace/eclipse.platform.runtime-SonarQube/tests/org.eclipse.core.contenttype.tests/pom.xml
[INFO] 
[INFO] --- tycho-surefire-plugin:1.7.0:test (default-test) @ org.eclipse.core.contenttype.tests ---
[INFO] Executing Test Runtime with timeout 0, logs (if any) will be placed at: /home/jenkins/agent/workspace/eclipse.platform.runtime-SonarQube/tests/org.eclipse.core.contenttype.tests/target/work/data/.metadata/.log
[INFO] Command line:
	[/opt/tools/java/oracle/jdk-8/1.8.0_202/jre/bin/java, -Dosgi.noShutdown=false, -Dosgi.os=linux, -Dosgi.ws=gtk, -Dosgi.arch=x86_64, -javaagent:/home/jenkins/agent/workspace/eclipse.platform.runtime-SonarQube/.repository/org/jacoco/org.jacoco.agent/0.8.5/org.jacoco.agent-0.8.5-runtime.jar=destfile=/home/jenkins/agent/workspace/eclipse.platform.runtime-SonarQube/jacoco.exec,append=true, -Dosgi.clean=true, -ea, -jar, /home/jenkins/agent/workspace/eclipse.platform.runtime-SonarQube/.repository/p2/osgi/bundle/org.eclipse.equinox.launcher/1.5.700.v20200207-2156/org.eclipse.equinox.launcher-1.5.700.v20200207-2156.jar, -data, /home/jenkins/agent/workspace/eclipse.platform.runtime-SonarQube/tests/org.eclipse.core.contenttype.tests/target/work/data, -install, /home/jenkins/agent/workspace/eclipse.platform.runtime-SonarQube/tests/org.eclipse.core.contenttype.tests/target/work, -configuration, /home/jenkins/agent/workspace/eclipse.platform.runtime-SonarQube/tests/org.eclipse.core.contenttype.tests/target/work/configuration, -application, org.eclipse.tycho.surefire.osgibooter.headlesstest, -testproperties, /home/jenkins/agent/workspace/eclipse.platform.runtime-SonarQube/tests/org.eclipse.core.contenttype.tests/target/surefire.properties]
Running org.eclipse.core.internal.contenttype.tests.AllTests
Tests run: 4, Failures: 0, Errors: 0, Skipped: 0, Time elapsed: 0.162 s - in org.eclipse.core.internal.contenttype.tests.AllTests
testCannotDeleteSystemContentType(org.eclipse.core.internal.contenttype.tests.UserContentTypeTest)  Time elapsed: 0.037 s
testPersistContentTypeAndAssociation(org.eclipse.core.internal.contenttype.tests.UserContentTypeTest)  Time elapsed: 0.022 s
testAddUserDefinedContentTypes(org.eclipse.core.internal.contenttype.tests.UserContentTypeTest)  Time elapsed: 0.011 s
testParse(org.eclipse.core.internal.contenttype.tests.XMLRootHandlerTest)  Time elapsed: 0.006 s

Results:

Tests run: 4, Failures: 0, Errors: 0, Skipped: 0

[INFO] All tests passed!
[INFO] 
[INFO] --- tycho-p2-extras-plugin:1.7.0:compare-version-with-baselines (compare-attached-artifacts-with-release) @ org.eclipse.core.contenttype.tests ---
[INFO] Skipped
[INFO] ------------------------------------------------------------------------
[INFO] Reactor Summary:
[INFO] 
[INFO] eclipse.platform.runtime 4.16.0-SNAPSHOT ........... SUCCESS [01:14 min]
[INFO] org.eclipse.core.contenttype 3.7.700-SNAPSHOT ...... SUCCESS [ 25.453 s]
[INFO] org.eclipse.core.jobs 3.10.800-SNAPSHOT ............ SUCCESS [  6.807 s]
[INFO] org.eclipse.core.runtime 3.18.0-SNAPSHOT ........... SUCCESS [  7.203 s]
[INFO] org.eclipse.core.expressions 3.6.800-SNAPSHOT ...... SUCCESS [  6.095 s]
[INFO] org.eclipse.e4.core.di.annotations 1.6.600-SNAPSHOT  SUCCESS [  5.764 s]
[INFO] org.eclipse.e4.core.di 1.7.600-SNAPSHOT ............ SUCCESS [  6.414 s]
[INFO] org.eclipse.e4.core.contexts 1.8.400-SNAPSHOT ...... SUCCESS [  6.137 s]
[INFO] org.eclipse.e4.core.di.extensions 0.16.0-SNAPSHOT .. SUCCESS [  6.055 s]
[INFO] org.eclipse.e4.core.di.extensions.supplier 0.15.600-SNAPSHOT SUCCESS [  6.064 s]
[INFO] org.eclipse.e4.core.services 2.2.300-SNAPSHOT ...... SUCCESS [  6.667 s]
[INFO] org.eclipse.core.runtime.feature 1.2.900-SNAPSHOT .. SUCCESS [  0.336 s]
[INFO] eclipse.platform.runtime.tests 4.16.0-SNAPSHOT ..... SUCCESS [  0.018 s]
[INFO] org.eclipse.core.expressions.tests 3.5.800-SNAPSHOT  SUCCESS [ 15.026 s]
[INFO] org.eclipse.core.tests.harness 3.11.700-SNAPSHOT ... SUCCESS [  0.859 s]
[INFO] org.eclipse.core.tests.runtime 3.18.0-SNAPSHOT ..... SUCCESS [05:46 min]
[INFO] org.eclipse.e4.core.tests 1.1.1100-SNAPSHOT ........ SUCCESS [  9.151 s]
[INFO] org.eclipse.core.contenttype.tests 1.0.200-SNAPSHOT  SUCCESS [  6.348 s]
[INFO] ------------------------------------------------------------------------
[INFO] BUILD SUCCESS
[INFO] ------------------------------------------------------------------------
[INFO] Total time:  11:08 min
[INFO] Finished at: 2020-06-02T22:44:06Z
[INFO] ------------------------------------------------------------------------
Terminating xvnc.
[eclipse.platform.runtime-SonarQube] $ /opt/tools/apache-maven/latest/bin/mvn -f /home/jenkins/agent/workspace/eclipse.platform.runtime-SonarQube/pom.xml -e -B org.sonarsource.scanner.maven:sonar-maven-plugin:3.3.0.603:sonar -Pbuild-individual-bundles -Pcoverage -Dmaven.repo.local=/home/jenkins/agent/workspace/eclipse.platform.runtime-SonarQube/.maven/.repo -Djacoco.destFile=/home/jenkins/agent/workspace/eclipse.platform.runtime-SonarQube/jacoco.exec -Dsonar.jdbc.url=jdbc:mysql://dbmaster:3306/sonar?autoReconnect=true&useUnicode=true&characterEncoding=utf8 ******** ******** -Dsonar.host.url=https://sonar.eclipse.org
Apache Maven 3.6.3 (cecedd343002696d0abb50b32b541b8a6ba2883f)
Maven home: /opt/tools/apache-maven/latest
Java version: 1.8.0_202, vendor: Oracle Corporation, runtime: /opt/tools/java/oracle/jdk-8/1.8.0_202/jre
Default locale: en_US, platform encoding: UTF-8
OS name: "linux", version: "3.10.0-1062.12.1.el7.x86_64", arch: "amd64", family: "unix"
[INFO] Error stacktraces are turned on.
[INFO] Scanning for projects...
[INFO] Computing target platform for MavenProject: org.eclipse.core:org.eclipse.core.contenttype:3.7.700-SNAPSHOT @ /home/jenkins/agent/workspace/eclipse.platform.runtime-SonarQube/bundles/org.eclipse.core.contenttype/pom.xml
[INFO] Fetching p2.index from https://download.eclipse.org/tools/orbit/downloads/drops/S20200526004052/repository/
[INFO] Adding repository https://download.eclipse.org/tools/orbit/downloads/drops/S20200526004052/repository
[INFO] Fetching compositeContent.xml from https://download.eclipse.org/tools/orbit/downloads/drops/S20200526004052/repository/
[INFO] Fetching content.jar from https://download.eclipse.org/tools/orbit/downloads/drops/R20191115185527/repository/ (107.42kB)
[INFO] Fetching p2.index from https://download.eclipse.org/tools/orbit/downloads/drops2/S20200526004052/repository/
[INFO] Fetching content.xml.xz from https://download.eclipse.org/tools/orbit/downloads/drops2/S20200526004052/repository/
[INFO] Fetching p2.index from https://download.eclipse.org/modeling/emf/emf/builds/milestone/S202005191146/
[INFO] Adding repository https://download.eclipse.org/modeling/emf/emf/builds/milestone/S202005191146
[INFO] Fetching content.xml.xz from https://download.eclipse.org/modeling/emf/emf/builds/milestone/S202005191146/
[INFO] Adding repository https://download.eclipse.org/jetty/updates/jetty-bundles-9.x/9.4.29.v20200521
[INFO] Fetching content.jar from https://download.eclipse.org/jetty/updates/jetty-bundles-9.x/9.4.29.v20200521/ (22.48kB)
[INFO] Fetching p2.index from https://download.eclipse.org/rt/ecf/snapshot/site.p2/3.14.8.v20200522-1203/
[INFO] Adding repository https://download.eclipse.org/rt/ecf/snapshot/site.p2/3.14.8.v20200522-1203
[INFO] Fetching content.xml.xz from https://download.eclipse.org/rt/ecf/snapshot/site.p2/3.14.8.v20200522-1203/
[INFO] Fetching p2.index from https://download.eclipse.org/cbi/updates/license/2.0.2.v20181016-2210/
[INFO] Adding repository https://download.eclipse.org/cbi/updates/license/2.0.2.v20181016-2210
[INFO] Fetching content.xml.xz from https://download.eclipse.org/cbi/updates/license/2.0.2.v20181016-2210/
[INFO] Fetching p2.index from https://download.eclipse.org/egit/updates-5.7/
[INFO] Adding repository https://download.eclipse.org/egit/updates-5.7
[INFO] Fetching content.xml.xz from https://download.eclipse.org/egit/updates-5.7/
[INFO] Fetching p2.index from https://download.eclipse.org/reddeer/releases/2.9.0/
[INFO] Adding repository https://download.eclipse.org/reddeer/releases/2.9.0
[INFO] Fetching content.xml.xz from https://download.eclipse.org/reddeer/releases/2.9.0/
[INFO] Fetching p2.index from https://download.eclipse.org/eclipse/updates/4.16-I-builds/
[INFO] Adding repository https://download.eclipse.org/eclipse/updates/4.16-I-builds
[INFO] Fetching compositeContent.jar from https://download.eclipse.org/eclipse/updates/4.16-I-builds/ (462B)
[INFO] Fetching content.jar from https://download.eclipse.org/eclipse/updates/4.16-I-builds/categories/ (1.46kB)
[INFO] Fetching p2.index from https://download.eclipse.org/eclipse/updates/4.16-I-builds/I20200531-1800/
[INFO] Fetching content.xml from https://download.eclipse.org/eclipse/updates/4.16-I-builds/I20200531-1800/
[INFO] Fetching p2.index from https://download.eclipse.org/eclipse/updates/4.16-I-builds/I20200601-0140/
[INFO] Fetching content.xml from https://download.eclipse.org/eclipse/updates/4.16-I-builds/I20200601-0140/
[INFO] Fetching p2.index from https://download.eclipse.org/eclipse/updates/4.16-I-builds/I20200601-0640/
[INFO] Fetching content.xml from https://download.eclipse.org/eclipse/updates/4.16-I-builds/I20200601-0640/
[INFO] Fetching p2.index from https://download.eclipse.org/eclipse/updates/4.16-I-builds/I20200602-0510/
[INFO] Fetching content.xml from https://download.eclipse.org/eclipse/updates/4.16-I-builds/I20200602-0510/
[INFO] Resolving dependencies of MavenProject: org.eclipse.core:org.eclipse.core.contenttype:3.7.700-SNAPSHOT @ /home/jenkins/agent/workspace/eclipse.platform.runtime-SonarQube/bundles/org.eclipse.core.contenttype/pom.xml
[INFO] Fetching org.eclipse.osgi_3.15.300.v20200520-1959.jar.pack.gz from https://download.eclipse.org/eclipse/updates/4.16-I-builds/I20200531-1800/plugins/ (459.89kB)
[INFO] Fetching org.eclipse.equinox.preferences_3.8.0.v20200422-1833.jar.pack.gz from https://download.eclipse.org/eclipse/updates/4.16-I-builds/I20200531-1800/plugins/ (55.59kB)
[INFO] Fetching org.eclipse.equinox.registry_3.8.800.v20200406-0956.jar.pack.gz from https://download.eclipse.org/eclipse/updates/4.16-I-builds/I20200531-1800/plugins/ (77.27kB)
[INFO] Fetching org.eclipse.equinox.common_3.12.0.v20200504-1602.jar.pack.gz from https://download.eclipse.org/eclipse/updates/4.16-I-builds/I20200531-1800/plugins/ (55.07kB)
[INFO] Resolving class path of MavenProject: org.eclipse.core:org.eclipse.core.contenttype:3.7.700-SNAPSHOT @ /home/jenkins/agent/workspace/eclipse.platform.runtime-SonarQube/bundles/org.eclipse.core.contenttype/pom.xml
[INFO] Computing target platform for MavenProject: org.eclipse.core:org.eclipse.core.expressions:3.6.800-SNAPSHOT @ /home/jenkins/agent/workspace/eclipse.platform.runtime-SonarQube/bundles/org.eclipse.core.expressions/pom.xml
[INFO] Resolving dependencies of MavenProject: org.eclipse.core:org.eclipse.core.expressions:3.6.800-SNAPSHOT @ /home/jenkins/agent/workspace/eclipse.platform.runtime-SonarQube/bundles/org.eclipse.core.expressions/pom.xml
[INFO] Fetching org.eclipse.equinox.app_1.4.500.v20200422-1833.jar.pack.gz from https://download.eclipse.org/eclipse/updates/4.16-I-builds/I20200531-1800/plugins/ (42.05kB)
[INFO] Resolving class path of MavenProject: org.eclipse.core:org.eclipse.core.expressions:3.6.800-SNAPSHOT @ /home/jenkins/agent/workspace/eclipse.platform.runtime-SonarQube/bundles/org.eclipse.core.expressions/pom.xml
[INFO] Computing target platform for MavenProject: org.eclipse.core:org.eclipse.core.jobs:3.10.800-SNAPSHOT @ /home/jenkins/agent/workspace/eclipse.platform.runtime-SonarQube/bundles/org.eclipse.core.jobs/pom.xml
[INFO] Resolving dependencies of MavenProject: org.eclipse.core:org.eclipse.core.jobs:3.10.800-SNAPSHOT @ /home/jenkins/agent/workspace/eclipse.platform.runtime-SonarQube/bundles/org.eclipse.core.jobs/pom.xml
[INFO] Resolving class path of MavenProject: org.eclipse.core:org.eclipse.core.jobs:3.10.800-SNAPSHOT @ /home/jenkins/agent/workspace/eclipse.platform.runtime-SonarQube/bundles/org.eclipse.core.jobs/pom.xml
[INFO] Computing target platform for MavenProject: org.eclipse.core:org.eclipse.core.runtime:3.18.0-SNAPSHOT @ /home/jenkins/agent/workspace/eclipse.platform.runtime-SonarQube/bundles/org.eclipse.core.runtime/pom.xml
[INFO] Resolving dependencies of MavenProject: org.eclipse.core:org.eclipse.core.runtime:3.18.0-SNAPSHOT @ /home/jenkins/agent/workspace/eclipse.platform.runtime-SonarQube/bundles/org.eclipse.core.runtime/pom.xml
[INFO] Resolving class path of MavenProject: org.eclipse.core:org.eclipse.core.runtime:3.18.0-SNAPSHOT @ /home/jenkins/agent/workspace/eclipse.platform.runtime-SonarQube/bundles/org.eclipse.core.runtime/pom.xml
[INFO] Computing target platform for MavenProject: org.eclipse.e4:org.eclipse.e4.core.contexts:1.8.400-SNAPSHOT @ /home/jenkins/agent/workspace/eclipse.platform.runtime-SonarQube/bundles/org.eclipse.e4.core.contexts/pom.xml
[INFO] Resolving dependencies of MavenProject: org.eclipse.e4:org.eclipse.e4.core.contexts:1.8.400-SNAPSHOT @ /home/jenkins/agent/workspace/eclipse.platform.runtime-SonarQube/bundles/org.eclipse.e4.core.contexts/pom.xml
[INFO] Fetching javax.inject_1.0.0.v20091030.jar from https://download.eclipse.org/eclipse/updates/4.16-I-builds/I20200531-1800/plugins/ (14.07kB)
[INFO] Fetching org.eclipse.osgi.services_3.8.0.v20190206-2147.jar.pack.gz from https://download.eclipse.org/eclipse/updates/4.16-I-builds/I20200531-1800/plugins/ (44.03kB)
[INFO] Fetching org.eclipse.osgi.util_3.5.300.v20190708-1141.jar.pack.gz from https://download.eclipse.org/eclipse/updates/4.16-I-builds/I20200531-1800/plugins/ (30.65kB)
[INFO] Resolving class path of MavenProject: org.eclipse.e4:org.eclipse.e4.core.contexts:1.8.400-SNAPSHOT @ /home/jenkins/agent/workspace/eclipse.platform.runtime-SonarQube/bundles/org.eclipse.e4.core.contexts/pom.xml
[INFO] Computing target platform for MavenProject: org.eclipse.e4:org.eclipse.e4.core.di.annotations:1.6.600-SNAPSHOT @ /home/jenkins/agent/workspace/eclipse.platform.runtime-SonarQube/bundles/org.eclipse.e4.core.di.annotations/pom.xml
[INFO] Resolving dependencies of MavenProject: org.eclipse.e4:org.eclipse.e4.core.di.annotations:1.6.600-SNAPSHOT @ /home/jenkins/agent/workspace/eclipse.platform.runtime-SonarQube/bundles/org.eclipse.e4.core.di.annotations/pom.xml
[INFO] Resolving class path of MavenProject: org.eclipse.e4:org.eclipse.e4.core.di.annotations:1.6.600-SNAPSHOT @ /home/jenkins/agent/workspace/eclipse.platform.runtime-SonarQube/bundles/org.eclipse.e4.core.di.annotations/pom.xml
[INFO] Computing target platform for MavenProject: org.eclipse.e4:org.eclipse.e4.core.di:1.7.600-SNAPSHOT @ /home/jenkins/agent/workspace/eclipse.platform.runtime-SonarQube/bundles/org.eclipse.e4.core.di/pom.xml
[INFO] Resolving dependencies of MavenProject: org.eclipse.e4:org.eclipse.e4.core.di:1.7.600-SNAPSHOT @ /home/jenkins/agent/workspace/eclipse.platform.runtime-SonarQube/bundles/org.eclipse.e4.core.di/pom.xml
[INFO] Resolving class path of MavenProject: org.eclipse.e4:org.eclipse.e4.core.di:1.7.600-SNAPSHOT @ /home/jenkins/agent/workspace/eclipse.platform.runtime-SonarQube/bundles/org.eclipse.e4.core.di/pom.xml
[INFO] Computing target platform for MavenProject: org.eclipse.e4:org.eclipse.e4.core.di.extensions:0.16.0-SNAPSHOT @ /home/jenkins/agent/workspace/eclipse.platform.runtime-SonarQube/bundles/org.eclipse.e4.core.di.extensions/pom.xml
[INFO] Resolving dependencies of MavenProject: org.eclipse.e4:org.eclipse.e4.core.di.extensions:0.16.0-SNAPSHOT @ /home/jenkins/agent/workspace/eclipse.platform.runtime-SonarQube/bundles/org.eclipse.e4.core.di.extensions/pom.xml
[INFO] Resolving class path of MavenProject: org.eclipse.e4:org.eclipse.e4.core.di.extensions:0.16.0-SNAPSHOT @ /home/jenkins/agent/workspace/eclipse.platform.runtime-SonarQube/bundles/org.eclipse.e4.core.di.extensions/pom.xml
[INFO] Computing target platform for MavenProject: org.eclipse.e4:org.eclipse.e4.core.di.extensions.supplier:0.15.600-SNAPSHOT @ /home/jenkins/agent/workspace/eclipse.platform.runtime-SonarQube/bundles/org.eclipse.e4.core.di.extensions.supplier/pom.xml
[INFO] Resolving dependencies of MavenProject: org.eclipse.e4:org.eclipse.e4.core.di.extensions.supplier:0.15.600-SNAPSHOT @ /home/jenkins/agent/workspace/eclipse.platform.runtime-SonarQube/bundles/org.eclipse.e4.core.di.extensions.supplier/pom.xml
[INFO] Fetching org.apache.felix.scr_2.1.16.v20200110-1820.jar.pack.gz from https://download.eclipse.org/eclipse/updates/4.16-I-builds/I20200531-1800/plugins/ (155.55kB)
[INFO] Resolving class path of MavenProject: org.eclipse.e4:org.eclipse.e4.core.di.extensions.supplier:0.15.600-SNAPSHOT @ /home/jenkins/agent/workspace/eclipse.platform.runtime-SonarQube/bundles/org.eclipse.e4.core.di.extensions.supplier/pom.xml
[INFO] Computing target platform for MavenProject: org.eclipse.e4:org.eclipse.e4.core.services:2.2.300-SNAPSHOT @ /home/jenkins/agent/workspace/eclipse.platform.runtime-SonarQube/bundles/org.eclipse.e4.core.services/pom.xml
[INFO] Resolving dependencies of MavenProject: org.eclipse.e4:org.eclipse.e4.core.services:2.2.300-SNAPSHOT @ /home/jenkins/agent/workspace/eclipse.platform.runtime-SonarQube/bundles/org.eclipse.e4.core.services/pom.xml
[INFO] Resolving class path of MavenProject: org.eclipse.e4:org.eclipse.e4.core.services:2.2.300-SNAPSHOT @ /home/jenkins/agent/workspace/eclipse.platform.runtime-SonarQube/bundles/org.eclipse.e4.core.services/pom.xml
[INFO] Computing target platform for MavenProject: org.eclipse.core.feature:org.eclipse.core.runtime.feature:1.2.900-SNAPSHOT @ /home/jenkins/agent/workspace/eclipse.platform.runtime-SonarQube/features/org.eclipse.core.runtime.feature/pom.xml
[INFO] Resolving dependencies of MavenProject: org.eclipse.core.feature:org.eclipse.core.runtime.feature:1.2.900-SNAPSHOT @ /home/jenkins/agent/workspace/eclipse.platform.runtime-SonarQube/features/org.eclipse.core.runtime.feature/pom.xml
[INFO] Fetching org.apache.felix.gogo.command_1.0.2.v20170914-1324.jar.pack.gz from https://download.eclipse.org/eclipse/updates/4.16-I-builds/I20200531-1800/plugins/ (31.52kB)
[INFO] Fetching org.apache.felix.gogo.runtime_1.1.0.v20180713-1646.jar.pack.gz from https://download.eclipse.org/eclipse/updates/4.16-I-builds/I20200531-1800/plugins/ (75.47kB)
[INFO] Fetching org.apache.felix.gogo.shell_1.1.0.v20180713-1646.jar.pack.gz from https://download.eclipse.org/eclipse/updates/4.16-I-builds/I20200531-1800/plugins/ (34.83kB)
[INFO] Fetching org.eclipse.core.variables_3.4.800.v20200120-1101.jar.pack.gz from https://download.eclipse.org/eclipse/updates/4.16-I-builds/I20200531-1800/plugins/ (18.03kB)
[INFO] Fetching org.eclipse.equinox.console_1.4.100.v20200525-1407.jar.pack.gz from https://download.eclipse.org/eclipse/updates/4.16-I-builds/I20200531-1800/plugins/ (51.48kB)
[INFO] Fetching org.eclipse.equinox.ds_1.6.200.v20200422-1833.jar.pack.gz from https://download.eclipse.org/eclipse/updates/4.16-I-builds/I20200531-1800/plugins/ (17.46kB)
[INFO] Fetching org.eclipse.equinox.simpleconfigurator_1.3.500.v20200211-1505.jar.pack.gz from https://download.eclipse.org/eclipse/updates/4.16-I-builds/I20200531-1800/plugins/ (23.81kB)
[INFO] Fetching org.eclipse.osgi.compatibility.state_1.1.800.v20200511-1223.jar.pack.gz from https://download.eclipse.org/eclipse/updates/4.16-I-builds/I20200531-1800/plugins/ (103.56kB)
[INFO] Fetching org.eclipse.equinox.core.feature_1.11.200.v20200525-1407.jar from https://download.eclipse.org/eclipse/updates/4.16-I-builds/I20200531-1800/features/ (19.2kB)
[INFO] Fetching org.eclipse.license_2.0.2.v20181016-2210.jar from https://download.eclipse.org/cbi/updates/license/2.0.2.v20181016-2210/features/ (13.05kB)
[INFO] Resolving class path of MavenProject: org.eclipse.core.feature:org.eclipse.core.runtime.feature:1.2.900-SNAPSHOT @ /home/jenkins/agent/workspace/eclipse.platform.runtime-SonarQube/features/org.eclipse.core.runtime.feature/pom.xml
[INFO] Computing target platform for MavenProject: org.eclipse.core:org.eclipse.core.expressions.tests:3.5.800-SNAPSHOT @ /home/jenkins/agent/workspace/eclipse.platform.runtime-SonarQube/tests/org.eclipse.core.expressions.tests/pom.xml
[INFO] Resolving dependencies of MavenProject: org.eclipse.core:org.eclipse.core.expressions.tests:3.5.800-SNAPSHOT @ /home/jenkins/agent/workspace/eclipse.platform.runtime-SonarQube/tests/org.eclipse.core.expressions.tests/pom.xml
[INFO] Fetching com.ibm.icu_64.2.0.v20190507-1337.jar.pack.gz from https://download.eclipse.org/eclipse/updates/4.16-I-builds/I20200531-1800/plugins/ (9.5MB)
[INFO] Fetching org.apache.batik.constants_1.11.0.v20190515-0436.jar.pack.gz from https://download.eclipse.org/eclipse/updates/4.16-I-builds/I20200531-1800/plugins/ (13.03kB)
[INFO] Fetching org.apache.batik.css_1.11.0.v20190515-0436.jar.pack.gz from https://download.eclipse.org/eclipse/updates/4.16-I-builds/I20200531-1800/plugins/ (101.68kB)
[INFO] Fetching org.apache.batik.util_1.11.0.v20190515-0436.jar.pack.gz from https://download.eclipse.org/eclipse/updates/4.16-I-builds/I20200531-1800/plugins/ (63.49kB)
[INFO] Fetching org.apache.batik.i18n_1.11.0.v20190515-0436.jar.pack.gz from https://download.eclipse.org/eclipse/updates/4.16-I-builds/I20200531-1800/plugins/ (14.52kB)
[INFO] Fetching org.apache.xmlgraphics_2.3.0.v20190515-0436.jar.pack.gz from https://download.eclipse.org/eclipse/updates/4.16-I-builds/I20200531-1800/plugins/ (258.72kB)
[INFO] Fetching org.w3c.dom.svg_1.1.0.v201011041433.jar from https://download.eclipse.org/eclipse/updates/4.16-I-builds/I20200531-1800/plugins/ (95.26kB)
[INFO] Fetching org.w3c.dom.events_3.0.0.draft20060413_v201105210656.jar from https://download.eclipse.org/eclipse/updates/4.16-I-builds/I20200531-1800/plugins/ (15.35kB)
[INFO] Fetching org.w3c.css.sac_1.3.1.v200903091627.jar from https://download.eclipse.org/eclipse/updates/4.16-I-builds/I20200531-1800/plugins/ (35.59kB)
[INFO] Fetching org.apache.commons.io_2.6.0.v20190123-2029.jar.pack.gz from https://download.eclipse.org/eclipse/updates/4.16-I-builds/I20200531-1800/plugins/ (82.7kB)
[INFO] Fetching org.apache.commons.logging_1.2.0.v20180409-1502.jar.pack.gz from https://download.eclipse.org/eclipse/updates/4.16-I-builds/I20200531-1800/plugins/ (33.71kB)
[INFO] Fetching org.eclipse.compare_3.7.1000.v20200511-1203.jar.pack.gz from https://download.eclipse.org/eclipse/updates/4.16-I-builds/I20200531-1800/plugins/ (306.31kB)
[INFO] Fetching org.eclipse.ui_3.117.0.v20200518-1705.jar.pack.gz from https://download.eclipse.org/eclipse/updates/4.16-I-builds/I20200531-1800/plugins/ (363.6kB)
[INFO] Fetching org.eclipse.core.resources_3.13.700.v20200209-1624.jar from https://download.eclipse.org/eclipse/updates/4.16-I-builds/I20200531-1800/plugins/ (873.17kB)
[INFO] Fetching org.eclipse.jface.text_3.16.300.v20200526-0811.jar.pack.gz from https://download.eclipse.org/eclipse/updates/4.16-I-builds/I20200531-1800/plugins/ (316.88kB)
[INFO] Fetching org.eclipse.ui.ide_3.17.100.v20200530-0835.jar.pack.gz from https://download.eclipse.org/eclipse/updates/4.16-I-builds/I20200531-1800/plugins/ (957.79kB)
[INFO] Fetching org.eclipse.ui.views_3.10.300.v20200311-1018.jar.pack.gz from https://download.eclipse.org/eclipse/updates/4.16-I-builds/I20200531-1800/plugins/ (48.59kB)
[INFO] Fetching org.eclipse.ui.workbench.texteditor_3.14.200.v20200421-1954.jar.pack.gz from https://download.eclipse.org/eclipse/updates/4.16-I-builds/I20200531-1800/plugins/ (233.97kB)
[INFO] Fetching org.eclipse.ui.editors_3.13.200.v20200501-2307.jar.pack.gz from https://download.eclipse.org/eclipse/updates/4.16-I-builds/I20200531-1800/plugins/ (199.91kB)
[INFO] Fetching org.eclipse.ui.forms_3.9.100.v20200413-1417.jar.pack.gz from https://download.eclipse.org/eclipse/updates/4.16-I-builds/I20200531-1800/plugins/ (124.18kB)
[INFO] Fetching org.eclipse.compare.core_3.6.900.v20200412-2017.jar.pack.gz from https://download.eclipse.org/eclipse/updates/4.16-I-builds/I20200531-1800/plugins/ (32.85kB)
[INFO] Fetching org.eclipse.core.commands_3.9.700.v20191217-1850.jar.pack.gz from https://download.eclipse.org/eclipse/updates/4.16-I-builds/I20200531-1800/plugins/ (43.01kB)
[INFO] Fetching org.eclipse.core.databinding_1.9.0.v20200519-1409.jar.pack.gz from https://download.eclipse.org/eclipse/updates/4.16-I-builds/I20200531-1800/plugins/ (56.72kB)
[INFO] Fetching org.eclipse.core.databinding.observable_1.9.0.v20200205-2119.jar.pack.gz from https://download.eclipse.org/eclipse/updates/4.16-I-builds/I20200531-1800/plugins/ (82.47kB)
[INFO] Fetching org.eclipse.core.databinding.property_1.8.0.v20200124-0715.jar.pack.gz from https://download.eclipse.org/eclipse/updates/4.16-I-builds/I20200531-1800/plugins/ (44.98kB)
[INFO] Fetching org.junit_4.13.0.v20200204-1500.jar.pack.gz from https://download.eclipse.org/eclipse/updates/4.16-I-builds/I20200531-1800/plugins/ (123kB)
[INFO] Fetching org.eclipse.core.filebuffers_3.6.1000.v20200409-1035.jar.pack.gz from https://download.eclipse.org/eclipse/updates/4.16-I-builds/I20200531-1800/plugins/ (41.15kB)
[INFO] Fetching org.eclipse.text_3.10.200.v20200428-0633.jar.pack.gz from https://download.eclipse.org/eclipse/updates/4.16-I-builds/I20200531-1800/plugins/ (100.5kB)
[INFO] Fetching org.eclipse.core.filesystem_1.7.700.v20200110-1734.jar.pack.gz from https://download.eclipse.org/eclipse/updates/4.16-I-builds/I20200531-1800/plugins/ (27.79kB)
[INFO] Fetching org.eclipse.core.net_1.3.900.v20200428-1255.jar.pack.gz from https://download.eclipse.org/eclipse/updates/4.16-I-builds/I20200531-1800/plugins/ (31.74kB)
[INFO] Fetching org.eclipse.equinox.security_1.3.500.v20200114-1637.jar.pack.gz from https://download.eclipse.org/eclipse/updates/4.16-I-builds/I20200531-1800/plugins/ (44.56kB)
[INFO] Fetching org.eclipse.e4.core.commands_0.12.900.v20200110-1732.jar.pack.gz from https://download.eclipse.org/eclipse/updates/4.16-I-builds/I20200531-1800/plugins/ (13.76kB)
[INFO] Fetching org.eclipse.e4.emf.xpath_0.2.700.v20200318-1219.jar.pack.gz from https://download.eclipse.org/eclipse/updates/4.16-I-builds/I20200531-1800/plugins/ (21.82kB)
[INFO] Fetching org.apache.commons.jxpath_1.3.0.v200911051830.jar.pack.gz from https://download.eclipse.org/eclipse/updates/4.16-I-builds/I20200531-1800/plugins/ (107.16kB)
[INFO] Fetching org.eclipse.emf.ecore_2.22.0.v20200519-1135.jar.pack.gz from https://download.eclipse.org/eclipse/updates/4.16-I-builds/I20200531-1800/plugins/ (487.54kB)
[INFO] Fetching org.eclipse.e4.ui.bindings_0.12.900.v20200513-0930.jar.pack.gz from https://download.eclipse.org/eclipse/updates/4.16-I-builds/I20200531-1800/plugins/ (23.02kB)
[INFO] Fetching org.eclipse.swt_3.114.100.v20200527-2203.jar.pack.gz from https://download.eclipse.org/eclipse/updates/4.16-I-builds/I20200531-1800/plugins/ (16.01kB)
[INFO] Fetching org.eclipse.e4.ui.services_1.3.700.v20190930-1643.jar.pack.gz from https://download.eclipse.org/eclipse/updates/4.16-I-builds/I20200531-1800/plugins/ (13.16kB)
[INFO] Fetching org.eclipse.jface_3.20.0.v20200505-1952.jar.pack.gz from https://download.eclipse.org/eclipse/updates/4.16-I-builds/I20200531-1800/plugins/ (361.92kB)
[INFO] Fetching org.eclipse.e4.ui.css.core_0.12.1200.v20200513-0930.jar.pack.gz from https://download.eclipse.org/eclipse/updates/4.16-I-builds/I20200531-1800/plugins/ (66.16kB)
[INFO] Fetching org.eclipse.e4.ui.css.swt_0.13.1000.v20200525-0806.jar.pack.gz from https://download.eclipse.org/eclipse/updates/4.16-I-builds/I20200531-1800/plugins/ (65.8kB)
[INFO] Fetching org.eclipse.e4.ui.css.swt.theme_0.12.700.v20200527-0719.jar.pack.gz from https://download.eclipse.org/eclipse/updates/4.16-I-builds/I20200531-1800/plugins/ (16.47kB)
[INFO] Fetching org.eclipse.e4.ui.di_1.2.800.v20200128-0855.jar.pack.gz from https://download.eclipse.org/eclipse/updates/4.16-I-builds/I20200531-1800/plugins/ (9.76kB)
[INFO] Fetching org.eclipse.e4.ui.dialogs_1.1.800.v20200522-0923.jar.pack.gz from https://download.eclipse.org/eclipse/updates/4.16-I-builds/I20200531-1800/plugins/ (27.84kB)
[INFO] Fetching org.eclipse.e4.ui.ide_3.15.100.v20200323-2111.jar.pack.gz from https://download.eclipse.org/eclipse/updates/4.16-I-builds/I20200531-1800/plugins/ (7.94kB)
[INFO] Fetching org.eclipse.e4.ui.model.workbench_2.1.700.v20200113-1422.jar.pack.gz from https://download.eclipse.org/eclipse/updates/4.16-I-builds/I20200531-1800/plugins/ (111.14kB)
[INFO] Fetching org.eclipse.equinox.event_1.5.400.v20200511-1702.jar.pack.gz from https://download.eclipse.org/eclipse/updates/4.16-I-builds/I20200531-1800/plugins/ (16.62kB)
[INFO] Fetching org.eclipse.e4.ui.widgets_1.2.700.v20191222-1048.jar.pack.gz from https://download.eclipse.org/eclipse/updates/4.16-I-builds/I20200531-1800/plugins/ (9.45kB)
[INFO] Fetching org.eclipse.e4.ui.workbench_1.11.300.v20200514-1625.jar.pack.gz from https://download.eclipse.org/eclipse/updates/4.16-I-builds/I20200531-1800/plugins/ (85.1kB)
[INFO] Fetching org.eclipse.emf.ecore.change_2.14.0.v20190528-0725.jar.pack.gz from https://download.eclipse.org/eclipse/updates/4.16-I-builds/I20200531-1800/plugins/ (51kB)
[INFO] Fetching org.eclipse.emf.ecore.xmi_2.16.0.v20190528-0725.jar.pack.gz from https://download.eclipse.org/eclipse/updates/4.16-I-builds/I20200531-1800/plugins/ (84.02kB)
[INFO] Fetching org.eclipse.e4.ui.workbench.addons.swt_1.3.1000.v20200517-1848.jar.pack.gz from https://download.eclipse.org/eclipse/updates/4.16-I-builds/I20200531-1800/plugins/ (49.88kB)
[INFO] Fetching org.eclipse.e4.ui.workbench.renderers.swt_0.14.1200.v20200529-1321.jar.pack.gz from https://download.eclipse.org/eclipse/updates/4.16-I-builds/I20200531-1800/plugins/ (95.01kB)
[INFO] Fetching org.eclipse.e4.ui.workbench.swt_0.14.1000.v20200514-1625.jar.pack.gz from https://download.eclipse.org/eclipse/updates/4.16-I-builds/I20200531-1800/plugins/ (60.86kB)
[INFO] Fetching org.eclipse.jface.databinding_1.11.100.v20200522-1835.jar.pack.gz from https://download.eclipse.org/eclipse/updates/4.16-I-builds/I20200531-1800/plugins/ (77.88kB)
[INFO] Fetching org.eclipse.e4.ui.workbench3_0.15.400.v20191216-0805.jar.pack.gz from https://download.eclipse.org/eclipse/updates/4.16-I-builds/I20200531-1800/plugins/ (13.07kB)
[INFO] Fetching org.eclipse.urischeme_1.1.0.v20200526-0654.jar.pack.gz from https://download.eclipse.org/eclipse/updates/4.16-I-builds/I20200531-1800/plugins/ (22.55kB)
[INFO] Fetching org.eclipse.emf.common_2.19.0.v20200324-0932.jar.pack.gz from https://download.eclipse.org/eclipse/updates/4.16-I-builds/I20200531-1800/plugins/ (115.11kB)
[INFO] Fetching org.eclipse.equinox.bidi_1.2.300.v20191213-1901.jar.pack.gz from https://download.eclipse.org/eclipse/updates/4.16-I-builds/I20200531-1800/plugins/ (23.95kB)
[INFO] Fetching org.eclipse.equinox.launcher_1.5.700.v20200207-2156.jar.pack.gz from https://download.eclipse.org/eclipse/updates/4.16-I-builds/I20200531-1800/plugins/ (29.85kB)
[INFO] Fetching org.eclipse.equinox.p2.core_2.6.300.v20200211-1504.jar.pack.gz from https://download.eclipse.org/eclipse/updates/4.16-I-builds/I20200531-1800/plugins/ (32.04kB)
[INFO] Fetching org.eclipse.equinox.p2.engine_2.6.700.v20200511-1530.jar.pack.gz from https://download.eclipse.org/eclipse/updates/4.16-I-builds/I20200531-1800/plugins/ (74.47kB)
[INFO] Fetching org.eclipse.equinox.p2.metadata_2.5.0.v20200511-1530.jar.pack.gz from https://download.eclipse.org/eclipse/updates/4.16-I-builds/I20200531-1800/plugins/ (107.88kB)
[INFO] Fetching org.eclipse.equinox.p2.metadata.repository_1.3.400.v20191211-1528.jar.pack.gz from https://download.eclipse.org/eclipse/updates/4.16-I-builds/I20200531-1800/plugins/ (50.94kB)
[INFO] Fetching org.eclipse.equinox.p2.repository_2.4.700.v20200110-2121.jar.pack.gz from https://download.eclipse.org/eclipse/updates/4.16-I-builds/I20200531-1800/plugins/ (55.47kB)
[INFO] Fetching org.tukaani.xz_1.8.0.v20180207-1613.jar.pack.gz from https://download.eclipse.org/eclipse/updates/4.16-I-builds/I20200531-1800/plugins/ (44.42kB)
[INFO] Fetching org.eclipse.help_3.8.800.v20200525-0755.jar.pack.gz from https://download.eclipse.org/eclipse/updates/4.16-I-builds/I20200531-1800/plugins/ (120.7kB)
[INFO] Fetching org.eclipse.ltk.core.refactoring_3.11.0.v20200515-0330.jar.pack.gz from https://download.eclipse.org/eclipse/updates/4.16-I-builds/I20200531-1800/plugins/ (105.75kB)
[INFO] Fetching org.eclipse.ltk.ui.refactoring_3.11.0.v20200515-0330.jar.pack.gz from https://download.eclipse.org/eclipse/updates/4.16-I-builds/I20200531-1800/plugins/ (176.74kB)
[INFO] Fetching org.eclipse.ui.navigator_3.9.300.v20200513-0930.jar.pack.gz from https://download.eclipse.org/eclipse/updates/4.16-I-builds/I20200531-1800/plugins/ (131.02kB)
[INFO] Fetching org.eclipse.team.core_3.8.1000.v20200428-1255.jar.pack.gz from https://download.eclipse.org/eclipse/updates/4.16-I-builds/I20200531-1800/plugins/ (124.89kB)
[INFO] Fetching org.eclipse.team.ui_3.8.900.v20200422-1935.jar.pack.gz from https://download.eclipse.org/eclipse/updates/4.16-I-builds/I20200531-1800/plugins/ (492.92kB)
[INFO] Fetching org.eclipse.swt.gtk.linux.x86_64_3.114.100.v20200527-2203.jar.pack.gz from https://download.eclipse.org/eclipse/updates/4.16-I-builds/I20200531-1800/plugins/ (956.04kB)
[INFO] Fetching org.eclipse.ui.workbench_3.119.0.v20200521-1247.jar.pack.gz from https://download.eclipse.org/eclipse/updates/4.16-I-builds/I20200531-1800/plugins/ (997.92kB)
Jun 02, 2020 10:46:22 PM org.apache.http.impl.execchain.RetryExec execute
INFO: I/O exception (org.apache.http.NoHttpResponseException) caught when processing request to {s}->https://download.eclipse.org:443: The target server failed to respond
Jun 02, 2020 10:46:22 PM org.apache.http.impl.execchain.RetryExec execute
INFO: Retrying request to {s}->https://download.eclipse.org:443
[INFO] Fetching org.eclipse.ui.ide.application_1.3.700.v20200525-1456.jar.pack.gz from https://download.eclipse.org/eclipse/updates/4.16-I-builds/I20200531-1800/plugins/ (56.86kB)
[INFO] Fetching org.eclipse.ui.navigator.resources_3.7.300.v20200417-1241.jar.pack.gz from https://download.eclipse.org/eclipse/updates/4.16-I-builds/I20200531-1800/plugins/ (71.64kB)
[INFO] Fetching org.eclipse.ui.views.properties.tabbed_3.8.900.v20200513-0930.jar.pack.gz from https://download.eclipse.org/eclipse/updates/4.16-I-builds/I20200531-1800/plugins/ (40.75kB)
[INFO] Fetching org.hamcrest.core_1.3.0.v20180420-1519.jar.pack.gz from https://download.eclipse.org/eclipse/updates/4.16-I-builds/I20200531-1800/plugins/ (29.18kB)
[INFO] Fetching org.w3c.dom.smil_1.0.1.v200903091627.jar.pack.gz from https://download.eclipse.org/eclipse/updates/4.16-I-builds/I20200531-1800/plugins/ (16.71kB)
[INFO] Fetching org.eclipse.swt.gtk.linux.ppc64le_3.114.100.v20200527-2203.jar.pack.gz from https://download.eclipse.org/eclipse/updates/4.16-I-builds/I20200531-1800/plugins/ (914.83kB)
[INFO] Fetching org.eclipse.swt.win32.win32.x86_64_3.114.100.v20200527-2203.jar.pack.gz from https://download.eclipse.org/eclipse/updates/4.16-I-builds/I20200531-1800/plugins/ (1.13MB)
Jun 02, 2020 10:46:25 PM org.apache.http.impl.execchain.RetryExec execute
INFO: I/O exception (org.apache.http.NoHttpResponseException) caught when processing request to {s}->https://download.eclipse.org:443: The target server failed to respond
Jun 02, 2020 10:46:25 PM org.apache.http.impl.execchain.RetryExec execute
INFO: Retrying request to {s}->https://download.eclipse.org:443
[INFO] Fetching org.eclipse.swt.cocoa.macosx.x86_64_3.114.100.v20200527-2203.jar.pack.gz from https://download.eclipse.org/eclipse/updates/4.16-I-builds/I20200531-1800/plugins/ (835.01kB)
[INFO] Resolving class path of MavenProject: org.eclipse.core:org.eclipse.core.expressions.tests:3.5.800-SNAPSHOT @ /home/jenkins/agent/workspace/eclipse.platform.runtime-SonarQube/tests/org.eclipse.core.expressions.tests/pom.xml
[INFO] Computing target platform for MavenProject: org.eclipse.core:org.eclipse.core.tests.harness:3.11.700-SNAPSHOT @ /home/jenkins/agent/workspace/eclipse.platform.runtime-SonarQube/tests/org.eclipse.core.tests.harness/pom.xml
[INFO] Resolving dependencies of MavenProject: org.eclipse.core:org.eclipse.core.tests.harness:3.11.700-SNAPSHOT @ /home/jenkins/agent/workspace/eclipse.platform.runtime-SonarQube/tests/org.eclipse.core.tests.harness/pom.xml
Jun 02, 2020 10:46:26 PM org.apache.http.impl.execchain.RetryExec execute
INFO: I/O exception (org.apache.http.NoHttpResponseException) caught when processing request to {s}->https://download.eclipse.org:443: The target server failed to respond
Jun 02, 2020 10:46:26 PM org.apache.http.impl.execchain.RetryExec execute
INFO: Retrying request to {s}->https://download.eclipse.org:443
[INFO] Fetching org.eclipse.test.performance_3.15.0.v20200513-0959.jar.pack.gz from https://download.eclipse.org/eclipse/updates/4.16-I-builds/I20200531-1800/plugins/ (56.99kB)
[INFO] Resolving class path of MavenProject: org.eclipse.core:org.eclipse.core.tests.harness:3.11.700-SNAPSHOT @ /home/jenkins/agent/workspace/eclipse.platform.runtime-SonarQube/tests/org.eclipse.core.tests.harness/pom.xml
[INFO] Computing target platform for MavenProject: org.eclipse.core:org.eclipse.core.tests.runtime:3.18.0-SNAPSHOT @ /home/jenkins/agent/workspace/eclipse.platform.runtime-SonarQube/tests/org.eclipse.core.tests.runtime/pom.xml
[INFO] Resolving dependencies of MavenProject: org.eclipse.core:org.eclipse.core.tests.runtime:3.18.0-SNAPSHOT @ /home/jenkins/agent/workspace/eclipse.platform.runtime-SonarQube/tests/org.eclipse.core.tests.runtime/pom.xml
[INFO] Fetching org.eclipse.jdt.annotation_2.2.600.v20200408-1511.jar.pack.gz from https://download.eclipse.org/eclipse/updates/4.16-I-builds/I20200531-1800/plugins/ (16.59kB)
[INFO] Fetching org.eclipse.jdt.junit.runtime_3.5.200.v20200501-1429.jar.pack.gz from https://download.eclipse.org/eclipse/updates/4.16-I-builds/I20200531-1800/plugins/ (24.57kB)
[INFO] Fetching org.eclipse.jdt.junit4.runtime_1.1.1200.v20200214-0716.jar.pack.gz from https://download.eclipse.org/eclipse/updates/4.16-I-builds/I20200531-1800/plugins/ (13.19kB)
[INFO] Fetching org.eclipse.pde.junit.runtime_3.5.800.v20200310-0710.jar.pack.gz from https://download.eclipse.org/eclipse/updates/4.16-I-builds/I20200531-1800/plugins/ (13.72kB)
[INFO] Resolving class path of MavenProject: org.eclipse.core:org.eclipse.core.tests.runtime:3.18.0-SNAPSHOT @ /home/jenkins/agent/workspace/eclipse.platform.runtime-SonarQube/tests/org.eclipse.core.tests.runtime/pom.xml
[INFO] Computing target platform for MavenProject: org.eclipse.e4:org.eclipse.e4.core.tests:1.1.1100-SNAPSHOT @ /home/jenkins/agent/workspace/eclipse.platform.runtime-SonarQube/tests/org.eclipse.e4.core.tests/pom.xml
[INFO] Resolving dependencies of MavenProject: org.eclipse.e4:org.eclipse.e4.core.tests:1.1.1100-SNAPSHOT @ /home/jenkins/agent/workspace/eclipse.platform.runtime-SonarQube/tests/org.eclipse.e4.core.tests/pom.xml
[INFO] Resolving class path of MavenProject: org.eclipse.e4:org.eclipse.e4.core.tests:1.1.1100-SNAPSHOT @ /home/jenkins/agent/workspace/eclipse.platform.runtime-SonarQube/tests/org.eclipse.e4.core.tests/pom.xml
[INFO] Computing target platform for MavenProject: org.eclipse.core:org.eclipse.core.contenttype.tests:1.0.200-SNAPSHOT @ /home/jenkins/agent/workspace/eclipse.platform.runtime-SonarQube/tests/org.eclipse.core.contenttype.tests/pom.xml
[INFO] Resolving dependencies of MavenProject: org.eclipse.core:org.eclipse.core.contenttype.tests:1.0.200-SNAPSHOT @ /home/jenkins/agent/workspace/eclipse.platform.runtime-SonarQube/tests/org.eclipse.core.contenttype.tests/pom.xml
[INFO] Resolving class path of MavenProject: org.eclipse.core:org.eclipse.core.contenttype.tests:1.0.200-SNAPSHOT @ /home/jenkins/agent/workspace/eclipse.platform.runtime-SonarQube/tests/org.eclipse.core.contenttype.tests/pom.xml
[INFO] ------------------------------------------------------------------------
[INFO] Reactor Build Order:
[INFO] 
[INFO] eclipse.platform.runtime                                           [pom]
[INFO] org.eclipse.core.contenttype                            [eclipse-plugin]
[INFO] org.eclipse.core.jobs                                   [eclipse-plugin]
[INFO] org.eclipse.core.runtime                                [eclipse-plugin]
[INFO] org.eclipse.core.expressions                            [eclipse-plugin]
[INFO] org.eclipse.e4.core.di.annotations                      [eclipse-plugin]
[INFO] org.eclipse.e4.core.di                                  [eclipse-plugin]
[INFO] org.eclipse.e4.core.contexts                            [eclipse-plugin]
[INFO] org.eclipse.e4.core.di.extensions                       [eclipse-plugin]
[INFO] org.eclipse.e4.core.di.extensions.supplier              [eclipse-plugin]
[INFO] org.eclipse.e4.core.services                            [eclipse-plugin]
[INFO] org.eclipse.core.runtime.feature                       [eclipse-feature]
[INFO] eclipse.platform.runtime.tests                                     [pom]
[INFO] org.eclipse.core.expressions.tests                 [eclipse-test-plugin]
[INFO] org.eclipse.core.tests.harness                          [eclipse-plugin]
[INFO] org.eclipse.core.tests.runtime                     [eclipse-test-plugin]
[INFO] org.eclipse.e4.core.tests                          [eclipse-test-plugin]
[INFO] org.eclipse.core.contenttype.tests                 [eclipse-test-plugin]
[INFO] 
[INFO] ---------< eclipse.platform.runtime:eclipse.platform.runtime >----------
[INFO] Building eclipse.platform.runtime 4.16.0-SNAPSHOT                 [1/18]
[INFO] --------------------------------[ pom ]---------------------------------
[WARNING] The following dependencies could not be resolved at this point of the build but seem to be part of the reactor:
[WARNING] o org.eclipse.core:org.eclipse.core.contenttype:jar:3.7.700-SNAPSHOT (provided)
[WARNING] o org.eclipse.core:org.eclipse.core.jobs:jar:3.10.800-SNAPSHOT (provided)
[WARNING] Try running the build up to the lifecycle phase "package"
[WARNING] The following dependencies could not be resolved at this point of the build but seem to be part of the reactor:
[WARNING] o org.eclipse.core:org.eclipse.core.contenttype:jar:3.7.700-SNAPSHOT (provided)
[WARNING] o org.eclipse.core:org.eclipse.core.runtime:jar:3.18.0-SNAPSHOT (provided)
[WARNING] o org.eclipse.core:org.eclipse.core.jobs:jar:3.10.800-SNAPSHOT (provided)
[WARNING] Try running the build up to the lifecycle phase "package"
[WARNING] The following dependencies could not be resolved at this point of the build but seem to be part of the reactor:
[WARNING] o org.eclipse.e4:org.eclipse.e4.core.di.annotations:jar:1.6.600-SNAPSHOT (provided)
[WARNING] Try running the build up to the lifecycle phase "package"
[WARNING] The following dependencies could not be resolved at this point of the build but seem to be part of the reactor:
[WARNING] o org.eclipse.e4:org.eclipse.e4.core.di:jar:1.7.600-SNAPSHOT (provided)
[WARNING] o org.eclipse.e4:org.eclipse.e4.core.di.annotations:jar:1.6.600-SNAPSHOT (provided)
[WARNING] Try running the build up to the lifecycle phase "package"
[WARNING] The following dependencies could not be resolved at this point of the build but seem to be part of the reactor:
[WARNING] o org.eclipse.e4:org.eclipse.e4.core.contexts:jar:1.8.400-SNAPSHOT (provided)
[WARNING] o org.eclipse.e4:org.eclipse.e4.core.di:jar:1.7.600-SNAPSHOT (provided)
[WARNING] o org.eclipse.e4:org.eclipse.e4.core.di.annotations:jar:1.6.600-SNAPSHOT (provided)
[WARNING] o org.eclipse.e4:org.eclipse.e4.core.di.extensions:jar:0.16.0-SNAPSHOT (provided)
[WARNING] Try running the build up to the lifecycle phase "package"
[WARNING] The following dependencies could not be resolved at this point of the build but seem to be part of the reactor:
[WARNING] o org.eclipse.core:org.eclipse.core.jobs:jar:3.10.800-SNAPSHOT (provided)
[WARNING] o org.eclipse.e4:org.eclipse.e4.core.contexts:jar:1.8.400-SNAPSHOT (provided)
[WARNING] o org.eclipse.e4:org.eclipse.e4.core.di:jar:1.7.600-SNAPSHOT (provided)
[WARNING] o org.eclipse.e4:org.eclipse.e4.core.di.annotations:jar:1.6.600-SNAPSHOT (provided)
[WARNING] Try running the build up to the lifecycle phase "package"
[WARNING] The following dependencies could not be resolved at this point of the build but seem to be part of the reactor:
[WARNING] o org.eclipse.core:org.eclipse.core.contenttype:jar:3.7.700-SNAPSHOT (provided)
[WARNING] o org.eclipse.core:org.eclipse.core.expressions:jar:3.6.800-SNAPSHOT (provided)
[WARNING] o org.eclipse.core:org.eclipse.core.runtime:jar:3.18.0-SNAPSHOT (provided)
[WARNING] o org.eclipse.core:org.eclipse.core.jobs:jar:3.10.800-SNAPSHOT (provided)
[WARNING] Try running the build up to the lifecycle phase "package"
[WARNING] The following dependencies could not be resolved at this point of the build but seem to be part of the reactor:
[WARNING] o org.eclipse.core:org.eclipse.core.runtime:jar:3.18.0-SNAPSHOT (provided)
[WARNING] o org.eclipse.core:org.eclipse.core.expressions:jar:3.6.800-SNAPSHOT (provided)
[WARNING] o org.eclipse.core:org.eclipse.core.contenttype:jar:3.7.700-SNAPSHOT (provided)
[WARNING] o org.eclipse.core:org.eclipse.core.jobs:jar:3.10.800-SNAPSHOT (provided)
[WARNING] o org.eclipse.e4:org.eclipse.e4.core.di:jar:1.7.600-SNAPSHOT (provided)
[WARNING] o org.eclipse.e4:org.eclipse.e4.core.contexts:jar:1.8.400-SNAPSHOT (provided)
[WARNING] o org.eclipse.e4:org.eclipse.e4.core.services:jar:2.2.300-SNAPSHOT (provided)
[WARNING] o org.eclipse.e4:org.eclipse.e4.core.di.annotations:jar:1.6.600-SNAPSHOT (provided)
[WARNING] o org.eclipse.e4:org.eclipse.e4.core.di.extensions:jar:0.16.0-SNAPSHOT (provided)
[WARNING] o org.eclipse.e4:org.eclipse.e4.core.di.extensions.supplier:jar:0.15.600-SNAPSHOT (provided)
[WARNING] Try running the build up to the lifecycle phase "package"
[WARNING] The following dependencies could not be resolved at this point of the build but seem to be part of the reactor:
[WARNING] o org.eclipse.core:org.eclipse.core.contenttype:jar:3.7.700-SNAPSHOT (provided)
[WARNING] o org.eclipse.core:org.eclipse.core.jobs:jar:3.10.800-SNAPSHOT (provided)
[WARNING] o org.eclipse.core:org.eclipse.core.runtime:jar:3.18.0-SNAPSHOT (provided)
[WARNING] Try running the build up to the lifecycle phase "package"
[WARNING] The following dependencies could not be resolved at this point of the build but seem to be part of the reactor:
[WARNING] o org.eclipse.core:org.eclipse.core.runtime:jar:3.18.0-SNAPSHOT (provided)
[WARNING] o org.eclipse.core:org.eclipse.core.expressions:jar:3.6.800-SNAPSHOT (provided)
[WARNING] o org.eclipse.core:org.eclipse.core.contenttype:jar:3.7.700-SNAPSHOT (provided)
[WARNING] o org.eclipse.core:org.eclipse.core.jobs:jar:3.10.800-SNAPSHOT (provided)
[WARNING] o org.eclipse.core:org.eclipse.core.tests.harness:jar:3.11.700-SNAPSHOT (provided)
[WARNING] o org.eclipse.e4:org.eclipse.e4.core.di:jar:1.7.600-SNAPSHOT (provided)
[WARNING] o org.eclipse.e4:org.eclipse.e4.core.contexts:jar:1.8.400-SNAPSHOT (provided)
[WARNING] o org.eclipse.e4:org.eclipse.e4.core.services:jar:2.2.300-SNAPSHOT (provided)
[WARNING] o org.eclipse.e4:org.eclipse.e4.core.di.annotations:jar:1.6.600-SNAPSHOT (provided)
[WARNING] o org.eclipse.e4:org.eclipse.e4.core.di.extensions:jar:0.16.0-SNAPSHOT (provided)
[WARNING] o org.eclipse.e4:org.eclipse.e4.core.di.extensions.supplier:jar:0.15.600-SNAPSHOT (provided)
[WARNING] Try running the build up to the lifecycle phase "package"
[WARNING] The following dependencies could not be resolved at this point of the build but seem to be part of the reactor:
[WARNING] o org.eclipse.core:org.eclipse.core.runtime:jar:3.18.0-SNAPSHOT (provided)
[WARNING] o org.eclipse.core:org.eclipse.core.expressions:jar:3.6.800-SNAPSHOT (provided)
[WARNING] o org.eclipse.core:org.eclipse.core.contenttype:jar:3.7.700-SNAPSHOT (provided)
[WARNING] o org.eclipse.core:org.eclipse.core.jobs:jar:3.10.800-SNAPSHOT (provided)
[WARNING] o org.eclipse.core:org.eclipse.core.tests.harness:jar:3.11.700-SNAPSHOT (provided)
[WARNING] o org.eclipse.e4:org.eclipse.e4.core.di:jar:1.7.600-SNAPSHOT (provided)
[WARNING] o org.eclipse.e4:org.eclipse.e4.core.contexts:jar:1.8.400-SNAPSHOT (provided)
[WARNING] o org.eclipse.e4:org.eclipse.e4.core.services:jar:2.2.300-SNAPSHOT (provided)
[WARNING] o org.eclipse.e4:org.eclipse.e4.core.di.annotations:jar:1.6.600-SNAPSHOT (provided)
[WARNING] o org.eclipse.e4:org.eclipse.e4.core.di.extensions:jar:0.16.0-SNAPSHOT (provided)
[WARNING] o org.eclipse.e4:org.eclipse.e4.core.di.extensions.supplier:jar:0.15.600-SNAPSHOT (provided)
[WARNING] Try running the build up to the lifecycle phase "package"
[WARNING] The following dependencies could not be resolved at this point of the build but seem to be part of the reactor:
[WARNING] o org.eclipse.core:org.eclipse.core.runtime:jar:3.18.0-SNAPSHOT (provided)
[WARNING] o org.eclipse.core:org.eclipse.core.expressions:jar:3.6.800-SNAPSHOT (provided)
[WARNING] o org.eclipse.core:org.eclipse.core.contenttype:jar:3.7.700-SNAPSHOT (provided)
[WARNING] o org.eclipse.core:org.eclipse.core.jobs:jar:3.10.800-SNAPSHOT (provided)
[WARNING] o org.eclipse.e4:org.eclipse.e4.core.di:jar:1.7.600-SNAPSHOT (provided)
[WARNING] o org.eclipse.e4:org.eclipse.e4.core.contexts:jar:1.8.400-SNAPSHOT (provided)
[WARNING] o org.eclipse.e4:org.eclipse.e4.core.services:jar:2.2.300-SNAPSHOT (provided)
[WARNING] o org.eclipse.e4:org.eclipse.e4.core.di.annotations:jar:1.6.600-SNAPSHOT (provided)
[WARNING] o org.eclipse.e4:org.eclipse.e4.core.di.extensions:jar:0.16.0-SNAPSHOT (provided)
[WARNING] o org.eclipse.e4:org.eclipse.e4.core.di.extensions.supplier:jar:0.15.600-SNAPSHOT (provided)
[WARNING] Try running the build up to the lifecycle phase "package"
[INFO] 
[INFO] --- sonar-maven-plugin:3.3.0.603:sonar (default-cli) @ eclipse.platform.runtime ---
[INFO] User cache: /home/jenkins/.sonar/cache
[INFO] SonarQube version: 4.5.7
[INFO] Default locale: "en_US", source code encoding: "UTF-8"
22:46:40.404 INFO  - Load global referentials...
22:46:40.568 INFO  - Load global referentials done: 165 ms
22:46:40.616 INFO  - User cache: /home/jenkins/.sonar/cache
22:46:40.627 INFO  - Install plugins
22:46:40.634 INFO  - Download sonar-core-plugin-4.5.7.jar
22:46:40.672 INFO  - Download sonar-email-notifications-plugin-4.5.7.jar
22:46:40.760 INFO  - Download sonar-findbugs-plugin-3.3.jar
22:46:41.129 INFO  - Download sonar-java-plugin-3.9.jar
22:46:41.307 INFO  - Download sonar-ldap-plugin-1.4.jar
22:46:41.314 INFO  - Download sonar-pmd-plugin-2.6.jar
22:46:41.578 INFO  - Download sonar-cpd-plugin-4.5.7.jar
22:46:41.587 INFO  - Download sonar-dbcleaner-plugin-4.5.7.jar
22:46:41.603 INFO  - Download sonar-design-plugin-4.5.7.jar
22:46:41.608 INFO  - Download sonar-l10n-en-plugin-4.5.7.jar
22:46:41.612 INFO  - Download sonar-checkstyle-plugin-2.3.jar
22:46:41.768 INFO  - Install JDBC driver
22:46:41.782 INFO  - Download mysql-connector-java-5.1.27.jar
22:46:41.836 INFO  - Create JDBC datasource for jdbc:mysql://dbmaster:3306/sonar?autoReconnect=true&useUnicode=true&characterEncoding=utf8
[INFO] ------------------------------------------------------------------------
[INFO] Reactor Summary:
[INFO] 
[INFO] eclipse.platform.runtime 4.16.0-SNAPSHOT ........... FAILURE [ 17.168 s]
[INFO] org.eclipse.core.contenttype 3.7.700-SNAPSHOT ...... SKIPPED
[INFO] org.eclipse.core.jobs 3.10.800-SNAPSHOT ............ SKIPPED
[INFO] org.eclipse.core.runtime 3.18.0-SNAPSHOT ........... SKIPPED
[INFO] org.eclipse.core.expressions 3.6.800-SNAPSHOT ...... SKIPPED
[INFO] org.eclipse.e4.core.di.annotations 1.6.600-SNAPSHOT  SKIPPED
[INFO] org.eclipse.e4.core.di 1.7.600-SNAPSHOT ............ SKIPPED
[INFO] org.eclipse.e4.core.contexts 1.8.400-SNAPSHOT ...... SKIPPED
[INFO] org.eclipse.e4.core.di.extensions 0.16.0-SNAPSHOT .. SKIPPED
[INFO] org.eclipse.e4.core.di.extensions.supplier 0.15.600-SNAPSHOT SKIPPED
[INFO] org.eclipse.e4.core.services 2.2.300-SNAPSHOT ...... SKIPPED
[INFO] org.eclipse.core.runtime.feature 1.2.900-SNAPSHOT .. SKIPPED
[INFO] eclipse.platform.runtime.tests 4.16.0-SNAPSHOT ..... SKIPPED
[INFO] org.eclipse.core.expressions.tests 3.5.800-SNAPSHOT  SKIPPED
[INFO] org.eclipse.core.tests.harness 3.11.700-SNAPSHOT ... SKIPPED
[INFO] org.eclipse.core.tests.runtime 3.18.0-SNAPSHOT ..... SKIPPED
[INFO] org.eclipse.e4.core.tests 1.1.1100-SNAPSHOT ........ SKIPPED
[INFO] org.eclipse.core.contenttype.tests 1.0.200-SNAPSHOT  SKIPPED
[INFO] ------------------------------------------------------------------------
[INFO] BUILD FAILURE
[INFO] ------------------------------------------------------------------------
[INFO] Total time:  02:20 min
[INFO] Finished at: 2020-06-02T22:46:46Z
[INFO] ------------------------------------------------------------------------
[ERROR] Failed to execute goal org.sonarsource.scanner.maven:sonar-maven-plugin:3.3.0.603:sonar (default-cli) on project eclipse.platform.runtime: Fail to connect to database: Cannot create PoolableConnectionFactory (Could not create connection to database server. Attempted reconnect 3 times. Giving up.): Unknown database 'sonar' -> [Help 1]
org.apache.maven.lifecycle.LifecycleExecutionException: Failed to execute goal org.sonarsource.scanner.maven:sonar-maven-plugin:3.3.0.603:sonar (default-cli) on project eclipse.platform.runtime: Fail to connect to database
    at org.apache.maven.lifecycle.internal.MojoExecutor.execute (MojoExecutor.java:215)
    at org.apache.maven.lifecycle.internal.MojoExecutor.execute (MojoExecutor.java:156)
    at org.apache.maven.lifecycle.internal.MojoExecutor.execute (MojoExecutor.java:148)
    at org.apache.maven.lifecycle.internal.LifecycleModuleBuilder.buildProject (LifecycleModuleBuilder.java:117)
    at org.apache.maven.lifecycle.internal.LifecycleModuleBuilder.buildProject (LifecycleModuleBuilder.java:81)
    at org.apache.maven.lifecycle.internal.builder.singlethreaded.SingleThreadedBuilder.build (SingleThreadedBuilder.java:56)
    at org.apache.maven.lifecycle.internal.LifecycleStarter.execute (LifecycleStarter.java:128)
    at org.apache.maven.DefaultMaven.doExecute (DefaultMaven.java:305)
    at org.apache.maven.DefaultMaven.doExecute (DefaultMaven.java:192)
    at org.apache.maven.DefaultMaven.execute (DefaultMaven.java:105)
    at org.apache.maven.cli.MavenCli.execute (MavenCli.java:957)
    at org.apache.maven.cli.MavenCli.doMain (MavenCli.java:289)
    at org.apache.maven.cli.MavenCli.main (MavenCli.java:193)
    at sun.reflect.NativeMethodAccessorImpl.invoke0 (Native Method)
    at sun.reflect.NativeMethodAccessorImpl.invoke (NativeMethodAccessorImpl.java:62)
    at sun.reflect.DelegatingMethodAccessorImpl.invoke (DelegatingMethodAccessorImpl.java:43)
    at java.lang.reflect.Method.invoke (Method.java:498)
    at org.codehaus.plexus.classworlds.launcher.Launcher.launchEnhanced (Launcher.java:282)
    at org.codehaus.plexus.classworlds.launcher.Launcher.launch (Launcher.java:225)
    at org.codehaus.plexus.classworlds.launcher.Launcher.mainWithExitCode (Launcher.java:406)
    at org.codehaus.plexus.classworlds.launcher.Launcher.main (Launcher.java:347)
Caused by: org.apache.maven.plugin.MojoExecutionException: Fail to connect to database
    at org.sonarsource.scanner.maven.bootstrap.ExceptionHandling.handle (ExceptionHandling.java:36)
    at org.sonarsource.scanner.maven.bootstrap.ScannerBootstrapper.execute (ScannerBootstrapper.java:80)
    at org.sonarsource.scanner.maven.SonarQubeMojo.execute (SonarQubeMojo.java:139)
    at org.apache.maven.plugin.DefaultBuildPluginManager.executeMojo (DefaultBuildPluginManager.java:137)
    at org.apache.maven.lifecycle.internal.MojoExecutor.execute (MojoExecutor.java:210)
    at org.apache.maven.lifecycle.internal.MojoExecutor.execute (MojoExecutor.java:156)
    at org.apache.maven.lifecycle.internal.MojoExecutor.execute (MojoExecutor.java:148)
    at org.apache.maven.lifecycle.internal.LifecycleModuleBuilder.buildProject (LifecycleModuleBuilder.java:117)
    at org.apache.maven.lifecycle.internal.LifecycleModuleBuilder.buildProject (LifecycleModuleBuilder.java:81)
    at org.apache.maven.lifecycle.internal.builder.singlethreaded.SingleThreadedBuilder.build (SingleThreadedBuilder.java:56)
    at org.apache.maven.lifecycle.internal.LifecycleStarter.execute (LifecycleStarter.java:128)
    at org.apache.maven.DefaultMaven.doExecute (DefaultMaven.java:305)
    at org.apache.maven.DefaultMaven.doExecute (DefaultMaven.java:192)
    at org.apache.maven.DefaultMaven.execute (DefaultMaven.java:105)
    at org.apache.maven.cli.MavenCli.execute (MavenCli.java:957)
    at org.apache.maven.cli.MavenCli.doMain (MavenCli.java:289)
    at org.apache.maven.cli.MavenCli.main (MavenCli.java:193)
    at sun.reflect.NativeMethodAccessorImpl.invoke0 (Native Method)
    at sun.reflect.NativeMethodAccessorImpl.invoke (NativeMethodAccessorImpl.java:62)
    at sun.reflect.DelegatingMethodAccessorImpl.invoke (DelegatingMethodAccessorImpl.java:43)
    at java.lang.reflect.Method.invoke (Method.java:498)
    at org.codehaus.plexus.classworlds.launcher.Launcher.launchEnhanced (Launcher.java:282)
    at org.codehaus.plexus.classworlds.launcher.Launcher.launch (Launcher.java:225)
    at org.codehaus.plexus.classworlds.launcher.Launcher.mainWithExitCode (Launcher.java:406)
    at org.codehaus.plexus.classworlds.launcher.Launcher.main (Launcher.java:347)
Caused by: java.lang.IllegalStateException: Fail to connect to database
    at org.sonar.core.persistence.DefaultDatabase.start (DefaultDatabase.java:77)
    at sun.reflect.NativeMethodAccessorImpl.invoke0 (Native Method)
    at sun.reflect.NativeMethodAccessorImpl.invoke (NativeMethodAccessorImpl.java:62)
    at sun.reflect.DelegatingMethodAccessorImpl.invoke (DelegatingMethodAccessorImpl.java:43)
    at java.lang.reflect.Method.invoke (Method.java:498)
    at org.picocontainer.lifecycle.ReflectionLifecycleStrategy.invokeMethod (ReflectionLifecycleStrategy.java:110)
    at org.picocontainer.lifecycle.ReflectionLifecycleStrategy.start (ReflectionLifecycleStrategy.java:89)
    at org.picocontainer.injectors.AbstractInjectionFactory$LifecycleAdapter.start (AbstractInjectionFactory.java:84)
    at org.picocontainer.behaviors.AbstractBehavior.start (AbstractBehavior.java:169)
    at org.picocontainer.behaviors.Stored$RealComponentLifecycle.start (Stored.java:132)
    at org.picocontainer.behaviors.Stored.start (Stored.java:110)
    at org.picocontainer.DefaultPicoContainer.potentiallyStartAdapter (DefaultPicoContainer.java:1015)
    at org.picocontainer.DefaultPicoContainer.startAdapters (DefaultPicoContainer.java:1008)
    at org.picocontainer.DefaultPicoContainer.start (DefaultPicoContainer.java:766)
    at org.sonar.api.platform.ComponentContainer.startComponents (ComponentContainer.java:92)
    at org.sonar.batch.bootstrapper.Batch.start (Batch.java:81)
    at org.sonar.batch.bootstrapper.Batch.execute (Batch.java:67)
    at org.sonarsource.scanner.api.internal.batch.BatchIsolatedLauncher.executeOldVersion (BatchIsolatedLauncher.java:71)
    at sun.reflect.NativeMethodAccessorImpl.invoke0 (Native Method)
    at sun.reflect.NativeMethodAccessorImpl.invoke (NativeMethodAccessorImpl.java:62)
    at sun.reflect.DelegatingMethodAccessorImpl.invoke (DelegatingMethodAccessorImpl.java:43)
    at java.lang.reflect.Method.invoke (Method.java:498)
    at org.sonarsource.scanner.api.internal.IsolatedLauncherProxy.invoke (IsolatedLauncherProxy.java:60)
    at com.sun.proxy.$Proxy25.executeOldVersion (Unknown Source)
    at org.sonarsource.scanner.api.EmbeddedScanner.doExecute (EmbeddedScanner.java:238)
    at org.sonarsource.scanner.api.EmbeddedScanner.runAnalysis (EmbeddedScanner.java:151)
    at org.sonarsource.scanner.maven.bootstrap.ScannerBootstrapper.execute (ScannerBootstrapper.java:77)
    at org.sonarsource.scanner.maven.SonarQubeMojo.execute (SonarQubeMojo.java:139)
    at org.apache.maven.plugin.DefaultBuildPluginManager.executeMojo (DefaultBuildPluginManager.java:137)
    at org.apache.maven.lifecycle.internal.MojoExecutor.execute (MojoExecutor.java:210)
    at org.apache.maven.lifecycle.internal.MojoExecutor.execute (MojoExecutor.java:156)
    at org.apache.maven.lifecycle.internal.MojoExecutor.execute (MojoExecutor.java:148)
    at org.apache.maven.lifecycle.internal.LifecycleModuleBuilder.buildProject (LifecycleModuleBuilder.java:117)
    at org.apache.maven.lifecycle.internal.LifecycleModuleBuilder.buildProject (LifecycleModuleBuilder.java:81)
    at org.apache.maven.lifecycle.internal.builder.singlethreaded.SingleThreadedBuilder.build (SingleThreadedBuilder.java:56)
    at org.apache.maven.lifecycle.internal.LifecycleStarter.execute (LifecycleStarter.java:128)
    at org.apache.maven.DefaultMaven.doExecute (DefaultMaven.java:305)
    at org.apache.maven.DefaultMaven.doExecute (DefaultMaven.java:192)
    at org.apache.maven.DefaultMaven.execute (DefaultMaven.java:105)
    at org.apache.maven.cli.MavenCli.execute (MavenCli.java:957)
    at org.apache.maven.cli.MavenCli.doMain (MavenCli.java:289)
    at org.apache.maven.cli.MavenCli.main (MavenCli.java:193)
    at sun.reflect.NativeMethodAccessorImpl.invoke0 (Native Method)
    at sun.reflect.NativeMethodAccessorImpl.invoke (NativeMethodAccessorImpl.java:62)
    at sun.reflect.DelegatingMethodAccessorImpl.invoke (DelegatingMethodAccessorImpl.java:43)
    at java.lang.reflect.Method.invoke (Method.java:498)
    at org.codehaus.plexus.classworlds.launcher.Launcher.launchEnhanced (Launcher.java:282)
    at org.codehaus.plexus.classworlds.launcher.Launcher.launch (Launcher.java:225)
    at org.codehaus.plexus.classworlds.launcher.Launcher.mainWithExitCode (Launcher.java:406)
    at org.codehaus.plexus.classworlds.launcher.Launcher.main (Launcher.java:347)
Caused by: org.apache.commons.dbcp.SQLNestedException: Cannot create PoolableConnectionFactory (Could not create connection to database server. Attempted reconnect 3 times. Giving up.)
    at org.apache.commons.dbcp.BasicDataSource.createPoolableConnectionFactory (BasicDataSource.java:1549)
    at org.apache.commons.dbcp.BasicDataSource.createDataSource (BasicDataSource.java:1388)
    at org.apache.commons.dbcp.BasicDataSource.getLogWriter (BasicDataSource.java:1098)
    at org.apache.commons.dbcp.BasicDataSourceFactory.createDataSource (BasicDataSourceFactory.java:350)
    at org.sonar.core.persistence.DefaultDatabase.initDatasource (DefaultDatabase.java:103)
    at org.sonar.core.persistence.DefaultDatabase.start (DefaultDatabase.java:72)
    at sun.reflect.NativeMethodAccessorImpl.invoke0 (Native Method)
    at sun.reflect.NativeMethodAccessorImpl.invoke (NativeMethodAccessorImpl.java:62)
    at sun.reflect.DelegatingMethodAccessorImpl.invoke (DelegatingMethodAccessorImpl.java:43)
    at java.lang.reflect.Method.invoke (Method.java:498)
    at org.picocontainer.lifecycle.ReflectionLifecycleStrategy.invokeMethod (ReflectionLifecycleStrategy.java:110)
    at org.picocontainer.lifecycle.ReflectionLifecycleStrategy.start (ReflectionLifecycleStrategy.java:89)
    at org.picocontainer.injectors.AbstractInjectionFactory$LifecycleAdapter.start (AbstractInjectionFactory.java:84)
    at org.picocontainer.behaviors.AbstractBehavior.start (AbstractBehavior.java:169)
    at org.picocontainer.behaviors.Stored$RealComponentLifecycle.start (Stored.java:132)
    at org.picocontainer.behaviors.Stored.start (Stored.java:110)
    at org.picocontainer.DefaultPicoContainer.potentiallyStartAdapter (DefaultPicoContainer.java:1015)
    at org.picocontainer.DefaultPicoContainer.startAdapters (DefaultPicoContainer.java:1008)
    at org.picocontainer.DefaultPicoContainer.start (DefaultPicoContainer.java:766)
    at org.sonar.api.platform.ComponentContainer.startComponents (ComponentContainer.java:92)
    at org.sonar.batch.bootstrapper.Batch.start (Batch.java:81)
    at org.sonar.batch.bootstrapper.Batch.execute (Batch.java:67)
    at org.sonarsource.scanner.api.internal.batch.BatchIsolatedLauncher.executeOldVersion (BatchIsolatedLauncher.java:71)
    at sun.reflect.NativeMethodAccessorImpl.invoke0 (Native Method)
    at sun.reflect.NativeMethodAccessorImpl.invoke (NativeMethodAccessorImpl.java:62)
    at sun.reflect.DelegatingMethodAccessorImpl.invoke (DelegatingMethodAccessorImpl.java:43)
    at java.lang.reflect.Method.invoke (Method.java:498)
    at org.sonarsource.scanner.api.internal.IsolatedLauncherProxy.invoke (IsolatedLauncherProxy.java:60)
    at com.sun.proxy.$Proxy25.executeOldVersion (Unknown Source)
    at org.sonarsource.scanner.api.EmbeddedScanner.doExecute (EmbeddedScanner.java:238)
    at org.sonarsource.scanner.api.EmbeddedScanner.runAnalysis (EmbeddedScanner.java:151)
    at org.sonarsource.scanner.maven.bootstrap.ScannerBootstrapper.execute (ScannerBootstrapper.java:77)
    at org.sonarsource.scanner.maven.SonarQubeMojo.execute (SonarQubeMojo.java:139)
    at org.apache.maven.plugin.DefaultBuildPluginManager.executeMojo (DefaultBuildPluginManager.java:137)
    at org.apache.maven.lifecycle.internal.MojoExecutor.execute (MojoExecutor.java:210)
    at org.apache.maven.lifecycle.internal.MojoExecutor.execute (MojoExecutor.java:156)
    at org.apache.maven.lifecycle.internal.MojoExecutor.execute (MojoExecutor.java:148)
    at org.apache.maven.lifecycle.internal.LifecycleModuleBuilder.buildProject (LifecycleModuleBuilder.java:117)
    at org.apache.maven.lifecycle.internal.LifecycleModuleBuilder.buildProject (LifecycleModuleBuilder.java:81)
    at org.apache.maven.lifecycle.internal.builder.singlethreaded.SingleThreadedBuilder.build (SingleThreadedBuilder.java:56)
    at org.apache.maven.lifecycle.internal.LifecycleStarter.execute (LifecycleStarter.java:128)
    at org.apache.maven.DefaultMaven.doExecute (DefaultMaven.java:305)
    at org.apache.maven.DefaultMaven.doExecute (DefaultMaven.java:192)
    at org.apache.maven.DefaultMaven.execute (DefaultMaven.java:105)
    at org.apache.maven.cli.MavenCli.execute (MavenCli.java:957)
    at org.apache.maven.cli.MavenCli.doMain (MavenCli.java:289)
    at org.apache.maven.cli.MavenCli.main (MavenCli.java:193)
    at sun.reflect.NativeMethodAccessorImpl.invoke0 (Native Method)
    at sun.reflect.NativeMethodAccessorImpl.invoke (NativeMethodAccessorImpl.java:62)
    at sun.reflect.DelegatingMethodAccessorImpl.invoke (DelegatingMethodAccessorImpl.java:43)
    at java.lang.reflect.Method.invoke (Method.java:498)
    at org.codehaus.plexus.classworlds.launcher.Launcher.launchEnhanced (Launcher.java:282)
    at org.codehaus.plexus.classworlds.launcher.Launcher.launch (Launcher.java:225)
    at org.codehaus.plexus.classworlds.launcher.Launcher.mainWithExitCode (Launcher.java:406)
    at org.codehaus.plexus.classworlds.launcher.Launcher.main (Launcher.java:347)
Caused by: com.mysql.jdbc.exceptions.jdbc4.MySQLNonTransientConnectionException: Could not create connection to database server. Attempted reconnect 3 times. Giving up.
    at sun.reflect.NativeConstructorAccessorImpl.newInstance0 (Native Method)
    at sun.reflect.NativeConstructorAccessorImpl.newInstance (NativeConstructorAccessorImpl.java:62)
    at sun.reflect.DelegatingConstructorAccessorImpl.newInstance (DelegatingConstructorAccessorImpl.java:45)
    at java.lang.reflect.Constructor.newInstance (Constructor.java:423)
    at com.mysql.jdbc.Util.handleNewInstance (Util.java:411)
    at com.mysql.jdbc.Util.getInstance (Util.java:386)
    at com.mysql.jdbc.SQLError.createSQLException (SQLError.java:1015)
    at com.mysql.jdbc.SQLError.createSQLException (SQLError.java:989)
    at com.mysql.jdbc.SQLError.createSQLException (SQLError.java:975)
    at com.mysql.jdbc.SQLError.createSQLException (SQLError.java:920)
    at com.mysql.jdbc.ConnectionImpl.connectWithRetries (ConnectionImpl.java:2395)
    at com.mysql.jdbc.ConnectionImpl.createNewIO (ConnectionImpl.java:2316)
    at com.mysql.jdbc.ConnectionImpl.<init> (ConnectionImpl.java:834)
    at com.mysql.jdbc.JDBC4Connection.<init> (JDBC4Connection.java:47)
    at sun.reflect.NativeConstructorAccessorImpl.newInstance0 (Native Method)
    at sun.reflect.NativeConstructorAccessorImpl.newInstance (NativeConstructorAccessorImpl.java:62)
    at sun.reflect.DelegatingConstructorAccessorImpl.newInstance (DelegatingConstructorAccessorImpl.java:45)
    at java.lang.reflect.Constructor.newInstance (Constructor.java:423)
    at com.mysql.jdbc.Util.handleNewInstance (Util.java:411)
    at com.mysql.jdbc.ConnectionImpl.getInstance (ConnectionImpl.java:416)
    at com.mysql.jdbc.NonRegisteringDriver.connect (NonRegisteringDriver.java:347)
    at org.apache.commons.dbcp.DriverConnectionFactory.createConnection (DriverConnectionFactory.java:38)
    at org.apache.commons.dbcp.PoolableConnectionFactory.makeObject (PoolableConnectionFactory.java:582)
    at org.apache.commons.dbcp.BasicDataSource.validateConnectionFactory (BasicDataSource.java:1556)
    at org.apache.commons.dbcp.BasicDataSource.createPoolableConnectionFactory (BasicDataSource.java:1545)
    at org.apache.commons.dbcp.BasicDataSource.createDataSource (BasicDataSource.java:1388)
    at org.apache.commons.dbcp.BasicDataSource.getLogWriter (BasicDataSource.java:1098)
    at org.apache.commons.dbcp.BasicDataSourceFactory.createDataSource (BasicDataSourceFactory.java:350)
    at org.sonar.core.persistence.DefaultDatabase.initDatasource (DefaultDatabase.java:103)
    at org.sonar.core.persistence.DefaultDatabase.start (DefaultDatabase.java:72)
    at sun.reflect.NativeMethodAccessorImpl.invoke0 (Native Method)
    at sun.reflect.NativeMethodAccessorImpl.invoke (NativeMethodAccessorImpl.java:62)
    at sun.reflect.DelegatingMethodAccessorImpl.invoke (DelegatingMethodAccessorImpl.java:43)
    at java.lang.reflect.Method.invoke (Method.java:498)
    at org.picocontainer.lifecycle.ReflectionLifecycleStrategy.invokeMethod (ReflectionLifecycleStrategy.java:110)
    at org.picocontainer.lifecycle.ReflectionLifecycleStrategy.start (ReflectionLifecycleStrategy.java:89)
    at org.picocontainer.injectors.AbstractInjectionFactory$LifecycleAdapter.start (AbstractInjectionFactory.java:84)
    at org.picocontainer.behaviors.AbstractBehavior.start (AbstractBehavior.java:169)
    at org.picocontainer.behaviors.Stored$RealComponentLifecycle.start (Stored.java:132)
    at org.picocontainer.behaviors.Stored.start (Stored.java:110)
    at org.picocontainer.DefaultPicoContainer.potentiallyStartAdapter (DefaultPicoContainer.java:1015)
    at org.picocontainer.DefaultPicoContainer.startAdapters (DefaultPicoContainer.java:1008)
    at org.picocontainer.DefaultPicoContainer.start (DefaultPicoContainer.java:766)
    at org.sonar.api.platform.ComponentContainer.startComponents (ComponentContainer.java:92)
    at org.sonar.batch.bootstrapper.Batch.start (Batch.java:81)
    at org.sonar.batch.bootstrapper.Batch.execute (Batch.java:67)
    at org.sonarsource.scanner.api.internal.batch.BatchIsolatedLauncher.executeOldVersion (BatchIsolatedLauncher.java:71)
    at sun.reflect.NativeMethodAccessorImpl.invoke0 (Native Method)
    at sun.reflect.NativeMethodAccessorImpl.invoke (NativeMethodAccessorImpl.java:62)
    at sun.reflect.DelegatingMethodAccessorImpl.invoke (DelegatingMethodAccessorImpl.java:43)
    at java.lang.reflect.Method.invoke (Method.java:498)
    at org.sonarsource.scanner.api.internal.IsolatedLauncherProxy.invoke (IsolatedLauncherProxy.java:60)
    at com.sun.proxy.$Proxy25.executeOldVersion (Unknown Source)
    at org.sonarsource.scanner.api.EmbeddedScanner.doExecute (EmbeddedScanner.java:238)
    at org.sonarsource.scanner.api.EmbeddedScanner.runAnalysis (EmbeddedScanner.java:151)
    at org.sonarsource.scanner.maven.bootstrap.ScannerBootstrapper.execute (ScannerBootstrapper.java:77)
    at org.sonarsource.scanner.maven.SonarQubeMojo.execute (SonarQubeMojo.java:139)
    at org.apache.maven.plugin.DefaultBuildPluginManager.executeMojo (DefaultBuildPluginManager.java:137)
    at org.apache.maven.lifecycle.internal.MojoExecutor.execute (MojoExecutor.java:210)
    at org.apache.maven.lifecycle.internal.MojoExecutor.execute (MojoExecutor.java:156)
    at org.apache.maven.lifecycle.internal.MojoExecutor.execute (MojoExecutor.java:148)
    at org.apache.maven.lifecycle.internal.LifecycleModuleBuilder.buildProject (LifecycleModuleBuilder.java:117)
    at org.apache.maven.lifecycle.internal.LifecycleModuleBuilder.buildProject (LifecycleModuleBuilder.java:81)
    at org.apache.maven.lifecycle.internal.builder.singlethreaded.SingleThreadedBuilder.build (SingleThreadedBuilder.java:56)
    at org.apache.maven.lifecycle.internal.LifecycleStarter.execute (LifecycleStarter.java:128)
    at org.apache.maven.DefaultMaven.doExecute (DefaultMaven.java:305)
    at org.apache.maven.DefaultMaven.doExecute (DefaultMaven.java:192)
    at org.apache.maven.DefaultMaven.execute (DefaultMaven.java:105)
    at org.apache.maven.cli.MavenCli.execute (MavenCli.java:957)
    at org.apache.maven.cli.MavenCli.doMain (MavenCli.java:289)
    at org.apache.maven.cli.MavenCli.main (MavenCli.java:193)
    at sun.reflect.NativeMethodAccessorImpl.invoke0 (Native Method)
    at sun.reflect.NativeMethodAccessorImpl.invoke (NativeMethodAccessorImpl.java:62)
    at sun.reflect.DelegatingMethodAccessorImpl.invoke (DelegatingMethodAccessorImpl.java:43)
    at java.lang.reflect.Method.invoke (Method.java:498)
    at org.codehaus.plexus.classworlds.launcher.Launcher.launchEnhanced (Launcher.java:282)
    at org.codehaus.plexus.classworlds.launcher.Launcher.launch (Launcher.java:225)
    at org.codehaus.plexus.classworlds.launcher.Launcher.mainWithExitCode (Launcher.java:406)
    at org.codehaus.plexus.classworlds.launcher.Launcher.main (Launcher.java:347)
Caused by: com.mysql.jdbc.exceptions.jdbc4.MySQLSyntaxErrorException: Unknown database 'sonar'
    at sun.reflect.NativeConstructorAccessorImpl.newInstance0 (Native Method)
    at sun.reflect.NativeConstructorAccessorImpl.newInstance (NativeConstructorAccessorImpl.java:62)
    at sun.reflect.DelegatingConstructorAccessorImpl.newInstance (DelegatingConstructorAccessorImpl.java:45)
    at java.lang.reflect.Constructor.newInstance (Constructor.java:423)
    at com.mysql.jdbc.Util.handleNewInstance (Util.java:411)
    at com.mysql.jdbc.Util.getInstance (Util.java:386)
    at com.mysql.jdbc.SQLError.createSQLException (SQLError.java:1054)
    at com.mysql.jdbc.MysqlIO.checkErrorPacket (MysqlIO.java:4237)
    at com.mysql.jdbc.MysqlIO.checkErrorPacket (MysqlIO.java:4169)
    at com.mysql.jdbc.MysqlIO.checkErrorPacket (MysqlIO.java:928)
    at com.mysql.jdbc.MysqlIO.proceedHandshakeWithPluggableAuthentication (MysqlIO.java:1750)
    at com.mysql.jdbc.MysqlIO.doHandshake (MysqlIO.java:1290)
    at com.mysql.jdbc.ConnectionImpl.coreConnect (ConnectionImpl.java:2493)
    at com.mysql.jdbc.ConnectionImpl.connectWithRetries (ConnectionImpl.java:2334)
    at com.mysql.jdbc.ConnectionImpl.createNewIO (ConnectionImpl.java:2316)
    at com.mysql.jdbc.ConnectionImpl.<init> (ConnectionImpl.java:834)
    at com.mysql.jdbc.JDBC4Connection.<init> (JDBC4Connection.java:47)
    at sun.reflect.NativeConstructorAccessorImpl.newInstance0 (Native Method)
    at sun.reflect.NativeConstructorAccessorImpl.newInstance (NativeConstructorAccessorImpl.java:62)
    at sun.reflect.DelegatingConstructorAccessorImpl.newInstance (DelegatingConstructorAccessorImpl.java:45)
    at java.lang.reflect.Constructor.newInstance (Constructor.java:423)
    at com.mysql.jdbc.Util.handleNewInstance (Util.java:411)
    at com.mysql.jdbc.ConnectionImpl.getInstance (ConnectionImpl.java:416)
    at com.mysql.jdbc.NonRegisteringDriver.connect (NonRegisteringDriver.java:347)
    at org.apache.commons.dbcp.DriverConnectionFactory.createConnection (DriverConnectionFactory.java:38)
    at org.apache.commons.dbcp.PoolableConnectionFactory.makeObject (PoolableConnectionFactory.java:582)
    at org.apache.commons.dbcp.BasicDataSource.validateConnectionFactory (BasicDataSource.java:1556)
    at org.apache.commons.dbcp.BasicDataSource.createPoolableConnectionFactory (BasicDataSource.java:1545)
    at org.apache.commons.dbcp.BasicDataSource.createDataSource (BasicDataSource.java:1388)
    at org.apache.commons.dbcp.BasicDataSource.getLogWriter (BasicDataSource.java:1098)
    at org.apache.commons.dbcp.BasicDataSourceFactory.createDataSource (BasicDataSourceFactory.java:350)
    at org.sonar.core.persistence.DefaultDatabase.initDatasource (DefaultDatabase.java:103)
    at org.sonar.core.persistence.DefaultDatabase.start (DefaultDatabase.java:72)
    at sun.reflect.NativeMethodAccessorImpl.invoke0 (Native Method)
    at sun.reflect.NativeMethodAccessorImpl.invoke (NativeMethodAccessorImpl.java:62)
    at sun.reflect.DelegatingMethodAccessorImpl.invoke (DelegatingMethodAccessorImpl.java:43)
    at java.lang.reflect.Method.invoke (Method.java:498)
    at org.picocontainer.lifecycle.ReflectionLifecycleStrategy.invokeMethod (ReflectionLifecycleStrategy.java:110)
    at org.picocontainer.lifecycle.ReflectionLifecycleStrategy.start (ReflectionLifecycleStrategy.java:89)
    at org.picocontainer.injectors.AbstractInjectionFactory$LifecycleAdapter.start (AbstractInjectionFactory.java:84)
    at org.picocontainer.behaviors.AbstractBehavior.start (AbstractBehavior.java:169)
    at org.picocontainer.behaviors.Stored$RealComponentLifecycle.start (Stored.java:132)
    at org.picocontainer.behaviors.Stored.start (Stored.java:110)
    at org.picocontainer.DefaultPicoContainer.potentiallyStartAdapter (DefaultPicoContainer.java:1015)
    at org.picocontainer.DefaultPicoContainer.startAdapters (DefaultPicoContainer.java:1008)
    at org.picocontainer.DefaultPicoContainer.start (DefaultPicoContainer.java:766)
    at org.sonar.api.platform.ComponentContainer.startComponents (ComponentContainer.java:92)
    at org.sonar.batch.bootstrapper.Batch.start (Batch.java:81)
    at org.sonar.batch.bootstrapper.Batch.execute (Batch.java:67)
    at org.sonarsource.scanner.api.internal.batch.BatchIsolatedLauncher.executeOldVersion (BatchIsolatedLauncher.java:71)
    at sun.reflect.NativeMethodAccessorImpl.invoke0 (Native Method)
    at sun.reflect.NativeMethodAccessorImpl.invoke (NativeMethodAccessorImpl.java:62)
    at sun.reflect.DelegatingMethodAccessorImpl.invoke (DelegatingMethodAccessorImpl.java:43)
    at java.lang.reflect.Method.invoke (Method.java:498)
    at org.sonarsource.scanner.api.internal.IsolatedLauncherProxy.invoke (IsolatedLauncherProxy.java:60)
    at com.sun.proxy.$Proxy25.executeOldVersion (Unknown Source)
    at org.sonarsource.scanner.api.EmbeddedScanner.doExecute (EmbeddedScanner.java:238)
    at org.sonarsource.scanner.api.EmbeddedScanner.runAnalysis (EmbeddedScanner.java:151)
    at org.sonarsource.scanner.maven.bootstrap.ScannerBootstrapper.execute (ScannerBootstrapper.java:77)
    at org.sonarsource.scanner.maven.SonarQubeMojo.execute (SonarQubeMojo.java:139)
    at org.apache.maven.plugin.DefaultBuildPluginManager.executeMojo (DefaultBuildPluginManager.java:137)
    at org.apache.maven.lifecycle.internal.MojoExecutor.execute (MojoExecutor.java:210)
    at org.apache.maven.lifecycle.internal.MojoExecutor.execute (MojoExecutor.java:156)
    at org.apache.maven.lifecycle.internal.MojoExecutor.execute (MojoExecutor.java:148)
    at org.apache.maven.lifecycle.internal.LifecycleModuleBuilder.buildProject (LifecycleModuleBuilder.java:117)
    at org.apache.maven.lifecycle.internal.LifecycleModuleBuilder.buildProject (LifecycleModuleBuilder.java:81)
    at org.apache.maven.lifecycle.internal.builder.singlethreaded.SingleThreadedBuilder.build (SingleThreadedBuilder.java:56)
    at org.apache.maven.lifecycle.internal.LifecycleStarter.execute (LifecycleStarter.java:128)
    at org.apache.maven.DefaultMaven.doExecute (DefaultMaven.java:305)
    at org.apache.maven.DefaultMaven.doExecute (DefaultMaven.java:192)
    at org.apache.maven.DefaultMaven.execute (DefaultMaven.java:105)
    at org.apache.maven.cli.MavenCli.execute (MavenCli.java:957)
    at org.apache.maven.cli.MavenCli.doMain (MavenCli.java:289)
    at org.apache.maven.cli.MavenCli.main (MavenCli.java:193)
    at sun.reflect.NativeMethodAccessorImpl.invoke0 (Native Method)
    at sun.reflect.NativeMethodAccessorImpl.invoke (NativeMethodAccessorImpl.java:62)
    at sun.reflect.DelegatingMethodAccessorImpl.invoke (DelegatingMethodAccessorImpl.java:43)
    at java.lang.reflect.Method.invoke (Method.java:498)
    at org.codehaus.plexus.classworlds.launcher.Launcher.launchEnhanced (Launcher.java:282)
    at org.codehaus.plexus.classworlds.launcher.Launcher.launch (Launcher.java:225)
    at org.codehaus.plexus.classworlds.launcher.Launcher.mainWithExitCode (Launcher.java:406)
    at org.codehaus.plexus.classworlds.launcher.Launcher.main (Launcher.java:347)
[ERROR] 
[ERROR] Re-run Maven using the -X switch to enable full debug logging.
[ERROR] 
[ERROR] For more information about the errors and possible solutions, please read the following articles:
[ERROR] [Help 1] http://cwiki.apache.org/confluence/display/MAVEN/MojoExecutionException
SonarQube analysis completed: FAILURE
Build step 'SonarQube analysis with Maven' changed build result to FAILURE
Build step 'SonarQube analysis with Maven' marked build as failure
Recording test results
Archiving artifacts
Finished: FAILURE