FailedConsole Output

Skipping 121 KB.. Full Log
tform.debug-SonarQube/org.eclipse.debug.examples.memory/target/eclipserun-work, -configuration, /home/jenkins/agent/workspace/eclipse.platform.debug-SonarQube/org.eclipse.debug.examples.memory/target/eclipserun-work/configuration, -data, target/apibuild-workspace, -application, org.eclipse.ant.core.antRunner, -buildfile, target/.apibuild.xml]
Buildfile: target/.apibuild.xml

apigen:
BUILD SUCCESSFUL

BUILD SUCCESSFUL
Total time: 0 seconds
[INFO] 
[INFO] --- maven-resources-plugin:3.1.0:testResources (default-testResources) @ org.eclipse.debug.examples.memory ---
[INFO] Using 'UTF-8' encoding to copy filtered resources.
[INFO] skip non existing resourceDirectory /home/jenkins/agent/workspace/eclipse.platform.debug-SonarQube/org.eclipse.debug.examples.memory/src/test/resources
[INFO] 
[INFO] --- tycho-source-plugin:1.7.0:plugin-source (plugin-source) @ org.eclipse.debug.examples.memory ---
[INFO] Building jar: /home/jenkins/agent/workspace/eclipse.platform.debug-SonarQube/org.eclipse.debug.examples.memory/target/org.eclipse.debug.examples.memory-1.102.200-SNAPSHOT-sources.jar
[INFO] 
[INFO] --- target-platform-configuration:1.7.0:target-platform (default-target-platform) @ org.eclipse.debug.examples.memory ---
[INFO] 
[INFO] --- tycho-packaging-plugin:1.7.0:package-plugin (default-package-plugin) @ org.eclipse.debug.examples.memory ---
[INFO] Building jar: /home/jenkins/agent/workspace/eclipse.platform.debug-SonarQube/org.eclipse.debug.examples.memory/target/org.eclipse.debug.examples.memory-1.102.200-SNAPSHOT.jar
[INFO] 
[INFO] --- tycho-p2-plugin:1.7.0:p2-metadata-default (default-p2-metadata-default) @ org.eclipse.debug.examples.memory ---
[WARNING] No repository found at file:/noThanks.
org.eclipse.equinox.p2.core.ProvisionException: No repository found at file:/noThanks.
    at org.eclipse.equinox.internal.p2.repository.helpers.AbstractRepositoryManager.fail (AbstractRepositoryManager.java:396)
    at org.eclipse.equinox.internal.p2.repository.helpers.AbstractRepositoryManager.loadRepository (AbstractRepositoryManager.java:661)
    at org.eclipse.equinox.internal.p2.metadata.repository.MetadataRepositoryManager.loadRepository (MetadataRepositoryManager.java:110)
    at org.eclipse.tycho.p2.remote.RemoteMetadataRepositoryManager.loadRepository (RemoteMetadataRepositoryManager.java:61)
    at org.eclipse.tycho.p2.remote.RemoteMetadataRepositoryManager.loadRepository (RemoteMetadataRepositoryManager.java:53)
    at org.eclipse.tycho.p2.tools.baseline.BaselineServiceImpl.getProjectBaseline (BaselineServiceImpl.java:95)
    at org.eclipse.tycho.plugins.p2.BaselineValidator.validateAndReplace (BaselineValidator.java:88)
    at org.eclipse.tycho.plugins.p2.P2MetadataMojo.attachP2Metadata (P2MetadataMojo.java:183)
    at org.eclipse.tycho.plugins.p2.P2MetadataMojo.execute (P2MetadataMojo.java:137)
    at org.eclipse.tycho.plugins.p2.P2MetadataDefaultMojo.execute (P2MetadataDefaultMojo.java:32)
    at org.apache.maven.plugin.DefaultBuildPluginManager.executeMojo (DefaultBuildPluginManager.java:137)
    at org.apache.maven.lifecycle.internal.MojoExecutor.execute (MojoExecutor.java:210)
    at org.apache.maven.lifecycle.internal.MojoExecutor.execute (MojoExecutor.java:156)
    at org.apache.maven.lifecycle.internal.MojoExecutor.execute (MojoExecutor.java:148)
    at org.apache.maven.lifecycle.internal.LifecycleModuleBuilder.buildProject (LifecycleModuleBuilder.java:117)
    at org.apache.maven.lifecycle.internal.LifecycleModuleBuilder.buildProject (LifecycleModuleBuilder.java:81)
    at org.apache.maven.lifecycle.internal.builder.singlethreaded.SingleThreadedBuilder.build (SingleThreadedBuilder.java:56)
    at org.apache.maven.lifecycle.internal.LifecycleStarter.execute (LifecycleStarter.java:128)
    at org.apache.maven.DefaultMaven.doExecute (DefaultMaven.java:305)
    at org.apache.maven.DefaultMaven.doExecute (DefaultMaven.java:192)
    at org.apache.maven.DefaultMaven.execute (DefaultMaven.java:105)
    at org.apache.maven.cli.MavenCli.execute (MavenCli.java:957)
    at org.apache.maven.cli.MavenCli.doMain (MavenCli.java:289)
    at org.apache.maven.cli.MavenCli.main (MavenCli.java:193)
    at sun.reflect.NativeMethodAccessorImpl.invoke0 (Native Method)
    at sun.reflect.NativeMethodAccessorImpl.invoke (NativeMethodAccessorImpl.java:62)
    at sun.reflect.DelegatingMethodAccessorImpl.invoke (DelegatingMethodAccessorImpl.java:43)
    at java.lang.reflect.Method.invoke (Method.java:498)
    at org.codehaus.plexus.classworlds.launcher.Launcher.launchEnhanced (Launcher.java:282)
    at org.codehaus.plexus.classworlds.launcher.Launcher.launch (Launcher.java:225)
    at org.codehaus.plexus.classworlds.launcher.Launcher.mainWithExitCode (Launcher.java:406)
    at org.codehaus.plexus.classworlds.launcher.Launcher.main (Launcher.java:347)
[INFO] No baseline version MavenProject: org.eclipse.debug:org.eclipse.debug.examples.memory:1.102.200-SNAPSHOT @ /home/jenkins/agent/workspace/eclipse.platform.debug-SonarQube/org.eclipse.debug.examples.memory/pom.xml
[INFO] 
[INFO] --- tycho-p2-extras-plugin:1.7.0:compare-version-with-baselines (compare-attached-artifacts-with-release) @ org.eclipse.debug.examples.memory ---
[INFO] Skipped
[INFO] 
[INFO] -------< org.eclipse.debug:org.eclipse.debug.examples.mixedmode >-------
[INFO] Building org.eclipse.debug.examples.mixedmode 1.2.0-SNAPSHOT      [9/12]
[INFO] ---------------------------[ eclipse-plugin ]---------------------------
[INFO] 
[INFO] --- maven-clean-plugin:3.1.0:clean (default-clean) @ org.eclipse.debug.examples.mixedmode ---
[INFO] 
[INFO] --- tycho-packaging-plugin:1.7.0:build-qualifier (default-build-qualifier) @ org.eclipse.debug.examples.mixedmode ---
[INFO] The project's OSGi version is 1.2.0.v20191014-1300
[INFO] 
[INFO] --- tycho-packaging-plugin:1.7.0:validate-id (default-validate-id) @ org.eclipse.debug.examples.mixedmode ---
[INFO] 
[INFO] --- tycho-packaging-plugin:1.7.0:validate-version (default-validate-version) @ org.eclipse.debug.examples.mixedmode ---
[INFO] 
[INFO] --- maven-resources-plugin:3.1.0:copy-resources (saveproperties) @ org.eclipse.debug.examples.mixedmode ---
[INFO] Using 'UTF-8' encoding to copy filtered resources.
[INFO] skip non existing resourceDirectory /home/jenkins/agent/workspace/eclipse.platform.debug-SonarQube/org.eclipse.debug.examples.mixedmode/saveproperties
[INFO] 
[INFO] --- maven-enforcer-plugin:3.0.0-M3:enforce (enforce-maven) @ org.eclipse.debug.examples.mixedmode ---
[INFO] 
[INFO] --- jacoco-maven-plugin:0.8.5:prepare-agent (jacoco-agent) @ org.eclipse.debug.examples.mixedmode ---
[INFO] argLine set to -javaagent:/home/jenkins/agent/workspace/eclipse.platform.debug-SonarQube/.repository/org/jacoco/org.jacoco.agent/0.8.5/org.jacoco.agent-0.8.5-runtime.jar=destfile=/home/jenkins/agent/workspace/eclipse.platform.debug-SonarQube/jacoco.exec,append=true
[INFO] 
[INFO] --- eclipse-cbi-plugin:1.1.8-SNAPSHOT:generate-api-build-xml (default) @ org.eclipse.debug.examples.mixedmode ---
Generating target/.apibuild.xml
[INFO] 
[INFO] --- maven-resources-plugin:3.1.0:resources (default-resources) @ org.eclipse.debug.examples.mixedmode ---
[INFO] Using 'UTF-8' encoding to copy filtered resources.
[INFO] skip non existing resourceDirectory /home/jenkins/agent/workspace/eclipse.platform.debug-SonarQube/org.eclipse.debug.examples.mixedmode/src/main/resources
[INFO] 
[INFO] --- maven-resources-plugin:3.1.0:resources (filter-resources) @ org.eclipse.debug.examples.mixedmode ---
[INFO] Using 'UTF-8' encoding to copy filtered resources.
[INFO] skip non existing resourceDirectory /home/jenkins/agent/workspace/eclipse.platform.debug-SonarQube/org.eclipse.debug.examples.mixedmode/src/main/resources
[INFO] 
[INFO] --- tycho-compiler-plugin:1.7.0:compile (default-compile) @ org.eclipse.debug.examples.mixedmode ---
[INFO] Compiling 6 source files to /home/jenkins/agent/workspace/eclipse.platform.debug-SonarQube/org.eclipse.debug.examples.mixedmode/target/classes
[INFO] 
[INFO] --- tycho-eclipserun-plugin:1.7.0:eclipse-run (default) @ org.eclipse.debug.examples.mixedmode ---
[INFO] Toolchain in tycho-eclipserun-plugin: JDK[/opt/tools/java/oracle/jdk-8/latest]
[INFO] Expected eclipse log file: /home/jenkins/agent/workspace/eclipse.platform.debug-SonarQube/org.eclipse.debug.examples.mixedmode/target/eclipserun-work/data/.metadata/.log
[INFO] Command line:
	[/opt/tools/java/oracle/jdk-8/latest/bin/java, -jar, /home/jenkins/agent/workspace/eclipse.platform.debug-SonarQube/.repository/p2/osgi/bundle/org.eclipse.equinox.launcher/1.5.700.v20200207-2156/org.eclipse.equinox.launcher-1.5.700.v20200207-2156.jar, -install, /home/jenkins/agent/workspace/eclipse.platform.debug-SonarQube/org.eclipse.debug.examples.mixedmode/target/eclipserun-work, -configuration, /home/jenkins/agent/workspace/eclipse.platform.debug-SonarQube/org.eclipse.debug.examples.mixedmode/target/eclipserun-work/configuration, -data, target/apibuild-workspace, -application, org.eclipse.ant.core.antRunner, -buildfile, target/.apibuild.xml]
Buildfile: target/.apibuild.xml

apigen:
BUILD SUCCESSFUL

BUILD SUCCESSFUL
Total time: 0 seconds
[INFO] 
[INFO] --- maven-resources-plugin:3.1.0:testResources (default-testResources) @ org.eclipse.debug.examples.mixedmode ---
[INFO] Using 'UTF-8' encoding to copy filtered resources.
[INFO] skip non existing resourceDirectory /home/jenkins/agent/workspace/eclipse.platform.debug-SonarQube/org.eclipse.debug.examples.mixedmode/src/test/resources
[INFO] 
[INFO] --- tycho-source-plugin:1.7.0:plugin-source (plugin-source) @ org.eclipse.debug.examples.mixedmode ---
[INFO] Building jar: /home/jenkins/agent/workspace/eclipse.platform.debug-SonarQube/org.eclipse.debug.examples.mixedmode/target/org.eclipse.debug.examples.mixedmode-1.2.0-SNAPSHOT-sources.jar
[INFO] 
[INFO] --- target-platform-configuration:1.7.0:target-platform (default-target-platform) @ org.eclipse.debug.examples.mixedmode ---
[INFO] 
[INFO] --- tycho-packaging-plugin:1.7.0:package-plugin (default-package-plugin) @ org.eclipse.debug.examples.mixedmode ---
[INFO] Building jar: /home/jenkins/agent/workspace/eclipse.platform.debug-SonarQube/org.eclipse.debug.examples.mixedmode/target/org.eclipse.debug.examples.mixedmode-1.2.0-SNAPSHOT.jar
[INFO] 
[INFO] --- tycho-p2-plugin:1.7.0:p2-metadata-default (default-p2-metadata-default) @ org.eclipse.debug.examples.mixedmode ---
[WARNING] No repository found at file:/noThanks.
org.eclipse.equinox.p2.core.ProvisionException: No repository found at file:/noThanks.
    at org.eclipse.equinox.internal.p2.repository.helpers.AbstractRepositoryManager.fail (AbstractRepositoryManager.java:396)
    at org.eclipse.equinox.internal.p2.repository.helpers.AbstractRepositoryManager.loadRepository (AbstractRepositoryManager.java:661)
    at org.eclipse.equinox.internal.p2.metadata.repository.MetadataRepositoryManager.loadRepository (MetadataRepositoryManager.java:110)
    at org.eclipse.tycho.p2.remote.RemoteMetadataRepositoryManager.loadRepository (RemoteMetadataRepositoryManager.java:61)
    at org.eclipse.tycho.p2.remote.RemoteMetadataRepositoryManager.loadRepository (RemoteMetadataRepositoryManager.java:53)
    at org.eclipse.tycho.p2.tools.baseline.BaselineServiceImpl.getProjectBaseline (BaselineServiceImpl.java:95)
    at org.eclipse.tycho.plugins.p2.BaselineValidator.validateAndReplace (BaselineValidator.java:88)
    at org.eclipse.tycho.plugins.p2.P2MetadataMojo.attachP2Metadata (P2MetadataMojo.java:183)
    at org.eclipse.tycho.plugins.p2.P2MetadataMojo.execute (P2MetadataMojo.java:137)
    at org.eclipse.tycho.plugins.p2.P2MetadataDefaultMojo.execute (P2MetadataDefaultMojo.java:32)
    at org.apache.maven.plugin.DefaultBuildPluginManager.executeMojo (DefaultBuildPluginManager.java:137)
    at org.apache.maven.lifecycle.internal.MojoExecutor.execute (MojoExecutor.java:210)
    at org.apache.maven.lifecycle.internal.MojoExecutor.execute (MojoExecutor.java:156)
    at org.apache.maven.lifecycle.internal.MojoExecutor.execute (MojoExecutor.java:148)
    at org.apache.maven.lifecycle.internal.LifecycleModuleBuilder.buildProject (LifecycleModuleBuilder.java:117)
    at org.apache.maven.lifecycle.internal.LifecycleModuleBuilder.buildProject (LifecycleModuleBuilder.java:81)
    at org.apache.maven.lifecycle.internal.builder.singlethreaded.SingleThreadedBuilder.build (SingleThreadedBuilder.java:56)
    at org.apache.maven.lifecycle.internal.LifecycleStarter.execute (LifecycleStarter.java:128)
    at org.apache.maven.DefaultMaven.doExecute (DefaultMaven.java:305)
    at org.apache.maven.DefaultMaven.doExecute (DefaultMaven.java:192)
    at org.apache.maven.DefaultMaven.execute (DefaultMaven.java:105)
    at org.apache.maven.cli.MavenCli.execute (MavenCli.java:957)
    at org.apache.maven.cli.MavenCli.doMain (MavenCli.java:289)
    at org.apache.maven.cli.MavenCli.main (MavenCli.java:193)
    at sun.reflect.NativeMethodAccessorImpl.invoke0 (Native Method)
    at sun.reflect.NativeMethodAccessorImpl.invoke (NativeMethodAccessorImpl.java:62)
    at sun.reflect.DelegatingMethodAccessorImpl.invoke (DelegatingMethodAccessorImpl.java:43)
    at java.lang.reflect.Method.invoke (Method.java:498)
    at org.codehaus.plexus.classworlds.launcher.Launcher.launchEnhanced (Launcher.java:282)
    at org.codehaus.plexus.classworlds.launcher.Launcher.launch (Launcher.java:225)
    at org.codehaus.plexus.classworlds.launcher.Launcher.mainWithExitCode (Launcher.java:406)
    at org.codehaus.plexus.classworlds.launcher.Launcher.main (Launcher.java:347)
[INFO] No baseline version MavenProject: org.eclipse.debug:org.eclipse.debug.examples.mixedmode:1.2.0-SNAPSHOT @ /home/jenkins/agent/workspace/eclipse.platform.debug-SonarQube/org.eclipse.debug.examples.mixedmode/pom.xml
[INFO] 
[INFO] --- tycho-p2-extras-plugin:1.7.0:compare-version-with-baselines (compare-attached-artifacts-with-release) @ org.eclipse.debug.examples.mixedmode ---
[INFO] Skipped
[INFO] 
[INFO] ----------< org.eclipse.debug:org.eclipse.debug.examples.ui >-----------
[INFO] Building org.eclipse.debug.examples.ui 1.6.400-SNAPSHOT          [10/12]
[INFO] ---------------------------[ eclipse-plugin ]---------------------------
[INFO] 
[INFO] --- maven-clean-plugin:3.1.0:clean (default-clean) @ org.eclipse.debug.examples.ui ---
[INFO] 
[INFO] --- tycho-packaging-plugin:1.7.0:build-qualifier (default-build-qualifier) @ org.eclipse.debug.examples.ui ---
[INFO] The project's OSGi version is 1.6.400.v20200113-1549
[INFO] 
[INFO] --- tycho-packaging-plugin:1.7.0:validate-id (default-validate-id) @ org.eclipse.debug.examples.ui ---
[INFO] 
[INFO] --- tycho-packaging-plugin:1.7.0:validate-version (default-validate-version) @ org.eclipse.debug.examples.ui ---
[INFO] 
[INFO] --- maven-resources-plugin:3.1.0:copy-resources (saveproperties) @ org.eclipse.debug.examples.ui ---
[INFO] Using 'UTF-8' encoding to copy filtered resources.
[INFO] skip non existing resourceDirectory /home/jenkins/agent/workspace/eclipse.platform.debug-SonarQube/org.eclipse.debug.examples.ui/saveproperties
[INFO] 
[INFO] --- maven-enforcer-plugin:3.0.0-M3:enforce (enforce-maven) @ org.eclipse.debug.examples.ui ---
[INFO] 
[INFO] --- jacoco-maven-plugin:0.8.5:prepare-agent (jacoco-agent) @ org.eclipse.debug.examples.ui ---
[INFO] argLine set to -javaagent:/home/jenkins/agent/workspace/eclipse.platform.debug-SonarQube/.repository/org/jacoco/org.jacoco.agent/0.8.5/org.jacoco.agent-0.8.5-runtime.jar=destfile=/home/jenkins/agent/workspace/eclipse.platform.debug-SonarQube/jacoco.exec,append=true
[INFO] 
[INFO] --- eclipse-cbi-plugin:1.1.8-SNAPSHOT:generate-api-build-xml (default) @ org.eclipse.debug.examples.ui ---
Generating target/.apibuild.xml
[INFO] 
[INFO] --- maven-resources-plugin:3.1.0:resources (default-resources) @ org.eclipse.debug.examples.ui ---
[INFO] Using 'UTF-8' encoding to copy filtered resources.
[INFO] skip non existing resourceDirectory /home/jenkins/agent/workspace/eclipse.platform.debug-SonarQube/org.eclipse.debug.examples.ui/src/main/resources
[INFO] 
[INFO] --- maven-resources-plugin:3.1.0:resources (filter-resources) @ org.eclipse.debug.examples.ui ---
[INFO] Using 'UTF-8' encoding to copy filtered resources.
[INFO] skip non existing resourceDirectory /home/jenkins/agent/workspace/eclipse.platform.debug-SonarQube/org.eclipse.debug.examples.ui/src/main/resources
[INFO] 
[INFO] --- tycho-compiler-plugin:1.7.0:compile (default-compile) @ org.eclipse.debug.examples.ui ---
[INFO] Compiling 62 source files to /home/jenkins/agent/workspace/eclipse.platform.debug-SonarQube/org.eclipse.debug.examples.ui/target/classes
[INFO] 
[INFO] --- tycho-eclipserun-plugin:1.7.0:eclipse-run (default) @ org.eclipse.debug.examples.ui ---
[INFO] Toolchain in tycho-eclipserun-plugin: JDK[/opt/tools/java/oracle/jdk-8/latest]
[INFO] Expected eclipse log file: /home/jenkins/agent/workspace/eclipse.platform.debug-SonarQube/org.eclipse.debug.examples.ui/target/eclipserun-work/data/.metadata/.log
[INFO] Command line:
	[/opt/tools/java/oracle/jdk-8/latest/bin/java, -jar, /home/jenkins/agent/workspace/eclipse.platform.debug-SonarQube/.repository/p2/osgi/bundle/org.eclipse.equinox.launcher/1.5.700.v20200207-2156/org.eclipse.equinox.launcher-1.5.700.v20200207-2156.jar, -install, /home/jenkins/agent/workspace/eclipse.platform.debug-SonarQube/org.eclipse.debug.examples.ui/target/eclipserun-work, -configuration, /home/jenkins/agent/workspace/eclipse.platform.debug-SonarQube/org.eclipse.debug.examples.ui/target/eclipserun-work/configuration, -data, target/apibuild-workspace, -application, org.eclipse.ant.core.antRunner, -buildfile, target/.apibuild.xml]
Buildfile: target/.apibuild.xml

apigen:
BUILD SUCCESSFUL

BUILD SUCCESSFUL
Total time: 0 seconds
[INFO] 
[INFO] --- maven-resources-plugin:3.1.0:testResources (default-testResources) @ org.eclipse.debug.examples.ui ---
[INFO] Using 'UTF-8' encoding to copy filtered resources.
[INFO] skip non existing resourceDirectory /home/jenkins/agent/workspace/eclipse.platform.debug-SonarQube/org.eclipse.debug.examples.ui/src/test/resources
[INFO] 
[INFO] --- tycho-source-plugin:1.7.0:plugin-source (plugin-source) @ org.eclipse.debug.examples.ui ---
[INFO] Building jar: /home/jenkins/agent/workspace/eclipse.platform.debug-SonarQube/org.eclipse.debug.examples.ui/target/org.eclipse.debug.examples.ui-1.6.400-SNAPSHOT-sources.jar
[INFO] 
[INFO] --- target-platform-configuration:1.7.0:target-platform (default-target-platform) @ org.eclipse.debug.examples.ui ---
[INFO] 
[INFO] --- tycho-packaging-plugin:1.7.0:package-plugin (default-package-plugin) @ org.eclipse.debug.examples.ui ---
[INFO] Building jar: /home/jenkins/agent/workspace/eclipse.platform.debug-SonarQube/org.eclipse.debug.examples.ui/target/org.eclipse.debug.examples.ui-1.6.400-SNAPSHOT.jar
[INFO] 
[INFO] --- tycho-p2-plugin:1.7.0:p2-metadata-default (default-p2-metadata-default) @ org.eclipse.debug.examples.ui ---
[WARNING] No repository found at file:/noThanks.
org.eclipse.equinox.p2.core.ProvisionException: No repository found at file:/noThanks.
    at org.eclipse.equinox.internal.p2.repository.helpers.AbstractRepositoryManager.fail (AbstractRepositoryManager.java:396)
    at org.eclipse.equinox.internal.p2.repository.helpers.AbstractRepositoryManager.loadRepository (AbstractRepositoryManager.java:661)
    at org.eclipse.equinox.internal.p2.metadata.repository.MetadataRepositoryManager.loadRepository (MetadataRepositoryManager.java:110)
    at org.eclipse.tycho.p2.remote.RemoteMetadataRepositoryManager.loadRepository (RemoteMetadataRepositoryManager.java:61)
    at org.eclipse.tycho.p2.remote.RemoteMetadataRepositoryManager.loadRepository (RemoteMetadataRepositoryManager.java:53)
    at org.eclipse.tycho.p2.tools.baseline.BaselineServiceImpl.getProjectBaseline (BaselineServiceImpl.java:95)
    at org.eclipse.tycho.plugins.p2.BaselineValidator.validateAndReplace (BaselineValidator.java:88)
    at org.eclipse.tycho.plugins.p2.P2MetadataMojo.attachP2Metadata (P2MetadataMojo.java:183)
    at org.eclipse.tycho.plugins.p2.P2MetadataMojo.execute (P2MetadataMojo.java:137)
    at org.eclipse.tycho.plugins.p2.P2MetadataDefaultMojo.execute (P2MetadataDefaultMojo.java:32)
    at org.apache.maven.plugin.DefaultBuildPluginManager.executeMojo (DefaultBuildPluginManager.java:137)
    at org.apache.maven.lifecycle.internal.MojoExecutor.execute (MojoExecutor.java:210)
    at org.apache.maven.lifecycle.internal.MojoExecutor.execute (MojoExecutor.java:156)
    at org.apache.maven.lifecycle.internal.MojoExecutor.execute (MojoExecutor.java:148)
    at org.apache.maven.lifecycle.internal.LifecycleModuleBuilder.buildProject (LifecycleModuleBuilder.java:117)
    at org.apache.maven.lifecycle.internal.LifecycleModuleBuilder.buildProject (LifecycleModuleBuilder.java:81)
    at org.apache.maven.lifecycle.internal.builder.singlethreaded.SingleThreadedBuilder.build (SingleThreadedBuilder.java:56)
    at org.apache.maven.lifecycle.internal.LifecycleStarter.execute (LifecycleStarter.java:128)
    at org.apache.maven.DefaultMaven.doExecute (DefaultMaven.java:305)
    at org.apache.maven.DefaultMaven.doExecute (DefaultMaven.java:192)
    at org.apache.maven.DefaultMaven.execute (DefaultMaven.java:105)
    at org.apache.maven.cli.MavenCli.execute (MavenCli.java:957)
    at org.apache.maven.cli.MavenCli.doMain (MavenCli.java:289)
    at org.apache.maven.cli.MavenCli.main (MavenCli.java:193)
    at sun.reflect.NativeMethodAccessorImpl.invoke0 (Native Method)
    at sun.reflect.NativeMethodAccessorImpl.invoke (NativeMethodAccessorImpl.java:62)
    at sun.reflect.DelegatingMethodAccessorImpl.invoke (DelegatingMethodAccessorImpl.java:43)
    at java.lang.reflect.Method.invoke (Method.java:498)
    at org.codehaus.plexus.classworlds.launcher.Launcher.launchEnhanced (Launcher.java:282)
    at org.codehaus.plexus.classworlds.launcher.Launcher.launch (Launcher.java:225)
    at org.codehaus.plexus.classworlds.launcher.Launcher.mainWithExitCode (Launcher.java:406)
    at org.codehaus.plexus.classworlds.launcher.Launcher.main (Launcher.java:347)
[INFO] No baseline version MavenProject: org.eclipse.debug:org.eclipse.debug.examples.ui:1.6.400-SNAPSHOT @ /home/jenkins/agent/workspace/eclipse.platform.debug-SonarQube/org.eclipse.debug.examples.ui/pom.xml
[INFO] 
[INFO] --- tycho-p2-extras-plugin:1.7.0:compare-version-with-baselines (compare-attached-artifacts-with-release) @ org.eclipse.debug.examples.ui ---
[INFO] Skipped
[INFO] 
[INFO] ------------< org.eclipse.ui:org.eclipse.ui.externaltools >-------------
[INFO] Building org.eclipse.ui.externaltools 3.4.800-SNAPSHOT           [11/12]
[INFO] ---------------------------[ eclipse-plugin ]---------------------------
[INFO] 
[INFO] --- maven-clean-plugin:3.1.0:clean (default-clean) @ org.eclipse.ui.externaltools ---
[INFO] 
[INFO] --- tycho-packaging-plugin:1.7.0:build-qualifier (default-build-qualifier) @ org.eclipse.ui.externaltools ---
[INFO] The project's OSGi version is 3.4.800.v20200612-0848
[INFO] 
[INFO] --- tycho-packaging-plugin:1.7.0:validate-id (default-validate-id) @ org.eclipse.ui.externaltools ---
[INFO] 
[INFO] --- tycho-packaging-plugin:1.7.0:validate-version (default-validate-version) @ org.eclipse.ui.externaltools ---
[INFO] 
[INFO] --- maven-resources-plugin:3.1.0:copy-resources (saveproperties) @ org.eclipse.ui.externaltools ---
[INFO] Using 'UTF-8' encoding to copy filtered resources.
[INFO] skip non existing resourceDirectory /home/jenkins/agent/workspace/eclipse.platform.debug-SonarQube/org.eclipse.ui.externaltools/saveproperties
[INFO] 
[INFO] --- maven-enforcer-plugin:3.0.0-M3:enforce (enforce-maven) @ org.eclipse.ui.externaltools ---
[INFO] 
[INFO] --- jacoco-maven-plugin:0.8.5:prepare-agent (jacoco-agent) @ org.eclipse.ui.externaltools ---
[INFO] argLine set to -javaagent:/home/jenkins/agent/workspace/eclipse.platform.debug-SonarQube/.repository/org/jacoco/org.jacoco.agent/0.8.5/org.jacoco.agent-0.8.5-runtime.jar=destfile=/home/jenkins/agent/workspace/eclipse.platform.debug-SonarQube/jacoco.exec,append=true
[INFO] 
[INFO] --- eclipse-cbi-plugin:1.1.8-SNAPSHOT:generate-api-build-xml (default) @ org.eclipse.ui.externaltools ---
Generating target/.apibuild.xml
[INFO] 
[INFO] --- maven-resources-plugin:3.1.0:resources (default-resources) @ org.eclipse.ui.externaltools ---
[INFO] Using 'UTF-8' encoding to copy filtered resources.
[INFO] skip non existing resourceDirectory /home/jenkins/agent/workspace/eclipse.platform.debug-SonarQube/org.eclipse.ui.externaltools/src/main/resources
[INFO] 
[INFO] --- maven-resources-plugin:3.1.0:resources (filter-resources) @ org.eclipse.ui.externaltools ---
[INFO] Using 'UTF-8' encoding to copy filtered resources.
[INFO] skip non existing resourceDirectory /home/jenkins/agent/workspace/eclipse.platform.debug-SonarQube/org.eclipse.ui.externaltools/src/main/resources
[INFO] 
[INFO] --- tycho-compiler-plugin:1.7.0:compile (default-compile) @ org.eclipse.ui.externaltools ---
[INFO] Compiling 34 source files to /home/jenkins/agent/workspace/eclipse.platform.debug-SonarQube/org.eclipse.ui.externaltools/target/classes
[INFO] 
[INFO] --- tycho-eclipserun-plugin:1.7.0:eclipse-run (default) @ org.eclipse.ui.externaltools ---
[INFO] Toolchain in tycho-eclipserun-plugin: JDK[/opt/tools/java/oracle/jdk-8/latest]
[INFO] Expected eclipse log file: /home/jenkins/agent/workspace/eclipse.platform.debug-SonarQube/org.eclipse.ui.externaltools/target/eclipserun-work/data/.metadata/.log
[INFO] Command line:
	[/opt/tools/java/oracle/jdk-8/latest/bin/java, -jar, /home/jenkins/agent/workspace/eclipse.platform.debug-SonarQube/.repository/p2/osgi/bundle/org.eclipse.equinox.launcher/1.5.700.v20200207-2156/org.eclipse.equinox.launcher-1.5.700.v20200207-2156.jar, -install, /home/jenkins/agent/workspace/eclipse.platform.debug-SonarQube/org.eclipse.ui.externaltools/target/eclipserun-work, -configuration, /home/jenkins/agent/workspace/eclipse.platform.debug-SonarQube/org.eclipse.ui.externaltools/target/eclipserun-work/configuration, -data, target/apibuild-workspace, -application, org.eclipse.ant.core.antRunner, -buildfile, target/.apibuild.xml]
Buildfile: target/.apibuild.xml

apigen:
BUILD SUCCESSFUL

BUILD SUCCESSFUL
Total time: 0 seconds
[INFO] 
[INFO] --- maven-resources-plugin:3.1.0:testResources (default-testResources) @ org.eclipse.ui.externaltools ---
[INFO] Using 'UTF-8' encoding to copy filtered resources.
[INFO] skip non existing resourceDirectory /home/jenkins/agent/workspace/eclipse.platform.debug-SonarQube/org.eclipse.ui.externaltools/src/test/resources
[INFO] 
[INFO] --- tycho-source-plugin:1.7.0:plugin-source (plugin-source) @ org.eclipse.ui.externaltools ---
[INFO] Building jar: /home/jenkins/agent/workspace/eclipse.platform.debug-SonarQube/org.eclipse.ui.externaltools/target/org.eclipse.ui.externaltools-3.4.800-SNAPSHOT-sources.jar
[INFO] 
[INFO] --- target-platform-configuration:1.7.0:target-platform (default-target-platform) @ org.eclipse.ui.externaltools ---
[INFO] 
[INFO] --- tycho-packaging-plugin:1.7.0:package-plugin (default-package-plugin) @ org.eclipse.ui.externaltools ---
[INFO] Building jar: /home/jenkins/agent/workspace/eclipse.platform.debug-SonarQube/org.eclipse.ui.externaltools/target/org.eclipse.ui.externaltools-3.4.800-SNAPSHOT.jar
[INFO] 
[INFO] --- tycho-p2-plugin:1.7.0:p2-metadata-default (default-p2-metadata-default) @ org.eclipse.ui.externaltools ---
[WARNING] No repository found at file:/noThanks.
org.eclipse.equinox.p2.core.ProvisionException: No repository found at file:/noThanks.
    at org.eclipse.equinox.internal.p2.repository.helpers.AbstractRepositoryManager.fail (AbstractRepositoryManager.java:396)
    at org.eclipse.equinox.internal.p2.repository.helpers.AbstractRepositoryManager.loadRepository (AbstractRepositoryManager.java:661)
    at org.eclipse.equinox.internal.p2.metadata.repository.MetadataRepositoryManager.loadRepository (MetadataRepositoryManager.java:110)
    at org.eclipse.tycho.p2.remote.RemoteMetadataRepositoryManager.loadRepository (RemoteMetadataRepositoryManager.java:61)
    at org.eclipse.tycho.p2.remote.RemoteMetadataRepositoryManager.loadRepository (RemoteMetadataRepositoryManager.java:53)
    at org.eclipse.tycho.p2.tools.baseline.BaselineServiceImpl.getProjectBaseline (BaselineServiceImpl.java:95)
    at org.eclipse.tycho.plugins.p2.BaselineValidator.validateAndReplace (BaselineValidator.java:88)
    at org.eclipse.tycho.plugins.p2.P2MetadataMojo.attachP2Metadata (P2MetadataMojo.java:183)
    at org.eclipse.tycho.plugins.p2.P2MetadataMojo.execute (P2MetadataMojo.java:137)
    at org.eclipse.tycho.plugins.p2.P2MetadataDefaultMojo.execute (P2MetadataDefaultMojo.java:32)
    at org.apache.maven.plugin.DefaultBuildPluginManager.executeMojo (DefaultBuildPluginManager.java:137)
    at org.apache.maven.lifecycle.internal.MojoExecutor.execute (MojoExecutor.java:210)
    at org.apache.maven.lifecycle.internal.MojoExecutor.execute (MojoExecutor.java:156)
    at org.apache.maven.lifecycle.internal.MojoExecutor.execute (MojoExecutor.java:148)
    at org.apache.maven.lifecycle.internal.LifecycleModuleBuilder.buildProject (LifecycleModuleBuilder.java:117)
    at org.apache.maven.lifecycle.internal.LifecycleModuleBuilder.buildProject (LifecycleModuleBuilder.java:81)
    at org.apache.maven.lifecycle.internal.builder.singlethreaded.SingleThreadedBuilder.build (SingleThreadedBuilder.java:56)
    at org.apache.maven.lifecycle.internal.LifecycleStarter.execute (LifecycleStarter.java:128)
    at org.apache.maven.DefaultMaven.doExecute (DefaultMaven.java:305)
    at org.apache.maven.DefaultMaven.doExecute (DefaultMaven.java:192)
    at org.apache.maven.DefaultMaven.execute (DefaultMaven.java:105)
    at org.apache.maven.cli.MavenCli.execute (MavenCli.java:957)
    at org.apache.maven.cli.MavenCli.doMain (MavenCli.java:289)
    at org.apache.maven.cli.MavenCli.main (MavenCli.java:193)
    at sun.reflect.NativeMethodAccessorImpl.invoke0 (Native Method)
    at sun.reflect.NativeMethodAccessorImpl.invoke (NativeMethodAccessorImpl.java:62)
    at sun.reflect.DelegatingMethodAccessorImpl.invoke (DelegatingMethodAccessorImpl.java:43)
    at java.lang.reflect.Method.invoke (Method.java:498)
    at org.codehaus.plexus.classworlds.launcher.Launcher.launchEnhanced (Launcher.java:282)
    at org.codehaus.plexus.classworlds.launcher.Launcher.launch (Launcher.java:225)
    at org.codehaus.plexus.classworlds.launcher.Launcher.mainWithExitCode (Launcher.java:406)
    at org.codehaus.plexus.classworlds.launcher.Launcher.main (Launcher.java:347)
[INFO] No baseline version MavenProject: org.eclipse.ui:org.eclipse.ui.externaltools:3.4.800-SNAPSHOT @ /home/jenkins/agent/workspace/eclipse.platform.debug-SonarQube/org.eclipse.ui.externaltools/pom.xml
[INFO] 
[INFO] --- tycho-p2-extras-plugin:1.7.0:compare-version-with-baselines (compare-attached-artifacts-with-release) @ org.eclipse.ui.externaltools ---
[INFO] Skipped
[INFO] 
[INFO] -------------< org.eclipse.debug:org.eclipse.debug.tests >--------------
[INFO] Building org.eclipse.debug.tests 3.11.800-SNAPSHOT               [12/12]
[INFO] ------------------------[ eclipse-test-plugin ]-------------------------
[INFO] 
[INFO] --- maven-clean-plugin:3.1.0:clean (default-clean) @ org.eclipse.debug.tests ---
[INFO] 
[INFO] --- tycho-packaging-plugin:1.7.0:build-qualifier (default-build-qualifier) @ org.eclipse.debug.tests ---
[INFO] The project's OSGi version is 3.11.800.v20200627-1305
[INFO] 
[INFO] --- tycho-packaging-plugin:1.7.0:validate-id (default-validate-id) @ org.eclipse.debug.tests ---
[INFO] 
[INFO] --- tycho-packaging-plugin:1.7.0:validate-version (default-validate-version) @ org.eclipse.debug.tests ---
[INFO] 
[INFO] --- maven-resources-plugin:3.1.0:copy-resources (saveproperties) @ org.eclipse.debug.tests ---
[INFO] Using 'UTF-8' encoding to copy filtered resources.
[INFO] skip non existing resourceDirectory /home/jenkins/agent/workspace/eclipse.platform.debug-SonarQube/org.eclipse.debug.tests/saveproperties
[INFO] 
[INFO] --- maven-enforcer-plugin:3.0.0-M3:enforce (enforce-maven) @ org.eclipse.debug.tests ---
[INFO] 
[INFO] --- jacoco-maven-plugin:0.8.5:prepare-agent (jacoco-agent) @ org.eclipse.debug.tests ---
[INFO] tycho.testArgLine set to -javaagent:/home/jenkins/agent/workspace/eclipse.platform.debug-SonarQube/.repository/org/jacoco/org.jacoco.agent/0.8.5/org.jacoco.agent-0.8.5-runtime.jar=destfile=/home/jenkins/agent/workspace/eclipse.platform.debug-SonarQube/jacoco.exec,append=true
[INFO] 
[INFO] --- eclipse-cbi-plugin:1.1.8-SNAPSHOT:generate-api-build-xml (default) @ org.eclipse.debug.tests ---
[INFO] 
[INFO] --- maven-resources-plugin:3.1.0:resources (default-resources) @ org.eclipse.debug.tests ---
[INFO] Using 'UTF-8' encoding to copy filtered resources.
[INFO] skip non existing resourceDirectory /home/jenkins/agent/workspace/eclipse.platform.debug-SonarQube/org.eclipse.debug.tests/src/main/resources
[INFO] 
[INFO] --- maven-resources-plugin:3.1.0:resources (filter-resources) @ org.eclipse.debug.tests ---
[INFO] Using 'UTF-8' encoding to copy filtered resources.
[INFO] skip non existing resourceDirectory /home/jenkins/agent/workspace/eclipse.platform.debug-SonarQube/org.eclipse.debug.tests/src/main/resources
[INFO] 
[INFO] --- tycho-compiler-plugin:1.7.0:compile (default-compile) @ org.eclipse.debug.tests ---
[INFO] Compiling 95 source files to /home/jenkins/agent/workspace/eclipse.platform.debug-SonarQube/org.eclipse.debug.tests/target/classes
[INFO] 
[INFO] --- tycho-eclipserun-plugin:1.7.0:eclipse-run (default) @ org.eclipse.debug.tests ---
[INFO] 
[INFO] --- maven-resources-plugin:3.1.0:testResources (default-testResources) @ org.eclipse.debug.tests ---
[INFO] Using 'UTF-8' encoding to copy filtered resources.
[INFO] skip non existing resourceDirectory /home/jenkins/agent/workspace/eclipse.platform.debug-SonarQube/org.eclipse.debug.tests/src/test/resources
[INFO] 
[INFO] --- tycho-source-plugin:1.7.0:plugin-source (plugin-source) @ org.eclipse.debug.tests ---
[INFO] Building jar: /home/jenkins/agent/workspace/eclipse.platform.debug-SonarQube/org.eclipse.debug.tests/target/org.eclipse.debug.tests-3.11.800-SNAPSHOT-sources.jar
[INFO] 
[INFO] --- target-platform-configuration:1.7.0:target-platform (default-target-platform) @ org.eclipse.debug.tests ---
[INFO] 
[INFO] --- tycho-packaging-plugin:1.7.0:package-plugin (default-package-plugin) @ org.eclipse.debug.tests ---
[INFO] Building jar: /home/jenkins/agent/workspace/eclipse.platform.debug-SonarQube/org.eclipse.debug.tests/target/org.eclipse.debug.tests-3.11.800-SNAPSHOT.jar
[INFO] 
[INFO] --- tycho-p2-plugin:1.7.0:p2-metadata-default (default-p2-metadata-default) @ org.eclipse.debug.tests ---
[WARNING] No repository found at file:/noThanks.
org.eclipse.equinox.p2.core.ProvisionException: No repository found at file:/noThanks.
    at org.eclipse.equinox.internal.p2.repository.helpers.AbstractRepositoryManager.fail (AbstractRepositoryManager.java:396)
    at org.eclipse.equinox.internal.p2.repository.helpers.AbstractRepositoryManager.loadRepository (AbstractRepositoryManager.java:661)
    at org.eclipse.equinox.internal.p2.metadata.repository.MetadataRepositoryManager.loadRepository (MetadataRepositoryManager.java:110)
    at org.eclipse.tycho.p2.remote.RemoteMetadataRepositoryManager.loadRepository (RemoteMetadataRepositoryManager.java:61)
    at org.eclipse.tycho.p2.remote.RemoteMetadataRepositoryManager.loadRepository (RemoteMetadataRepositoryManager.java:53)
    at org.eclipse.tycho.p2.tools.baseline.BaselineServiceImpl.getProjectBaseline (BaselineServiceImpl.java:95)
    at org.eclipse.tycho.plugins.p2.BaselineValidator.validateAndReplace (BaselineValidator.java:88)
    at org.eclipse.tycho.plugins.p2.P2MetadataMojo.attachP2Metadata (P2MetadataMojo.java:183)
    at org.eclipse.tycho.plugins.p2.P2MetadataMojo.execute (P2MetadataMojo.java:137)
    at org.eclipse.tycho.plugins.p2.P2MetadataDefaultMojo.execute (P2MetadataDefaultMojo.java:32)
    at org.apache.maven.plugin.DefaultBuildPluginManager.executeMojo (DefaultBuildPluginManager.java:137)
    at org.apache.maven.lifecycle.internal.MojoExecutor.execute (MojoExecutor.java:210)
    at org.apache.maven.lifecycle.internal.MojoExecutor.execute (MojoExecutor.java:156)
    at org.apache.maven.lifecycle.internal.MojoExecutor.execute (MojoExecutor.java:148)
    at org.apache.maven.lifecycle.internal.LifecycleModuleBuilder.buildProject (LifecycleModuleBuilder.java:117)
    at org.apache.maven.lifecycle.internal.LifecycleModuleBuilder.buildProject (LifecycleModuleBuilder.java:81)
    at org.apache.maven.lifecycle.internal.builder.singlethreaded.SingleThreadedBuilder.build (SingleThreadedBuilder.java:56)
    at org.apache.maven.lifecycle.internal.LifecycleStarter.execute (LifecycleStarter.java:128)
    at org.apache.maven.DefaultMaven.doExecute (DefaultMaven.java:305)
    at org.apache.maven.DefaultMaven.doExecute (DefaultMaven.java:192)
    at org.apache.maven.DefaultMaven.execute (DefaultMaven.java:105)
    at org.apache.maven.cli.MavenCli.execute (MavenCli.java:957)
    at org.apache.maven.cli.MavenCli.doMain (MavenCli.java:289)
    at org.apache.maven.cli.MavenCli.main (MavenCli.java:193)
    at sun.reflect.NativeMethodAccessorImpl.invoke0 (Native Method)
    at sun.reflect.NativeMethodAccessorImpl.invoke (NativeMethodAccessorImpl.java:62)
    at sun.reflect.DelegatingMethodAccessorImpl.invoke (DelegatingMethodAccessorImpl.java:43)
    at java.lang.reflect.Method.invoke (Method.java:498)
    at org.codehaus.plexus.classworlds.launcher.Launcher.launchEnhanced (Launcher.java:282)
    at org.codehaus.plexus.classworlds.launcher.Launcher.launch (Launcher.java:225)
    at org.codehaus.plexus.classworlds.launcher.Launcher.mainWithExitCode (Launcher.java:406)
    at org.codehaus.plexus.classworlds.launcher.Launcher.main (Launcher.java:347)
[INFO] No baseline version MavenProject: org.eclipse.debug:org.eclipse.debug.tests:3.11.800-SNAPSHOT @ /home/jenkins/agent/workspace/eclipse.platform.debug-SonarQube/org.eclipse.debug.tests/pom.xml
[INFO] 
[INFO] --- tycho-surefire-plugin:1.7.0:test (default-test) @ org.eclipse.debug.tests ---
[INFO] Executing Test Runtime with timeout 0, logs (if any) will be placed at: /home/jenkins/agent/workspace/eclipse.platform.debug-SonarQube/org.eclipse.debug.tests/target/work/data/.metadata/.log
[INFO] Command line:
	[/opt/tools/java/oracle/jdk-8/1.8.0_202/jre/bin/java, -Dosgi.noShutdown=false, -Dosgi.os=linux, -Dosgi.ws=gtk, -Dosgi.arch=x86_64, -javaagent:/home/jenkins/agent/workspace/eclipse.platform.debug-SonarQube/.repository/org/jacoco/org.jacoco.agent/0.8.5/org.jacoco.agent-0.8.5-runtime.jar=destfile=/home/jenkins/agent/workspace/eclipse.platform.debug-SonarQube/jacoco.exec,append=true, -Dosgi.clean=true, -ea, -jar, /home/jenkins/agent/workspace/eclipse.platform.debug-SonarQube/.repository/p2/osgi/bundle/org.eclipse.equinox.launcher/1.5.700.v20200207-2156/org.eclipse.equinox.launcher-1.5.700.v20200207-2156.jar, -data, /home/jenkins/agent/workspace/eclipse.platform.debug-SonarQube/org.eclipse.debug.tests/target/work/data, -install, /home/jenkins/agent/workspace/eclipse.platform.debug-SonarQube/org.eclipse.debug.tests/target/work, -configuration, /home/jenkins/agent/workspace/eclipse.platform.debug-SonarQube/org.eclipse.debug.tests/target/work/configuration, -application, org.eclipse.tycho.surefire.osgibooter.uitest, -testproperties, /home/jenkins/agent/workspace/eclipse.platform.debug-SonarQube/org.eclipse.debug.tests/target/surefire.properties]
Running org.eclipse.debug.tests.AutomatedSuite
testDisconnectedAndWriteProcesses runs: 2000
testTerminatedAndWriteProcesses runs: 2000
testDisconnectedAndWriteTargets runs: 2000
testTerminatedAndWriteTargets runs: 2000
All tasks scheduled, processing UI events now...
Requesting to show: mock #1
Requesting to show: mock #8
Requesting to show: mock #10
Requesting to show: mock #3
Requesting to show: mock #2
Requesting to show: mock #12
Requesting to show: mock #13
Requesting to show: mock #5
Requesting to show: mock #4
Requesting to show: mock #14
Requesting to show: mock #15
Requesting to show: mock #16
Requesting to show: mock #6
Requesting to show: mock #17
Requesting to show: mock #9
Requesting to show: mock #18
Requesting to show: mock #20
Requesting to show: mock #7
Requesting to show: mock #11
Requesting to show: mock #19
Shown: mock #1, overall: 1
Shown: mock #20, overall: 2
Shown: mock #8, overall: 3
Shown: mock #7, overall: 4
Shown: mock #10, overall: 5
Shown: mock #11, overall: 6
Shown: mock #3, overall: 7
Shown: mock #19, overall: 8
Shown: mock #2, overall: 9
Shown: mock #12, overall: 10
Shown: mock #13, overall: 11
Shown: mock #5, overall: 12
Shown: mock #4, overall: 13
Shown: mock #14, overall: 14
Shown: mock #15, overall: 15
Shown: mock #16, overall: 16
Shown: mock #6, overall: 17
Shown: mock #17, overall: 18
Shown: mock #9, overall: 19
Shown: mock #18, overall: 20
Waiting on jobs now...
Done with jobs, processing UI events again...
Waiting on execution service to finish...
Done waiting on execution service to finish
Tests run: 309, Failures: 0, Errors: 0, Skipped: 0, Time elapsed: 102.558 s - in org.eclipse.debug.tests.AutomatedSuite
testLookupStackframeForce  Time elapsed: 0.028 s
testLRU  Time elapsed: 0.006 s
testLookupStackframeWithDebugElement1  Time elapsed: 0.008 s
testLookupStackframeWithDebugElement2  Time elapsed: 0.005 s
testLookupStackframeWithDebugElement3  Time elapsed: 0.006 s
testLookupStackframeWithDebugElement4  Time elapsed: 0.006 s
testLookupStackframeWithDebugElement5  Time elapsed: 0.006 s
testLookupStringLocatorNoForce  Time elapsed: 0.006 s
testLookupStringForce  Time elapsed: 0.006 s
testLookupStackframeNoForce  Time elapsed: 0.006 s
testLookupStringNoLocatorNoForce  Time elapsed: 0.006 s
testLookupStringNoForce  Time elapsed: 0.007 s
testBreakpointOrdering0  Time elapsed: 0.038 s
testBreakpointOrdering1  Time elapsed: 0.013 s
testBreakpointOrdering2  Time elapsed: 0.009 s
testBreakpointOrdering3  Time elapsed: 0.008 s
testInsertAndRemove  Time elapsed: 0.056 s
testInsertAndSelect  Time elapsed: 0.014 s
testUpdateLabel  Time elapsed: 0.013 s
testExpandAndSelect_simple  Time elapsed: 0.014 s
testCompositeModelAddElement  Time elapsed: 0.019 s
testAddElement  Time elapsed: 0.013 s
testRefreshStruct2  Time elapsed: 0.019 s
testBug292322  Time elapsed: 0.013 s
testRefreshStruct  Time elapsed: 0.013 s
testRefreshCoalesceStruct  Time elapsed: 0.018 s
testInsert  Time elapsed: 0.015 s
testCompositeModelRefreshStruct  Time elapsed: 0.019 s
testRemove  Time elapsed: 0.014 s
testExpandAndSelect  Time elapsed: 0.016 s
testLabelUpdatesCompletedOutOfSequence1  Time elapsed: 0.317 s
testLabelUpdatesCompletedOutOfSequence2  Time elapsed: 0.315 s
testSimpleSingleLevel  Time elapsed: 0.011 s
testSimpleMultiLevel  Time elapsed: 0.013 s
test  Time elapsed: 0.01 s
testSelectionPolicy  Time elapsed: 0.013 s
testSelectRemoveRefreshStruct  Time elapsed: 0.015 s
testSelectRemove  Time elapsed: 0.013 s
testSimpleSetSelection  Time elapsed: 0.012 s
testSaveAndRestore1  Time elapsed: 0.021 s
testSaveAndRestore2  Time elapsed: 0.017 s
testPreserveExpandedOnInsert  Time elapsed: 0.014 s
testPreserveExpandedOnRemove  Time elapsed: 0.013 s
testKeepCollapsedAfterRemovingAndReaddingChildrenInExpandedTree  Time elapsed: 0.143 s
testPreserveExpandedOnMultLevelContent  Time elapsed: 0.017 s
testPreserveLargeModelOnContent  Time elapsed: 0.403 s
testSaveAndRestorePartialStateLarge  Time elapsed: 0.949 s
testSaveRestoreOrder  Time elapsed: 0.014 s
testPreserveExpandDeltaAfterContent  Time elapsed: 0.014 s
testPreserveCollapseAndSelectDeltaAfterSaveAndRestore  Time elapsed: 0.015 s
testUpdateWithNullInput  Time elapsed: 0.013 s
testUpdateViewer  Time elapsed: 0.012 s
testSaveAndRestoreInputInstanceEquals  Time elapsed: 0.015 s
testSaveAndRestoreLarge  Time elapsed: 0.934 s
testSaveAndRestoreInputInstance  Time elapsed: 0.015 s
testPreserveCollapseDeltaAfterContent  Time elapsed: 0.013 s
testPreserveSelectionDeltaAfterContent  Time elapsed: 0.013 s
testPreserveExpandedOnSubTreeContent  Time elapsed: 0.013 s
testPreserveExpandedOnContentStress  Time elapsed: 0.033 s
testAddNewChildren  Time elapsed: 0.012 s
testRescheduleUpdates  Time elapsed: 0.017 s
testCanceledUpdates1  Time elapsed: 0.013 s
testCanceledUpdates2  Time elapsed: 0.012 s
testCanceledUpdates3  Time elapsed: 0.012 s
testCanceledUpdates4  Time elapsed: 0.012 s
testNotifyUpdatesTartedOnModelChanged  Time elapsed: 0.011 s
testInsertAtInvalidIndex  Time elapsed: 0.011 s
testRepeatedAddRemoveElement  Time elapsed: 0.013 s
testCanceledUpdatesOnSetNullInput  Time elapsed: 0.011 s
testCancelUpdatesOnRemoveElementWhileUpdatingSubTree  Time elapsed: 0.014 s
testRemoveElements  Time elapsed: 0.01 s
testContentPlusAddRemoveUpdateRaceConditionsElement  Time elapsed: 0.033 s
testCanceledUpdatesOnSetInput  Time elapsed: 0.011 s
testLargeSingleLevel  Time elapsed: 0.03 s
testSimpleMultiLevelWithMixedFilters  Time elapsed: 0.012 s
testSimpleSingleLevelWithTMVFilter  Time elapsed: 0.011 s
testPreserveExpandedOnMultLevelContent  Time elapsed: 0.014 s
testRefreshToUnfilterElementsWithMixedFilters  Time elapsed: 0.318 s
testReplacedUnrealizedFilteredElement  Time elapsed: 0.314 s
testSimpleSingleLevel  Time elapsed: 0.01 s
testRefreshUnrealizedFilteredElementWithTMVFilter  Time elapsed: 0.325 s
testRefreshToUnfilterElements  Time elapsed: 0.319 s
testRefreshToUnfilterElementsWithTMVFilter  Time elapsed: 0.314 s
testReplacedUnrealizedFilteredElementWithTMVFilter  Time elapsed: 0.315 s
testSimpleMultiLevel  Time elapsed: 0.01 s
testLargeSingleLevelWithTMVFilter  Time elapsed: 0.025 s
testSimpleSingleLevelWithMixedFilters  Time elapsed: 0.011 s
testSimpleMultiLevelWithTMVFilter  Time elapsed: 0.01 s
testRefreshUnrealizedFilteredElement  Time elapsed: 0.325 s
testViewToModelCount  Time elapsed: 0.006 s
testViewToModelIndex  Time elapsed: 0.006 s
testClearLastFromFilters  Time elapsed: 0.007 s
testAddAlreadyFiltered  Time elapsed: 0.005 s
testRemoveMiddleElementFromFilters  Time elapsed: 0.006 s
testRemoveLastFromFilters  Time elapsed: 0.006 s
testClearFirstElementFromFilters  Time elapsed: 0.005 s
testRemoveFirstElementFromFilters  Time elapsed: 0.006 s
testClearMiddleElementFromFilters  Time elapsed: 0.005 s
testRegression200325  Time elapsed: 0.006 s
testCoalesce  Time elapsed: 0.006 s
testSaveRestore  Time elapsed: 0.007 s
testDynamicBinding  Time elapsed: 0.009 s
testNoDefaultBinding  Time elapsed: 0.006 s
testSingleBinding  Time elapsed: 0.006 s
testNoPrimaryBinding  Time elapsed: 0.006 s
testBindingChangeNotification  Time elapsed: 0.006 s
testDefaultBinding  Time elapsed: 0.006 s
testRenderingTypes  Time elapsed: 0.006 s
testRenderingTypeNames  Time elapsed: 0.006 s
testDefaultWithoutPrimaryBinding  Time elapsed: 0.006 s
testPrimaryBinding  Time elapsed: 0.005 s
testDoubleBinding  Time elapsed: 0.005 s
testCreateDeleteEFS  Time elapsed: 0.091 s
testRenameSharedConfiguration  Time elapsed: 0.013 s
testTerminateTimeStamp  Time elapsed: 0.053 s
testPrototypeChildren  Time elapsed: 0.016 s
testSetAttributes  Time elapsed: 0.008 s
testGetProjectMappedResource1  Time elapsed: 0.007 s
testGetProjectMappedResource2  Time elapsed: 0.006 s
testGetProjectMappedResource3  Time elapsed: 0.016 s
testGetProjectMappedResource4  Time elapsed: 0.006 s
testNullLaunchConfigurationInLaunch  Time elapsed: 0.015 s
testCopyAttributes  Time elapsed: 0.01 s
testSetNullAttributes  Time elapsed: 0.008 s
testLocalCopy  Time elapsed: 0.011 s
testLocalName  Time elapsed: 0.007 s
testGetTypeImageFromURI  Time elapsed: 0.014 s
testWorkingCopyGetLocation  Time elapsed: 0.006 s
testPersistIndex  Time elapsed: 0.04 s
testIllegalFileSepCharName  Time elapsed: 0.019 s
testCreateLocalConfiguration  Time elapsed: 0.008 s
testCopyPrototype  Time elapsed: 0.006 s
testIsPrototype  Time elapsed: 0.007 s
testNestedPrototypes  Time elapsed: 0.007 s
testDoubleSave  Time elapsed: 0.012 s
testDeleteLocalConfiguration  Time elapsed: 0.008 s
testPrototypeRemoveBehavior  Time elapsed: 0.008 s
testNestedWorkingCopyLocalConfiguration  Time elapsed: 0.007 s
testLaunchTimeStamp  Time elapsed: 0.007 s
testLegalFileSepCharName  Time elapsed: 0.006 s
testGetTyeImage  Time elapsed: 0.006 s
testIllegalCharName  Time elapsed: 0.007 s
testDeleteSharedConfiguration  Time elapsed: 0.012 s
testUnPrototype  Time elapsed: 0.012 s
testMoveSharedToLocalConfiguration  Time elapsed: 0.013 s
testDeleteProjectWithSharedConfig  Time elapsed: 0.031 s
testCreateDeleteEFSLink  Time elapsed: 0.013 s
testCreationFromPrototype  Time elapsed: 0.008 s
testRenameLocalConfiguration  Time elapsed: 0.008 s
testImport  Time elapsed: 0.013 s
testCreateSharedConfiguration  Time elapsed: 0.01 s
testMoveLocalToSharedConfiguration  Time elapsed: 0.011 s
testRenameAndMoveShared  Time elapsed: 0.012 s
testMapAttributePersistence  Time elapsed: 0.012 s
testSharedCopy  Time elapsed: 0.012 s
testSharedName  Time elapsed: 0.012 s
testEFSProjectRename  Time elapsed: 0.04 s
testSetAttributePersistence  Time elapsed: 0.011 s
testGetAttributes  Time elapsed: 0.008 s
testIllegalPrototype  Time elapsed: 0.006 s
testWithEllipses  Time elapsed: 0.005 s
testWithoutEllipses  Time elapsed: 0.006 s
testWithoutDBCSAcclerator  Time elapsed: 0.006 s
testHistoryAddition  Time elapsed: 0.009 s
testLaunchHistorySize  Time elapsed: 0.01 s
testRenameConfigHistoryUpdate  Time elapsed: 0.104 s
testHistoryReodering  Time elapsed: 0.009 s
testHistoriesInSync  Time elapsed: 0.007 s
testDeleteLaunchConfigurationHistoryUpdate  Time elapsed: 0.008 s
testBecomeFavorite  Time elapsed: 0.019 s
testRenameFavorite  Time elapsed: 0.011 s
testDeleteConfiguration  Time elapsed: 0.008 s
testRenameBecomeFavorite  Time elapsed: 0.009 s
testRenameUnFavorite  Time elapsed: 0.011 s
testUnFavorite  Time elapsed: 0.01 s
testValidateConfigBadCharName  Time elapsed: 0.006 s
testValidateConfigBadName  Time elapsed: 0.005 s
testGenerateValidName  Time elapsed: 0.006 s
testGenerateBadConfigName  Time elapsed: 0.005 s
testGenereateConfigName  Time elapsed: 0.006 s
testGenerateConfigNameReservedName  Time elapsed: 0.006 s
testCancelledPreLaunchCheck  Time elapsed: 0.013 s
testCancelledBuildForLaunch  Time elapsed: 0.008 s
testGenereateConfigNameBadChar  Time elapsed: 0.006 s
testGenerateConflictingName  Time elapsed: 0.006 s
testGenerateBadCharConflict  Time elapsed: 0.007 s
testGenerateNameExistingConfig  Time elapsed: 0.009 s
testCancelledFinalLaunchCheck  Time elapsed: 0.008 s
testValidateConfigGoodName  Time elapsed: 0.006 s
testGenerateBadNameConflict  Time elapsed: 0.006 s
testRemoveAcc  Time elapsed: 0.006 s
testNPE_Bug484882  Time elapsed: 9.895 s
testSelectedResource  Time elapsed: 0.117 s
testSpecificResource  Time elapsed: 0.006 s
testSelectionsFolder  Time elapsed: 0.008 s
testWorkingSet  Time elapsed: 0.009 s
testWorkspaceScope  Time elapsed: 0.017 s
testSelectionsProject  Time elapsed: 0.008 s
testEmptyResourceSet  Time elapsed: 0.007 s
testResourceMemento  Time elapsed: 0.006 s
testRefreshScopeComparator  Time elapsed: 0.007 s
testAllInOne  Time elapsed: 0.097 s
testDoubleQuoted1  Time elapsed: 0.09 s
testDoubleQuoted2  Time elapsed: 0.087 s
testDoubleQuoted3  Time elapsed: 0.086 s
testDoubleQuoted4  Time elapsed: 0.086 s
testDoubleQuoted5  Time elapsed: 0.087 s
testEmpty  Time elapsed: 0.086 s
test1arg  Time elapsed: 0.086 s
test2arg  Time elapsed: 0.086 s
testEscapeDoubleQuote1  Time elapsed: 0.087 s
testEscapeDoubleQuote2  Time elapsed: 0.086 s
testWindows1  Time elapsed: 0.086 s
testWindows2  Time elapsed: 0.086 s
testWindows3  Time elapsed: 0.086 s
testWindows4  Time elapsed: 0.086 s
testWindows5  Time elapsed: 0.088 s
testDoubleQuotedWithSpace1  Time elapsed: 0.086 s
testDoubleQuotedWithSpace2  Time elapsed: 0.087 s
testSingleQuoted1  Time elapsed: 0.086 s
testSingleQuoted2  Time elapsed: 0.089 s
test100arg  Time elapsed: 0.103 s
testEscape  Time elapsed: 0.087 s
testDisconnectedAndWriteProcesses  Time elapsed: 2.196 s
testTerminatedAndWriteProcesses  Time elapsed: 2.201 s
testDisconnectedAndWriteTargets  Time elapsed: 2.239 s
testTerminatedAndWriteTargets  Time elapsed: 2.203 s
testStatusHandlerExtension  Time elapsed: 0.006 s
testDisableStatusHandlers  Time elapsed: 0.006 s
testStepFitlersExtension_01  Time elapsed: 0.007 s
testStepFitlersExtension_02  Time elapsed: 0.006 s
testMultilineRemove  Time elapsed: 0.013 s
testMultilineReplace  Time elapsed: 0.006 s
testChangeDocument  Time elapsed: 0.006 s
testInterfaceContract  Time elapsed: 0.006 s
testMultilineInserts  Time elapsed: 0.008 s
testManyLines  Time elapsed: 0.039 s
testSetText  Time elapsed: 0.006 s
testLineWrap  Time elapsed: 0.007 s
testSetWidth  Time elapsed: 0.005 s
testShowAllConsoles  Time elapsed: 4.874 s
testConsoleOutputStreamLastR  Time elapsed: 0.615 s
testConsoleOutputStreamClosed  Time elapsed: 0.006 s
testSetNullEncoding  Time elapsed: 0.006 s
testFindReplaceIsEnabledOnConsoleOpen  Time elapsed: 0.166 s
testConsoleOutputStreamDocumentStreamClosed  Time elapsed: 0.006 s
testIOConsoleAvailable  Time elapsed: 0.11 s
testConsoleOutputStreamDocumentClosed  Time elapsed: 0.006 s
testConsoleOutputStreamEncoding  Time elapsed: 0.823 s
testInputFile  Time elapsed: 0.209 s
testBackspaceControlCharacter  Time elapsed: 6.852 s
testTrim  Time elapsed: 0.519 s
testBug421303_StreamProcessingDeadlock  Time elapsed: 1.449 s
testUserInput  Time elapsed: 0.574 s
testControlCharacterSettings  Time elapsed: 0.861 s
testCarriageReturnControlCharacter  Time elapsed: 2.494 s
testIOPartitioner  Time elapsed: 1.183 s
testMixedWriteAndInput  Time elapsed: 4.45 s
testFormFeedControlCharacter  Time elapsed: 2.442 s
testIConsoleDocumentPartitioner  Time elapsed: 0.561 s
testConsoleClear  Time elapsed: 3.308 s
testManyPartitions  Time elapsed: 0.847 s
testWrites  Time elapsed: 1.302 s
testInputFile  Time elapsed: 0.255 s
testBackspaceControlCharacter  Time elapsed: 6.871 s
testTrim  Time elapsed: 0.583 s
testBug421303_StreamProcessingDeadlock  Time elapsed: 1.301 s
testUserInput  Time elapsed: 0.599 s
testControlCharacterSettings  Time elapsed: 0.886 s
testCarriageReturnControlCharacter  Time elapsed: 2.47 s
testIOPartitioner  Time elapsed: 1.215 s
testMixedWriteAndInput  Time elapsed: 4.553 s
testFormFeedControlCharacter  Time elapsed: 2.482 s
testIConsoleDocumentPartitioner  Time elapsed: 0.631 s
testConsoleClear  Time elapsed: 3.369 s
testManyPartitions  Time elapsed: 0.85 s
testWrites  Time elapsed: 1.385 s
testProcessConsoleLifecycle  Time elapsed: 0.095 s
testBug546710_ConsoleCreationRaceCondition  Time elapsed: 0.075 s
testProcessTerminationNotificationWithInputFile  Time elapsed: 0.166 s
testAppendOutputToFile  Time elapsed: 0.182 s
testBinaryInputFromFile  Time elapsed: 0.059 s
testInputReadJobCancel  Time elapsed: 0.017 s
testUTF8InputOdd  Time elapsed: 0.058 s
testUTF8InputEven  Time elapsed: 0.069 s
testRedirectOutputToFile  Time elapsed: 0.08 s
testProcessTerminationNotification  Time elapsed: 0.166 s
testBinaryOutputToFile  Time elapsed: 0.109 s
testOutput  Time elapsed: 0.211 s
testBug333239_regexSpecialCharactersInOutputFilename  Time elapsed: 0.281 s
testReceiveUTF8Odd  Time elapsed: 0.007 s
testReceiveUTF8Even  Time elapsed: 0.007 s
testStyleOverride  Time elapsed: 0.007 s
testTerminateProcess  Time elapsed: 0.039 s
testProcessTerminated  Time elapsed: 0.038 s
testUnbufferedOutputStreamMonitor  Time elapsed: 0.008 s
testBufferedOutputStreamMonitor  Time elapsed: 0.008 s
testNullCharset  Time elapsed: 0.006 s
testInputStreamMonitor  Time elapsed: 0.036 s
testClose  Time elapsed: 0.009 s
testNullCharset  Time elapsed: 0.036 s
testTerminated  Time elapsed: 2.04 s
testWaitForOutput  Time elapsed: 7.027 s
testAdopt  Time elapsed: 0.023 s
testDelay  Time elapsed: 2.013 s
testNone  Time elapsed: 0.01 s
testBuildBeforeLaunch  Time elapsed: 0.01 s
testAdoptComplex  Time elapsed: 0.013 s
testRename  Time elapsed: 0.01 s

Results:

Tests run: 309, Failures: 0, Errors: 0, Skipped: 0

[INFO] All tests passed!
[INFO] 
[INFO] --- tycho-p2-extras-plugin:1.7.0:compare-version-with-baselines (compare-attached-artifacts-with-release) @ org.eclipse.debug.tests ---
[INFO] Skipped
[INFO] ------------------------------------------------------------------------
[INFO] Reactor Summary:
[INFO] 
[INFO] eclipse.platform.debug 4.17.0-SNAPSHOT ............. SUCCESS [ 27.286 s]
[INFO] org.eclipse.core.variables 3.4.800-SNAPSHOT ........ SUCCESS [ 12.339 s]
[INFO] org.eclipse.debug.core 3.16.0-SNAPSHOT ............. SUCCESS [  5.576 s]
[INFO] org.eclipse.core.externaltools 1.1.700-SNAPSHOT .... SUCCESS [  3.036 s]
[INFO] org.eclipse.debug.examples.core 1.4.800-SNAPSHOT ... SUCCESS [  3.296 s]
[INFO] org.eclipse.ui.console 3.9.300-SNAPSHOT ............ SUCCESS [  3.405 s]
[INFO] org.eclipse.debug.ui 3.14.600-SNAPSHOT ............. SUCCESS [  7.142 s]
[INFO] org.eclipse.debug.examples.memory 1.102.200-SNAPSHOT SUCCESS [  3.286 s]
[INFO] org.eclipse.debug.examples.mixedmode 1.2.0-SNAPSHOT  SUCCESS [  3.009 s]
[INFO] org.eclipse.debug.examples.ui 1.6.400-SNAPSHOT ..... SUCCESS [  3.464 s]
[INFO] org.eclipse.ui.externaltools 3.4.800-SNAPSHOT ...... SUCCESS [  3.491 s]
[INFO] org.eclipse.debug.tests 3.11.800-SNAPSHOT .......... SUCCESS [01:49 min]
[INFO] ------------------------------------------------------------------------
[INFO] BUILD SUCCESS
[INFO] ------------------------------------------------------------------------
[INFO] Total time:  04:09 min
[INFO] Finished at: 2020-06-28T20:35:59Z
[INFO] ------------------------------------------------------------------------
Terminating xvnc.
[eclipse.platform.debug-SonarQube] $ /opt/tools/apache-maven/latest/bin/mvn -f /home/jenkins/agent/workspace/eclipse.platform.debug-SonarQube/pom.xml -e -B org.sonarsource.scanner.maven:sonar-maven-plugin:3.3.0.603:sonar -Pbuild-individual-bundles -Pcoverage -Dmaven.repo.local=/home/jenkins/agent/workspace/eclipse.platform.debug-SonarQube/.maven/.repo -Djacoco.destFile=/home/jenkins/agent/workspace/eclipse.platform.debug-SonarQube/jacoco.exec -Dsonar.jdbc.url=jdbc:mysql://dbmaster:3306/sonar?autoReconnect=true&useUnicode=true&characterEncoding=utf8 ******** ******** -Dsonar.host.url=https://sonar.eclipse.org
Apache Maven 3.6.3 (cecedd343002696d0abb50b32b541b8a6ba2883f)
Maven home: /opt/tools/apache-maven/latest
Java version: 1.8.0_202, vendor: Oracle Corporation, runtime: /opt/tools/java/oracle/jdk-8/1.8.0_202/jre
Default locale: en_US, platform encoding: UTF-8
OS name: "linux", version: "3.10.0-1062.el7.x86_64", arch: "amd64", family: "unix"
[INFO] Error stacktraces are turned on.
[INFO] Scanning for projects...
[INFO] Computing target platform for MavenProject: org.eclipse.core:org.eclipse.core.externaltools:1.1.700-SNAPSHOT @ /home/jenkins/agent/workspace/eclipse.platform.debug-SonarQube/org.eclipse.core.externaltools/pom.xml
[INFO] Fetching p2.index from https://download.eclipse.org/tools/orbit/downloads/drops/I20200623091847/repository/
[INFO] Adding repository https://download.eclipse.org/tools/orbit/downloads/drops/I20200623091847/repository
[INFO] Fetching compositeContent.xml from https://download.eclipse.org/tools/orbit/downloads/drops/I20200623091847/repository/
[INFO] Fetching content.jar from https://download.eclipse.org/tools/orbit/downloads/drops/R20191115185527/repository/ (107.42kB)
[INFO] Fetching p2.index from https://download.eclipse.org/tools/orbit/downloads/drops2/I20200623091847/repository/
[INFO] Fetching content.xml.xz from https://download.eclipse.org/tools/orbit/downloads/drops2/I20200623091847/repository/
[INFO] Fetching p2.index from https://download.eclipse.org/modeling/emf/emf/builds/release/2.22/
[INFO] Adding repository https://download.eclipse.org/modeling/emf/emf/builds/release/2.22
[INFO] Fetching content.xml.xz from https://download.eclipse.org/modeling/emf/emf/builds/release/2.22/
[INFO] Adding repository https://download.eclipse.org/jetty/updates/jetty-bundles-9.x/9.4.30.v20200611
[INFO] Fetching content.jar from https://download.eclipse.org/jetty/updates/jetty-bundles-9.x/9.4.30.v20200611/ (19.67kB)
[INFO] Fetching p2.index from https://download.eclipse.org/rt/ecf/staging/site.p2/3.14.8.v20200522-1203/
[INFO] Adding repository https://download.eclipse.org/rt/ecf/staging/site.p2/3.14.8.v20200522-1203
[INFO] Fetching content.xml.xz from https://download.eclipse.org/rt/ecf/staging/site.p2/3.14.8.v20200522-1203/
[INFO] Fetching p2.index from https://download.eclipse.org/cbi/updates/license/2.0.2.v20181016-2210/
[INFO] Adding repository https://download.eclipse.org/cbi/updates/license/2.0.2.v20181016-2210
[INFO] Fetching content.xml.xz from https://download.eclipse.org/cbi/updates/license/2.0.2.v20181016-2210/
[INFO] Fetching p2.index from https://download.eclipse.org/egit/updates-5.8/
[INFO] Adding repository https://download.eclipse.org/egit/updates-5.8
[INFO] Fetching content.xml.xz from https://download.eclipse.org/egit/updates-5.8/
[INFO] Fetching p2.index from https://download.eclipse.org/reddeer/releases/3.0.0/
[INFO] Adding repository https://download.eclipse.org/reddeer/releases/3.0.0
[INFO] Fetching content.xml.xz from https://download.eclipse.org/reddeer/releases/3.0.0/
[INFO] Fetching p2.index from https://download.eclipse.org/eclipse/updates/4.17-I-builds/
[INFO] Adding repository https://download.eclipse.org/eclipse/updates/4.17-I-builds
[INFO] Fetching compositeContent.jar from https://download.eclipse.org/eclipse/updates/4.17-I-builds/ (456B)
[INFO] Fetching content.jar from https://download.eclipse.org/eclipse/updates/4.17-I-builds/categories/ (1.46kB)
[INFO] Fetching p2.index from https://download.eclipse.org/eclipse/updates/4.17-I-builds/I20200623-1800/
[INFO] Fetching content.xml from https://download.eclipse.org/eclipse/updates/4.17-I-builds/I20200623-1800/
[INFO] Fetching p2.index from https://download.eclipse.org/eclipse/updates/4.17-I-builds/I20200624-1800/
[INFO] Fetching content.xml from https://download.eclipse.org/eclipse/updates/4.17-I-builds/I20200624-1800/
[INFO] Fetching p2.index from https://download.eclipse.org/eclipse/updates/4.17-I-builds/I20200625-1800/
[INFO] Fetching content.xml from https://download.eclipse.org/eclipse/updates/4.17-I-builds/I20200625-1800/
[INFO] Fetching p2.index from https://download.eclipse.org/eclipse/updates/4.17-I-builds/I20200626-1800/
[INFO] Fetching content.xml from https://download.eclipse.org/eclipse/updates/4.17-I-builds/I20200626-1800/
[INFO] Resolving dependencies of MavenProject: org.eclipse.core:org.eclipse.core.externaltools:1.1.700-SNAPSHOT @ /home/jenkins/agent/workspace/eclipse.platform.debug-SonarQube/org.eclipse.core.externaltools/pom.xml
[INFO] Fetching org.eclipse.osgi_3.16.0.v20200615-2047.jar.pack.gz from https://download.eclipse.org/eclipse/updates/4.17-I-builds/I20200623-1800/plugins/ (468.68kB)
[INFO] Fetching org.eclipse.equinox.preferences_3.8.0.v20200422-1833.jar.pack.gz from https://download.eclipse.org/eclipse/updates/4.17-I-builds/I20200623-1800/plugins/ (55.59kB)
[INFO] Fetching org.eclipse.equinox.registry_3.9.0.v20200625-1425.jar.pack.gz from https://download.eclipse.org/eclipse/updates/4.17-I-builds/I20200625-1800/plugins/ (77.12kB)
[INFO] Fetching org.eclipse.equinox.common_3.13.0.v20200626-1514.jar.pack.gz from https://download.eclipse.org/eclipse/updates/4.17-I-builds/I20200626-1800/plugins/ (57.05kB)
[INFO] Fetching org.eclipse.core.contenttype_3.7.800.v20200626-1852.jar.pack.gz from https://download.eclipse.org/eclipse/updates/4.17-I-builds/I20200626-1800/plugins/ (41.4kB)
[INFO] Fetching org.eclipse.core.expressions_3.7.0.v20200615-1454.jar.pack.gz from https://download.eclipse.org/eclipse/updates/4.17-I-builds/I20200623-1800/plugins/ (34.4kB)
[INFO] Fetching org.eclipse.core.runtime_3.19.0.v20200626-1402.jar.pack.gz from https://download.eclipse.org/eclipse/updates/4.17-I-builds/I20200626-1800/plugins/ (33.65kB)
[INFO] Fetching org.eclipse.core.resources_3.13.800.v20200613-0540.jar from https://download.eclipse.org/eclipse/updates/4.17-I-builds/I20200623-1800/plugins/ (873.58kB)
[INFO] Fetching org.eclipse.core.filesystem_1.7.700.v20200110-1734.jar.pack.gz from https://download.eclipse.org/eclipse/updates/4.17-I-builds/I20200623-1800/plugins/ (27.79kB)
[INFO] Fetching org.eclipse.core.jobs_3.10.800.v20200421-0950.jar.pack.gz from https://download.eclipse.org/eclipse/updates/4.17-I-builds/I20200623-1800/plugins/ (46.11kB)
[INFO] Fetching org.eclipse.equinox.app_1.5.0.v20200615-0855.jar.pack.gz from https://download.eclipse.org/eclipse/updates/4.17-I-builds/I20200623-1800/plugins/ (42.11kB)
[INFO] Resolving class path of MavenProject: org.eclipse.core:org.eclipse.core.externaltools:1.1.700-SNAPSHOT @ /home/jenkins/agent/workspace/eclipse.platform.debug-SonarQube/org.eclipse.core.externaltools/pom.xml
[INFO] Computing target platform for MavenProject: org.eclipse.core:org.eclipse.core.variables:3.4.800-SNAPSHOT @ /home/jenkins/agent/workspace/eclipse.platform.debug-SonarQube/org.eclipse.core.variables/pom.xml
[INFO] Resolving dependencies of MavenProject: org.eclipse.core:org.eclipse.core.variables:3.4.800-SNAPSHOT @ /home/jenkins/agent/workspace/eclipse.platform.debug-SonarQube/org.eclipse.core.variables/pom.xml
[INFO] Resolving class path of MavenProject: org.eclipse.core:org.eclipse.core.variables:3.4.800-SNAPSHOT @ /home/jenkins/agent/workspace/eclipse.platform.debug-SonarQube/org.eclipse.core.variables/pom.xml
[INFO] Computing target platform for MavenProject: org.eclipse.debug:org.eclipse.debug.core:3.16.0-SNAPSHOT @ /home/jenkins/agent/workspace/eclipse.platform.debug-SonarQube/org.eclipse.debug.core/pom.xml
[INFO] Resolving dependencies of MavenProject: org.eclipse.debug:org.eclipse.debug.core:3.16.0-SNAPSHOT @ /home/jenkins/agent/workspace/eclipse.platform.debug-SonarQube/org.eclipse.debug.core/pom.xml
[INFO] Resolving class path of MavenProject: org.eclipse.debug:org.eclipse.debug.core:3.16.0-SNAPSHOT @ /home/jenkins/agent/workspace/eclipse.platform.debug-SonarQube/org.eclipse.debug.core/pom.xml
[INFO] Computing target platform for MavenProject: org.eclipse.debug:org.eclipse.debug.examples.core:1.4.800-SNAPSHOT @ /home/jenkins/agent/workspace/eclipse.platform.debug-SonarQube/org.eclipse.debug.examples.core/pom.xml
[INFO] Resolving dependencies of MavenProject: org.eclipse.debug:org.eclipse.debug.examples.core:1.4.800-SNAPSHOT @ /home/jenkins/agent/workspace/eclipse.platform.debug-SonarQube/org.eclipse.debug.examples.core/pom.xml
[INFO] Fetching org.apache.ant_1.10.8.v20200515-1239.jar.pack.gz from https://download.eclipse.org/eclipse/updates/4.17-I-builds/I20200623-1800/plugins/ (2.86MB)
[INFO] Resolving class path of MavenProject: org.eclipse.debug:org.eclipse.debug.examples.core:1.4.800-SNAPSHOT @ /home/jenkins/agent/workspace/eclipse.platform.debug-SonarQube/org.eclipse.debug.examples.core/pom.xml
[INFO] Computing target platform for MavenProject: org.eclipse.debug:org.eclipse.debug.examples.memory:1.102.200-SNAPSHOT @ /home/jenkins/agent/workspace/eclipse.platform.debug-SonarQube/org.eclipse.debug.examples.memory/pom.xml
[INFO] Resolving dependencies of MavenProject: org.eclipse.debug:org.eclipse.debug.examples.memory:1.102.200-SNAPSHOT @ /home/jenkins/agent/workspace/eclipse.platform.debug-SonarQube/org.eclipse.debug.examples.memory/pom.xml
[INFO] Fetching com.ibm.icu_64.2.0.v20190507-1337.jar.pack.gz from https://download.eclipse.org/eclipse/updates/4.17-I-builds/I20200623-1800/plugins/ (9.5MB)
[INFO] Fetching com.sun.jna_4.5.1.v20190425-1842.jar.pack.gz from https://download.eclipse.org/eclipse/updates/4.17-I-builds/I20200623-1800/plugins/ (1.28MB)
[INFO] Fetching com.sun.jna.platform_4.5.1.v20190425-1842.jar.pack.gz from https://download.eclipse.org/eclipse/updates/4.17-I-builds/I20200623-1800/plugins/ (328.72kB)
[INFO] Fetching org.apache.batik.constants_1.13.0.v20200622-2037.jar.pack.gz from https://download.eclipse.org/eclipse/updates/4.17-I-builds/I20200623-1800/plugins/ (13.04kB)
[INFO] Fetching org.apache.batik.css_1.13.0.v20200622-2037.jar.pack.gz from https://download.eclipse.org/eclipse/updates/4.17-I-builds/I20200623-1800/plugins/ (102.44kB)
[INFO] Fetching org.apache.batik.util_1.13.0.v20200622-2037.jar.pack.gz from https://download.eclipse.org/eclipse/updates/4.17-I-builds/I20200623-1800/plugins/ (63.28kB)
[INFO] Fetching org.apache.batik.i18n_1.13.0.v20200622-2037.jar.pack.gz from https://download.eclipse.org/eclipse/updates/4.17-I-builds/I20200623-1800/plugins/ (14.51kB)
[INFO] Fetching org.apache.xmlgraphics_2.4.0.v20200622-2037.jar.pack.gz from https://download.eclipse.org/eclipse/updates/4.17-I-builds/I20200623-1800/plugins/ (255.79kB)
[INFO] Fetching org.w3c.dom.svg_1.1.0.v201011041433.jar from https://download.eclipse.org/eclipse/updates/4.17-I-builds/I20200623-1800/plugins/ (95.26kB)
[INFO] Fetching org.w3c.dom.events_3.0.0.draft20060413_v201105210656.jar from https://download.eclipse.org/eclipse/updates/4.17-I-builds/I20200623-1800/plugins/ (15.35kB)
[INFO] Fetching org.w3c.css.sac_1.3.1.v200903091627.jar from https://download.eclipse.org/eclipse/updates/4.17-I-builds/I20200623-1800/plugins/ (35.59kB)
[INFO] Fetching org.apache.commons.io_2.6.0.v20190123-2029.jar.pack.gz from https://download.eclipse.org/eclipse/updates/4.17-I-builds/I20200623-1800/plugins/ (82.7kB)
[INFO] Fetching org.apache.commons.logging_1.2.0.v20180409-1502.jar.pack.gz from https://download.eclipse.org/eclipse/updates/4.17-I-builds/I20200623-1800/plugins/ (33.71kB)
[INFO] Fetching org.apache.felix.scr_2.1.16.v20200110-1820.jar.pack.gz from https://download.eclipse.org/eclipse/updates/4.17-I-builds/I20200623-1800/plugins/ (155.55kB)
[INFO] Fetching org.eclipse.osgi.services_3.9.0.v20200511-1725.jar.pack.gz from https://download.eclipse.org/eclipse/updates/4.17-I-builds/I20200623-1800/plugins/ (43.97kB)
[INFO] Fetching org.eclipse.osgi.util_3.5.300.v20190708-1141.jar.pack.gz from https://download.eclipse.org/eclipse/updates/4.17-I-builds/I20200623-1800/plugins/ (30.65kB)
[INFO] Fetching org.eclipse.compare.core_3.6.900.v20200412-2017.jar.pack.gz from https://download.eclipse.org/eclipse/updates/4.17-I-builds/I20200623-1800/plugins/ (32.85kB)
[INFO] Fetching org.eclipse.core.commands_3.9.700.v20191217-1850.jar.pack.gz from https://download.eclipse.org/eclipse/updates/4.17-I-builds/I20200623-1800/plugins/ (43.01kB)
[INFO] Fetching org.eclipse.core.databinding_1.9.100.v20200615-1701.jar.pack.gz from https://download.eclipse.org/eclipse/updates/4.17-I-builds/I20200623-1800/plugins/ (56.78kB)
[INFO] Fetching org.eclipse.core.databinding.observable_1.10.0.v20200615-1701.jar.pack.gz from https://download.eclipse.org/eclipse/updates/4.17-I-builds/I20200623-1800/plugins/ (82.81kB)
[INFO] Fetching org.eclipse.core.databinding.property_1.8.100.v20200619-0651.jar.pack.gz from https://download.eclipse.org/eclipse/updates/4.17-I-builds/I20200623-1800/plugins/ (44.71kB)
[INFO] Fetching org.eclipse.core.filebuffers_3.6.1000.v20200409-1035.jar.pack.gz from https://download.eclipse.org/eclipse/updates/4.17-I-builds/I20200623-1800/plugins/ (41.15kB)
[INFO] Fetching org.eclipse.text_3.10.200.v20200428-0633.jar.pack.gz from https://download.eclipse.org/eclipse/updates/4.17-I-builds/I20200623-1800/plugins/ (100.5kB)
[INFO] Fetching org.eclipse.ui_3.117.100.v20200619-0915.jar.pack.gz from https://download.eclipse.org/eclipse/updates/4.17-I-builds/I20200623-1800/plugins/ (339.77kB)
[INFO] Fetching org.eclipse.jface.text_3.16.300.v20200526-0811.jar.pack.gz from https://download.eclipse.org/eclipse/updates/4.17-I-builds/I20200623-1800/plugins/ (316.88kB)
[INFO] Fetching org.eclipse.help_3.8.800.v20200525-0755.jar.pack.gz from https://download.eclipse.org/eclipse/updates/4.17-I-builds/I20200623-1800/plugins/ (120.7kB)
[INFO] Fetching org.eclipse.ui.workbench.texteditor_3.14.300.v20200609-1726.jar.pack.gz from https://download.eclipse.org/eclipse/updates/4.17-I-builds/I20200623-1800/plugins/ (233.82kB)
[INFO] Fetching org.eclipse.ui.ide_3.17.200.v20200624-1715.jar.pack.gz from https://download.eclipse.org/eclipse/updates/4.17-I-builds/I20200625-1800/plugins/ (954.74kB)
[INFO] Fetching org.eclipse.ui.editors_3.13.300.v20200612-0639.jar.pack.gz from https://download.eclipse.org/eclipse/updates/4.17-I-builds/I20200623-1800/plugins/ (197.54kB)
[INFO] Fetching org.eclipse.ui.workbench_3.120.0.v20200625-1121.jar.pack.gz from https://download.eclipse.org/eclipse/updates/4.17-I-builds/I20200626-1800/plugins/ (979.33kB)
[INFO] Fetching org.eclipse.ui.forms_3.10.0.v20200623-0553.jar.pack.gz from https://download.eclipse.org/eclipse/updates/4.17-I-builds/I20200623-1800/plugins/ (124.55kB)
[INFO] Fetching org.eclipse.e4.core.commands_0.12.900.v20200110-1732.jar.pack.gz from https://download.eclipse.org/eclipse/updates/4.17-I-builds/I20200623-1800/plugins/ (13.76kB)
[INFO] Fetching org.eclipse.e4.core.di_1.7.600.v20200428-0912.jar.pack.gz from https://download.eclipse.org/eclipse/updates/4.17-I-builds/I20200623-1800/plugins/ (25.88kB)
[INFO] Fetching javax.inject_1.0.0.v20091030.jar from https://download.eclipse.org/eclipse/updates/4.17-I-builds/I20200623-1800/plugins/ (14.07kB)
[INFO] Fetching org.eclipse.e4.core.contexts_1.8.400.v20191217-1710.jar.pack.gz from https://download.eclipse.org/eclipse/updates/4.17-I-builds/I20200623-1800/plugins/ (22.66kB)
[INFO] Fetching org.eclipse.e4.core.services_2.2.400.v20200622-1247.jar.pack.gz from https://download.eclipse.org/eclipse/updates/4.17-I-builds/I20200623-1800/plugins/ (27.95kB)
[INFO] Fetching org.eclipse.e4.core.di.annotations_1.6.600.v20191216-2352.jar.pack.gz from https://download.eclipse.org/eclipse/updates/4.17-I-builds/I20200623-1800/plugins/ (7.68kB)
[INFO] Fetching org.eclipse.e4.core.di.extensions_0.16.0.v20200507-0938.jar.pack.gz from https://download.eclipse.org/eclipse/updates/4.17-I-builds/I20200623-1800/plugins/ (7.72kB)
[INFO] Fetching org.eclipse.e4.core.di.extensions.supplier_0.15.700.v20200622-1247.jar.pack.gz from https://download.eclipse.org/eclipse/updates/4.17-I-builds/I20200623-1800/plugins/ (16.43kB)
[INFO] Fetching org.eclipse.e4.emf.xpath_0.2.800.v20200609-0849.jar.pack.gz from https://download.eclipse.org/eclipse/updates/4.17-I-builds/I20200623-1800/plugins/ (21.73kB)
[INFO] Fetching org.apache.commons.jxpath_1.3.0.v200911051830.jar.pack.gz from https://download.eclipse.org/eclipse/updates/4.17-I-builds/I20200623-1800/plugins/ (107.16kB)
[INFO] Fetching org.eclipse.emf.ecore_2.22.0.v20200519-1135.jar.pack.gz from https://download.eclipse.org/eclipse/updates/4.17-I-builds/I20200623-1800/plugins/ (487.54kB)
[INFO] Fetching org.eclipse.e4.ui.bindings_0.12.900.v20200513-0930.jar.pack.gz from https://download.eclipse.org/eclipse/updates/4.17-I-builds/I20200623-1800/plugins/ (23.02kB)
[INFO] Fetching org.eclipse.swt_3.115.0.v20200626-2203.jar.pack.gz from https://download.eclipse.org/eclipse/updates/4.17-I-builds/I20200626-1800/plugins/ (16kB)
[INFO] Fetching org.eclipse.e4.ui.services_1.3.700.v20190930-1643.jar.pack.gz from https://download.eclipse.org/eclipse/updates/4.17-I-builds/I20200623-1800/plugins/ (13.16kB)
[INFO] Fetching org.eclipse.jface_3.21.0.v20200622-1145.jar.pack.gz from https://download.eclipse.org/eclipse/updates/4.17-I-builds/I20200623-1800/plugins/ (363.61kB)
[INFO] Fetching org.eclipse.e4.ui.css.core_0.12.1300.v20200615-1701.jar.pack.gz from https://download.eclipse.org/eclipse/updates/4.17-I-builds/I20200623-1800/plugins/ (66.19kB)
[INFO] Fetching org.eclipse.e4.ui.css.swt_0.13.1100.v20200615-1701.jar.pack.gz from https://download.eclipse.org/eclipse/updates/4.17-I-builds/I20200623-1800/plugins/ (65.63kB)
[INFO] Fetching org.eclipse.e4.ui.css.swt.theme_0.12.700.v20200527-0719.jar.pack.gz from https://download.eclipse.org/eclipse/updates/4.17-I-builds/I20200623-1800/plugins/ (16.47kB)
[INFO] Fetching org.eclipse.e4.ui.di_1.2.800.v20200128-0855.jar.pack.gz from https://download.eclipse.org/eclipse/updates/4.17-I-builds/I20200623-1800/plugins/ (9.76kB)
[INFO] Fetching org.eclipse.e4.ui.dialogs_1.1.900.v20200616-2015.jar.pack.gz from https://download.eclipse.org/eclipse/updates/4.17-I-builds/I20200623-1800/plugins/ (27.7kB)
[INFO] Fetching org.eclipse.e4.ui.ide_3.15.100.v20200323-2111.jar.pack.gz from https://download.eclipse.org/eclipse/updates/4.17-I-builds/I20200623-1800/plugins/ (7.94kB)
[INFO] Fetching org.eclipse.e4.ui.model.workbench_2.1.800.v20200616-1638.jar.pack.gz from https://download.eclipse.org/eclipse/updates/4.17-I-builds/I20200623-1800/plugins/ (110.4kB)
[INFO] Fetching org.eclipse.equinox.event_1.5.500.v20200616-0800.jar.pack.gz from https://download.eclipse.org/eclipse/updates/4.17-I-builds/I20200623-1800/plugins/ (16.65kB)
[INFO] Fetching org.eclipse.e4.ui.widgets_1.2.700.v20191222-1048.jar.pack.gz from https://download.eclipse.org/eclipse/updates/4.17-I-builds/I20200623-1800/plugins/ (9.45kB)
[INFO] Fetching org.eclipse.e4.ui.workbench_1.11.400.v20200618-1755.jar.pack.gz from https://download.eclipse.org/eclipse/updates/4.17-I-builds/I20200623-1800/plugins/ (84.62kB)
[INFO] Fetching org.eclipse.emf.ecore.change_2.14.0.v20190528-0725.jar.pack.gz from https://download.eclipse.org/eclipse/updates/4.17-I-builds/I20200623-1800/plugins/ (51kB)
[INFO] Fetching org.eclipse.emf.ecore.xmi_2.16.0.v20190528-0725.jar.pack.gz from https://download.eclipse.org/eclipse/updates/4.17-I-builds/I20200623-1800/plugins/ (84.02kB)
[INFO] Fetching org.eclipse.e4.ui.workbench.addons.swt_1.3.1000.v20200517-1848.jar.pack.gz from https://download.eclipse.org/eclipse/updates/4.17-I-builds/I20200623-1800/plugins/ (49.88kB)
[INFO] Fetching org.eclipse.e4.ui.workbench.renderers.swt_0.14.1300.v20200619-1018.jar.pack.gz from https://download.eclipse.org/eclipse/updates/4.17-I-builds/I20200623-1800/plugins/ (94.67kB)
[INFO] Fetching org.eclipse.e4.ui.workbench.swt_0.14.1100.v20200619-0644.jar.pack.gz from https://download.eclipse.org/eclipse/updates/4.17-I-builds/I20200623-1800/plugins/ (60.83kB)
[INFO] Fetching org.eclipse.jface.databinding_1.12.0.v20200619-2210.jar.pack.gz from https://download.eclipse.org/eclipse/updates/4.17-I-builds/I20200623-1800/plugins/ (77.5kB)
[INFO] Fetching org.eclipse.e4.ui.workbench3_0.15.400.v20191216-0805.jar.pack.gz from https://download.eclipse.org/eclipse/updates/4.17-I-builds/I20200623-1800/plugins/ (13.07kB)
[INFO] Fetching org.eclipse.urischeme_1.1.100.v20200618-1230.jar.pack.gz from https://download.eclipse.org/eclipse/updates/4.17-I-builds/I20200623-1800/plugins/ (21.65kB)
[INFO] Fetching org.eclipse.emf.common_2.19.0.v20200324-0932.jar.pack.gz from https://download.eclipse.org/eclipse/updates/4.17-I-builds/I20200623-1800/plugins/ (115.11kB)
[INFO] Fetching org.eclipse.equinox.bidi_1.3.0.v20200612-1624.jar.pack.gz from https://download.eclipse.org/eclipse/updates/4.17-I-builds/I20200623-1800/plugins/ (23.97kB)
[INFO] Fetching org.eclipse.equinox.p2.core_2.6.300.v20200211-1504.jar.pack.gz from https://download.eclipse.org/eclipse/updates/4.17-I-builds/I20200623-1800/plugins/ (32.04kB)
[INFO] Fetching org.eclipse.equinox.p2.engine_2.6.700.v20200511-1530.jar.pack.gz from https://download.eclipse.org/eclipse/updates/4.17-I-builds/I20200623-1800/plugins/ (74.47kB)
[INFO] Fetching org.eclipse.equinox.p2.metadata_2.5.0.v20200511-1530.jar.pack.gz from https://download.eclipse.org/eclipse/updates/4.17-I-builds/I20200623-1800/plugins/ (107.88kB)
[INFO] Fetching org.eclipse.equinox.p2.metadata.repository_1.3.400.v20191211-1528.jar.pack.gz from https://download.eclipse.org/eclipse/updates/4.17-I-builds/I20200623-1800/plugins/ (50.94kB)
[INFO] Fetching org.eclipse.equinox.p2.repository_2.4.700.v20200110-2121.jar.pack.gz from https://download.eclipse.org/eclipse/updates/4.17-I-builds/I20200623-1800/plugins/ (55.47kB)
[INFO] Fetching org.tukaani.xz_1.8.0.v20180207-1613.jar.pack.gz from https://download.eclipse.org/eclipse/updates/4.17-I-builds/I20200623-1800/plugins/ (44.42kB)
[INFO] Fetching org.eclipse.equinox.security_1.3.500.v20200114-1637.jar.pack.gz from https://download.eclipse.org/eclipse/updates/4.17-I-builds/I20200623-1800/plugins/ (44.56kB)
[INFO] Fetching org.eclipse.jface.notifications_0.1.100.v20200621-0731.jar.pack.gz from https://download.eclipse.org/eclipse/updates/4.17-I-builds/I20200623-1800/plugins/ (14.96kB)
[INFO] Fetching org.eclipse.swt.gtk.linux.x86_64_3.115.0.v20200626-2203.jar.pack.gz from https://download.eclipse.org/eclipse/updates/4.17-I-builds/I20200626-1800/plugins/ (952.44kB)
[INFO] Fetching org.eclipse.ui.navigator_3.9.400.v20200615-1710.jar.pack.gz from https://download.eclipse.org/eclipse/updates/4.17-I-builds/I20200623-1800/plugins/ (130.95kB)
[INFO] Fetching org.w3c.dom.smil_1.0.1.v200903091627.jar.pack.gz from https://download.eclipse.org/eclipse/updates/4.17-I-builds/I20200623-1800/plugins/ (16.71kB)
[INFO] Fetching org.eclipse.swt.gtk.linux.ppc64le_3.115.0.v20200626-2203.jar.pack.gz from https://download.eclipse.org/eclipse/updates/4.17-I-builds/I20200626-1800/plugins/ (914.74kB)
[INFO] Fetching org.eclipse.swt.win32.win32.x86_64_3.115.0.v20200626-2203.jar.pack.gz from https://download.eclipse.org/eclipse/updates/4.17-I-builds/I20200626-1800/plugins/ (1.13MB)
[INFO] Fetching org.eclipse.swt.cocoa.macosx.x86_64_3.115.0.v20200626-2203.jar.pack.gz from https://download.eclipse.org/eclipse/updates/4.17-I-builds/I20200626-1800/plugins/ (833.92kB)
[INFO] Resolving class path of MavenProject: org.eclipse.debug:org.eclipse.debug.examples.memory:1.102.200-SNAPSHOT @ /home/jenkins/agent/workspace/eclipse.platform.debug-SonarQube/org.eclipse.debug.examples.memory/pom.xml
[INFO] Computing target platform for MavenProject: org.eclipse.debug:org.eclipse.debug.examples.mixedmode:1.2.0-SNAPSHOT @ /home/jenkins/agent/workspace/eclipse.platform.debug-SonarQube/org.eclipse.debug.examples.mixedmode/pom.xml
[INFO] Resolving dependencies of MavenProject: org.eclipse.debug:org.eclipse.debug.examples.mixedmode:1.2.0-SNAPSHOT @ /home/jenkins/agent/workspace/eclipse.platform.debug-SonarQube/org.eclipse.debug.examples.mixedmode/pom.xml
[INFO] Resolving class path of MavenProject: org.eclipse.debug:org.eclipse.debug.examples.mixedmode:1.2.0-SNAPSHOT @ /home/jenkins/agent/workspace/eclipse.platform.debug-SonarQube/org.eclipse.debug.examples.mixedmode/pom.xml
[INFO] Computing target platform for MavenProject: org.eclipse.debug:org.eclipse.debug.examples.ui:1.6.400-SNAPSHOT @ /home/jenkins/agent/workspace/eclipse.platform.debug-SonarQube/org.eclipse.debug.examples.ui/pom.xml
[INFO] Resolving dependencies of MavenProject: org.eclipse.debug:org.eclipse.debug.examples.ui:1.6.400-SNAPSHOT @ /home/jenkins/agent/workspace/eclipse.platform.debug-SonarQube/org.eclipse.debug.examples.ui/pom.xml
[INFO] Resolving class path of MavenProject: org.eclipse.debug:org.eclipse.debug.examples.ui:1.6.400-SNAPSHOT @ /home/jenkins/agent/workspace/eclipse.platform.debug-SonarQube/org.eclipse.debug.examples.ui/pom.xml
[INFO] Computing target platform for MavenProject: org.eclipse.debug:org.eclipse.debug.tests:3.11.800-SNAPSHOT @ /home/jenkins/agent/workspace/eclipse.platform.debug-SonarQube/org.eclipse.debug.tests/pom.xml
[INFO] Resolving dependencies of MavenProject: org.eclipse.debug:org.eclipse.debug.tests:3.11.800-SNAPSHOT @ /home/jenkins/agent/workspace/eclipse.platform.debug-SonarQube/org.eclipse.debug.tests/pom.xml
Jun 28, 2020 8:37:27 PM org.apache.http.impl.execchain.RetryExec execute
INFO: I/O exception (org.apache.http.NoHttpResponseException) caught when processing request to {s}->https://download.eclipse.org:443: The target server failed to respond
Jun 28, 2020 8:37:27 PM org.apache.http.impl.execchain.RetryExec execute
INFO: Retrying request to {s}->https://download.eclipse.org:443
[INFO] Fetching org.apiguardian_1.1.0.v20190826-0900.jar.pack.gz from https://download.eclipse.org/eclipse/updates/4.17-I-builds/I20200623-1800/plugins/ (12.57kB)
[INFO] Fetching org.eclipse.compare_3.7.1100.v20200611-0145.jar.pack.gz from https://download.eclipse.org/eclipse/updates/4.17-I-builds/I20200623-1800/plugins/ (306.32kB)
[INFO] Fetching org.eclipse.ui.views_3.10.400.v20200611-1719.jar.pack.gz from https://download.eclipse.org/eclipse/updates/4.17-I-builds/I20200623-1800/plugins/ (48.2kB)
[INFO] Fetching org.eclipse.core.net_1.3.1000.v20200611-0145.jar.pack.gz from https://download.eclipse.org/eclipse/updates/4.17-I-builds/I20200623-1800/plugins/ (31.73kB)
[INFO] Fetching org.junit_4.13.0.v20200204-1500.jar.pack.gz from https://download.eclipse.org/eclipse/updates/4.17-I-builds/I20200623-1800/plugins/ (123kB)
[INFO] Fetching org.eclipse.test.performance_3.16.0.v20200608-1255.jar.pack.gz from https://download.eclipse.org/eclipse/updates/4.17-I-builds/I20200623-1800/plugins/ (57.6kB)
[INFO] Fetching org.eclipse.equinox.launcher_1.5.700.v20200207-2156.jar.pack.gz from https://download.eclipse.org/eclipse/updates/4.17-I-builds/I20200623-1800/plugins/ (29.85kB)
[INFO] Fetching org.eclipse.ltk.core.refactoring_3.11.0.v20200515-0330.jar.pack.gz from https://download.eclipse.org/eclipse/updates/4.17-I-builds/I20200623-1800/plugins/ (105.75kB)
[INFO] Fetching org.eclipse.ltk.ui.refactoring_3.11.0.v20200515-0330.jar.pack.gz from https://download.eclipse.org/eclipse/updates/4.17-I-builds/I20200623-1800/plugins/ (176.74kB)
[INFO] Fetching org.eclipse.team.core_3.8.1100.v20200607-0846.jar.pack.gz from https://download.eclipse.org/eclipse/updates/4.17-I-builds/I20200623-1800/plugins/ (124.88kB)
[INFO] Fetching org.eclipse.team.ui_3.8.1000.v20200612-0641.jar.pack.gz from https://download.eclipse.org/eclipse/updates/4.17-I-builds/I20200623-1800/plugins/ (491.44kB)
[INFO] Fetching org.junit.jupiter.api_5.6.0.v20200203-2009.jar.pack.gz from https://download.eclipse.org/eclipse/updates/4.17-I-builds/I20200623-1800/plugins/ (56.99kB)
[INFO] Fetching org.eclipse.ui.ide.application_1.3.800.v20200611-1719.jar.pack.gz from https://download.eclipse.org/eclipse/updates/4.17-I-builds/I20200623-1800/plugins/ (55.69kB)
[INFO] Fetching org.eclipse.ui.navigator.resources_3.7.400.v20200611-1719.jar.pack.gz from https://download.eclipse.org/eclipse/updates/4.17-I-builds/I20200623-1800/plugins/ (70.57kB)
[INFO] Fetching org.eclipse.ui.views.properties.tabbed_3.8.1000.v20200609-0849.jar.pack.gz from https://download.eclipse.org/eclipse/updates/4.17-I-builds/I20200623-1800/plugins/ (40.74kB)
[INFO] Fetching org.hamcrest.core_1.3.0.v20180420-1519.jar.pack.gz from https://download.eclipse.org/eclipse/updates/4.17-I-builds/I20200623-1800/plugins/ (29.18kB)
[INFO] Fetching org.opentest4j_1.2.0.v20190826-0900.jar.pack.gz from https://download.eclipse.org/eclipse/updates/4.17-I-builds/I20200623-1800/plugins/ (14.79kB)
[INFO] Fetching org.junit.platform.commons_1.6.0.v20200203-2009.jar.pack.gz from https://download.eclipse.org/eclipse/updates/4.17-I-builds/I20200623-1800/plugins/ (50.23kB)
[INFO] Resolving class path of MavenProject: org.eclipse.debug:org.eclipse.debug.tests:3.11.800-SNAPSHOT @ /home/jenkins/agent/workspace/eclipse.platform.debug-SonarQube/org.eclipse.debug.tests/pom.xml
[INFO] Computing target platform for MavenProject: org.eclipse.debug:org.eclipse.debug.ui:3.14.600-SNAPSHOT @ /home/jenkins/agent/workspace/eclipse.platform.debug-SonarQube/org.eclipse.debug.ui/pom.xml
[INFO] Resolving dependencies of MavenProject: org.eclipse.debug:org.eclipse.debug.ui:3.14.600-SNAPSHOT @ /home/jenkins/agent/workspace/eclipse.platform.debug-SonarQube/org.eclipse.debug.ui/pom.xml
[INFO] Fetching org.eclipse.ui.genericeditor_1.1.700.v20200211-1227.jar.pack.gz from https://download.eclipse.org/eclipse/updates/4.17-I-builds/I20200623-1800/plugins/ (49.3kB)
[INFO] Resolving class path of MavenProject: org.eclipse.debug:org.eclipse.debug.ui:3.14.600-SNAPSHOT @ /home/jenkins/agent/workspace/eclipse.platform.debug-SonarQube/org.eclipse.debug.ui/pom.xml
[INFO] Computing target platform for MavenProject: org.eclipse.ui:org.eclipse.ui.console:3.9.300-SNAPSHOT @ /home/jenkins/agent/workspace/eclipse.platform.debug-SonarQube/org.eclipse.ui.console/pom.xml
[INFO] Resolving dependencies of MavenProject: org.eclipse.ui:org.eclipse.ui.console:3.9.300-SNAPSHOT @ /home/jenkins/agent/workspace/eclipse.platform.debug-SonarQube/org.eclipse.ui.console/pom.xml
[INFO] Resolving class path of MavenProject: org.eclipse.ui:org.eclipse.ui.console:3.9.300-SNAPSHOT @ /home/jenkins/agent/workspace/eclipse.platform.debug-SonarQube/org.eclipse.ui.console/pom.xml
[INFO] Computing target platform for MavenProject: org.eclipse.ui:org.eclipse.ui.externaltools:3.4.800-SNAPSHOT @ /home/jenkins/agent/workspace/eclipse.platform.debug-SonarQube/org.eclipse.ui.externaltools/pom.xml
[INFO] Resolving dependencies of MavenProject: org.eclipse.ui:org.eclipse.ui.externaltools:3.4.800-SNAPSHOT @ /home/jenkins/agent/workspace/eclipse.platform.debug-SonarQube/org.eclipse.ui.externaltools/pom.xml
[INFO] Resolving class path of MavenProject: org.eclipse.ui:org.eclipse.ui.externaltools:3.4.800-SNAPSHOT @ /home/jenkins/agent/workspace/eclipse.platform.debug-SonarQube/org.eclipse.ui.externaltools/pom.xml
[INFO] ------------------------------------------------------------------------
[INFO] Reactor Build Order:
[INFO] 
[INFO] eclipse.platform.debug                                             [pom]
[INFO] org.eclipse.core.variables                              [eclipse-plugin]
[INFO] org.eclipse.debug.core                                  [eclipse-plugin]
[INFO] org.eclipse.core.externaltools                          [eclipse-plugin]
[INFO] org.eclipse.debug.examples.core                         [eclipse-plugin]
[INFO] org.eclipse.ui.console                                  [eclipse-plugin]
[INFO] org.eclipse.debug.ui                                    [eclipse-plugin]
[INFO] org.eclipse.debug.examples.memory                       [eclipse-plugin]
[INFO] org.eclipse.debug.examples.mixedmode                    [eclipse-plugin]
[INFO] org.eclipse.debug.examples.ui                           [eclipse-plugin]
[INFO] org.eclipse.ui.externaltools                            [eclipse-plugin]
[INFO] org.eclipse.debug.tests                            [eclipse-test-plugin]
[INFO] 
[INFO] -----------< eclipse.platform.debug:eclipse.platform.debug >------------
[INFO] Building eclipse.platform.debug 4.17.0-SNAPSHOT                   [1/12]
[INFO] --------------------------------[ pom ]---------------------------------
[WARNING] The following dependencies could not be resolved at this point of the build but seem to be part of the reactor:
[WARNING] o org.eclipse.core:org.eclipse.core.variables:jar:3.4.800-SNAPSHOT (provided)
[WARNING] Try running the build up to the lifecycle phase "package"
[WARNING] The following dependencies could not be resolved at this point of the build but seem to be part of the reactor:
[WARNING] o org.eclipse.debug:org.eclipse.debug.core:jar:3.16.0-SNAPSHOT (provided)
[WARNING] o org.eclipse.core:org.eclipse.core.variables:jar:3.4.800-SNAPSHOT (provided)
[WARNING] Try running the build up to the lifecycle phase "package"
[WARNING] The following dependencies could not be resolved at this point of the build but seem to be part of the reactor:
[WARNING] o org.eclipse.core:org.eclipse.core.variables:jar:3.4.800-SNAPSHOT (provided)
[WARNING] o org.eclipse.debug:org.eclipse.debug.core:jar:3.16.0-SNAPSHOT (provided)
[WARNING] Try running the build up to the lifecycle phase "package"
[WARNING] The following dependencies could not be resolved at this point of the build but seem to be part of the reactor:
[WARNING] o org.eclipse.core:org.eclipse.core.variables:jar:3.4.800-SNAPSHOT (provided)
[WARNING] o org.eclipse.debug:org.eclipse.debug.core:jar:3.16.0-SNAPSHOT (provided)
[WARNING] Try running the build up to the lifecycle phase "package"
[WARNING] The following dependencies could not be resolved at this point of the build but seem to be part of the reactor:
[WARNING] o org.eclipse.core:org.eclipse.core.variables:jar:3.4.800-SNAPSHOT (provided)
[WARNING] o org.eclipse.debug:org.eclipse.debug.core:jar:3.16.0-SNAPSHOT (provided)
[WARNING] o org.eclipse.ui:org.eclipse.ui.console:jar:3.9.300-SNAPSHOT (provided)
[WARNING] Try running the build up to the lifecycle phase "package"
[WARNING] The following dependencies could not be resolved at this point of the build but seem to be part of the reactor:
[WARNING] o org.eclipse.core:org.eclipse.core.variables:jar:3.4.800-SNAPSHOT (provided)
[WARNING] o org.eclipse.debug:org.eclipse.debug.core:jar:3.16.0-SNAPSHOT (provided)
[WARNING] o org.eclipse.debug:org.eclipse.debug.ui:jar:3.14.600-SNAPSHOT (provided)
[WARNING] o org.eclipse.ui:org.eclipse.ui.console:jar:3.9.300-SNAPSHOT (provided)
[WARNING] Try running the build up to the lifecycle phase "package"
[WARNING] The following dependencies could not be resolved at this point of the build but seem to be part of the reactor:
[WARNING] o org.eclipse.core:org.eclipse.core.variables:jar:3.4.800-SNAPSHOT (provided)
[WARNING] o org.eclipse.debug:org.eclipse.debug.core:jar:3.16.0-SNAPSHOT (provided)
[WARNING] o org.eclipse.debug:org.eclipse.debug.ui:jar:3.14.600-SNAPSHOT (provided)
[WARNING] o org.eclipse.ui:org.eclipse.ui.console:jar:3.9.300-SNAPSHOT (provided)
[WARNING] Try running the build up to the lifecycle phase "package"
[WARNING] The following dependencies could not be resolved at this point of the build but seem to be part of the reactor:
[WARNING] o org.eclipse.core:org.eclipse.core.variables:jar:3.4.800-SNAPSHOT (provided)
[WARNING] o org.eclipse.debug:org.eclipse.debug.core:jar:3.16.0-SNAPSHOT (provided)
[WARNING] o org.eclipse.debug:org.eclipse.debug.examples.core:jar:1.4.800-SNAPSHOT (provided)
[WARNING] o org.eclipse.debug:org.eclipse.debug.ui:jar:3.14.600-SNAPSHOT (provided)
[WARNING] o org.eclipse.ui:org.eclipse.ui.console:jar:3.9.300-SNAPSHOT (provided)
[WARNING] Try running the build up to the lifecycle phase "package"
[WARNING] The following dependencies could not be resolved at this point of the build but seem to be part of the reactor:
[WARNING] o org.eclipse.core:org.eclipse.core.externaltools:jar:1.1.700-SNAPSHOT (provided)
[WARNING] o org.eclipse.debug:org.eclipse.debug.core:jar:3.16.0-SNAPSHOT (provided)
[WARNING] o org.eclipse.core:org.eclipse.core.variables:jar:3.4.800-SNAPSHOT (provided)
[WARNING] o org.eclipse.debug:org.eclipse.debug.ui:jar:3.14.600-SNAPSHOT (provided)
[WARNING] o org.eclipse.ui:org.eclipse.ui.console:jar:3.9.300-SNAPSHOT (provided)
[WARNING] Try running the build up to the lifecycle phase "package"
[WARNING] The following dependencies could not be resolved at this point of the build but seem to be part of the reactor:
[WARNING] o org.eclipse.core:org.eclipse.core.externaltools:jar:1.1.700-SNAPSHOT (provided)
[WARNING] o org.eclipse.debug:org.eclipse.debug.core:jar:3.16.0-SNAPSHOT (provided)
[WARNING] o org.eclipse.core:org.eclipse.core.variables:jar:3.4.800-SNAPSHOT (provided)
[WARNING] o org.eclipse.debug:org.eclipse.debug.ui:jar:3.14.600-SNAPSHOT (provided)
[WARNING] o org.eclipse.ui:org.eclipse.ui.externaltools:jar:3.4.800-SNAPSHOT (provided)
[WARNING] o org.eclipse.ui:org.eclipse.ui.console:jar:3.9.300-SNAPSHOT (provided)
[WARNING] Try running the build up to the lifecycle phase "package"
[INFO] 
[INFO] --- sonar-maven-plugin:3.3.0.603:sonar (default-cli) @ eclipse.platform.debug ---
[INFO] User cache: /home/jenkins/.sonar/cache
[INFO] SonarQube version: 4.5.7
[INFO] Default locale: "en_US", source code encoding: "UTF-8"
20:37:37.466 INFO  - Load global referentials...
20:37:37.551 INFO  - Load global referentials done: 86 ms
20:37:37.578 INFO  - User cache: /home/jenkins/.sonar/cache
20:37:37.582 INFO  - Install plugins
20:37:37.586 INFO  - Download sonar-core-plugin-4.5.7.jar
20:37:37.599 INFO  - Download sonar-email-notifications-plugin-4.5.7.jar
20:37:37.617 INFO  - Download sonar-findbugs-plugin-3.3.jar
20:37:37.800 INFO  - Download sonar-java-plugin-3.9.jar
20:37:37.876 INFO  - Download sonar-ldap-plugin-1.4.jar
20:37:37.891 INFO  - Download sonar-pmd-plugin-2.6.jar
20:37:38.016 INFO  - Download sonar-cpd-plugin-4.5.7.jar
20:37:38.025 INFO  - Download sonar-dbcleaner-plugin-4.5.7.jar
20:37:38.028 INFO  - Download sonar-design-plugin-4.5.7.jar
20:37:38.031 INFO  - Download sonar-l10n-en-plugin-4.5.7.jar
20:37:38.033 INFO  - Download sonar-checkstyle-plugin-2.3.jar
20:37:38.100 INFO  - Install JDBC driver
20:37:38.102 INFO  - Download mysql-connector-java-5.1.27.jar
20:37:38.134 INFO  - Create JDBC datasource for jdbc:mysql://dbmaster:3306/sonar?autoReconnect=true&useUnicode=true&characterEncoding=utf8
[INFO] ------------------------------------------------------------------------
[INFO] Reactor Summary:
[INFO] 
[INFO] eclipse.platform.debug 4.17.0-SNAPSHOT ............. FAILURE [ 10.055 s]
[INFO] org.eclipse.core.variables 3.4.800-SNAPSHOT ........ SKIPPED
[INFO] org.eclipse.debug.core 3.16.0-SNAPSHOT ............. SKIPPED
[INFO] org.eclipse.core.externaltools 1.1.700-SNAPSHOT .... SKIPPED
[INFO] org.eclipse.debug.examples.core 1.4.800-SNAPSHOT ... SKIPPED
[INFO] org.eclipse.ui.console 3.9.300-SNAPSHOT ............ SKIPPED
[INFO] org.eclipse.debug.ui 3.14.600-SNAPSHOT ............. SKIPPED
[INFO] org.eclipse.debug.examples.memory 1.102.200-SNAPSHOT SKIPPED
[INFO] org.eclipse.debug.examples.mixedmode 1.2.0-SNAPSHOT  SKIPPED
[INFO] org.eclipse.debug.examples.ui 1.6.400-SNAPSHOT ..... SKIPPED
[INFO] org.eclipse.ui.externaltools 3.4.800-SNAPSHOT ...... SKIPPED
[INFO] org.eclipse.debug.tests 3.11.800-SNAPSHOT .......... SKIPPED
[INFO] ------------------------------------------------------------------------
[INFO] BUILD FAILURE
[INFO] ------------------------------------------------------------------------
[INFO] Total time:  01:12 min
[INFO] Finished at: 2020-06-28T20:37:42Z
[INFO] ------------------------------------------------------------------------
[ERROR] Failed to execute goal org.sonarsource.scanner.maven:sonar-maven-plugin:3.3.0.603:sonar (default-cli) on project eclipse.platform.debug: Fail to connect to database: Cannot create PoolableConnectionFactory (Could not create connection to database server. Attempted reconnect 3 times. Giving up.): Unknown database 'sonar' -> [Help 1]
org.apache.maven.lifecycle.LifecycleExecutionException: Failed to execute goal org.sonarsource.scanner.maven:sonar-maven-plugin:3.3.0.603:sonar (default-cli) on project eclipse.platform.debug: Fail to connect to database
    at org.apache.maven.lifecycle.internal.MojoExecutor.execute (MojoExecutor.java:215)
    at org.apache.maven.lifecycle.internal.MojoExecutor.execute (MojoExecutor.java:156)
    at org.apache.maven.lifecycle.internal.MojoExecutor.execute (MojoExecutor.java:148)
    at org.apache.maven.lifecycle.internal.LifecycleModuleBuilder.buildProject (LifecycleModuleBuilder.java:117)
    at org.apache.maven.lifecycle.internal.LifecycleModuleBuilder.buildProject (LifecycleModuleBuilder.java:81)
    at org.apache.maven.lifecycle.internal.builder.singlethreaded.SingleThreadedBuilder.build (SingleThreadedBuilder.java:56)
    at org.apache.maven.lifecycle.internal.LifecycleStarter.execute (LifecycleStarter.java:128)
    at org.apache.maven.DefaultMaven.doExecute (DefaultMaven.java:305)
    at org.apache.maven.DefaultMaven.doExecute (DefaultMaven.java:192)
    at org.apache.maven.DefaultMaven.execute (DefaultMaven.java:105)
    at org.apache.maven.cli.MavenCli.execute (MavenCli.java:957)
    at org.apache.maven.cli.MavenCli.doMain (MavenCli.java:289)
    at org.apache.maven.cli.MavenCli.main (MavenCli.java:193)
    at sun.reflect.NativeMethodAccessorImpl.invoke0 (Native Method)
    at sun.reflect.NativeMethodAccessorImpl.invoke (NativeMethodAccessorImpl.java:62)
    at sun.reflect.DelegatingMethodAccessorImpl.invoke (DelegatingMethodAccessorImpl.java:43)
    at java.lang.reflect.Method.invoke (Method.java:498)
    at org.codehaus.plexus.classworlds.launcher.Launcher.launchEnhanced (Launcher.java:282)
    at org.codehaus.plexus.classworlds.launcher.Launcher.launch (Launcher.java:225)
    at org.codehaus.plexus.classworlds.launcher.Launcher.mainWithExitCode (Launcher.java:406)
    at org.codehaus.plexus.classworlds.launcher.Launcher.main (Launcher.java:347)
Caused by: org.apache.maven.plugin.MojoExecutionException: Fail to connect to database
    at org.sonarsource.scanner.maven.bootstrap.ExceptionHandling.handle (ExceptionHandling.java:36)
    at org.sonarsource.scanner.maven.bootstrap.ScannerBootstrapper.execute (ScannerBootstrapper.java:80)
    at org.sonarsource.scanner.maven.SonarQubeMojo.execute (SonarQubeMojo.java:139)
    at org.apache.maven.plugin.DefaultBuildPluginManager.executeMojo (DefaultBuildPluginManager.java:137)
    at org.apache.maven.lifecycle.internal.MojoExecutor.execute (MojoExecutor.java:210)
    at org.apache.maven.lifecycle.internal.MojoExecutor.execute (MojoExecutor.java:156)
    at org.apache.maven.lifecycle.internal.MojoExecutor.execute (MojoExecutor.java:148)
    at org.apache.maven.lifecycle.internal.LifecycleModuleBuilder.buildProject (LifecycleModuleBuilder.java:117)
    at org.apache.maven.lifecycle.internal.LifecycleModuleBuilder.buildProject (LifecycleModuleBuilder.java:81)
    at org.apache.maven.lifecycle.internal.builder.singlethreaded.SingleThreadedBuilder.build (SingleThreadedBuilder.java:56)
    at org.apache.maven.lifecycle.internal.LifecycleStarter.execute (LifecycleStarter.java:128)
    at org.apache.maven.DefaultMaven.doExecute (DefaultMaven.java:305)
    at org.apache.maven.DefaultMaven.doExecute (DefaultMaven.java:192)
    at org.apache.maven.DefaultMaven.execute (DefaultMaven.java:105)
    at org.apache.maven.cli.MavenCli.execute (MavenCli.java:957)
    at org.apache.maven.cli.MavenCli.doMain (MavenCli.java:289)
    at org.apache.maven.cli.MavenCli.main (MavenCli.java:193)
    at sun.reflect.NativeMethodAccessorImpl.invoke0 (Native Method)
    at sun.reflect.NativeMethodAccessorImpl.invoke (NativeMethodAccessorImpl.java:62)
    at sun.reflect.DelegatingMethodAccessorImpl.invoke (DelegatingMethodAccessorImpl.java:43)
    at java.lang.reflect.Method.invoke (Method.java:498)
    at org.codehaus.plexus.classworlds.launcher.Launcher.launchEnhanced (Launcher.java:282)
    at org.codehaus.plexus.classworlds.launcher.Launcher.launch (Launcher.java:225)
    at org.codehaus.plexus.classworlds.launcher.Launcher.mainWithExitCode (Launcher.java:406)
    at org.codehaus.plexus.classworlds.launcher.Launcher.main (Launcher.java:347)
Caused by: java.lang.IllegalStateException: Fail to connect to database
    at org.sonar.core.persistence.DefaultDatabase.start (DefaultDatabase.java:77)
    at sun.reflect.NativeMethodAccessorImpl.invoke0 (Native Method)
    at sun.reflect.NativeMethodAccessorImpl.invoke (NativeMethodAccessorImpl.java:62)
    at sun.reflect.DelegatingMethodAccessorImpl.invoke (DelegatingMethodAccessorImpl.java:43)
    at java.lang.reflect.Method.invoke (Method.java:498)
    at org.picocontainer.lifecycle.ReflectionLifecycleStrategy.invokeMethod (ReflectionLifecycleStrategy.java:110)
    at org.picocontainer.lifecycle.ReflectionLifecycleStrategy.start (ReflectionLifecycleStrategy.java:89)
    at org.picocontainer.injectors.AbstractInjectionFactory$LifecycleAdapter.start (AbstractInjectionFactory.java:84)
    at org.picocontainer.behaviors.AbstractBehavior.start (AbstractBehavior.java:169)
    at org.picocontainer.behaviors.Stored$RealComponentLifecycle.start (Stored.java:132)
    at org.picocontainer.behaviors.Stored.start (Stored.java:110)
    at org.picocontainer.DefaultPicoContainer.potentiallyStartAdapter (DefaultPicoContainer.java:1015)
    at org.picocontainer.DefaultPicoContainer.startAdapters (DefaultPicoContainer.java:1008)
    at org.picocontainer.DefaultPicoContainer.start (DefaultPicoContainer.java:766)
    at org.sonar.api.platform.ComponentContainer.startComponents (ComponentContainer.java:92)
    at org.sonar.batch.bootstrapper.Batch.start (Batch.java:81)
    at org.sonar.batch.bootstrapper.Batch.execute (Batch.java:67)
    at org.sonarsource.scanner.api.internal.batch.BatchIsolatedLauncher.executeOldVersion (BatchIsolatedLauncher.java:71)
    at sun.reflect.NativeMethodAccessorImpl.invoke0 (Native Method)
    at sun.reflect.NativeMethodAccessorImpl.invoke (NativeMethodAccessorImpl.java:62)
    at sun.reflect.DelegatingMethodAccessorImpl.invoke (DelegatingMethodAccessorImpl.java:43)
    at java.lang.reflect.Method.invoke (Method.java:498)
    at org.sonarsource.scanner.api.internal.IsolatedLauncherProxy.invoke (IsolatedLauncherProxy.java:60)
    at com.sun.proxy.$Proxy25.executeOldVersion (Unknown Source)
    at org.sonarsource.scanner.api.EmbeddedScanner.doExecute (EmbeddedScanner.java:238)
    at org.sonarsource.scanner.api.EmbeddedScanner.runAnalysis (EmbeddedScanner.java:151)
    at org.sonarsource.scanner.maven.bootstrap.ScannerBootstrapper.execute (ScannerBootstrapper.java:77)
    at org.sonarsource.scanner.maven.SonarQubeMojo.execute (SonarQubeMojo.java:139)
    at org.apache.maven.plugin.DefaultBuildPluginManager.executeMojo (DefaultBuildPluginManager.java:137)
    at org.apache.maven.lifecycle.internal.MojoExecutor.execute (MojoExecutor.java:210)
    at org.apache.maven.lifecycle.internal.MojoExecutor.execute (MojoExecutor.java:156)
    at org.apache.maven.lifecycle.internal.MojoExecutor.execute (MojoExecutor.java:148)
    at org.apache.maven.lifecycle.internal.LifecycleModuleBuilder.buildProject (LifecycleModuleBuilder.java:117)
    at org.apache.maven.lifecycle.internal.LifecycleModuleBuilder.buildProject (LifecycleModuleBuilder.java:81)
    at org.apache.maven.lifecycle.internal.builder.singlethreaded.SingleThreadedBuilder.build (SingleThreadedBuilder.java:56)
    at org.apache.maven.lifecycle.internal.LifecycleStarter.execute (LifecycleStarter.java:128)
    at org.apache.maven.DefaultMaven.doExecute (DefaultMaven.java:305)
    at org.apache.maven.DefaultMaven.doExecute (DefaultMaven.java:192)
    at org.apache.maven.DefaultMaven.execute (DefaultMaven.java:105)
    at org.apache.maven.cli.MavenCli.execute (MavenCli.java:957)
    at org.apache.maven.cli.MavenCli.doMain (MavenCli.java:289)
    at org.apache.maven.cli.MavenCli.main (MavenCli.java:193)
    at sun.reflect.NativeMethodAccessorImpl.invoke0 (Native Method)
    at sun.reflect.NativeMethodAccessorImpl.invoke (NativeMethodAccessorImpl.java:62)
    at sun.reflect.DelegatingMethodAccessorImpl.invoke (DelegatingMethodAccessorImpl.java:43)
    at java.lang.reflect.Method.invoke (Method.java:498)
    at org.codehaus.plexus.classworlds.launcher.Launcher.launchEnhanced (Launcher.java:282)
    at org.codehaus.plexus.classworlds.launcher.Launcher.launch (Launcher.java:225)
    at org.codehaus.plexus.classworlds.launcher.Launcher.mainWithExitCode (Launcher.java:406)
    at org.codehaus.plexus.classworlds.launcher.Launcher.main (Launcher.java:347)
Caused by: org.apache.commons.dbcp.SQLNestedException: Cannot create PoolableConnectionFactory (Could not create connection to database server. Attempted reconnect 3 times. Giving up.)
    at org.apache.commons.dbcp.BasicDataSource.createPoolableConnectionFactory (BasicDataSource.java:1549)
    at org.apache.commons.dbcp.BasicDataSource.createDataSource (BasicDataSource.java:1388)
    at org.apache.commons.dbcp.BasicDataSource.getLogWriter (BasicDataSource.java:1098)
    at org.apache.commons.dbcp.BasicDataSourceFactory.createDataSource (BasicDataSourceFactory.java:350)
    at org.sonar.core.persistence.DefaultDatabase.initDatasource (DefaultDatabase.java:103)
    at org.sonar.core.persistence.DefaultDatabase.start (DefaultDatabase.java:72)
    at sun.reflect.NativeMethodAccessorImpl.invoke0 (Native Method)
    at sun.reflect.NativeMethodAccessorImpl.invoke (NativeMethodAccessorImpl.java:62)
    at sun.reflect.DelegatingMethodAccessorImpl.invoke (DelegatingMethodAccessorImpl.java:43)
    at java.lang.reflect.Method.invoke (Method.java:498)
    at org.picocontainer.lifecycle.ReflectionLifecycleStrategy.invokeMethod (ReflectionLifecycleStrategy.java:110)
    at org.picocontainer.lifecycle.ReflectionLifecycleStrategy.start (ReflectionLifecycleStrategy.java:89)
    at org.picocontainer.injectors.AbstractInjectionFactory$LifecycleAdapter.start (AbstractInjectionFactory.java:84)
    at org.picocontainer.behaviors.AbstractBehavior.start (AbstractBehavior.java:169)
    at org.picocontainer.behaviors.Stored$RealComponentLifecycle.start (Stored.java:132)
    at org.picocontainer.behaviors.Stored.start (Stored.java:110)
    at org.picocontainer.DefaultPicoContainer.potentiallyStartAdapter (DefaultPicoContainer.java:1015)
    at org.picocontainer.DefaultPicoContainer.startAdapters (DefaultPicoContainer.java:1008)
    at org.picocontainer.DefaultPicoContainer.start (DefaultPicoContainer.java:766)
    at org.sonar.api.platform.ComponentContainer.startComponents (ComponentContainer.java:92)
    at org.sonar.batch.bootstrapper.Batch.start (Batch.java:81)
    at org.sonar.batch.bootstrapper.Batch.execute (Batch.java:67)
    at org.sonarsource.scanner.api.internal.batch.BatchIsolatedLauncher.executeOldVersion (BatchIsolatedLauncher.java:71)
    at sun.reflect.NativeMethodAccessorImpl.invoke0 (Native Method)
    at sun.reflect.NativeMethodAccessorImpl.invoke (NativeMethodAccessorImpl.java:62)
    at sun.reflect.DelegatingMethodAccessorImpl.invoke (DelegatingMethodAccessorImpl.java:43)
    at java.lang.reflect.Method.invoke (Method.java:498)
    at org.sonarsource.scanner.api.internal.IsolatedLauncherProxy.invoke (IsolatedLauncherProxy.java:60)
    at com.sun.proxy.$Proxy25.executeOldVersion (Unknown Source)
    at org.sonarsource.scanner.api.EmbeddedScanner.doExecute (EmbeddedScanner.java:238)
    at org.sonarsource.scanner.api.EmbeddedScanner.runAnalysis (EmbeddedScanner.java:151)
    at org.sonarsource.scanner.maven.bootstrap.ScannerBootstrapper.execute (ScannerBootstrapper.java:77)
    at org.sonarsource.scanner.maven.SonarQubeMojo.execute (SonarQubeMojo.java:139)
    at org.apache.maven.plugin.DefaultBuildPluginManager.executeMojo (DefaultBuildPluginManager.java:137)
    at org.apache.maven.lifecycle.internal.MojoExecutor.execute (MojoExecutor.java:210)
    at org.apache.maven.lifecycle.internal.MojoExecutor.execute (MojoExecutor.java:156)
    at org.apache.maven.lifecycle.internal.MojoExecutor.execute (MojoExecutor.java:148)
    at org.apache.maven.lifecycle.internal.LifecycleModuleBuilder.buildProject (LifecycleModuleBuilder.java:117)
    at org.apache.maven.lifecycle.internal.LifecycleModuleBuilder.buildProject (LifecycleModuleBuilder.java:81)
    at org.apache.maven.lifecycle.internal.builder.singlethreaded.SingleThreadedBuilder.build (SingleThreadedBuilder.java:56)
    at org.apache.maven.lifecycle.internal.LifecycleStarter.execute (LifecycleStarter.java:128)
    at org.apache.maven.DefaultMaven.doExecute (DefaultMaven.java:305)
    at org.apache.maven.DefaultMaven.doExecute (DefaultMaven.java:192)
    at org.apache.maven.DefaultMaven.execute (DefaultMaven.java:105)
    at org.apache.maven.cli.MavenCli.execute (MavenCli.java:957)
    at org.apache.maven.cli.MavenCli.doMain (MavenCli.java:289)
    at org.apache.maven.cli.MavenCli.main (MavenCli.java:193)
    at sun.reflect.NativeMethodAccessorImpl.invoke0 (Native Method)
    at sun.reflect.NativeMethodAccessorImpl.invoke (NativeMethodAccessorImpl.java:62)
    at sun.reflect.DelegatingMethodAccessorImpl.invoke (DelegatingMethodAccessorImpl.java:43)
    at java.lang.reflect.Method.invoke (Method.java:498)
    at org.codehaus.plexus.classworlds.launcher.Launcher.launchEnhanced (Launcher.java:282)
    at org.codehaus.plexus.classworlds.launcher.Launcher.launch (Launcher.java:225)
    at org.codehaus.plexus.classworlds.launcher.Launcher.mainWithExitCode (Launcher.java:406)
    at org.codehaus.plexus.classworlds.launcher.Launcher.main (Launcher.java:347)
Caused by: com.mysql.jdbc.exceptions.jdbc4.MySQLNonTransientConnectionException: Could not create connection to database server. Attempted reconnect 3 times. Giving up.
    at sun.reflect.NativeConstructorAccessorImpl.newInstance0 (Native Method)
    at sun.reflect.NativeConstructorAccessorImpl.newInstance (NativeConstructorAccessorImpl.java:62)
    at sun.reflect.DelegatingConstructorAccessorImpl.newInstance (DelegatingConstructorAccessorImpl.java:45)
    at java.lang.reflect.Constructor.newInstance (Constructor.java:423)
    at com.mysql.jdbc.Util.handleNewInstance (Util.java:411)
    at com.mysql.jdbc.Util.getInstance (Util.java:386)
    at com.mysql.jdbc.SQLError.createSQLException (SQLError.java:1015)
    at com.mysql.jdbc.SQLError.createSQLException (SQLError.java:989)
    at com.mysql.jdbc.SQLError.createSQLException (SQLError.java:975)
    at com.mysql.jdbc.SQLError.createSQLException (SQLError.java:920)
    at com.mysql.jdbc.ConnectionImpl.connectWithRetries (ConnectionImpl.java:2395)
    at com.mysql.jdbc.ConnectionImpl.createNewIO (ConnectionImpl.java:2316)
    at com.mysql.jdbc.ConnectionImpl.<init> (ConnectionImpl.java:834)
    at com.mysql.jdbc.JDBC4Connection.<init> (JDBC4Connection.java:47)
    at sun.reflect.NativeConstructorAccessorImpl.newInstance0 (Native Method)
    at sun.reflect.NativeConstructorAccessorImpl.newInstance (NativeConstructorAccessorImpl.java:62)
    at sun.reflect.DelegatingConstructorAccessorImpl.newInstance (DelegatingConstructorAccessorImpl.java:45)
    at java.lang.reflect.Constructor.newInstance (Constructor.java:423)
    at com.mysql.jdbc.Util.handleNewInstance (Util.java:411)
    at com.mysql.jdbc.ConnectionImpl.getInstance (ConnectionImpl.java:416)
    at com.mysql.jdbc.NonRegisteringDriver.connect (NonRegisteringDriver.java:347)
    at org.apache.commons.dbcp.DriverConnectionFactory.createConnection (DriverConnectionFactory.java:38)
    at org.apache.commons.dbcp.PoolableConnectionFactory.makeObject (PoolableConnectionFactory.java:582)
    at org.apache.commons.dbcp.BasicDataSource.validateConnectionFactory (BasicDataSource.java:1556)
    at org.apache.commons.dbcp.BasicDataSource.createPoolableConnectionFactory (BasicDataSource.java:1545)
    at org.apache.commons.dbcp.BasicDataSource.createDataSource (BasicDataSource.java:1388)
    at org.apache.commons.dbcp.BasicDataSource.getLogWriter (BasicDataSource.java:1098)
    at org.apache.commons.dbcp.BasicDataSourceFactory.createDataSource (BasicDataSourceFactory.java:350)
    at org.sonar.core.persistence.DefaultDatabase.initDatasource (DefaultDatabase.java:103)
    at org.sonar.core.persistence.DefaultDatabase.start (DefaultDatabase.java:72)
    at sun.reflect.NativeMethodAccessorImpl.invoke0 (Native Method)
    at sun.reflect.NativeMethodAccessorImpl.invoke (NativeMethodAccessorImpl.java:62)
    at sun.reflect.DelegatingMethodAccessorImpl.invoke (DelegatingMethodAccessorImpl.java:43)
    at java.lang.reflect.Method.invoke (Method.java:498)
    at org.picocontainer.lifecycle.ReflectionLifecycleStrategy.invokeMethod (ReflectionLifecycleStrategy.java:110)
    at org.picocontainer.lifecycle.ReflectionLifecycleStrategy.start (ReflectionLifecycleStrategy.java:89)
    at org.picocontainer.injectors.AbstractInjectionFactory$LifecycleAdapter.start (AbstractInjectionFactory.java:84)
    at org.picocontainer.behaviors.AbstractBehavior.start (AbstractBehavior.java:169)
    at org.picocontainer.behaviors.Stored$RealComponentLifecycle.start (Stored.java:132)
    at org.picocontainer.behaviors.Stored.start (Stored.java:110)
    at org.picocontainer.DefaultPicoContainer.potentiallyStartAdapter (DefaultPicoContainer.java:1015)
    at org.picocontainer.DefaultPicoContainer.startAdapters (DefaultPicoContainer.java:1008)
    at org.picocontainer.DefaultPicoContainer.start (DefaultPicoContainer.java:766)
    at org.sonar.api.platform.ComponentContainer.startComponents (ComponentContainer.java:92)
    at org.sonar.batch.bootstrapper.Batch.start (Batch.java:81)
    at org.sonar.batch.bootstrapper.Batch.execute (Batch.java:67)
    at org.sonarsource.scanner.api.internal.batch.BatchIsolatedLauncher.executeOldVersion (BatchIsolatedLauncher.java:71)
    at sun.reflect.NativeMethodAccessorImpl.invoke0 (Native Method)
    at sun.reflect.NativeMethodAccessorImpl.invoke (NativeMethodAccessorImpl.java:62)
    at sun.reflect.DelegatingMethodAccessorImpl.invoke (DelegatingMethodAccessorImpl.java:43)
    at java.lang.reflect.Method.invoke (Method.java:498)
    at org.sonarsource.scanner.api.internal.IsolatedLauncherProxy.invoke (IsolatedLauncherProxy.java:60)
    at com.sun.proxy.$Proxy25.executeOldVersion (Unknown Source)
    at org.sonarsource.scanner.api.EmbeddedScanner.doExecute (EmbeddedScanner.java:238)
    at org.sonarsource.scanner.api.EmbeddedScanner.runAnalysis (EmbeddedScanner.java:151)
    at org.sonarsource.scanner.maven.bootstrap.ScannerBootstrapper.execute (ScannerBootstrapper.java:77)
    at org.sonarsource.scanner.maven.SonarQubeMojo.execute (SonarQubeMojo.java:139)
    at org.apache.maven.plugin.DefaultBuildPluginManager.executeMojo (DefaultBuildPluginManager.java:137)
    at org.apache.maven.lifecycle.internal.MojoExecutor.execute (MojoExecutor.java:210)
    at org.apache.maven.lifecycle.internal.MojoExecutor.execute (MojoExecutor.java:156)
    at org.apache.maven.lifecycle.internal.MojoExecutor.execute (MojoExecutor.java:148)
    at org.apache.maven.lifecycle.internal.LifecycleModuleBuilder.buildProject (LifecycleModuleBuilder.java:117)
    at org.apache.maven.lifecycle.internal.LifecycleModuleBuilder.buildProject (LifecycleModuleBuilder.java:81)
    at org.apache.maven.lifecycle.internal.builder.singlethreaded.SingleThreadedBuilder.build (SingleThreadedBuilder.java:56)
    at org.apache.maven.lifecycle.internal.LifecycleStarter.execute (LifecycleStarter.java:128)
    at org.apache.maven.DefaultMaven.doExecute (DefaultMaven.java:305)
    at org.apache.maven.DefaultMaven.doExecute (DefaultMaven.java:192)
    at org.apache.maven.DefaultMaven.execute (DefaultMaven.java:105)
    at org.apache.maven.cli.MavenCli.execute (MavenCli.java:957)
    at org.apache.maven.cli.MavenCli.doMain (MavenCli.java:289)
    at org.apache.maven.cli.MavenCli.main (MavenCli.java:193)
    at sun.reflect.NativeMethodAccessorImpl.invoke0 (Native Method)
    at sun.reflect.NativeMethodAccessorImpl.invoke (NativeMethodAccessorImpl.java:62)
    at sun.reflect.DelegatingMethodAccessorImpl.invoke (DelegatingMethodAccessorImpl.java:43)
    at java.lang.reflect.Method.invoke (Method.java:498)
    at org.codehaus.plexus.classworlds.launcher.Launcher.launchEnhanced (Launcher.java:282)
    at org.codehaus.plexus.classworlds.launcher.Launcher.launch (Launcher.java:225)
    at org.codehaus.plexus.classworlds.launcher.Launcher.mainWithExitCode (Launcher.java:406)
    at org.codehaus.plexus.classworlds.launcher.Launcher.main (Launcher.java:347)
Caused by: com.mysql.jdbc.exceptions.jdbc4.MySQLSyntaxErrorException: Unknown database 'sonar'
    at sun.reflect.NativeConstructorAccessorImpl.newInstance0 (Native Method)
    at sun.reflect.NativeConstructorAccessorImpl.newInstance (NativeConstructorAccessorImpl.java:62)
    at sun.reflect.DelegatingConstructorAccessorImpl.newInstance (DelegatingConstructorAccessorImpl.java:45)
    at java.lang.reflect.Constructor.newInstance (Constructor.java:423)
    at com.mysql.jdbc.Util.handleNewInstance (Util.java:411)
    at com.mysql.jdbc.Util.getInstance (Util.java:386)
    at com.mysql.jdbc.SQLError.createSQLException (SQLError.java:1054)
    at com.mysql.jdbc.MysqlIO.checkErrorPacket (MysqlIO.java:4237)
    at com.mysql.jdbc.MysqlIO.checkErrorPacket (MysqlIO.java:4169)
    at com.mysql.jdbc.MysqlIO.checkErrorPacket (MysqlIO.java:928)
    at com.mysql.jdbc.MysqlIO.proceedHandshakeWithPluggableAuthentication (MysqlIO.java:1750)
    at com.mysql.jdbc.MysqlIO.doHandshake (MysqlIO.java:1290)
    at com.mysql.jdbc.ConnectionImpl.coreConnect (ConnectionImpl.java:2493)
    at com.mysql.jdbc.ConnectionImpl.connectWithRetries (ConnectionImpl.java:2334)
    at com.mysql.jdbc.ConnectionImpl.createNewIO (ConnectionImpl.java:2316)
    at com.mysql.jdbc.ConnectionImpl.<init> (ConnectionImpl.java:834)
    at com.mysql.jdbc.JDBC4Connection.<init> (JDBC4Connection.java:47)
    at sun.reflect.NativeConstructorAccessorImpl.newInstance0 (Native Method)
    at sun.reflect.NativeConstructorAccessorImpl.newInstance (NativeConstructorAccessorImpl.java:62)
    at sun.reflect.DelegatingConstructorAccessorImpl.newInstance (DelegatingConstructorAccessorImpl.java:45)
    at java.lang.reflect.Constructor.newInstance (Constructor.java:423)
    at com.mysql.jdbc.Util.handleNewInstance (Util.java:411)
    at com.mysql.jdbc.ConnectionImpl.getInstance (ConnectionImpl.java:416)
    at com.mysql.jdbc.NonRegisteringDriver.connect (NonRegisteringDriver.java:347)
    at org.apache.commons.dbcp.DriverConnectionFactory.createConnection (DriverConnectionFactory.java:38)
    at org.apache.commons.dbcp.PoolableConnectionFactory.makeObject (PoolableConnectionFactory.java:582)
    at org.apache.commons.dbcp.BasicDataSource.validateConnectionFactory (BasicDataSource.java:1556)
    at org.apache.commons.dbcp.BasicDataSource.createPoolableConnectionFactory (BasicDataSource.java:1545)
    at org.apache.commons.dbcp.BasicDataSource.createDataSource (BasicDataSource.java:1388)
    at org.apache.commons.dbcp.BasicDataSource.getLogWriter (BasicDataSource.java:1098)
    at org.apache.commons.dbcp.BasicDataSourceFactory.createDataSource (BasicDataSourceFactory.java:350)
    at org.sonar.core.persistence.DefaultDatabase.initDatasource (DefaultDatabase.java:103)
    at org.sonar.core.persistence.DefaultDatabase.start (DefaultDatabase.java:72)
    at sun.reflect.NativeMethodAccessorImpl.invoke0 (Native Method)
    at sun.reflect.NativeMethodAccessorImpl.invoke (NativeMethodAccessorImpl.java:62)
    at sun.reflect.DelegatingMethodAccessorImpl.invoke (DelegatingMethodAccessorImpl.java:43)
    at java.lang.reflect.Method.invoke (Method.java:498)
    at org.picocontainer.lifecycle.ReflectionLifecycleStrategy.invokeMethod (ReflectionLifecycleStrategy.java:110)
    at org.picocontainer.lifecycle.ReflectionLifecycleStrategy.start (ReflectionLifecycleStrategy.java:89)
    at org.picocontainer.injectors.AbstractInjectionFactory$LifecycleAdapter.start (AbstractInjectionFactory.java:84)
    at org.picocontainer.behaviors.AbstractBehavior.start (AbstractBehavior.java:169)
    at org.picocontainer.behaviors.Stored$RealComponentLifecycle.start (Stored.java:132)
    at org.picocontainer.behaviors.Stored.start (Stored.java:110)
    at org.picocontainer.DefaultPicoContainer.potentiallyStartAdapter (DefaultPicoContainer.java:1015)
    at org.picocontainer.DefaultPicoContainer.startAdapters (DefaultPicoContainer.java:1008)
    at org.picocontainer.DefaultPicoContainer.start (DefaultPicoContainer.java:766)
    at org.sonar.api.platform.ComponentContainer.startComponents (ComponentContainer.java:92)
    at org.sonar.batch.bootstrapper.Batch.start (Batch.java:81)
    at org.sonar.batch.bootstrapper.Batch.execute (Batch.java:67)
    at org.sonarsource.scanner.api.internal.batch.BatchIsolatedLauncher.executeOldVersion (BatchIsolatedLauncher.java:71)
    at sun.reflect.NativeMethodAccessorImpl.invoke0 (Native Method)
    at sun.reflect.NativeMethodAccessorImpl.invoke (NativeMethodAccessorImpl.java:62)
    at sun.reflect.DelegatingMethodAccessorImpl.invoke (DelegatingMethodAccessorImpl.java:43)
    at java.lang.reflect.Method.invoke (Method.java:498)
    at org.sonarsource.scanner.api.internal.IsolatedLauncherProxy.invoke (IsolatedLauncherProxy.java:60)
    at com.sun.proxy.$Proxy25.executeOldVersion (Unknown Source)
    at org.sonarsource.scanner.api.EmbeddedScanner.doExecute (EmbeddedScanner.java:238)
    at org.sonarsource.scanner.api.EmbeddedScanner.runAnalysis (EmbeddedScanner.java:151)
    at org.sonarsource.scanner.maven.bootstrap.ScannerBootstrapper.execute (ScannerBootstrapper.java:77)
    at org.sonarsource.scanner.maven.SonarQubeMojo.execute (SonarQubeMojo.java:139)
    at org.apache.maven.plugin.DefaultBuildPluginManager.executeMojo (DefaultBuildPluginManager.java:137)
    at org.apache.maven.lifecycle.internal.MojoExecutor.execute (MojoExecutor.java:210)
    at org.apache.maven.lifecycle.internal.MojoExecutor.execute (MojoExecutor.java:156)
    at org.apache.maven.lifecycle.internal.MojoExecutor.execute (MojoExecutor.java:148)
    at org.apache.maven.lifecycle.internal.LifecycleModuleBuilder.buildProject (LifecycleModuleBuilder.java:117)
    at org.apache.maven.lifecycle.internal.LifecycleModuleBuilder.buildProject (LifecycleModuleBuilder.java:81)
    at org.apache.maven.lifecycle.internal.builder.singlethreaded.SingleThreadedBuilder.build (SingleThreadedBuilder.java:56)
    at org.apache.maven.lifecycle.internal.LifecycleStarter.execute (LifecycleStarter.java:128)
    at org.apache.maven.DefaultMaven.doExecute (DefaultMaven.java:305)
    at org.apache.maven.DefaultMaven.doExecute (DefaultMaven.java:192)
    at org.apache.maven.DefaultMaven.execute (DefaultMaven.java:105)
    at org.apache.maven.cli.MavenCli.execute (MavenCli.java:957)
    at org.apache.maven.cli.MavenCli.doMain (MavenCli.java:289)
    at org.apache.maven.cli.MavenCli.main (MavenCli.java:193)
    at sun.reflect.NativeMethodAccessorImpl.invoke0 (Native Method)
    at sun.reflect.NativeMethodAccessorImpl.invoke (NativeMethodAccessorImpl.java:62)
    at sun.reflect.DelegatingMethodAccessorImpl.invoke (DelegatingMethodAccessorImpl.java:43)
    at java.lang.reflect.Method.invoke (Method.java:498)
    at org.codehaus.plexus.classworlds.launcher.Launcher.launchEnhanced (Launcher.java:282)
    at org.codehaus.plexus.classworlds.launcher.Launcher.launch (Launcher.java:225)
    at org.codehaus.plexus.classworlds.launcher.Launcher.mainWithExitCode (Launcher.java:406)
    at org.codehaus.plexus.classworlds.launcher.Launcher.main (Launcher.java:347)
[ERROR] 
[ERROR] Re-run Maven using the -X switch to enable full debug logging.
[ERROR] 
[ERROR] For more information about the errors and possible solutions, please read the following articles:
[ERROR] [Help 1] http://cwiki.apache.org/confluence/display/MAVEN/MojoExecutionException
SonarQube analysis completed: FAILURE
Build step 'SonarQube analysis with Maven' changed build result to FAILURE
Build step 'SonarQube analysis with Maven' marked build as failure
Recording test results
Archiving artifacts
Finished: FAILURE