FailedConsole Output

Skipping 14 KB.. Full Log
rom https://download.eclipse.org/eclipse/updates/4.17-I-builds/I20200609-0150/plugins/ (101.68kB)
[INFO] Fetching org.apache.batik.util_1.11.0.v20190515-0436.jar.pack.gz from https://download.eclipse.org/eclipse/updates/4.17-I-builds/I20200609-0150/plugins/ (63.49kB)
[INFO] Fetching org.apache.batik.i18n_1.11.0.v20190515-0436.jar.pack.gz from https://download.eclipse.org/eclipse/updates/4.17-I-builds/I20200609-0150/plugins/ (14.52kB)
[INFO] Fetching org.apache.xmlgraphics_2.3.0.v20190515-0436.jar.pack.gz from https://download.eclipse.org/eclipse/updates/4.17-I-builds/I20200609-0150/plugins/ (258.72kB)
[INFO] Fetching org.w3c.dom.svg_1.1.0.v201011041433.jar from https://download.eclipse.org/eclipse/updates/4.17-I-builds/I20200609-0150/plugins/ (95.26kB)
[INFO] Fetching org.w3c.dom.events_3.0.0.draft20060413_v201105210656.jar from https://download.eclipse.org/eclipse/updates/4.17-I-builds/I20200609-0150/plugins/ (15.35kB)
[INFO] Fetching org.w3c.css.sac_1.3.1.v200903091627.jar from https://download.eclipse.org/eclipse/updates/4.17-I-builds/I20200609-0150/plugins/ (35.59kB)
[INFO] Fetching org.apache.commons.io_2.6.0.v20190123-2029.jar.pack.gz from https://download.eclipse.org/eclipse/updates/4.17-I-builds/I20200609-0150/plugins/ (82.7kB)
[INFO] Fetching org.apache.commons.logging_1.2.0.v20180409-1502.jar.pack.gz from https://download.eclipse.org/eclipse/updates/4.17-I-builds/I20200609-0150/plugins/ (33.71kB)
[INFO] Fetching org.apache.felix.scr_2.1.16.v20200110-1820.jar.pack.gz from https://download.eclipse.org/eclipse/updates/4.17-I-builds/I20200609-0150/plugins/ (155.55kB)
[INFO] Fetching org.eclipse.osgi.services_3.8.0.v20190206-2147.jar.pack.gz from https://download.eclipse.org/eclipse/updates/4.17-I-builds/I20200609-0150/plugins/ (44.03kB)
[INFO] Fetching org.eclipse.osgi.util_3.5.300.v20190708-1141.jar.pack.gz from https://download.eclipse.org/eclipse/updates/4.17-I-builds/I20200609-0150/plugins/ (30.65kB)
[INFO] Fetching org.eclipse.core.commands_3.9.700.v20191217-1850.jar.pack.gz from https://download.eclipse.org/eclipse/updates/4.17-I-builds/I20200609-0150/plugins/ (43.01kB)
[INFO] Fetching org.eclipse.equinox.common_3.12.0.v20200504-1602.jar.pack.gz from https://download.eclipse.org/eclipse/updates/4.17-I-builds/I20200609-0150/plugins/ (55.07kB)
[INFO] Fetching org.eclipse.core.contenttype_3.7.800.v20200607-1901.jar.pack.gz from https://download.eclipse.org/eclipse/updates/4.17-I-builds/I20200609-0150/plugins/ (41.25kB)
[INFO] Fetching org.eclipse.equinox.preferences_3.8.0.v20200422-1833.jar.pack.gz from https://download.eclipse.org/eclipse/updates/4.17-I-builds/I20200609-0150/plugins/ (55.59kB)
[INFO] Fetching org.eclipse.equinox.registry_3.8.800.v20200406-0956.jar.pack.gz from https://download.eclipse.org/eclipse/updates/4.17-I-builds/I20200609-0150/plugins/ (77.27kB)
[INFO] Fetching org.eclipse.core.databinding_1.9.0.v20200519-1409.jar.pack.gz from https://download.eclipse.org/eclipse/updates/4.17-I-builds/I20200609-0150/plugins/ (56.72kB)
[INFO] Fetching org.eclipse.core.databinding.observable_1.9.0.v20200205-2119.jar.pack.gz from https://download.eclipse.org/eclipse/updates/4.17-I-builds/I20200609-0150/plugins/ (82.47kB)
[INFO] Fetching org.eclipse.core.databinding.property_1.8.0.v20200124-0715.jar.pack.gz from https://download.eclipse.org/eclipse/updates/4.17-I-builds/I20200609-0150/plugins/ (44.98kB)
[INFO] Fetching org.eclipse.core.expressions_3.6.900.v20200607-1452.jar.pack.gz from https://download.eclipse.org/eclipse/updates/4.17-I-builds/I20200609-0150/plugins/ (33.69kB)
[INFO] Fetching org.eclipse.core.runtime_3.19.0.v20200607-1730.jar.pack.gz from https://download.eclipse.org/eclipse/updates/4.17-I-builds/I20200609-0150/plugins/ (33.68kB)
[INFO] Fetching org.eclipse.core.jobs_3.10.800.v20200421-0950.jar.pack.gz from https://download.eclipse.org/eclipse/updates/4.17-I-builds/I20200609-0150/plugins/ (46.11kB)
[INFO] Fetching org.eclipse.equinox.app_1.4.500.v20200422-1833.jar.pack.gz from https://download.eclipse.org/eclipse/updates/4.17-I-builds/I20200609-0150/plugins/ (42.05kB)
[INFO] Fetching org.eclipse.e4.core.commands_0.12.900.v20200110-1732.jar.pack.gz from https://download.eclipse.org/eclipse/updates/4.17-I-builds/I20200609-0150/plugins/ (13.76kB)
[INFO] Fetching org.eclipse.e4.core.di_1.7.600.v20200428-0912.jar.pack.gz from https://download.eclipse.org/eclipse/updates/4.17-I-builds/I20200609-0150/plugins/ (25.88kB)
[INFO] Fetching javax.inject_1.0.0.v20091030.jar from https://download.eclipse.org/eclipse/updates/4.17-I-builds/I20200609-0150/plugins/ (14.07kB)
[INFO] Fetching org.eclipse.e4.core.contexts_1.8.400.v20191217-1710.jar.pack.gz from https://download.eclipse.org/eclipse/updates/4.17-I-builds/I20200609-0150/plugins/ (22.66kB)
[INFO] Fetching org.eclipse.e4.core.services_2.2.300.v20200422-1846.jar.pack.gz from https://download.eclipse.org/eclipse/updates/4.17-I-builds/I20200609-0150/plugins/ (28.06kB)
[INFO] Fetching org.eclipse.e4.core.di.annotations_1.6.600.v20191216-2352.jar.pack.gz from https://download.eclipse.org/eclipse/updates/4.17-I-builds/I20200609-0150/plugins/ (7.68kB)
[INFO] Fetching org.eclipse.e4.core.di.extensions_0.16.0.v20200507-0938.jar.pack.gz from https://download.eclipse.org/eclipse/updates/4.17-I-builds/I20200609-0150/plugins/ (7.72kB)
[INFO] Fetching org.eclipse.e4.core.di.extensions.supplier_0.15.600.v20200311-0642.jar.pack.gz from https://download.eclipse.org/eclipse/updates/4.17-I-builds/I20200609-0150/plugins/ (16.65kB)
[INFO] Fetching org.apache.commons.jxpath_1.3.0.v200911051830.jar.pack.gz from https://download.eclipse.org/eclipse/updates/4.17-I-builds/I20200609-0150/plugins/ (107.16kB)
[INFO] Fetching org.eclipse.emf.ecore_2.22.0.v20200519-1135.jar.pack.gz from https://download.eclipse.org/eclipse/updates/4.17-I-builds/I20200609-0150/plugins/ (487.54kB)
[INFO] Fetching org.eclipse.e4.emf.xpath_0.2.800.v20200609-0849.jar.pack.gz from https://download.eclipse.org/eclipse/updates/4.17-I-builds/I20200609-1800/plugins/ (21.73kB)
[INFO] Fetching org.eclipse.e4.ui.bindings_0.12.900.v20200513-0930.jar.pack.gz from https://download.eclipse.org/eclipse/updates/4.17-I-builds/I20200609-0150/plugins/ (23.02kB)
[INFO] Fetching org.eclipse.e4.ui.services_1.3.700.v20190930-1643.jar.pack.gz from https://download.eclipse.org/eclipse/updates/4.17-I-builds/I20200609-0150/plugins/ (13.16kB)
[INFO] Fetching org.eclipse.jface_3.21.0.v20200610-0841.jar.pack.gz from https://download.eclipse.org/eclipse/updates/4.17-I-builds/I20200610-1800/plugins/ (362.99kB)
[INFO] Fetching org.eclipse.e4.ui.css.core_0.12.1300.v20200608-0809.jar.pack.gz from https://download.eclipse.org/eclipse/updates/4.17-I-builds/I20200609-0150/plugins/ (66.21kB)
[INFO] Fetching org.eclipse.e4.ui.css.swt_0.13.1100.v20200610-1010.jar.pack.gz from https://download.eclipse.org/eclipse/updates/4.17-I-builds/I20200610-1800/plugins/ (65.59kB)
[INFO] Fetching org.eclipse.e4.ui.css.swt.theme_0.12.700.v20200527-0719.jar.pack.gz from https://download.eclipse.org/eclipse/updates/4.17-I-builds/I20200609-0150/plugins/ (16.47kB)
[INFO] Fetching org.eclipse.e4.ui.di_1.2.800.v20200128-0855.jar.pack.gz from https://download.eclipse.org/eclipse/updates/4.17-I-builds/I20200609-0150/plugins/ (9.76kB)
[INFO] Fetching org.eclipse.e4.ui.dialogs_1.1.900.v20200609-0849.jar.pack.gz from https://download.eclipse.org/eclipse/updates/4.17-I-builds/I20200609-1800/plugins/ (27.82kB)
[INFO] Fetching org.eclipse.e4.ui.model.workbench_2.1.700.v20200113-1422.jar.pack.gz from https://download.eclipse.org/eclipse/updates/4.17-I-builds/I20200609-0150/plugins/ (111.14kB)
[INFO] Fetching org.eclipse.equinox.event_1.5.400.v20200511-1702.jar.pack.gz from https://download.eclipse.org/eclipse/updates/4.17-I-builds/I20200609-0150/plugins/ (16.62kB)
[INFO] Fetching org.eclipse.e4.ui.widgets_1.2.700.v20191222-1048.jar.pack.gz from https://download.eclipse.org/eclipse/updates/4.17-I-builds/I20200609-0150/plugins/ (9.45kB)
[INFO] Fetching org.eclipse.emf.ecore.change_2.14.0.v20190528-0725.jar.pack.gz from https://download.eclipse.org/eclipse/updates/4.17-I-builds/I20200609-0150/plugins/ (51kB)
[INFO] Fetching org.eclipse.emf.ecore.xmi_2.16.0.v20190528-0725.jar.pack.gz from https://download.eclipse.org/eclipse/updates/4.17-I-builds/I20200609-0150/plugins/ (84.02kB)
[INFO] Fetching org.eclipse.e4.ui.workbench_1.11.400.v20200609-0849.jar.pack.gz from https://download.eclipse.org/eclipse/updates/4.17-I-builds/I20200609-1800/plugins/ (85.19kB)
Jun 12, 2020 8:35:05 AM org.apache.http.impl.execchain.RetryExec execute
INFO: I/O exception (org.apache.http.NoHttpResponseException) caught when processing request to {s}->https://download.eclipse.org:443: The target server failed to respond
Jun 12, 2020 8:35:05 AM org.apache.http.impl.execchain.RetryExec execute
INFO: Retrying request to {s}->https://download.eclipse.org:443
[INFO] Fetching org.eclipse.e4.ui.workbench.addons.swt_1.3.1000.v20200517-1848.jar.pack.gz from https://download.eclipse.org/eclipse/updates/4.17-I-builds/I20200609-0150/plugins/ (49.88kB)
[INFO] Fetching org.eclipse.e4.ui.workbench.renderers.swt_0.14.1300.v20200610-1350.jar.pack.gz from https://download.eclipse.org/eclipse/updates/4.17-I-builds/I20200610-1800/plugins/ (94.39kB)
[INFO] Fetching org.eclipse.e4.ui.workbench.swt_0.14.1100.v20200610-1241.jar.pack.gz from https://download.eclipse.org/eclipse/updates/4.17-I-builds/I20200610-1800/plugins/ (60.84kB)
[INFO] Fetching org.eclipse.jface.databinding_1.11.100.v20200522-1835.jar.pack.gz from https://download.eclipse.org/eclipse/updates/4.17-I-builds/I20200609-0150/plugins/ (77.88kB)
[INFO] Fetching org.eclipse.e4.ui.workbench3_0.15.400.v20191216-0805.jar.pack.gz from https://download.eclipse.org/eclipse/updates/4.17-I-builds/I20200609-0150/plugins/ (13.07kB)
[INFO] Fetching org.eclipse.urischeme_1.1.100.v20200608-1350.jar.pack.gz from https://download.eclipse.org/eclipse/updates/4.17-I-builds/I20200609-0150/plugins/ (22.47kB)
[INFO] Fetching org.eclipse.emf.common_2.19.0.v20200324-0932.jar.pack.gz from https://download.eclipse.org/eclipse/updates/4.17-I-builds/I20200609-0150/plugins/ (115.11kB)
[INFO] Fetching org.eclipse.help_3.8.800.v20200525-0755.jar.pack.gz from https://download.eclipse.org/eclipse/updates/4.17-I-builds/I20200609-0150/plugins/ (120.7kB)
[INFO] Fetching org.eclipse.ui_3.117.100.v20200608-0952.jar.pack.gz from https://download.eclipse.org/eclipse/updates/4.17-I-builds/I20200609-0150/plugins/ (343.16kB)
[INFO] Fetching org.eclipse.ui.workbench_3.119.100.v20200610-0928.jar.pack.gz from https://download.eclipse.org/eclipse/updates/4.17-I-builds/I20200610-1800/plugins/ (996.01kB)
Jun 12, 2020 8:35:09 AM org.apache.http.impl.execchain.RetryExec execute
INFO: I/O exception (org.apache.http.NoHttpResponseException) caught when processing request to {s}->https://download.eclipse.org:443: The target server failed to respond
Jun 12, 2020 8:35:09 AM org.apache.http.impl.execchain.RetryExec execute
INFO: Retrying request to {s}->https://download.eclipse.org:443
[INFO] Fetching org.w3c.dom.smil_1.0.1.v200903091627.jar.pack.gz from https://download.eclipse.org/eclipse/updates/4.17-I-builds/I20200609-0150/plugins/ (16.71kB)
[INFO] Resolving class path of MavenProject: org.eclipse.swt:org.eclipse.swt.tools.base:3.107.300-SNAPSHOT @ /home/jenkins/agent/workspace/eclipse.platform.swt-SonarQube/bundles/org.eclipse.swt.tools.base/pom.xml
[INFO] Computing target platform for MavenProject: org.eclipse.swt:org.eclipse.swt.tools.spies:3.107.300-SNAPSHOT @ /home/jenkins/agent/workspace/eclipse.platform.swt-SonarQube/bundles/org.eclipse.swt.tools.spies/pom.xml
[INFO] Resolving dependencies of MavenProject: org.eclipse.swt:org.eclipse.swt.tools.spies:3.107.300-SNAPSHOT @ /home/jenkins/agent/workspace/eclipse.platform.swt-SonarQube/bundles/org.eclipse.swt.tools.spies/pom.xml
[INFO] Fetching javax.annotation_1.2.0.v201602091430.jar.pack.gz from https://download.eclipse.org/eclipse/updates/4.17-I-builds/I20200609-0150/plugins/ (21.32kB)
[INFO] Resolving class path of MavenProject: org.eclipse.swt:org.eclipse.swt.tools.spies:3.107.300-SNAPSHOT @ /home/jenkins/agent/workspace/eclipse.platform.swt-SonarQube/bundles/org.eclipse.swt.tools.spies/pom.xml
[INFO] Computing target platform for MavenProject: org.eclipse.swt:org.eclipse.swt.tools:3.108.300-SNAPSHOT @ /home/jenkins/agent/workspace/eclipse.platform.swt-SonarQube/bundles/org.eclipse.swt.tools/pom.xml
[INFO] Resolving dependencies of MavenProject: org.eclipse.swt:org.eclipse.swt.tools:3.108.300-SNAPSHOT @ /home/jenkins/agent/workspace/eclipse.platform.swt-SonarQube/bundles/org.eclipse.swt.tools/pom.xml
[INFO] Fetching org.eclipse.core.filesystem_1.7.700.v20200110-1734.jar.pack.gz from https://download.eclipse.org/eclipse/updates/4.17-I-builds/I20200609-0150/plugins/ (27.79kB)
[INFO] Fetching org.eclipse.core.resources_3.13.800.v20200608-1055.jar from https://download.eclipse.org/eclipse/updates/4.17-I-builds/I20200609-0150/plugins/ (873.59kB)
[INFO] Fetching org.eclipse.text_3.10.200.v20200428-0633.jar.pack.gz from https://download.eclipse.org/eclipse/updates/4.17-I-builds/I20200609-0150/plugins/ (100.5kB)
[INFO] Fetching org.eclipse.jdt.core_3.22.100.v20200610-0703.jar from https://download.eclipse.org/eclipse/updates/4.17-I-builds/I20200610-1800/plugins/ (6.83MB)
[INFO] Fetching org.eclipse.jface.text_3.16.300.v20200526-0811.jar.pack.gz from https://download.eclipse.org/eclipse/updates/4.17-I-builds/I20200609-0150/plugins/ (316.88kB)
[INFO] Resolving class path of MavenProject: org.eclipse.swt:org.eclipse.swt.tools:3.108.300-SNAPSHOT @ /home/jenkins/agent/workspace/eclipse.platform.swt-SonarQube/bundles/org.eclipse.swt.tools/pom.xml
[INFO] Computing target platform for MavenProject: org.eclipse.swt:org.eclipse.swt.examples:3.106.1000-SNAPSHOT @ /home/jenkins/agent/workspace/eclipse.platform.swt-SonarQube/examples/org.eclipse.swt.examples/pom.xml
[INFO] Resolving dependencies of MavenProject: org.eclipse.swt:org.eclipse.swt.examples:3.106.1000-SNAPSHOT @ /home/jenkins/agent/workspace/eclipse.platform.swt-SonarQube/examples/org.eclipse.swt.examples/pom.xml
[INFO] Resolving class path of MavenProject: org.eclipse.swt:org.eclipse.swt.examples:3.106.1000-SNAPSHOT @ /home/jenkins/agent/workspace/eclipse.platform.swt-SonarQube/examples/org.eclipse.swt.examples/pom.xml
[INFO] Computing target platform for MavenProject: org.eclipse.swt:org.eclipse.swt.examples.browser.demos:3.106.400-SNAPSHOT @ /home/jenkins/agent/workspace/eclipse.platform.swt-SonarQube/examples/org.eclipse.swt.examples.browser.demos/pom.xml
[INFO] Resolving dependencies of MavenProject: org.eclipse.swt:org.eclipse.swt.examples.browser.demos:3.106.400-SNAPSHOT @ /home/jenkins/agent/workspace/eclipse.platform.swt-SonarQube/examples/org.eclipse.swt.examples.browser.demos/pom.xml
[INFO] Resolving class path of MavenProject: org.eclipse.swt:org.eclipse.swt.examples.browser.demos:3.106.400-SNAPSHOT @ /home/jenkins/agent/workspace/eclipse.platform.swt-SonarQube/examples/org.eclipse.swt.examples.browser.demos/pom.xml
[INFO] Computing target platform for MavenProject: org.eclipse.swt:org.eclipse.swt.examples.launcher:3.106.300-SNAPSHOT @ /home/jenkins/agent/workspace/eclipse.platform.swt-SonarQube/examples/org.eclipse.swt.examples.launcher/pom.xml
[INFO] Resolving dependencies of MavenProject: org.eclipse.swt:org.eclipse.swt.examples.launcher:3.106.300-SNAPSHOT @ /home/jenkins/agent/workspace/eclipse.platform.swt-SonarQube/examples/org.eclipse.swt.examples.launcher/pom.xml
[INFO] Resolving class path of MavenProject: org.eclipse.swt:org.eclipse.swt.examples.launcher:3.106.300-SNAPSHOT @ /home/jenkins/agent/workspace/eclipse.platform.swt-SonarQube/examples/org.eclipse.swt.examples.launcher/pom.xml
[INFO] Computing target platform for MavenProject: org.eclipse.swt:org.eclipse.swt.examples.ole.win32:3.107.400-SNAPSHOT @ /home/jenkins/agent/workspace/eclipse.platform.swt-SonarQube/examples/org.eclipse.swt.examples.ole.win32/pom.xml
[INFO] Resolving dependencies of MavenProject: org.eclipse.swt:org.eclipse.swt.examples.ole.win32:3.107.400-SNAPSHOT @ /home/jenkins/agent/workspace/eclipse.platform.swt-SonarQube/examples/org.eclipse.swt.examples.ole.win32/pom.xml
[INFO] Fetching org.eclipse.compare.core_3.6.900.v20200412-2017.jar.pack.gz from https://download.eclipse.org/eclipse/updates/4.17-I-builds/I20200609-0150/plugins/ (32.85kB)
[INFO] Fetching org.eclipse.core.filebuffers_3.6.1000.v20200409-1035.jar.pack.gz from https://download.eclipse.org/eclipse/updates/4.17-I-builds/I20200609-0150/plugins/ (41.15kB)
[INFO] Fetching org.eclipse.e4.ui.ide_3.15.100.v20200323-2111.jar.pack.gz from https://download.eclipse.org/eclipse/updates/4.17-I-builds/I20200609-0150/plugins/ (7.94kB)
Jun 12, 2020 8:35:20 AM org.apache.http.impl.execchain.RetryExec execute
INFO: I/O exception (org.apache.http.NoHttpResponseException) caught when processing request to {s}->https://download.eclipse.org:443: The target server failed to respond
Jun 12, 2020 8:35:20 AM org.apache.http.impl.execchain.RetryExec execute
INFO: Retrying request to {s}->https://download.eclipse.org:443
[INFO] Fetching org.eclipse.equinox.bidi_1.2.300.v20191213-1901.jar.pack.gz from https://download.eclipse.org/eclipse/updates/4.17-I-builds/I20200609-0150/plugins/ (23.95kB)
[INFO] Fetching org.eclipse.equinox.p2.core_2.6.300.v20200211-1504.jar.pack.gz from https://download.eclipse.org/eclipse/updates/4.17-I-builds/I20200609-0150/plugins/ (32.04kB)
[INFO] Fetching org.eclipse.equinox.p2.engine_2.6.700.v20200511-1530.jar.pack.gz from https://download.eclipse.org/eclipse/updates/4.17-I-builds/I20200609-0150/plugins/ (74.47kB)
[INFO] Fetching org.eclipse.equinox.p2.metadata_2.5.0.v20200511-1530.jar.pack.gz from https://download.eclipse.org/eclipse/updates/4.17-I-builds/I20200609-0150/plugins/ (107.88kB)
[INFO] Fetching org.eclipse.equinox.p2.metadata.repository_1.3.400.v20191211-1528.jar.pack.gz from https://download.eclipse.org/eclipse/updates/4.17-I-builds/I20200609-0150/plugins/ (50.94kB)
[INFO] Fetching org.eclipse.equinox.p2.repository_2.4.700.v20200110-2121.jar.pack.gz from https://download.eclipse.org/eclipse/updates/4.17-I-builds/I20200609-0150/plugins/ (55.47kB)
[INFO] Fetching org.tukaani.xz_1.8.0.v20180207-1613.jar.pack.gz from https://download.eclipse.org/eclipse/updates/4.17-I-builds/I20200609-0150/plugins/ (44.42kB)
[INFO] Fetching org.eclipse.equinox.security_1.3.500.v20200114-1637.jar.pack.gz from https://download.eclipse.org/eclipse/updates/4.17-I-builds/I20200609-0150/plugins/ (44.56kB)
[INFO] Fetching org.eclipse.ui.workbench.texteditor_3.14.300.v20200609-1726.jar.pack.gz from https://download.eclipse.org/eclipse/updates/4.17-I-builds/I20200609-1800/plugins/ (233.82kB)
[INFO] Fetching org.eclipse.ui.views_3.10.400.v20200609-0849.jar.pack.gz from https://download.eclipse.org/eclipse/updates/4.17-I-builds/I20200609-1800/plugins/ (48.85kB)
[INFO] Fetching org.eclipse.ui.editors_3.13.300.v20200609-2059.jar.pack.gz from https://download.eclipse.org/eclipse/updates/4.17-I-builds/I20200609-1800/plugins/ (200.81kB)
[INFO] Fetching org.eclipse.ui.ide_3.17.200.v20200610-0809.jar.pack.gz from https://download.eclipse.org/eclipse/updates/4.17-I-builds/I20200610-1800/plugins/ (957.48kB)
[INFO] Fetching org.eclipse.ui.navigator_3.9.400.v20200610-0809.jar.pack.gz from https://download.eclipse.org/eclipse/updates/4.17-I-builds/I20200610-1800/plugins/ (130.9kB)
[INFO] Resolving class path of MavenProject: org.eclipse.swt:org.eclipse.swt.examples.ole.win32:3.107.400-SNAPSHOT @ /home/jenkins/agent/workspace/eclipse.platform.swt-SonarQube/examples/org.eclipse.swt.examples.ole.win32/pom.xml
[INFO] Computing target platform for MavenProject: org.eclipse.swt:org.eclipse.swt.examples.views:3.106.300-SNAPSHOT @ /home/jenkins/agent/workspace/eclipse.platform.swt-SonarQube/examples/org.eclipse.swt.examples.views/pom.xml
[INFO] Resolving dependencies of MavenProject: org.eclipse.swt:org.eclipse.swt.examples.views:3.106.300-SNAPSHOT @ /home/jenkins/agent/workspace/eclipse.platform.swt-SonarQube/examples/org.eclipse.swt.examples.views/pom.xml
[INFO] Resolving class path of MavenProject: org.eclipse.swt:org.eclipse.swt.examples.views:3.106.300-SNAPSHOT @ /home/jenkins/agent/workspace/eclipse.platform.swt-SonarQube/examples/org.eclipse.swt.examples.views/pom.xml
[INFO] Computing target platform for MavenProject: org.eclipse.swt.tests:org.eclipse.swt.tests.fragments.feature:3.106.0-SNAPSHOT @ /home/jenkins/agent/workspace/eclipse.platform.swt-SonarQube/tests/org.eclipse.swt.tests.fragments.feature/pom.xml
[INFO] Resolving dependencies of MavenProject: org.eclipse.swt.tests:org.eclipse.swt.tests.fragments.feature:3.106.0-SNAPSHOT @ /home/jenkins/agent/workspace/eclipse.platform.swt-SonarQube/tests/org.eclipse.swt.tests.fragments.feature/pom.xml
[INFO] Fetching org.eclipse.license_2.0.2.v20181016-2210.jar from https://download.eclipse.org/cbi/updates/license/2.0.2.v20181016-2210/features/ (13.05kB)
[INFO] Resolving class path of MavenProject: org.eclipse.swt.tests:org.eclipse.swt.tests.fragments.feature:3.106.0-SNAPSHOT @ /home/jenkins/agent/workspace/eclipse.platform.swt-SonarQube/tests/org.eclipse.swt.tests.fragments.feature/pom.xml
[INFO] Computing target platform for MavenProject: org.eclipse.swt:org.eclipse.swt.tests:3.106.1000-SNAPSHOT @ /home/jenkins/agent/workspace/eclipse.platform.swt-SonarQube/tests/org.eclipse.swt.tests/pom.xml
[INFO] Resolving dependencies of MavenProject: org.eclipse.swt:org.eclipse.swt.tests:3.106.1000-SNAPSHOT @ /home/jenkins/agent/workspace/eclipse.platform.swt-SonarQube/tests/org.eclipse.swt.tests/pom.xml
Jun 12, 2020 8:35:30 AM org.apache.http.impl.execchain.RetryExec execute
INFO: I/O exception (org.apache.http.NoHttpResponseException) caught when processing request to {s}->https://download.eclipse.org:443: The target server failed to respond
Jun 12, 2020 8:35:30 AM org.apache.http.impl.execchain.RetryExec execute
INFO: Retrying request to {s}->https://download.eclipse.org:443
[INFO] Fetching org.apiguardian_1.1.0.v20190826-0900.jar.pack.gz from https://download.eclipse.org/eclipse/updates/4.17-I-builds/I20200609-0150/plugins/ (12.57kB)
[INFO] Fetching org.eclipse.compare_3.7.1000.v20200511-1203.jar.pack.gz from https://download.eclipse.org/eclipse/updates/4.17-I-builds/I20200609-0150/plugins/ (306.31kB)
[INFO] Fetching org.eclipse.ui.forms_3.9.200.v20200610-0840.jar.pack.gz from https://download.eclipse.org/eclipse/updates/4.17-I-builds/I20200610-1800/plugins/ (124kB)
[INFO] Fetching org.eclipse.core.net_1.3.900.v20200428-1255.jar.pack.gz from https://download.eclipse.org/eclipse/updates/4.17-I-builds/I20200609-0150/plugins/ (31.74kB)
[INFO] Fetching org.eclipse.equinox.launcher_1.5.700.v20200207-2156.jar.pack.gz from https://download.eclipse.org/eclipse/updates/4.17-I-builds/I20200609-0150/plugins/ (29.85kB)
[INFO] Fetching org.eclipse.ltk.core.refactoring_3.11.0.v20200515-0330.jar.pack.gz from https://download.eclipse.org/eclipse/updates/4.17-I-builds/I20200609-0150/plugins/ (105.75kB)
[INFO] Fetching org.eclipse.ltk.ui.refactoring_3.11.0.v20200515-0330.jar.pack.gz from https://download.eclipse.org/eclipse/updates/4.17-I-builds/I20200609-0150/plugins/ (176.74kB)
[INFO] Fetching org.eclipse.team.core_3.8.1100.v20200607-0846.jar.pack.gz from https://download.eclipse.org/eclipse/updates/4.17-I-builds/I20200609-0150/plugins/ (124.88kB)
[INFO] Fetching org.eclipse.team.ui_3.8.1000.v20200610-1306.jar.pack.gz from https://download.eclipse.org/eclipse/updates/4.17-I-builds/I20200610-1800/plugins/ (492.72kB)
[INFO] Fetching org.junit_4.13.0.v20200204-1500.jar.pack.gz from https://download.eclipse.org/eclipse/updates/4.17-I-builds/I20200609-0150/plugins/ (123kB)
[INFO] Fetching org.eclipse.test.performance_3.16.0.v20200608-1255.jar.pack.gz from https://download.eclipse.org/eclipse/updates/4.17-I-builds/I20200609-0150/plugins/ (57.6kB)
[INFO] Fetching org.junit.jupiter.api_5.6.0.v20200203-2009.jar.pack.gz from https://download.eclipse.org/eclipse/updates/4.17-I-builds/I20200609-0150/plugins/ (56.99kB)
[INFO] Fetching org.eclipse.ui.navigator.resources_3.7.400.v20200610-1107.jar.pack.gz from https://download.eclipse.org/eclipse/updates/4.17-I-builds/I20200610-1800/plugins/ (71.32kB)
[INFO] Fetching org.eclipse.ui.ide.application_1.3.800.v20200610-1559.jar.pack.gz from https://download.eclipse.org/eclipse/updates/4.17-I-builds/I20200610-1800/plugins/ (56.83kB)
[INFO] Fetching org.eclipse.ui.views.properties.tabbed_3.8.1000.v20200609-0849.jar.pack.gz from https://download.eclipse.org/eclipse/updates/4.17-I-builds/I20200609-1800/plugins/ (40.74kB)
[INFO] Fetching org.hamcrest.core_1.3.0.v20180420-1519.jar.pack.gz from https://download.eclipse.org/eclipse/updates/4.17-I-builds/I20200609-0150/plugins/ (29.18kB)
[INFO] Fetching org.opentest4j_1.2.0.v20190826-0900.jar.pack.gz from https://download.eclipse.org/eclipse/updates/4.17-I-builds/I20200609-0150/plugins/ (14.79kB)
[INFO] Fetching org.junit.platform.commons_1.6.0.v20200203-2009.jar.pack.gz from https://download.eclipse.org/eclipse/updates/4.17-I-builds/I20200609-0150/plugins/ (50.23kB)
[INFO] Resolving class path of MavenProject: org.eclipse.swt:org.eclipse.swt.tests:3.106.1000-SNAPSHOT @ /home/jenkins/agent/workspace/eclipse.platform.swt-SonarQube/tests/org.eclipse.swt.tests/pom.xml
[INFO] Computing target platform for MavenProject: org.eclipse.swt.tools.feature:org.eclipse.swt.tools.feature:3.107.900-SNAPSHOT @ /home/jenkins/agent/workspace/eclipse.platform.swt-SonarQube/features/org.eclipse.swt.tools.feature/pom.xml
[INFO] Resolving dependencies of MavenProject: org.eclipse.swt.tools.feature:org.eclipse.swt.tools.feature:3.107.900-SNAPSHOT @ /home/jenkins/agent/workspace/eclipse.platform.swt-SonarQube/features/org.eclipse.swt.tools.feature/pom.xml
[INFO] Resolving class path of MavenProject: org.eclipse.swt.tools.feature:org.eclipse.swt.tools.feature:3.107.900-SNAPSHOT @ /home/jenkins/agent/workspace/eclipse.platform.swt-SonarQube/features/org.eclipse.swt.tools.feature/pom.xml
[INFO] Computing target platform for MavenProject: org.eclipse.swt:org.eclipse.swt.tests.gtk:3.107.200-SNAPSHOT @ /home/jenkins/agent/workspace/eclipse.platform.swt-SonarQube/tests/org.eclipse.swt.tests.gtk/pom.xml
[INFO] Resolving dependencies of MavenProject: org.eclipse.swt:org.eclipse.swt.tests.gtk:3.107.200-SNAPSHOT @ /home/jenkins/agent/workspace/eclipse.platform.swt-SonarQube/tests/org.eclipse.swt.tests.gtk/pom.xml
[INFO] Resolving class path of MavenProject: org.eclipse.swt:org.eclipse.swt.tests.gtk:3.107.200-SNAPSHOT @ /home/jenkins/agent/workspace/eclipse.platform.swt-SonarQube/tests/org.eclipse.swt.tests.gtk/pom.xml
[INFO] ------------------------------------------------------------------------
[INFO] Reactor Build Order:
[INFO] 
[INFO] eclipse.platform.swt                                               [pom]
[INFO] org.eclipse.swt                                         [eclipse-plugin]
[INFO] org.eclipse.swt.fragments.localbuild                    [eclipse-plugin]
[INFO] org.eclipse.swt.tools.base                              [eclipse-plugin]
[INFO] org.eclipse.swt.tools.spies                             [eclipse-plugin]
[INFO] org.eclipse.swt.tools                                   [eclipse-plugin]
[INFO] org.eclipse.swt.examples                                [eclipse-plugin]
[INFO] org.eclipse.swt.examples.browser.demos                  [eclipse-plugin]
[INFO] org.eclipse.swt.examples.launcher                       [eclipse-plugin]
[INFO] org.eclipse.swt.examples.ole.win32                      [eclipse-plugin]
[INFO] org.eclipse.swt.examples.views                          [eclipse-plugin]
[INFO] org.eclipse.swt.tests.fragments.feature                [eclipse-feature]
[INFO] org.eclipse.swt.tests                              [eclipse-test-plugin]
[INFO] org.eclipse.swt.tools.feature                          [eclipse-feature]
[INFO] org.eclipse.swt.tests.gtk                          [eclipse-test-plugin]
[INFO] 
[INFO] -------------< eclipse.platform.swt:eclipse.platform.swt >--------------
[INFO] Building eclipse.platform.swt 4.17.0-SNAPSHOT                     [1/15]
[INFO] --------------------------------[ pom ]---------------------------------
[INFO] 
[INFO] --- maven-clean-plugin:3.1.0:clean (default-clean) @ eclipse.platform.swt ---
[INFO] 
[INFO] --- maven-resources-plugin:3.1.0:copy-resources (saveproperties) @ eclipse.platform.swt ---
[INFO] Using 'UTF-8' encoding to copy filtered resources.
[INFO] skip non existing resourceDirectory /home/jenkins/agent/workspace/eclipse.platform.swt-SonarQube/saveproperties
[INFO] 
[INFO] --- maven-enforcer-plugin:3.0.0-M3:enforce (enforce-maven) @ eclipse.platform.swt ---
[INFO] 
[INFO] --- jacoco-maven-plugin:0.8.5:prepare-agent (jacoco-agent) @ eclipse.platform.swt ---
[INFO] argLine set to -javaagent:/home/jenkins/agent/workspace/eclipse.platform.swt-SonarQube/.repository/org/jacoco/org.jacoco.agent/0.8.5/org.jacoco.agent-0.8.5-runtime.jar=destfile=/home/jenkins/agent/workspace/eclipse.platform.swt-SonarQube/jacoco.exec,append=true
[INFO] 
[INFO] --- eclipse-cbi-plugin:1.1.8-SNAPSHOT:generate-api-build-xml (default) @ eclipse.platform.swt ---
[INFO] 
[INFO] --- maven-resources-plugin:3.1.0:resources (filter-resources) @ eclipse.platform.swt ---
[INFO] Using 'UTF-8' encoding to copy filtered resources.
[INFO] skip non existing resourceDirectory /home/jenkins/agent/workspace/eclipse.platform.swt-SonarQube/src/main/resources
[INFO] 
[INFO] --- tycho-eclipserun-plugin:1.7.0:eclipse-run (default) @ eclipse.platform.swt ---
[INFO] 
[INFO] --- tycho-source-plugin:1.7.0:plugin-source (plugin-source) @ eclipse.platform.swt ---
[INFO] 
[INFO] --- tycho-p2-extras-plugin:1.7.0:compare-version-with-baselines (compare-attached-artifacts-with-release) @ eclipse.platform.swt ---
[INFO] Skipped
[INFO] 
[INFO] ------------------< org.eclipse.swt:org.eclipse.swt >-------------------
[INFO] Building org.eclipse.swt 3.115.0-SNAPSHOT                         [2/15]
[INFO] ---------------------------[ eclipse-plugin ]---------------------------
[INFO] 
[INFO] --- maven-clean-plugin:3.1.0:clean (default-clean) @ org.eclipse.swt ---
[INFO] 
[INFO] --- tycho-packaging-plugin:1.7.0:build-qualifier (default-build-qualifier) @ org.eclipse.swt ---
[INFO] The project's OSGi version is 3.115.0.v20200611-2204
[INFO] 
[INFO] --- tycho-packaging-plugin:1.7.0:validate-id (default-validate-id) @ org.eclipse.swt ---
[INFO] 
[INFO] --- tycho-packaging-plugin:1.7.0:validate-version (default-validate-version) @ org.eclipse.swt ---
[INFO] 
[INFO] --- maven-resources-plugin:3.1.0:copy-resources (saveproperties) @ org.eclipse.swt ---
[INFO] Using 'UTF-8' encoding to copy filtered resources.
[INFO] skip non existing resourceDirectory /home/jenkins/agent/workspace/eclipse.platform.swt-SonarQube/bundles/org.eclipse.swt/saveproperties
[INFO] 
[INFO] --- maven-enforcer-plugin:3.0.0-M3:enforce (enforce-maven) @ org.eclipse.swt ---
[INFO] 
[INFO] --- jacoco-maven-plugin:0.8.5:prepare-agent (jacoco-agent) @ org.eclipse.swt ---
[INFO] argLine set to -javaagent:/home/jenkins/agent/workspace/eclipse.platform.swt-SonarQube/.repository/org/jacoco/org.jacoco.agent/0.8.5/org.jacoco.agent-0.8.5-runtime.jar=destfile=/home/jenkins/agent/workspace/eclipse.platform.swt-SonarQube/jacoco.exec,append=true
[INFO] 
[INFO] --- eclipse-cbi-plugin:1.1.8-SNAPSHOT:generate-api-build-xml (default) @ org.eclipse.swt ---
Generating target/.apibuild.xml
[INFO] 
[INFO] --- maven-resources-plugin:3.1.0:resources (default-resources) @ org.eclipse.swt ---
[INFO] Using 'UTF-8' encoding to copy filtered resources.
[INFO] skip non existing resourceDirectory /home/jenkins/agent/workspace/eclipse.platform.swt-SonarQube/bundles/org.eclipse.swt/src/main/resources
[INFO] 
[INFO] --- maven-resources-plugin:3.1.0:resources (filter-resources) @ org.eclipse.swt ---
[INFO] Using 'UTF-8' encoding to copy filtered resources.
[INFO] skip non existing resourceDirectory /home/jenkins/agent/workspace/eclipse.platform.swt-SonarQube/bundles/org.eclipse.swt/src/main/resources
[INFO] 
[INFO] --- tycho-compiler-plugin:1.7.0:compile (default-compile) @ org.eclipse.swt ---
[INFO] 
[INFO] --- tycho-eclipserun-plugin:1.7.0:eclipse-run (default) @ org.eclipse.swt ---
[INFO] Fetching org.apache.ant_1.10.8.v20200515-1239.jar.pack.gz from https://download.eclipse.org/eclipse/updates/4.17-I-builds/I20200609-0150/plugins/ (2.86MB)
[INFO] Fetching org.eclipse.ant.core_3.5.800.v20200608-1251.jar.pack.gz from https://download.eclipse.org/eclipse/updates/4.17-I-builds/I20200609-0150/plugins/ (71.46kB)
[INFO] Fetching org.eclipse.core.variables_3.4.800.v20200120-1101.jar.pack.gz from https://download.eclipse.org/eclipse/updates/4.17-I-builds/I20200609-0150/plugins/ (18.03kB)
[INFO] Fetching org.eclipse.debug.core_3.15.200.v20200610-0814.jar.pack.gz from https://download.eclipse.org/eclipse/updates/4.17-I-builds/I20200610-1800/plugins/ (124.67kB)
[INFO] Fetching org.eclipse.equinox.frameworkadmin_2.1.400.v20191002-0702.jar.pack.gz from https://download.eclipse.org/eclipse/updates/4.17-I-builds/I20200609-0150/plugins/ (19.47kB)
[INFO] Fetching org.eclipse.equinox.frameworkadmin.equinox_1.1.400.v20200319-1546.jar.pack.gz from https://download.eclipse.org/eclipse/updates/4.17-I-builds/I20200609-0150/plugins/ (34.56kB)
[INFO] Fetching org.eclipse.equinox.p2.artifact.repository_1.3.500.v20200406-2025.jar.pack.gz from https://download.eclipse.org/eclipse/updates/4.17-I-builds/I20200609-0150/plugins/ (58.11kB)
[INFO] Fetching org.eclipse.equinox.p2.jarprocessor_1.1.600.v20200217-1130.jar.pack.gz from https://download.eclipse.org/eclipse/updates/4.17-I-builds/I20200609-0150/plugins/ (38.9kB)
[INFO] Fetching org.eclipse.equinox.p2.director_2.4.700.v20200511-1530.jar.pack.gz from https://download.eclipse.org/eclipse/updates/4.17-I-builds/I20200609-0150/plugins/ (47.99kB)
[INFO] Fetching org.sat4j.core_2.3.5.v201308161310.jar.pack.gz from https://download.eclipse.org/eclipse/updates/4.17-I-builds/I20200609-0150/plugins/ (116.64kB)
[INFO] Fetching org.sat4j.pb_2.3.5.v201404071733.jar.pack.gz from https://download.eclipse.org/eclipse/updates/4.17-I-builds/I20200609-0150/plugins/ (81.19kB)
[INFO] Fetching org.eclipse.equinox.simpleconfigurator_1.3.500.v20200211-1505.jar.pack.gz from https://download.eclipse.org/eclipse/updates/4.17-I-builds/I20200609-0150/plugins/ (23.81kB)
[INFO] Fetching org.eclipse.equinox.p2.director.app_1.1.600.v20200511-1530.jar.pack.gz from https://download.eclipse.org/eclipse/updates/4.17-I-builds/I20200609-0150/plugins/ (37.85kB)
[INFO] Fetching org.eclipse.equinox.p2.garbagecollector_1.1.400.v20200221-1022.jar.pack.gz from https://download.eclipse.org/eclipse/updates/4.17-I-builds/I20200609-0150/plugins/ (13.86kB)
[INFO] Fetching org.eclipse.equinox.p2.publisher_1.5.400.v20200511-1530.jar.pack.gz from https://download.eclipse.org/eclipse/updates/4.17-I-builds/I20200609-0150/plugins/ (43.28kB)
[INFO] Fetching org.eclipse.equinox.p2.publisher.eclipse_1.3.600.v20200318-1507.jar.pack.gz from https://download.eclipse.org/eclipse/updates/4.17-I-builds/I20200609-0150/plugins/ (105.95kB)
[INFO] Fetching org.eclipse.equinox.simpleconfigurator.manipulator_2.1.500.v20200211-1505.jar.pack.gz from https://download.eclipse.org/eclipse/updates/4.17-I-builds/I20200609-0150/plugins/ (16.64kB)
[INFO] Fetching org.eclipse.equinox.p2.repository.tools_2.2.500.v20200110-2121.jar.pack.gz from https://download.eclipse.org/eclipse/updates/4.17-I-builds/I20200609-0150/plugins/ (121.9kB)
[INFO] Fetching org.eclipse.equinox.p2.touchpoint.eclipse_2.2.600.v20200114-1339.jar.pack.gz from https://download.eclipse.org/eclipse/updates/4.17-I-builds/I20200609-0150/plugins/ (46.47kB)
[INFO] Fetching org.eclipse.jdt.debug_3.15.100.v20200525-2012.jar.pack.gz from https://download.eclipse.org/eclipse/updates/4.17-I-builds/I20200609-0150/plugins/ (966.69kB)
[INFO] Fetching org.eclipse.jdt.launching_3.17.200.v20200609-1356.jar.pack.gz from https://download.eclipse.org/eclipse/updates/4.17-I-builds/I20200609-1800/plugins/ (281.63kB)
[INFO] Fetching org.eclipse.osgi.compatibility.state_1.1.800.v20200511-1223.jar.pack.gz from https://download.eclipse.org/eclipse/updates/4.17-I-builds/I20200609-0150/plugins/ (103.56kB)
[INFO] Fetching org.eclipse.pde.api.tools_1.1.1300.v20200514-1749.jar from https://download.eclipse.org/eclipse/updates/4.17-I-builds/I20200609-0150/plugins/ (924.8kB)
[INFO] Fetching org.eclipse.pde.core_3.13.400.v20200415-0531.jar from https://download.eclipse.org/eclipse/updates/4.17-I-builds/I20200609-0150/plugins/ (1.29MB)
[INFO] Fetching org.objectweb.asm_8.0.1.v20200420-1007.jar.pack.gz from https://download.eclipse.org/eclipse/updates/4.17-I-builds/I20200609-0150/plugins/ (60.93kB)
[INFO] Fetching org.objectweb.asm.tree_8.0.1.v20200420-1007.jar.pack.gz from https://download.eclipse.org/eclipse/updates/4.17-I-builds/I20200609-0150/plugins/ (26.36kB)
[INFO] Fetching org.eclipse.pde.build_3.10.800.v20200410-1419.jar from https://download.eclipse.org/eclipse/updates/4.17-I-builds/I20200609-0150/plugins/ (478.57kB)
[INFO] Fetching org.eclipse.update.configurator_3.4.600.v20200422-1910.jar.pack.gz from https://download.eclipse.org/eclipse/updates/4.17-I-builds/I20200609-0150/plugins/ (43.22kB)
[INFO] Toolchain in tycho-eclipserun-plugin: JDK[/opt/tools/java/oracle/jdk-8/latest/jre]
[INFO] Expected eclipse log file: /home/jenkins/agent/workspace/eclipse.platform.swt-SonarQube/bundles/org.eclipse.swt/target/eclipserun-work/data/.metadata/.log
[INFO] Command line:
	[/opt/tools/java/oracle/jdk-8/latest/jre/bin/java, -jar, /home/jenkins/agent/workspace/eclipse.platform.swt-SonarQube/.repository/p2/osgi/bundle/org.eclipse.equinox.launcher/1.5.700.v20200207-2156/org.eclipse.equinox.launcher-1.5.700.v20200207-2156.jar, -install, /home/jenkins/agent/workspace/eclipse.platform.swt-SonarQube/bundles/org.eclipse.swt/target/eclipserun-work, -configuration, /home/jenkins/agent/workspace/eclipse.platform.swt-SonarQube/bundles/org.eclipse.swt/target/eclipserun-work/configuration, -data, target/apibuild-workspace, -application, org.eclipse.ant.core.antRunner, -buildfile, target/.apibuild.xml]
Buildfile: target/.apibuild.xml

apigen:
BUILD SUCCESSFUL

BUILD SUCCESSFUL
Total time: 0 seconds
[INFO] 
[INFO] --- maven-resources-plugin:3.1.0:testResources (default-testResources) @ org.eclipse.swt ---
[INFO] Using 'UTF-8' encoding to copy filtered resources.
[INFO] skip non existing resourceDirectory /home/jenkins/agent/workspace/eclipse.platform.swt-SonarQube/bundles/org.eclipse.swt/src/test/resources
[INFO] 
[INFO] --- tycho-source-plugin:1.7.0:plugin-source (plugin-source) @ org.eclipse.swt ---
[INFO] 
[INFO] --- target-platform-configuration:1.7.0:target-platform (default-target-platform) @ org.eclipse.swt ---
[INFO] 
[INFO] --- tycho-packaging-plugin:1.7.0:package-plugin (default-package-plugin) @ org.eclipse.swt ---
[INFO] Building jar: /home/jenkins/agent/workspace/eclipse.platform.swt-SonarQube/bundles/org.eclipse.swt/target/org.eclipse.swt-3.115.0-SNAPSHOT.jar
[INFO] 
[INFO] --- tycho-p2-plugin:1.7.0:p2-metadata-default (default-p2-metadata-default) @ org.eclipse.swt ---
[WARNING] No repository found at file:/noThanks.
org.eclipse.equinox.p2.core.ProvisionException: No repository found at file:/noThanks.
    at org.eclipse.equinox.internal.p2.repository.helpers.AbstractRepositoryManager.fail (AbstractRepositoryManager.java:396)
    at org.eclipse.equinox.internal.p2.repository.helpers.AbstractRepositoryManager.loadRepository (AbstractRepositoryManager.java:700)
    at org.eclipse.equinox.internal.p2.metadata.repository.MetadataRepositoryManager.loadRepository (MetadataRepositoryManager.java:110)
    at org.eclipse.tycho.p2.remote.RemoteMetadataRepositoryManager.loadRepository (RemoteMetadataRepositoryManager.java:61)
    at org.eclipse.tycho.p2.remote.RemoteMetadataRepositoryManager.loadRepository (RemoteMetadataRepositoryManager.java:53)
    at org.eclipse.tycho.p2.tools.baseline.BaselineServiceImpl.getProjectBaseline (BaselineServiceImpl.java:95)
    at org.eclipse.tycho.plugins.p2.BaselineValidator.validateAndReplace (BaselineValidator.java:88)
    at org.eclipse.tycho.plugins.p2.P2MetadataMojo.attachP2Metadata (P2MetadataMojo.java:183)
    at org.eclipse.tycho.plugins.p2.P2MetadataMojo.execute (P2MetadataMojo.java:137)
    at org.eclipse.tycho.plugins.p2.P2MetadataDefaultMojo.execute (P2MetadataDefaultMojo.java:32)
    at org.apache.maven.plugin.DefaultBuildPluginManager.executeMojo (DefaultBuildPluginManager.java:137)
    at org.apache.maven.lifecycle.internal.MojoExecutor.execute (MojoExecutor.java:210)
    at org.apache.maven.lifecycle.internal.MojoExecutor.execute (MojoExecutor.java:156)
    at org.apache.maven.lifecycle.internal.MojoExecutor.execute (MojoExecutor.java:148)
    at org.apache.maven.lifecycle.internal.LifecycleModuleBuilder.buildProject (LifecycleModuleBuilder.java:117)
    at org.apache.maven.lifecycle.internal.LifecycleModuleBuilder.buildProject (LifecycleModuleBuilder.java:81)
    at org.apache.maven.lifecycle.internal.builder.singlethreaded.SingleThreadedBuilder.build (SingleThreadedBuilder.java:56)
    at org.apache.maven.lifecycle.internal.LifecycleStarter.execute (LifecycleStarter.java:128)
    at org.apache.maven.DefaultMaven.doExecute (DefaultMaven.java:305)
    at org.apache.maven.DefaultMaven.doExecute (DefaultMaven.java:192)
    at org.apache.maven.DefaultMaven.execute (DefaultMaven.java:105)
    at org.apache.maven.cli.MavenCli.execute (MavenCli.java:957)
    at org.apache.maven.cli.MavenCli.doMain (MavenCli.java:289)
    at org.apache.maven.cli.MavenCli.main (MavenCli.java:193)
    at sun.reflect.NativeMethodAccessorImpl.invoke0 (Native Method)
    at sun.reflect.NativeMethodAccessorImpl.invoke (NativeMethodAccessorImpl.java:62)
    at sun.reflect.DelegatingMethodAccessorImpl.invoke (DelegatingMethodAccessorImpl.java:43)
    at java.lang.reflect.Method.invoke (Method.java:498)
    at org.codehaus.plexus.classworlds.launcher.Launcher.launchEnhanced (Launcher.java:282)
    at org.codehaus.plexus.classworlds.launcher.Launcher.launch (Launcher.java:225)
    at org.codehaus.plexus.classworlds.launcher.Launcher.mainWithExitCode (Launcher.java:406)
    at org.codehaus.plexus.classworlds.launcher.Launcher.main (Launcher.java:347)
[INFO] No baseline version MavenProject: org.eclipse.swt:org.eclipse.swt:3.115.0-SNAPSHOT @ /home/jenkins/agent/workspace/eclipse.platform.swt-SonarQube/bundles/org.eclipse.swt/pom.xml
[INFO] 
[INFO] --- tycho-p2-extras-plugin:1.7.0:compare-version-with-baselines (compare-attached-artifacts-with-release) @ org.eclipse.swt ---
[INFO] Skipped
[INFO] 
[INFO] --------< org.eclipse.swt:org.eclipse.swt.fragments.localbuild >--------
[INFO] Building org.eclipse.swt.fragments.localbuild 3.105.0-SNAPSHOT    [3/15]
[INFO] ---------------------------[ eclipse-plugin ]---------------------------
[INFO] 
[INFO] --- maven-clean-plugin:3.1.0:clean (default-clean) @ org.eclipse.swt.fragments.localbuild ---
[INFO] 
[INFO] --- tycho-packaging-plugin:1.7.0:build-qualifier (default-build-qualifier) @ org.eclipse.swt.fragments.localbuild ---
[INFO] The project's OSGi version is 3.105.0.v20191220-1603
[INFO] 
[INFO] --- tycho-packaging-plugin:1.7.0:validate-id (default-validate-id) @ org.eclipse.swt.fragments.localbuild ---
[INFO] 
[INFO] --- tycho-packaging-plugin:1.7.0:validate-version (default-validate-version) @ org.eclipse.swt.fragments.localbuild ---
[INFO] 
[INFO] --- maven-resources-plugin:3.1.0:copy-resources (saveproperties) @ org.eclipse.swt.fragments.localbuild ---
[INFO] Using 'UTF-8' encoding to copy filtered resources.
[INFO] skip non existing resourceDirectory /home/jenkins/agent/workspace/eclipse.platform.swt-SonarQube/local-build/org.eclipse.swt.fragments.localbuild/saveproperties
[INFO] 
[INFO] --- maven-enforcer-plugin:3.0.0-M3:enforce (enforce-maven) @ org.eclipse.swt.fragments.localbuild ---
[INFO] 
[INFO] --- jacoco-maven-plugin:0.8.5:prepare-agent (jacoco-agent) @ org.eclipse.swt.fragments.localbuild ---
[INFO] argLine set to -javaagent:/home/jenkins/agent/workspace/eclipse.platform.swt-SonarQube/.repository/org/jacoco/org.jacoco.agent/0.8.5/org.jacoco.agent-0.8.5-runtime.jar=destfile=/home/jenkins/agent/workspace/eclipse.platform.swt-SonarQube/jacoco.exec,append=true
[INFO] 
[INFO] --- eclipse-cbi-plugin:1.1.8-SNAPSHOT:generate-api-build-xml (default) @ org.eclipse.swt.fragments.localbuild ---
[INFO] 
[INFO] --- maven-resources-plugin:3.1.0:resources (default-resources) @ org.eclipse.swt.fragments.localbuild ---
[INFO] Using 'UTF-8' encoding to copy filtered resources.
[INFO] skip non existing resourceDirectory /home/jenkins/agent/workspace/eclipse.platform.swt-SonarQube/local-build/org.eclipse.swt.fragments.localbuild/src/main/resources
[INFO] 
[INFO] --- maven-resources-plugin:3.1.0:resources (filter-resources) @ org.eclipse.swt.fragments.localbuild ---
[INFO] Using 'UTF-8' encoding to copy filtered resources.
[INFO] skip non existing resourceDirectory /home/jenkins/agent/workspace/eclipse.platform.swt-SonarQube/local-build/org.eclipse.swt.fragments.localbuild/src/main/resources
[INFO] 
[INFO] --- tycho-compiler-plugin:1.7.0:compile (default-compile) @ org.eclipse.swt.fragments.localbuild ---
[INFO] 
[INFO] --- tycho-eclipserun-plugin:1.7.0:eclipse-run (default) @ org.eclipse.swt.fragments.localbuild ---
[INFO] 
[INFO] --- maven-resources-plugin:3.1.0:testResources (default-testResources) @ org.eclipse.swt.fragments.localbuild ---
[INFO] Using 'UTF-8' encoding to copy filtered resources.
[INFO] skip non existing resourceDirectory /home/jenkins/agent/workspace/eclipse.platform.swt-SonarQube/local-build/org.eclipse.swt.fragments.localbuild/src/test/resources
[INFO] 
[INFO] --- tycho-source-plugin:1.7.0:plugin-source (plugin-source) @ org.eclipse.swt.fragments.localbuild ---
[INFO] 
[INFO] --- target-platform-configuration:1.7.0:target-platform (default-target-platform) @ org.eclipse.swt.fragments.localbuild ---
[INFO] 
[INFO] --- tycho-packaging-plugin:1.7.0:package-plugin (default-package-plugin) @ org.eclipse.swt.fragments.localbuild ---
[INFO] Building jar: /home/jenkins/agent/workspace/eclipse.platform.swt-SonarQube/local-build/org.eclipse.swt.fragments.localbuild/target/org.eclipse.swt.fragments.localbuild-3.105.0-SNAPSHOT.jar
[INFO] 
[INFO] --- tycho-p2-plugin:1.7.0:p2-metadata-default (default-p2-metadata-default) @ org.eclipse.swt.fragments.localbuild ---
[WARNING] No repository found at file:/noThanks.
org.eclipse.equinox.p2.core.ProvisionException: No repository found at file:/noThanks.
    at org.eclipse.equinox.internal.p2.repository.helpers.AbstractRepositoryManager.fail (AbstractRepositoryManager.java:396)
    at org.eclipse.equinox.internal.p2.repository.helpers.AbstractRepositoryManager.loadRepository (AbstractRepositoryManager.java:661)
    at org.eclipse.equinox.internal.p2.metadata.repository.MetadataRepositoryManager.loadRepository (MetadataRepositoryManager.java:110)
    at org.eclipse.tycho.p2.remote.RemoteMetadataRepositoryManager.loadRepository (RemoteMetadataRepositoryManager.java:61)
    at org.eclipse.tycho.p2.remote.RemoteMetadataRepositoryManager.loadRepository (RemoteMetadataRepositoryManager.java:53)
    at org.eclipse.tycho.p2.tools.baseline.BaselineServiceImpl.getProjectBaseline (BaselineServiceImpl.java:95)
    at org.eclipse.tycho.plugins.p2.BaselineValidator.validateAndReplace (BaselineValidator.java:88)
    at org.eclipse.tycho.plugins.p2.P2MetadataMojo.attachP2Metadata (P2MetadataMojo.java:183)
    at org.eclipse.tycho.plugins.p2.P2MetadataMojo.execute (P2MetadataMojo.java:137)
    at org.eclipse.tycho.plugins.p2.P2MetadataDefaultMojo.execute (P2MetadataDefaultMojo.java:32)
    at org.apache.maven.plugin.DefaultBuildPluginManager.executeMojo (DefaultBuildPluginManager.java:137)
    at org.apache.maven.lifecycle.internal.MojoExecutor.execute (MojoExecutor.java:210)
    at org.apache.maven.lifecycle.internal.MojoExecutor.execute (MojoExecutor.java:156)
    at org.apache.maven.lifecycle.internal.MojoExecutor.execute (MojoExecutor.java:148)
    at org.apache.maven.lifecycle.internal.LifecycleModuleBuilder.buildProject (LifecycleModuleBuilder.java:117)
    at org.apache.maven.lifecycle.internal.LifecycleModuleBuilder.buildProject (LifecycleModuleBuilder.java:81)
    at org.apache.maven.lifecycle.internal.builder.singlethreaded.SingleThreadedBuilder.build (SingleThreadedBuilder.java:56)
    at org.apache.maven.lifecycle.internal.LifecycleStarter.execute (LifecycleStarter.java:128)
    at org.apache.maven.DefaultMaven.doExecute (DefaultMaven.java:305)
    at org.apache.maven.DefaultMaven.doExecute (DefaultMaven.java:192)
    at org.apache.maven.DefaultMaven.execute (DefaultMaven.java:105)
    at org.apache.maven.cli.MavenCli.execute (MavenCli.java:957)
    at org.apache.maven.cli.MavenCli.doMain (MavenCli.java:289)
    at org.apache.maven.cli.MavenCli.main (MavenCli.java:193)
    at sun.reflect.NativeMethodAccessorImpl.invoke0 (Native Method)
    at sun.reflect.NativeMethodAccessorImpl.invoke (NativeMethodAccessorImpl.java:62)
    at sun.reflect.DelegatingMethodAccessorImpl.invoke (DelegatingMethodAccessorImpl.java:43)
    at java.lang.reflect.Method.invoke (Method.java:498)
    at org.codehaus.plexus.classworlds.launcher.Launcher.launchEnhanced (Launcher.java:282)
    at org.codehaus.plexus.classworlds.launcher.Launcher.launch (Launcher.java:225)
    at org.codehaus.plexus.classworlds.launcher.Launcher.mainWithExitCode (Launcher.java:406)
    at org.codehaus.plexus.classworlds.launcher.Launcher.main (Launcher.java:347)
[INFO] No baseline version MavenProject: org.eclipse.swt:org.eclipse.swt.fragments.localbuild:3.105.0-SNAPSHOT @ /home/jenkins/agent/workspace/eclipse.platform.swt-SonarQube/local-build/org.eclipse.swt.fragments.localbuild/pom.xml
[INFO] 
[INFO] --- tycho-p2-extras-plugin:1.7.0:compare-version-with-baselines (compare-attached-artifacts-with-release) @ org.eclipse.swt.fragments.localbuild ---
[INFO] Skipped
[INFO] 
[INFO] -------------< org.eclipse.swt:org.eclipse.swt.tools.base >-------------
[INFO] Building org.eclipse.swt.tools.base 3.107.300-SNAPSHOT            [4/15]
[INFO] ---------------------------[ eclipse-plugin ]---------------------------
[INFO] 
[INFO] --- maven-clean-plugin:3.1.0:clean (default-clean) @ org.eclipse.swt.tools.base ---
[INFO] 
[INFO] --- tycho-packaging-plugin:1.7.0:build-qualifier (default-build-qualifier) @ org.eclipse.swt.tools.base ---
[INFO] The project's OSGi version is 3.107.300.v20190925-1155
[INFO] 
[INFO] --- tycho-packaging-plugin:1.7.0:validate-id (default-validate-id) @ org.eclipse.swt.tools.base ---
[INFO] 
[INFO] --- tycho-packaging-plugin:1.7.0:validate-version (default-validate-version) @ org.eclipse.swt.tools.base ---
[INFO] 
[INFO] --- maven-resources-plugin:3.1.0:copy-resources (saveproperties) @ org.eclipse.swt.tools.base ---
[INFO] Using 'UTF-8' encoding to copy filtered resources.
[INFO] skip non existing resourceDirectory /home/jenkins/agent/workspace/eclipse.platform.swt-SonarQube/bundles/org.eclipse.swt.tools.base/saveproperties
[INFO] 
[INFO] --- maven-enforcer-plugin:3.0.0-M3:enforce (enforce-maven) @ org.eclipse.swt.tools.base ---
[INFO] 
[INFO] --- jacoco-maven-plugin:0.8.5:prepare-agent (jacoco-agent) @ org.eclipse.swt.tools.base ---
[INFO] argLine set to -javaagent:/home/jenkins/agent/workspace/eclipse.platform.swt-SonarQube/.repository/org/jacoco/org.jacoco.agent/0.8.5/org.jacoco.agent-0.8.5-runtime.jar=destfile=/home/jenkins/agent/workspace/eclipse.platform.swt-SonarQube/jacoco.exec,append=true
[INFO] 
[INFO] --- eclipse-cbi-plugin:1.1.8-SNAPSHOT:generate-api-build-xml (default) @ org.eclipse.swt.tools.base ---
[INFO] 
[INFO] --- maven-resources-plugin:3.1.0:resources (default-resources) @ org.eclipse.swt.tools.base ---
[INFO] Using 'UTF-8' encoding to copy filtered resources.
[INFO] skip non existing resourceDirectory /home/jenkins/agent/workspace/eclipse.platform.swt-SonarQube/bundles/org.eclipse.swt.tools.base/src/main/resources
[INFO] 
[INFO] --- maven-resources-plugin:3.1.0:resources (filter-resources) @ org.eclipse.swt.tools.base ---
[INFO] Using 'UTF-8' encoding to copy filtered resources.
[INFO] skip non existing resourceDirectory /home/jenkins/agent/workspace/eclipse.platform.swt-SonarQube/bundles/org.eclipse.swt.tools.base/src/main/resources
[INFO] 
[INFO] --- tycho-compiler-plugin:1.7.0:compile (default-compile) @ org.eclipse.swt.tools.base ---
[INFO] 
[INFO] --- tycho-eclipserun-plugin:1.7.0:eclipse-run (default) @ org.eclipse.swt.tools.base ---
[INFO] 
[INFO] --- maven-resources-plugin:3.1.0:testResources (default-testResources) @ org.eclipse.swt.tools.base ---
[INFO] Using 'UTF-8' encoding to copy filtered resources.
[INFO] skip non existing resourceDirectory /home/jenkins/agent/workspace/eclipse.platform.swt-SonarQube/bundles/org.eclipse.swt.tools.base/src/test/resources
[INFO] 
[INFO] --- tycho-source-plugin:1.7.0:plugin-source (plugin-source) @ org.eclipse.swt.tools.base ---
[INFO] Building jar: /home/jenkins/agent/workspace/eclipse.platform.swt-SonarQube/bundles/org.eclipse.swt.tools.base/target/org.eclipse.swt.tools.base-3.107.300-SNAPSHOT-sources.jar
[INFO] 
[INFO] --- target-platform-configuration:1.7.0:target-platform (default-target-platform) @ org.eclipse.swt.tools.base ---
[INFO] 
[INFO] --- tycho-packaging-plugin:1.7.0:package-plugin (default-package-plugin) @ org.eclipse.swt.tools.base ---
[INFO] Building jar: /home/jenkins/agent/workspace/eclipse.platform.swt-SonarQube/bundles/org.eclipse.swt.tools.base/target/org.eclipse.swt.tools.base-3.107.300-SNAPSHOT.jar
[INFO] 
[INFO] --- tycho-p2-plugin:1.7.0:p2-metadata-default (default-p2-metadata-default) @ org.eclipse.swt.tools.base ---
[WARNING] No repository found at file:/noThanks.
org.eclipse.equinox.p2.core.ProvisionException: No repository found at file:/noThanks.
    at org.eclipse.equinox.internal.p2.repository.helpers.AbstractRepositoryManager.fail (AbstractRepositoryManager.java:396)
    at org.eclipse.equinox.internal.p2.repository.helpers.AbstractRepositoryManager.loadRepository (AbstractRepositoryManager.java:661)
    at org.eclipse.equinox.internal.p2.metadata.repository.MetadataRepositoryManager.loadRepository (MetadataRepositoryManager.java:110)
    at org.eclipse.tycho.p2.remote.RemoteMetadataRepositoryManager.loadRepository (RemoteMetadataRepositoryManager.java:61)
    at org.eclipse.tycho.p2.remote.RemoteMetadataRepositoryManager.loadRepository (RemoteMetadataRepositoryManager.java:53)
    at org.eclipse.tycho.p2.tools.baseline.BaselineServiceImpl.getProjectBaseline (BaselineServiceImpl.java:95)
    at org.eclipse.tycho.plugins.p2.BaselineValidator.validateAndReplace (BaselineValidator.java:88)
    at org.eclipse.tycho.plugins.p2.P2MetadataMojo.attachP2Metadata (P2MetadataMojo.java:183)
    at org.eclipse.tycho.plugins.p2.P2MetadataMojo.execute (P2MetadataMojo.java:137)
    at org.eclipse.tycho.plugins.p2.P2MetadataDefaultMojo.execute (P2MetadataDefaultMojo.java:32)
    at org.apache.maven.plugin.DefaultBuildPluginManager.executeMojo (DefaultBuildPluginManager.java:137)
    at org.apache.maven.lifecycle.internal.MojoExecutor.execute (MojoExecutor.java:210)
    at org.apache.maven.lifecycle.internal.MojoExecutor.execute (MojoExecutor.java:156)
    at org.apache.maven.lifecycle.internal.MojoExecutor.execute (MojoExecutor.java:148)
    at org.apache.maven.lifecycle.internal.LifecycleModuleBuilder.buildProject (LifecycleModuleBuilder.java:117)
    at org.apache.maven.lifecycle.internal.LifecycleModuleBuilder.buildProject (LifecycleModuleBuilder.java:81)
    at org.apache.maven.lifecycle.internal.builder.singlethreaded.SingleThreadedBuilder.build (SingleThreadedBuilder.java:56)
    at org.apache.maven.lifecycle.internal.LifecycleStarter.execute (LifecycleStarter.java:128)
    at org.apache.maven.DefaultMaven.doExecute (DefaultMaven.java:305)
    at org.apache.maven.DefaultMaven.doExecute (DefaultMaven.java:192)
    at org.apache.maven.DefaultMaven.execute (DefaultMaven.java:105)
    at org.apache.maven.cli.MavenCli.execute (MavenCli.java:957)
    at org.apache.maven.cli.MavenCli.doMain (MavenCli.java:289)
    at org.apache.maven.cli.MavenCli.main (MavenCli.java:193)
    at sun.reflect.NativeMethodAccessorImpl.invoke0 (Native Method)
    at sun.reflect.NativeMethodAccessorImpl.invoke (NativeMethodAccessorImpl.java:62)
    at sun.reflect.DelegatingMethodAccessorImpl.invoke (DelegatingMethodAccessorImpl.java:43)
    at java.lang.reflect.Method.invoke (Method.java:498)
    at org.codehaus.plexus.classworlds.launcher.Launcher.launchEnhanced (Launcher.java:282)
    at org.codehaus.plexus.classworlds.launcher.Launcher.launch (Launcher.java:225)
    at org.codehaus.plexus.classworlds.launcher.Launcher.mainWithExitCode (Launcher.java:406)
    at org.codehaus.plexus.classworlds.launcher.Launcher.main (Launcher.java:347)
[INFO] No baseline version MavenProject: org.eclipse.swt:org.eclipse.swt.tools.base:3.107.300-SNAPSHOT @ /home/jenkins/agent/workspace/eclipse.platform.swt-SonarQube/bundles/org.eclipse.swt.tools.base/pom.xml
[INFO] 
[INFO] --- tycho-p2-extras-plugin:1.7.0:compare-version-with-baselines (compare-attached-artifacts-with-release) @ org.eclipse.swt.tools.base ---
[INFO] Skipped
[INFO] 
[INFO] ------------< org.eclipse.swt:org.eclipse.swt.tools.spies >-------------
[INFO] Building org.eclipse.swt.tools.spies 3.107.300-SNAPSHOT           [5/15]
[INFO] ---------------------------[ eclipse-plugin ]---------------------------
[INFO] 
[INFO] --- maven-clean-plugin:3.1.0:clean (default-clean) @ org.eclipse.swt.tools.spies ---
[INFO] 
[INFO] --- tycho-packaging-plugin:1.7.0:build-qualifier (default-build-qualifier) @ org.eclipse.swt.tools.spies ---
[INFO] The project's OSGi version is 3.107.300.v20200611-0059
[INFO] 
[INFO] --- tycho-packaging-plugin:1.7.0:validate-id (default-validate-id) @ org.eclipse.swt.tools.spies ---
[INFO] 
[INFO] --- tycho-packaging-plugin:1.7.0:validate-version (default-validate-version) @ org.eclipse.swt.tools.spies ---
[INFO] 
[INFO] --- maven-resources-plugin:3.1.0:copy-resources (saveproperties) @ org.eclipse.swt.tools.spies ---
[INFO] Using 'UTF-8' encoding to copy filtered resources.
[INFO] skip non existing resourceDirectory /home/jenkins/agent/workspace/eclipse.platform.swt-SonarQube/bundles/org.eclipse.swt.tools.spies/saveproperties
[INFO] 
[INFO] --- maven-enforcer-plugin:3.0.0-M3:enforce (enforce-maven) @ org.eclipse.swt.tools.spies ---
[INFO] 
[INFO] --- jacoco-maven-plugin:0.8.5:prepare-agent (jacoco-agent) @ org.eclipse.swt.tools.spies ---
[INFO] argLine set to -javaagent:/home/jenkins/agent/workspace/eclipse.platform.swt-SonarQube/.repository/org/jacoco/org.jacoco.agent/0.8.5/org.jacoco.agent-0.8.5-runtime.jar=destfile=/home/jenkins/agent/workspace/eclipse.platform.swt-SonarQube/jacoco.exec,append=true
[INFO] 
[INFO] --- eclipse-cbi-plugin:1.1.8-SNAPSHOT:generate-api-build-xml (default) @ org.eclipse.swt.tools.spies ---
[INFO] 
[INFO] --- maven-resources-plugin:3.1.0:resources (default-resources) @ org.eclipse.swt.tools.spies ---
[INFO] Using 'UTF-8' encoding to copy filtered resources.
[INFO] skip non existing resourceDirectory /home/jenkins/agent/workspace/eclipse.platform.swt-SonarQube/bundles/org.eclipse.swt.tools.spies/src/main/resources
[INFO] 
[INFO] --- maven-resources-plugin:3.1.0:resources (filter-resources) @ org.eclipse.swt.tools.spies ---
[INFO] Using 'UTF-8' encoding to copy filtered resources.
[INFO] skip non existing resourceDirectory /home/jenkins/agent/workspace/eclipse.platform.swt-SonarQube/bundles/org.eclipse.swt.tools.spies/src/main/resources
[INFO] 
[INFO] --- tycho-compiler-plugin:1.7.0:compile (default-compile) @ org.eclipse.swt.tools.spies ---
[INFO] Compiling 4 source files to /home/jenkins/agent/workspace/eclipse.platform.swt-SonarQube/bundles/org.eclipse.swt.tools.spies/target/classes
[INFO] 
[INFO] --- tycho-eclipserun-plugin:1.7.0:eclipse-run (default) @ org.eclipse.swt.tools.spies ---
[INFO] 
[INFO] --- maven-resources-plugin:3.1.0:testResources (default-testResources) @ org.eclipse.swt.tools.spies ---
[INFO] Using 'UTF-8' encoding to copy filtered resources.
[INFO] skip non existing resourceDirectory /home/jenkins/agent/workspace/eclipse.platform.swt-SonarQube/bundles/org.eclipse.swt.tools.spies/src/test/resources
[INFO] 
[INFO] --- tycho-source-plugin:1.7.0:plugin-source (plugin-source) @ org.eclipse.swt.tools.spies ---
[INFO] Building jar: /home/jenkins/agent/workspace/eclipse.platform.swt-SonarQube/bundles/org.eclipse.swt.tools.spies/target/org.eclipse.swt.tools.spies-3.107.300-SNAPSHOT-sources.jar
[INFO] 
[INFO] --- target-platform-configuration:1.7.0:target-platform (default-target-platform) @ org.eclipse.swt.tools.spies ---
[INFO] 
[INFO] --- tycho-packaging-plugin:1.7.0:package-plugin (default-package-plugin) @ org.eclipse.swt.tools.spies ---
[INFO] Building jar: /home/jenkins/agent/workspace/eclipse.platform.swt-SonarQube/bundles/org.eclipse.swt.tools.spies/target/org.eclipse.swt.tools.spies-3.107.300-SNAPSHOT.jar
[INFO] 
[INFO] --- tycho-p2-plugin:1.7.0:p2-metadata-default (default-p2-metadata-default) @ org.eclipse.swt.tools.spies ---
[WARNING] No repository found at file:/noThanks.
org.eclipse.equinox.p2.core.ProvisionException: No repository found at file:/noThanks.
    at org.eclipse.equinox.internal.p2.repository.helpers.AbstractRepositoryManager.fail (AbstractRepositoryManager.java:396)
    at org.eclipse.equinox.internal.p2.repository.helpers.AbstractRepositoryManager.loadRepository (AbstractRepositoryManager.java:661)
    at org.eclipse.equinox.internal.p2.metadata.repository.MetadataRepositoryManager.loadRepository (MetadataRepositoryManager.java:110)
    at org.eclipse.tycho.p2.remote.RemoteMetadataRepositoryManager.loadRepository (RemoteMetadataRepositoryManager.java:61)
    at org.eclipse.tycho.p2.remote.RemoteMetadataRepositoryManager.loadRepository (RemoteMetadataRepositoryManager.java:53)
    at org.eclipse.tycho.p2.tools.baseline.BaselineServiceImpl.getProjectBaseline (BaselineServiceImpl.java:95)
    at org.eclipse.tycho.plugins.p2.BaselineValidator.validateAndReplace (BaselineValidator.java:88)
    at org.eclipse.tycho.plugins.p2.P2MetadataMojo.attachP2Metadata (P2MetadataMojo.java:183)
    at org.eclipse.tycho.plugins.p2.P2MetadataMojo.execute (P2MetadataMojo.java:137)
    at org.eclipse.tycho.plugins.p2.P2MetadataDefaultMojo.execute (P2MetadataDefaultMojo.java:32)
    at org.apache.maven.plugin.DefaultBuildPluginManager.executeMojo (DefaultBuildPluginManager.java:137)
    at org.apache.maven.lifecycle.internal.MojoExecutor.execute (MojoExecutor.java:210)
    at org.apache.maven.lifecycle.internal.MojoExecutor.execute (MojoExecutor.java:156)
    at org.apache.maven.lifecycle.internal.MojoExecutor.execute (MojoExecutor.java:148)
    at org.apache.maven.lifecycle.internal.LifecycleModuleBuilder.buildProject (LifecycleModuleBuilder.java:117)
    at org.apache.maven.lifecycle.internal.LifecycleModuleBuilder.buildProject (LifecycleModuleBuilder.java:81)
    at org.apache.maven.lifecycle.internal.builder.singlethreaded.SingleThreadedBuilder.build (SingleThreadedBuilder.java:56)
    at org.apache.maven.lifecycle.internal.LifecycleStarter.execute (LifecycleStarter.java:128)
    at org.apache.maven.DefaultMaven.doExecute (DefaultMaven.java:305)
    at org.apache.maven.DefaultMaven.doExecute (DefaultMaven.java:192)
    at org.apache.maven.DefaultMaven.execute (DefaultMaven.java:105)
    at org.apache.maven.cli.MavenCli.execute (MavenCli.java:957)
    at org.apache.maven.cli.MavenCli.doMain (MavenCli.java:289)
    at org.apache.maven.cli.MavenCli.main (MavenCli.java:193)
    at sun.reflect.NativeMethodAccessorImpl.invoke0 (Native Method)
    at sun.reflect.NativeMethodAccessorImpl.invoke (NativeMethodAccessorImpl.java:62)
    at sun.reflect.DelegatingMethodAccessorImpl.invoke (DelegatingMethodAccessorImpl.java:43)
    at java.lang.reflect.Method.invoke (Method.java:498)
    at org.codehaus.plexus.classworlds.launcher.Launcher.launchEnhanced (Launcher.java:282)
    at org.codehaus.plexus.classworlds.launcher.Launcher.launch (Launcher.java:225)
    at org.codehaus.plexus.classworlds.launcher.Launcher.mainWithExitCode (Launcher.java:406)
    at org.codehaus.plexus.classworlds.launcher.Launcher.main (Launcher.java:347)
[INFO] No baseline version MavenProject: org.eclipse.swt:org.eclipse.swt.tools.spies:3.107.300-SNAPSHOT @ /home/jenkins/agent/workspace/eclipse.platform.swt-SonarQube/bundles/org.eclipse.swt.tools.spies/pom.xml
[INFO] 
[INFO] --- tycho-p2-extras-plugin:1.7.0:compare-version-with-baselines (compare-attached-artifacts-with-release) @ org.eclipse.swt.tools.spies ---
[INFO] Skipped
[INFO] 
[INFO] ---------------< org.eclipse.swt:org.eclipse.swt.tools >----------------
[INFO] Building org.eclipse.swt.tools 3.108.300-SNAPSHOT                 [6/15]
[INFO] ---------------------------[ eclipse-plugin ]---------------------------
[INFO] 
[INFO] --- maven-clean-plugin:3.1.0:clean (default-clean) @ org.eclipse.swt.tools ---
[INFO] 
[INFO] --- tycho-packaging-plugin:1.7.0:build-qualifier (default-build-qualifier) @ org.eclipse.swt.tools ---
[INFO] The project's OSGi version is 3.108.300.v20200511-2029
[INFO] 
[INFO] --- tycho-packaging-plugin:1.7.0:validate-id (default-validate-id) @ org.eclipse.swt.tools ---
[INFO] 
[INFO] --- tycho-packaging-plugin:1.7.0:validate-version (default-validate-version) @ org.eclipse.swt.tools ---
[INFO] 
[INFO] --- maven-resources-plugin:3.1.0:copy-resources (saveproperties) @ org.eclipse.swt.tools ---
[INFO] Using 'UTF-8' encoding to copy filtered resources.
[INFO] skip non existing resourceDirectory /home/jenkins/agent/workspace/eclipse.platform.swt-SonarQube/bundles/org.eclipse.swt.tools/saveproperties
[INFO] 
[INFO] --- maven-enforcer-plugin:3.0.0-M3:enforce (enforce-maven) @ org.eclipse.swt.tools ---
[INFO] 
[INFO] --- jacoco-maven-plugin:0.8.5:prepare-agent (jacoco-agent) @ org.eclipse.swt.tools ---
[INFO] argLine set to -javaagent:/home/jenkins/agent/workspace/eclipse.platform.swt-SonarQube/.repository/org/jacoco/org.jacoco.agent/0.8.5/org.jacoco.agent-0.8.5-runtime.jar=destfile=/home/jenkins/agent/workspace/eclipse.platform.swt-SonarQube/jacoco.exec,append=true
[INFO] 
[INFO] --- eclipse-cbi-plugin:1.1.8-SNAPSHOT:generate-api-build-xml (default) @ org.eclipse.swt.tools ---
[INFO] 
[INFO] --- maven-resources-plugin:3.1.0:resources (default-resources) @ org.eclipse.swt.tools ---
[INFO] Using 'UTF-8' encoding to copy filtered resources.
[INFO] skip non existing resourceDirectory /home/jenkins/agent/workspace/eclipse.platform.swt-SonarQube/bundles/org.eclipse.swt.tools/src/main/resources
[INFO] 
[INFO] --- maven-resources-plugin:3.1.0:resources (filter-resources) @ org.eclipse.swt.tools ---
[INFO] Using 'UTF-8' encoding to copy filtered resources.
[INFO] skip non existing resourceDirectory /home/jenkins/agent/workspace/eclipse.platform.swt-SonarQube/bundles/org.eclipse.swt.tools/src/main/resources
[INFO] 
[INFO] --- tycho-compiler-plugin:1.7.0:compile (default-compile) @ org.eclipse.swt.tools ---
[INFO] Compiling 44 source files to /home/jenkins/agent/workspace/eclipse.platform.swt-SonarQube/bundles/org.eclipse.swt.tools/target/classes
[INFO] 
[INFO] --- tycho-eclipserun-plugin:1.7.0:eclipse-run (default) @ org.eclipse.swt.tools ---
[INFO] 
[INFO] --- maven-resources-plugin:3.1.0:testResources (default-testResources) @ org.eclipse.swt.tools ---
[INFO] Using 'UTF-8' encoding to copy filtered resources.
[INFO] skip non existing resourceDirectory /home/jenkins/agent/workspace/eclipse.platform.swt-SonarQube/bundles/org.eclipse.swt.tools/src/test/resources
[INFO] 
[INFO] --- tycho-source-plugin:1.7.0:plugin-source (plugin-source) @ org.eclipse.swt.tools ---
[INFO] Building jar: /home/jenkins/agent/workspace/eclipse.platform.swt-SonarQube/bundles/org.eclipse.swt.tools/target/org.eclipse.swt.tools-3.108.300-SNAPSHOT-sources.jar
[INFO] 
[INFO] --- target-platform-configuration:1.7.0:target-platform (default-target-platform) @ org.eclipse.swt.tools ---
[INFO] 
[INFO] --- tycho-packaging-plugin:1.7.0:package-plugin (default-package-plugin) @ org.eclipse.swt.tools ---
[INFO] Building jar: /home/jenkins/agent/workspace/eclipse.platform.swt-SonarQube/bundles/org.eclipse.swt.tools/target/org.eclipse.swt.tools-3.108.300-SNAPSHOT.jar
[INFO] 
[INFO] --- tycho-p2-plugin:1.7.0:p2-metadata-default (default-p2-metadata-default) @ org.eclipse.swt.tools ---
[WARNING] No repository found at file:/noThanks.
org.eclipse.equinox.p2.core.ProvisionException: No repository found at file:/noThanks.
    at org.eclipse.equinox.internal.p2.repository.helpers.AbstractRepositoryManager.fail (AbstractRepositoryManager.java:396)
    at org.eclipse.equinox.internal.p2.repository.helpers.AbstractRepositoryManager.loadRepository (AbstractRepositoryManager.java:661)
    at org.eclipse.equinox.internal.p2.metadata.repository.MetadataRepositoryManager.loadRepository (MetadataRepositoryManager.java:110)
    at org.eclipse.tycho.p2.remote.RemoteMetadataRepositoryManager.loadRepository (RemoteMetadataRepositoryManager.java:61)
    at org.eclipse.tycho.p2.remote.RemoteMetadataRepositoryManager.loadRepository (RemoteMetadataRepositoryManager.java:53)
    at org.eclipse.tycho.p2.tools.baseline.BaselineServiceImpl.getProjectBaseline (BaselineServiceImpl.java:95)
    at org.eclipse.tycho.plugins.p2.BaselineValidator.validateAndReplace (BaselineValidator.java:88)
    at org.eclipse.tycho.plugins.p2.P2MetadataMojo.attachP2Metadata (P2MetadataMojo.java:183)
    at org.eclipse.tycho.plugins.p2.P2MetadataMojo.execute (P2MetadataMojo.java:137)
    at org.eclipse.tycho.plugins.p2.P2MetadataDefaultMojo.execute (P2MetadataDefaultMojo.java:32)
    at org.apache.maven.plugin.DefaultBuildPluginManager.executeMojo (DefaultBuildPluginManager.java:137)
    at org.apache.maven.lifecycle.internal.MojoExecutor.execute (MojoExecutor.java:210)
    at org.apache.maven.lifecycle.internal.MojoExecutor.execute (MojoExecutor.java:156)
    at org.apache.maven.lifecycle.internal.MojoExecutor.execute (MojoExecutor.java:148)
    at org.apache.maven.lifecycle.internal.LifecycleModuleBuilder.buildProject (LifecycleModuleBuilder.java:117)
    at org.apache.maven.lifecycle.internal.LifecycleModuleBuilder.buildProject (LifecycleModuleBuilder.java:81)
    at org.apache.maven.lifecycle.internal.builder.singlethreaded.SingleThreadedBuilder.build (SingleThreadedBuilder.java:56)
    at org.apache.maven.lifecycle.internal.LifecycleStarter.execute (LifecycleStarter.java:128)
    at org.apache.maven.DefaultMaven.doExecute (DefaultMaven.java:305)
    at org.apache.maven.DefaultMaven.doExecute (DefaultMaven.java:192)
    at org.apache.maven.DefaultMaven.execute (DefaultMaven.java:105)
    at org.apache.maven.cli.MavenCli.execute (MavenCli.java:957)
    at org.apache.maven.cli.MavenCli.doMain (MavenCli.java:289)
    at org.apache.maven.cli.MavenCli.main (MavenCli.java:193)
    at sun.reflect.NativeMethodAccessorImpl.invoke0 (Native Method)
    at sun.reflect.NativeMethodAccessorImpl.invoke (NativeMethodAccessorImpl.java:62)
    at sun.reflect.DelegatingMethodAccessorImpl.invoke (DelegatingMethodAccessorImpl.java:43)
    at java.lang.reflect.Method.invoke (Method.java:498)
    at org.codehaus.plexus.classworlds.launcher.Launcher.launchEnhanced (Launcher.java:282)
    at org.codehaus.plexus.classworlds.launcher.Launcher.launch (Launcher.java:225)
    at org.codehaus.plexus.classworlds.launcher.Launcher.mainWithExitCode (Launcher.java:406)
    at org.codehaus.plexus.classworlds.launcher.Launcher.main (Launcher.java:347)
[INFO] No baseline version MavenProject: org.eclipse.swt:org.eclipse.swt.tools:3.108.300-SNAPSHOT @ /home/jenkins/agent/workspace/eclipse.platform.swt-SonarQube/bundles/org.eclipse.swt.tools/pom.xml
[INFO] 
[INFO] --- tycho-p2-extras-plugin:1.7.0:compare-version-with-baselines (compare-attached-artifacts-with-release) @ org.eclipse.swt.tools ---
[INFO] Skipped
[INFO] 
[INFO] --------------< org.eclipse.swt:org.eclipse.swt.examples >--------------
[INFO] Building org.eclipse.swt.examples 3.106.1000-SNAPSHOT             [7/15]
[INFO] ---------------------------[ eclipse-plugin ]---------------------------
[INFO] 
[INFO] --- maven-clean-plugin:3.1.0:clean (default-clean) @ org.eclipse.swt.examples ---
[INFO] 
[INFO] --- tycho-packaging-plugin:1.7.0:build-qualifier (default-build-qualifier) @ org.eclipse.swt.examples ---
[INFO] The project's OSGi version is 3.106.1000.v20200611-1332
[INFO] 
[INFO] --- tycho-packaging-plugin:1.7.0:validate-id (default-validate-id) @ org.eclipse.swt.examples ---
[INFO] 
[INFO] --- tycho-packaging-plugin:1.7.0:validate-version (default-validate-version) @ org.eclipse.swt.examples ---
[INFO] 
[INFO] --- maven-resources-plugin:3.1.0:copy-resources (saveproperties) @ org.eclipse.swt.examples ---
[INFO] Using 'UTF-8' encoding to copy filtered resources.
[INFO] skip non existing resourceDirectory /home/jenkins/agent/workspace/eclipse.platform.swt-SonarQube/examples/org.eclipse.swt.examples/saveproperties
[INFO] 
[INFO] --- maven-enforcer-plugin:3.0.0-M3:enforce (enforce-maven) @ org.eclipse.swt.examples ---
[INFO] 
[INFO] --- jacoco-maven-plugin:0.8.5:prepare-agent (jacoco-agent) @ org.eclipse.swt.examples ---
[INFO] argLine set to -javaagent:/home/jenkins/agent/workspace/eclipse.platform.swt-SonarQube/.repository/org/jacoco/org.jacoco.agent/0.8.5/org.jacoco.agent-0.8.5-runtime.jar=destfile=/home/jenkins/agent/workspace/eclipse.platform.swt-SonarQube/jacoco.exec,append=true
[INFO] 
[INFO] --- eclipse-cbi-plugin:1.1.8-SNAPSHOT:generate-api-build-xml (default) @ org.eclipse.swt.examples ---
[INFO] 
[INFO] --- maven-resources-plugin:3.1.0:resources (default-resources) @ org.eclipse.swt.examples ---
[INFO] Using 'UTF-8' encoding to copy filtered resources.
[INFO] skip non existing resourceDirectory /home/jenkins/agent/workspace/eclipse.platform.swt-SonarQube/examples/org.eclipse.swt.examples/src/main/resources
[INFO] 
[INFO] --- maven-resources-plugin:3.1.0:resources (filter-resources) @ org.eclipse.swt.examples ---
[INFO] Using 'UTF-8' encoding to copy filtered resources.
[INFO] skip non existing resourceDirectory /home/jenkins/agent/workspace/eclipse.platform.swt-SonarQube/examples/org.eclipse.swt.examples/src/main/resources
[INFO] 
[INFO] --- tycho-compiler-plugin:1.7.0:compile (default-compile) @ org.eclipse.swt.examples ---
[INFO] Compiling 148 source files to /home/jenkins/agent/workspace/eclipse.platform.swt-SonarQube/examples/org.eclipse.swt.examples/target/classes
[INFO] ------------------------------------------------------------------------
[INFO] Reactor Summary:
[INFO] 
[INFO] eclipse.platform.swt 4.17.0-SNAPSHOT ............... SUCCESS [04:08 min]
[INFO] org.eclipse.swt 3.115.0-SNAPSHOT ................... SUCCESS [ 50.271 s]
[INFO] org.eclipse.swt.fragments.localbuild 3.105.0-SNAPSHOT SUCCESS [  0.688 s]
[INFO] org.eclipse.swt.tools.base 3.107.300-SNAPSHOT ...... SUCCESS [  0.481 s]
[INFO] org.eclipse.swt.tools.spies 3.107.300-SNAPSHOT ..... SUCCESS [  1.289 s]
[INFO] org.eclipse.swt.tools 3.108.300-SNAPSHOT ........... SUCCESS [  1.587 s]
[INFO] org.eclipse.swt.examples 3.106.1000-SNAPSHOT ....... FAILURE [  2.627 s]
[INFO] org.eclipse.swt.examples.browser.demos 3.106.400-SNAPSHOT SKIPPED
[INFO] org.eclipse.swt.examples.launcher 3.106.300-SNAPSHOT SKIPPED
[INFO] org.eclipse.swt.examples.ole.win32 3.107.400-SNAPSHOT SKIPPED
[INFO] org.eclipse.swt.examples.views 3.106.300-SNAPSHOT .. SKIPPED
[INFO] org.eclipse.swt.tests.fragments.feature 3.106.0-SNAPSHOT SKIPPED
[INFO] org.eclipse.swt.tests 3.106.1000-SNAPSHOT .......... SKIPPED
[INFO] org.eclipse.swt.tools.feature 3.107.900-SNAPSHOT ... SKIPPED
[INFO] org.eclipse.swt.tests.gtk 3.107.200-SNAPSHOT ....... SKIPPED
[INFO] ------------------------------------------------------------------------
[INFO] BUILD FAILURE
[INFO] ------------------------------------------------------------------------
[INFO] Total time:  12:37 min
[INFO] Finished at: 2020-06-12T08:40:40Z
[INFO] ------------------------------------------------------------------------
[ERROR] Failed to execute goal org.eclipse.tycho:tycho-compiler-plugin:1.7.0:compile (default-compile) on project org.eclipse.swt.examples: Compilation failure: Compilation failure: 
[ERROR] /home/jenkins/agent/workspace/eclipse.platform.swt-SonarQube/examples/org.eclipse.swt.examples/src/org/eclipse/swt/examples/helloworld/HelloWorld5.java:[43] 
[ERROR] 	final Color red = new Color(0xFF, 0, 0);
[ERROR] 	                  ^^^^^^^^^^^^^^^^^^^^^
[ERROR] The constructor Color(int, int, int) is undefined
[ERROR] /home/jenkins/agent/workspace/eclipse.platform.swt-SonarQube/examples/org.eclipse.swt.examples/src/org/eclipse/swt/examples/controlexample/TreeTab.java:[150] 
[ERROR] 	itemForegroundColor = new Color (rgb);
[ERROR] 	                      ^^^^^^^^^^^^^^^
[ERROR] The constructor Color(RGB) is undefined
[ERROR] /home/jenkins/agent/workspace/eclipse.platform.swt-SonarQube/examples/org.eclipse.swt.examples/src/org/eclipse/swt/examples/controlexample/TreeTab.java:[162] 
[ERROR] 	itemBackgroundColor = new Color (rgb);
[ERROR] 	                      ^^^^^^^^^^^^^^^
[ERROR] The constructor Color(RGB) is undefined
[ERROR] /home/jenkins/agent/workspace/eclipse.platform.swt-SonarQube/examples/org.eclipse.swt.examples/src/org/eclipse/swt/examples/controlexample/TreeTab.java:[187] 
[ERROR] 	cellForegroundColor = new Color (rgb);
[ERROR] 	                      ^^^^^^^^^^^^^^^
[ERROR] The constructor Color(RGB) is undefined
[ERROR] /home/jenkins/agent/workspace/eclipse.platform.swt-SonarQube/examples/org.eclipse.swt.examples/src/org/eclipse/swt/examples/controlexample/TreeTab.java:[199] 
[ERROR] 	cellBackgroundColor = new Color (rgb);
[ERROR] 	                      ^^^^^^^^^^^^^^^
[ERROR] The constructor Color(RGB) is undefined
[ERROR] /home/jenkins/agent/workspace/eclipse.platform.swt-SonarQube/examples/org.eclipse.swt.examples/src/org/eclipse/swt/examples/controlexample/TreeTab.java:[224] 
[ERROR] 	headerForegroundColor = new Color (rgb);
[ERROR] 	                        ^^^^^^^^^^^^^^^
[ERROR] The constructor Color(RGB) is undefined
[ERROR] /home/jenkins/agent/workspace/eclipse.platform.swt-SonarQube/examples/org.eclipse.swt.examples/src/org/eclipse/swt/examples/controlexample/TreeTab.java:[236] 
[ERROR] 	headerBackgroundColor = new Color (rgb);
[ERROR] 	                        ^^^^^^^^^^^^^^^
[ERROR] The constructor Color(RGB) is undefined
[ERROR] /home/jenkins/agent/workspace/eclipse.platform.swt-SonarQube/examples/org.eclipse.swt.examples/src/org/eclipse/swt/examples/controlexample/TableTab.java:[148] 
[ERROR] 	itemForegroundColor = new Color (rgb);
[ERROR] 	                      ^^^^^^^^^^^^^^^
[ERROR] The constructor Color(RGB) is undefined
[ERROR] /home/jenkins/agent/workspace/eclipse.platform.swt-SonarQube/examples/org.eclipse.swt.examples/src/org/eclipse/swt/examples/controlexample/TableTab.java:[160] 
[ERROR] 	itemBackgroundColor = new Color (rgb);
[ERROR] 	                      ^^^^^^^^^^^^^^^
[ERROR] The constructor Color(RGB) is undefined
[ERROR] /home/jenkins/agent/workspace/eclipse.platform.swt-SonarQube/examples/org.eclipse.swt.examples/src/org/eclipse/swt/examples/controlexample/TableTab.java:[185] 
[ERROR] 	cellForegroundColor = new Color (rgb);
[ERROR] 	                      ^^^^^^^^^^^^^^^
[ERROR] The constructor Color(RGB) is undefined
[ERROR] /home/jenkins/agent/workspace/eclipse.platform.swt-SonarQube/examples/org.eclipse.swt.examples/src/org/eclipse/swt/examples/controlexample/TableTab.java:[197] 
[ERROR] 	cellBackgroundColor = new Color (rgb);
[ERROR] 	                      ^^^^^^^^^^^^^^^
[ERROR] The constructor Color(RGB) is undefined
[ERROR] /home/jenkins/agent/workspace/eclipse.platform.swt-SonarQube/examples/org.eclipse.swt.examples/src/org/eclipse/swt/examples/controlexample/TableTab.java:[222] 
[ERROR] 	headerForegroundColor = new Color (rgb);
[ERROR] 	                        ^^^^^^^^^^^^^^^
[ERROR] The constructor Color(RGB) is undefined
[ERROR] /home/jenkins/agent/workspace/eclipse.platform.swt-SonarQube/examples/org.eclipse.swt.examples/src/org/eclipse/swt/examples/controlexample/TableTab.java:[234] 
[ERROR] 	headerBackgroundColor = new Color (rgb);
[ERROR] 	                        ^^^^^^^^^^^^^^^
[ERROR] The constructor Color(RGB) is undefined
[ERROR] /home/jenkins/agent/workspace/eclipse.platform.swt-SonarQube/examples/org.eclipse.swt.examples/src/org/eclipse/swt/examples/imageanalyzer/ImageAnalyzer.java:[233] 
[ERROR] 	whiteColor = new Color(255, 255, 255);
[ERROR] 	             ^^^^^^^^^^^^^^^^^^^^^^^^
[ERROR] The constructor Color(int, int, int) is undefined
[ERROR] /home/jenkins/agent/workspace/eclipse.platform.swt-SonarQube/examples/org.eclipse.swt.examples/src/org/eclipse/swt/examples/imageanalyzer/ImageAnalyzer.java:[234] 
[ERROR] 	blackColor = new Color(0, 0, 0);
[ERROR] 	             ^^^^^^^^^^^^^^^^^^
[ERROR] The constructor Color(int, int, int) is undefined
[ERROR] /home/jenkins/agent/workspace/eclipse.platform.swt-SonarQube/examples/org.eclipse.swt.examples/src/org/eclipse/swt/examples/imageanalyzer/ImageAnalyzer.java:[235] 
[ERROR] 	redColor = new Color(255, 0, 0);
[ERROR] 	           ^^^^^^^^^^^^^^^^^^^^
[ERROR] The constructor Color(int, int, int) is undefined
[ERROR] /home/jenkins/agent/workspace/eclipse.platform.swt-SonarQube/examples/org.eclipse.swt.examples/src/org/eclipse/swt/examples/imageanalyzer/ImageAnalyzer.java:[236] 
[ERROR] 	greenColor = new Color(0, 255, 0);
[ERROR] 	             ^^^^^^^^^^^^^^^^^^^^
[ERROR] The constructor Color(int, int, int) is undefined
[ERROR] /home/jenkins/agent/workspace/eclipse.platform.swt-SonarQube/examples/org.eclipse.swt.examples/src/org/eclipse/swt/examples/imageanalyzer/ImageAnalyzer.java:[237] 
[ERROR] 	blueColor = new Color(0, 0, 255);
[ERROR] 	            ^^^^^^^^^^^^^^^^^^^^
[ERROR] The constructor Color(int, int, int) is undefined
[ERROR] /home/jenkins/agent/workspace/eclipse.platform.swt-SonarQube/examples/org.eclipse.swt.examples/src/org/eclipse/swt/examples/imageanalyzer/ImageAnalyzer.java:[1489] 
[ERROR] 	bgColor = new Color(backgroundRGB);
[ERROR] 	          ^^^^^^^^^^^^^^^^^^^^^^^^
[ERROR] The constructor Color(RGB) is undefined
[ERROR] /home/jenkins/agent/workspace/eclipse.platform.swt-SonarQube/examples/org.eclipse.swt.examples/src/org/eclipse/swt/examples/imageanalyzer/ImageAnalyzer.java:[1857] 
[ERROR] 	Color color = new Color(rgbs[i]);
[ERROR] 	              ^^^^^^^^^^^^^^^^^^
[ERROR] The constructor Color(RGB) is undefined
[ERROR] /home/jenkins/agent/workspace/eclipse.platform.swt-SonarQube/examples/org.eclipse.swt.examples/src/org/eclipse/swt/examples/javaviewer/JavaLineStyler.java:[76] 
[ERROR] 	new Color(new RGB(0, 0, 0)),		// black
[ERROR] 	^^^^^^^^^^^^^^^^^^^^^^^^^^^
[ERROR] The constructor Color(RGB) is undefined
[ERROR] /home/jenkins/agent/workspace/eclipse.platform.swt-SonarQube/examples/org.eclipse.swt.examples/src/org/eclipse/swt/examples/javaviewer/JavaLineStyler.java:[77] 
[ERROR] 	new Color(new RGB(255, 0, 0)),	// red
[ERROR] 	^^^^^^^^^^^^^^^^^^^^^^^^^^^^^
[ERROR] The constructor Color(RGB) is undefined
[ERROR] /home/jenkins/agent/workspace/eclipse.platform.swt-SonarQube/examples/org.eclipse.swt.examples/src/org/eclipse/swt/examples/javaviewer/JavaLineStyler.java:[78] 
[ERROR] 	new Color(new RGB(0, 255, 0)),	// green
[ERROR] 	^^^^^^^^^^^^^^^^^^^^^^^^^^^^^
[ERROR] The constructor Color(RGB) is undefined
[ERROR] /home/jenkins/agent/workspace/eclipse.platform.swt-SonarQube/examples/org.eclipse.swt.examples/src/org/eclipse/swt/examples/javaviewer/JavaLineStyler.java:[79] 
[ERROR] 	new Color(new RGB(0,   0, 255))	// blue
[ERROR] 	^^^^^^^^^^^^^^^^^^^^^^^^^^^^^^^
[ERROR] The constructor Color(RGB) is undefined
[ERROR] /home/jenkins/agent/workspace/eclipse.platform.swt-SonarQube/examples/org.eclipse.swt.examples/src/org/eclipse/swt/examples/controlexample/LinkTab.java:[109] 
[ERROR] 	linkForegroundColor = new Color (rgb);
[ERROR] 	                      ^^^^^^^^^^^^^^^
[ERROR] The constructor Color(RGB) is undefined
[ERROR] /home/jenkins/agent/workspace/eclipse.platform.swt-SonarQube/examples/org.eclipse.swt.examples/src/org/eclipse/swt/examples/texteditor/TextEditor.java:[561] 
[ERROR] 	underlineColor = new Color(newRgb);
[ERROR] 	                 ^^^^^^^^^^^^^^^^^
[ERROR] The constructor Color(RGB) is undefined
[ERROR] /home/jenkins/agent/workspace/eclipse.platform.swt-SonarQube/examples/org.eclipse.swt.examples/src/org/eclipse/swt/examples/texteditor/TextEditor.java:[599] 
[ERROR] 	strikeoutColor = new Color(newRgb);
[ERROR] 	                 ^^^^^^^^^^^^^^^^^
[ERROR] The constructor Color(RGB) is undefined
[ERROR] /home/jenkins/agent/workspace/eclipse.platform.swt-SonarQube/examples/org.eclipse.swt.examples/src/org/eclipse/swt/examples/texteditor/TextEditor.java:[641] 
[ERROR] 	borderColor = new Color(newRgb);
[ERROR] 	              ^^^^^^^^^^^^^^^^^
[ERROR] The constructor Color(RGB) is undefined
[ERROR] /home/jenkins/agent/workspace/eclipse.platform.swt-SonarQube/examples/org.eclipse.swt.examples/src/org/eclipse/swt/examples/texteditor/TextEditor.java:[677] 
[ERROR] 	textForeground = new Color(newRgb);
[ERROR] 	                 ^^^^^^^^^^^^^^^^^
[ERROR] The constructor Color(RGB) is undefined
[ERROR] /home/jenkins/agent/workspace/eclipse.platform.swt-SonarQube/examples/org.eclipse.swt.examples/src/org/eclipse/swt/examples/texteditor/TextEditor.java:[695] 
[ERROR] 	textBackground = new Color(newRgb);
[ERROR] 	                 ^^^^^^^^^^^^^^^^^
[ERROR] The constructor Color(RGB) is undefined
[ERROR] /home/jenkins/agent/workspace/eclipse.platform.swt-SonarQube/examples/org.eclipse.swt.examples/src/org/eclipse/swt/examples/texteditor/TextEditor.java:[947] 
[ERROR] 	range.foreground = new Color(red, green, blue);
[ERROR] 	                   ^^^^^^^^^^^^^^^^^^^^^^^^^^^
[ERROR] The constructor Color(int, int, int) is undefined
[ERROR] /home/jenkins/agent/workspace/eclipse.platform.swt-SonarQube/examples/org.eclipse.swt.examples/src/org/eclipse/swt/examples/texteditor/TextEditor.java:[953] 
[ERROR] 	range.background = new Color(red, green, blue);
[ERROR] 	                   ^^^^^^^^^^^^^^^^^^^^^^^^^^^
[ERROR] The constructor Color(int, int, int) is undefined
[ERROR] /home/jenkins/agent/workspace/eclipse.platform.swt-SonarQube/examples/org.eclipse.swt.examples/src/org/eclipse/swt/examples/graphics/ColorMenu.java:[317] 
[ERROR] 	customColor = new Color(rgb);
[ERROR] 	              ^^^^^^^^^^^^^^
[ERROR] The constructor Color(RGB) is undefined
[ERROR] /home/jenkins/agent/workspace/eclipse.platform.swt-SonarQube/examples/org.eclipse.swt.examples/src/org/eclipse/swt/examples/graphics/ColorMenu.java:[357] 
[ERROR] 	Color colorA = new Color(dialog.getFirstRGB());
[ERROR] 	               ^^^^^^^^^^^^^^^^^^^^^^^^^^^^^^^
[ERROR] The constructor Color(RGB) is undefined
[ERROR] /home/jenkins/agent/workspace/eclipse.platform.swt-SonarQube/examples/org.eclipse.swt.examples/src/org/eclipse/swt/examples/graphics/ColorMenu.java:[358] 
[ERROR] 	Color colorB = new Color(dialog.getSecondRGB());
[ERROR] 	               ^^^^^^^^^^^^^^^^^^^^^^^^^^^^^^^^
[ERROR] The constructor Color(RGB) is undefined
[ERROR] /home/jenkins/agent/workspace/eclipse.platform.swt-SonarQube/examples/org.eclipse.swt.examples/src/org/eclipse/swt/examples/paint/PaintExample.java:[414] 
[ERROR] 	paintColorWhite = new Color(255, 255, 255);
[ERROR] 	                  ^^^^^^^^^^^^^^^^^^^^^^^^
[ERROR] The constructor Color(int, int, int) is undefined
[ERROR] /home/jenkins/agent/workspace/eclipse.platform.swt-SonarQube/examples/org.eclipse.swt.examples/src/org/eclipse/swt/examples/paint/PaintExample.java:[415] 
[ERROR] 	paintColorBlack = new Color(0, 0, 0);
[ERROR] 	                  ^^^^^^^^^^^^^^^^^^
[ERROR] The constructor Color(int, int, int) is undefined
[ERROR] /home/jenkins/agent/workspace/eclipse.platform.swt-SonarQube/examples/org.eclipse.swt.examples/src/org/eclipse/swt/examples/paint/PaintExample.java:[423] 
[ERROR] 	paintColors[i] = new Color(((i*7)%255),
[ERROR] 				((i*23)%255),((i*51)%255));
[ERROR] 	                 ^^^^^^^^^^^^^^^^^^^^^^^^^^^^^^^^^^^^^^^^^^^^^^^^^^^^^
[ERROR] The constructor Color(int, int, int) is undefined
[ERROR] /home/jenkins/agent/workspace/eclipse.platform.swt-SonarQube/examples/org.eclipse.swt.examples/src/org/eclipse/swt/examples/graphics/GradientDialog.java:[148] 
[ERROR] 	Color color1 = new Color(rgb1);
[ERROR] 	               ^^^^^^^^^^^^^^^
[ERROR] The constructor Color(RGB) is undefined
[ERROR] /home/jenkins/agent/workspace/eclipse.platform.swt-SonarQube/examples/org.eclipse.swt.examples/src/org/eclipse/swt/examples/graphics/GradientDialog.java:[149] 
[ERROR] 	Color color2 = new Color(rgb2);
[ERROR] 	               ^^^^^^^^^^^^^^^
[ERROR] The constructor Color(RGB) is undefined
[ERROR] /home/jenkins/agent/workspace/eclipse.platform.swt-SonarQube/examples/org.eclipse.swt.examples/src/org/eclipse/swt/examples/graphics/GradientDialog.java:[177] 
[ERROR] 	Color color1 = new Color(rgb1);
[ERROR] 	               ^^^^^^^^^^^^^^^
[ERROR] The constructor Color(RGB) is undefined
[ERROR] /home/jenkins/agent/workspace/eclipse.platform.swt-SonarQube/examples/org.eclipse.swt.examples/src/org/eclipse/swt/examples/graphics/GradientDialog.java:[199] 
[ERROR] 	Color color2 = new Color(rgb2);
[ERROR] 	               ^^^^^^^^^^^^^^^
[ERROR] The constructor Color(RGB) is undefined
[ERROR] /home/jenkins/agent/workspace/eclipse.platform.swt-SonarQube/examples/org.eclipse.swt.examples/src/org/eclipse/swt/examples/controlexample/CTabFolderTab.java:[149] 
[ERROR] 	selectionForegroundColor = new Color (rgb);
[ERROR] 	                           ^^^^^^^^^^^^^^^
[ERROR] The constructor Color(RGB) is undefined
[ERROR] /home/jenkins/agent/workspace/eclipse.platform.swt-SonarQube/examples/org.eclipse.swt.examples/src/org/eclipse/swt/examples/controlexample/CTabFolderTab.java:[161] 
[ERROR] 	selectionBackgroundColor = new Color (rgb);
[ERROR] 	                           ^^^^^^^^^^^^^^^
[ERROR] The constructor Color(RGB) is undefined
[ERROR] /home/jenkins/agent/workspace/eclipse.platform.swt-SonarQube/examples/org.eclipse.swt.examples/src/org/eclipse/swt/examples/controlexample/CTabFolderTab.java:[186] 
[ERROR] 	itemForegroundColor = new Color (rgb);
[ERROR] 	                      ^^^^^^^^^^^^^^^
[ERROR] The constructor Color(RGB) is undefined
[ERROR] /home/jenkins/agent/workspace/eclipse.platform.swt-SonarQube/examples/org.eclipse.swt.examples/src/org/eclipse/swt/examples/controlexample/CTabFolderTab.java:[198] 
[ERROR] 	itemBackgroundColor = new Color (rgb);
[ERROR] 	                      ^^^^^^^^^^^^^^^
[ERROR] The constructor Color(RGB) is undefined
[ERROR] /home/jenkins/agent/workspace/eclipse.platform.swt-SonarQube/examples/org.eclipse.swt.examples/src/org/eclipse/swt/examples/controlexample/Tab.java:[464] 
[ERROR] 	foregroundColor = new Color (rgb);
[ERROR] 	                  ^^^^^^^^^^^^^^^
[ERROR] The constructor Color(RGB) is undefined
[ERROR] /home/jenkins/agent/workspace/eclipse.platform.swt-SonarQube/examples/org.eclipse.swt.examples/src/org/eclipse/swt/examples/controlexample/Tab.java:[479] 
[ERROR] 	backgroundColor = new Color (rgb);
[ERROR] 	                  ^^^^^^^^^^^^^^^
[ERROR] The constructor Color(RGB) is undefined
[ERROR] 48 problems (48 errors)
[ERROR] -> [Help 1]
[ERROR] 
[ERROR] To see the full stack trace of the errors, re-run Maven with the -e switch.
[ERROR] Re-run Maven using the -X switch to enable full debug logging.
[ERROR] 
[ERROR] For more information about the errors and possible solutions, please read the following articles:
[ERROR] [Help 1] http://cwiki.apache.org/confluence/display/MAVEN/MojoFailureException
[ERROR] 
[ERROR] After correcting the problems, you can resume the build with the command
[ERROR]   mvn <args> -rf :org.eclipse.swt.examples
Build step 'Invoke top-level Maven targets' marked build as failure
Terminating xvnc.
Skipping sonar analysis due to bad build status FAILURE
Recording test results
ERROR: Step ‘Publish JUnit test result report’ failed: No test report files were found. Configuration error?
Archiving artifacts
Finished: FAILURE