FailedConsole Output

Skipping 167 KB.. Full Log
n-plugin:3.1.0:clean (default-clean) @ org.eclipse.swt.tests ---
[INFO] 
[INFO] --- tycho-packaging-plugin:1.7.0:build-qualifier (default-build-qualifier) @ org.eclipse.swt.tests ---
[INFO] The project's OSGi version is 3.106.900.v20200510-2058
[INFO] 
[INFO] --- tycho-packaging-plugin:1.7.0:validate-id (default-validate-id) @ org.eclipse.swt.tests ---
[INFO] 
[INFO] --- tycho-packaging-plugin:1.7.0:validate-version (default-validate-version) @ org.eclipse.swt.tests ---
[INFO] 
[INFO] --- maven-resources-plugin:3.1.0:copy-resources (saveproperties) @ org.eclipse.swt.tests ---
[INFO] Using 'UTF-8' encoding to copy filtered resources.
[INFO] skip non existing resourceDirectory /home/jenkins/agent/workspace/eclipse.platform.swt-SonarQube/tests/org.eclipse.swt.tests/saveproperties
[INFO] 
[INFO] --- maven-enforcer-plugin:3.0.0-M3:enforce (enforce-maven) @ org.eclipse.swt.tests ---
[INFO] 
[INFO] --- jacoco-maven-plugin:0.8.5:prepare-agent (jacoco-agent) @ org.eclipse.swt.tests ---
[INFO] tycho.testArgLine set to -javaagent:/home/jenkins/agent/workspace/eclipse.platform.swt-SonarQube/.repository/org/jacoco/org.jacoco.agent/0.8.5/org.jacoco.agent-0.8.5-runtime.jar=destfile=/home/jenkins/agent/workspace/eclipse.platform.swt-SonarQube/jacoco.exec,append=true
[INFO] 
[INFO] --- eclipse-cbi-plugin:1.1.8-SNAPSHOT:generate-api-build-xml (default) @ org.eclipse.swt.tests ---
[INFO] 
[INFO] --- maven-resources-plugin:3.1.0:resources (default-resources) @ org.eclipse.swt.tests ---
[INFO] Using 'UTF-8' encoding to copy filtered resources.
[INFO] skip non existing resourceDirectory /home/jenkins/agent/workspace/eclipse.platform.swt-SonarQube/tests/org.eclipse.swt.tests/src/main/resources
[INFO] 
[INFO] --- maven-resources-plugin:3.1.0:resources (filter-resources) @ org.eclipse.swt.tests ---
[INFO] Using 'UTF-8' encoding to copy filtered resources.
[INFO] skip non existing resourceDirectory /home/jenkins/agent/workspace/eclipse.platform.swt-SonarQube/tests/org.eclipse.swt.tests/src/main/resources
[INFO] 
[INFO] --- tycho-compiler-plugin:1.7.0:compile (default-compile) @ org.eclipse.swt.tests ---
[INFO] Compiling 126 source files to /home/jenkins/agent/workspace/eclipse.platform.swt-SonarQube/tests/org.eclipse.swt.tests/target/classes
[INFO] 
[INFO] --- tycho-eclipserun-plugin:1.7.0:eclipse-run (default) @ org.eclipse.swt.tests ---
[INFO] 
[INFO] --- maven-resources-plugin:3.1.0:testResources (default-testResources) @ org.eclipse.swt.tests ---
[INFO] Using 'UTF-8' encoding to copy filtered resources.
[INFO] skip non existing resourceDirectory /home/jenkins/agent/workspace/eclipse.platform.swt-SonarQube/tests/org.eclipse.swt.tests/src/test/resources
[INFO] 
[INFO] --- tycho-source-plugin:1.7.0:plugin-source (plugin-source) @ org.eclipse.swt.tests ---
[INFO] Building jar: /home/jenkins/agent/workspace/eclipse.platform.swt-SonarQube/tests/org.eclipse.swt.tests/target/org.eclipse.swt.tests-3.106.900-SNAPSHOT-sources.jar
[INFO] 
[INFO] --- target-platform-configuration:1.7.0:target-platform (default-target-platform) @ org.eclipse.swt.tests ---
[INFO] 
[INFO] --- tycho-packaging-plugin:1.7.0:package-plugin (default-package-plugin) @ org.eclipse.swt.tests ---
[INFO] Building jar: /home/jenkins/agent/workspace/eclipse.platform.swt-SonarQube/tests/org.eclipse.swt.tests/target/org.eclipse.swt.tests-3.106.900-SNAPSHOT.jar
[INFO] 
[INFO] --- tycho-p2-plugin:1.7.0:p2-metadata-default (default-p2-metadata-default) @ org.eclipse.swt.tests ---
[WARNING] No repository found at file:/noThanks.
org.eclipse.equinox.p2.core.ProvisionException: No repository found at file:/noThanks.
    at org.eclipse.equinox.internal.p2.repository.helpers.AbstractRepositoryManager.fail (AbstractRepositoryManager.java:396)
    at org.eclipse.equinox.internal.p2.repository.helpers.AbstractRepositoryManager.loadRepository (AbstractRepositoryManager.java:661)
    at org.eclipse.equinox.internal.p2.metadata.repository.MetadataRepositoryManager.loadRepository (MetadataRepositoryManager.java:110)
    at org.eclipse.tycho.p2.remote.RemoteMetadataRepositoryManager.loadRepository (RemoteMetadataRepositoryManager.java:61)
    at org.eclipse.tycho.p2.remote.RemoteMetadataRepositoryManager.loadRepository (RemoteMetadataRepositoryManager.java:53)
    at org.eclipse.tycho.p2.tools.baseline.BaselineServiceImpl.getProjectBaseline (BaselineServiceImpl.java:95)
    at org.eclipse.tycho.plugins.p2.BaselineValidator.validateAndReplace (BaselineValidator.java:88)
    at org.eclipse.tycho.plugins.p2.P2MetadataMojo.attachP2Metadata (P2MetadataMojo.java:183)
    at org.eclipse.tycho.plugins.p2.P2MetadataMojo.execute (P2MetadataMojo.java:137)
    at org.eclipse.tycho.plugins.p2.P2MetadataDefaultMojo.execute (P2MetadataDefaultMojo.java:32)
    at org.apache.maven.plugin.DefaultBuildPluginManager.executeMojo (DefaultBuildPluginManager.java:137)
    at org.apache.maven.lifecycle.internal.MojoExecutor.execute (MojoExecutor.java:210)
    at org.apache.maven.lifecycle.internal.MojoExecutor.execute (MojoExecutor.java:156)
    at org.apache.maven.lifecycle.internal.MojoExecutor.execute (MojoExecutor.java:148)
    at org.apache.maven.lifecycle.internal.LifecycleModuleBuilder.buildProject (LifecycleModuleBuilder.java:117)
    at org.apache.maven.lifecycle.internal.LifecycleModuleBuilder.buildProject (LifecycleModuleBuilder.java:81)
    at org.apache.maven.lifecycle.internal.builder.singlethreaded.SingleThreadedBuilder.build (SingleThreadedBuilder.java:56)
    at org.apache.maven.lifecycle.internal.LifecycleStarter.execute (LifecycleStarter.java:128)
    at org.apache.maven.DefaultMaven.doExecute (DefaultMaven.java:305)
    at org.apache.maven.DefaultMaven.doExecute (DefaultMaven.java:192)
    at org.apache.maven.DefaultMaven.execute (DefaultMaven.java:105)
    at org.apache.maven.cli.MavenCli.execute (MavenCli.java:957)
    at org.apache.maven.cli.MavenCli.doMain (MavenCli.java:289)
    at org.apache.maven.cli.MavenCli.main (MavenCli.java:193)
    at sun.reflect.NativeMethodAccessorImpl.invoke0 (Native Method)
    at sun.reflect.NativeMethodAccessorImpl.invoke (NativeMethodAccessorImpl.java:62)
    at sun.reflect.DelegatingMethodAccessorImpl.invoke (DelegatingMethodAccessorImpl.java:43)
    at java.lang.reflect.Method.invoke (Method.java:498)
    at org.codehaus.plexus.classworlds.launcher.Launcher.launchEnhanced (Launcher.java:282)
    at org.codehaus.plexus.classworlds.launcher.Launcher.launch (Launcher.java:225)
    at org.codehaus.plexus.classworlds.launcher.Launcher.mainWithExitCode (Launcher.java:406)
    at org.codehaus.plexus.classworlds.launcher.Launcher.main (Launcher.java:347)
[INFO] No baseline version MavenProject: org.eclipse.swt:org.eclipse.swt.tests:3.106.900-SNAPSHOT @ /home/jenkins/agent/workspace/eclipse.platform.swt-SonarQube/tests/org.eclipse.swt.tests/pom.xml
[INFO] 
[INFO] --- tycho-surefire-plugin:1.7.0:test (default-test) @ org.eclipse.swt.tests ---
[INFO] Skipping tests
[INFO] 
[INFO] --- maven-surefire-plugin:3.0.0-M4:test (test) @ org.eclipse.swt.tests ---
[INFO] 
[INFO] -------------------------------------------------------
[INFO]  T E S T S
[INFO] -------------------------------------------------------
[INFO] Running org.eclipse.swt.tests.junit.Test_org_eclipse_swt_SWT
SWT.getVersion(): 4934
[INFO] Tests run: 6, Failures: 0, Errors: 0, Skipped: 0, Time elapsed: 0.091 s - in org.eclipse.swt.tests.junit.Test_org_eclipse_swt_SWT
[INFO] Running org.eclipse.swt.tests.junit.Test_org_eclipse_swt_SWTException
[INFO] Tests run: 6, Failures: 0, Errors: 0, Skipped: 0, Time elapsed: 0.004 s - in org.eclipse.swt.tests.junit.Test_org_eclipse_swt_SWTException
[INFO] Running org.eclipse.swt.tests.junit.Test_org_eclipse_swt_SWTError
[INFO] Tests run: 6, Failures: 0, Errors: 0, Skipped: 0, Time elapsed: 0.004 s - in org.eclipse.swt.tests.junit.Test_org_eclipse_swt_SWTError
[INFO] Running org.eclipse.swt.tests.junit.Test_org_eclipse_swt_widgets_Display
org.eclipse.swt.widgets.Display.isSystemDarkTheme(): false
org.eclipse.swt.internal.DPIUtil.getDeviceZoom(): 100
org.eclipse.swt.internal.gtk.version=3.22.30
org.eclipse.swt.tests.junit.Test_org_eclipse_swt_widgets_Display#test_setCursorLocationLorg_eclipse_swt_graphics_Point: actual == Point {100, 50}
org.eclipse.swt.tests.junit.Test_org_eclipse_swt_widgets_Display#test_setCursorLocationII: actual == Point {100, 100}
[INFO] Tests run: 55, Failures: 0, Errors: 0, Skipped: 0, Time elapsed: 12.489 s - in org.eclipse.swt.tests.junit.Test_org_eclipse_swt_widgets_Display
[INFO] Running org.eclipse.swt.tests.junit.Test_org_eclipse_swt_graphics_Color
[INFO] Tests run: 12, Failures: 0, Errors: 0, Skipped: 0, Time elapsed: 0.042 s - in org.eclipse.swt.tests.junit.Test_org_eclipse_swt_graphics_Color
[INFO] Running org.eclipse.swt.tests.junit.Test_org_eclipse_swt_graphics_Cursor
[INFO] Tests run: 5, Failures: 0, Errors: 0, Skipped: 0, Time elapsed: 0.136 s - in org.eclipse.swt.tests.junit.Test_org_eclipse_swt_graphics_Cursor
[INFO] Running org.eclipse.swt.tests.junit.Test_org_eclipse_swt_graphics_DeviceData
[INFO] Tests run: 1, Failures: 0, Errors: 0, Skipped: 0, Time elapsed: 0.002 s - in org.eclipse.swt.tests.junit.Test_org_eclipse_swt_graphics_DeviceData
[INFO] Running org.eclipse.swt.tests.junit.Test_org_eclipse_swt_graphics_Font
[INFO] Tests run: 9, Failures: 0, Errors: 0, Skipped: 0, Time elapsed: 0.002 s - in org.eclipse.swt.tests.junit.Test_org_eclipse_swt_graphics_Font
[INFO] Running org.eclipse.swt.tests.junit.Test_org_eclipse_swt_graphics_FontData
[INFO] Tests run: 10, Failures: 0, Errors: 0, Skipped: 0, Time elapsed: 0.002 s - in org.eclipse.swt.tests.junit.Test_org_eclipse_swt_graphics_FontData
[INFO] Running org.eclipse.swt.tests.junit.Test_org_eclipse_swt_graphics_FontMetrics
[INFO] Tests run: 8, Failures: 0, Errors: 0, Skipped: 0, Time elapsed: 0.073 s - in org.eclipse.swt.tests.junit.Test_org_eclipse_swt_graphics_FontMetrics
[INFO] Running org.eclipse.swt.tests.junit.Test_org_eclipse_swt_graphics_GC
[INFO] Tests run: 49, Failures: 0, Errors: 0, Skipped: 0, Time elapsed: 0.252 s - in org.eclipse.swt.tests.junit.Test_org_eclipse_swt_graphics_GC
[INFO] Running org.eclipse.swt.tests.junit.Test_org_eclipse_swt_graphics_Image
[INFO] Tests run: 20, Failures: 0, Errors: 0, Skipped: 0, Time elapsed: 0.064 s - in org.eclipse.swt.tests.junit.Test_org_eclipse_swt_graphics_Image
[INFO] Running org.eclipse.swt.tests.junit.Test_org_eclipse_swt_graphics_ImageData
[INFO] Tests run: 19, Failures: 0, Errors: 0, Skipped: 0, Time elapsed: 0.012 s - in org.eclipse.swt.tests.junit.Test_org_eclipse_swt_graphics_ImageData
[INFO] Running org.eclipse.swt.tests.junit.Test_org_eclipse_swt_graphics_PaletteData
[INFO] Tests run: 5, Failures: 0, Errors: 0, Skipped: 0, Time elapsed: 0.002 s - in org.eclipse.swt.tests.junit.Test_org_eclipse_swt_graphics_PaletteData
[INFO] Running org.eclipse.swt.tests.junit.Test_org_eclipse_swt_graphics_Point
[INFO] Tests run: 4, Failures: 0, Errors: 0, Skipped: 0, Time elapsed: 0.002 s - in org.eclipse.swt.tests.junit.Test_org_eclipse_swt_graphics_Point
[INFO] Running org.eclipse.swt.tests.junit.Test_org_eclipse_swt_graphics_Rectangle
[INFO] Tests run: 13, Failures: 0, Errors: 0, Skipped: 0, Time elapsed: 0.043 s - in org.eclipse.swt.tests.junit.Test_org_eclipse_swt_graphics_Rectangle
[INFO] Running org.eclipse.swt.tests.junit.Test_org_eclipse_swt_graphics_Region
[INFO] Tests run: 21, Failures: 0, Errors: 0, Skipped: 0, Time elapsed: 0.002 s - in org.eclipse.swt.tests.junit.Test_org_eclipse_swt_graphics_Region
[INFO] Running org.eclipse.swt.tests.junit.Test_org_eclipse_swt_graphics_RGB
[INFO] Tests run: 6, Failures: 0, Errors: 0, Skipped: 0, Time elapsed: 0.002 s - in org.eclipse.swt.tests.junit.Test_org_eclipse_swt_graphics_RGB
[INFO] Running org.eclipse.swt.tests.junit.Test_org_eclipse_swt_graphics_RGBA
[INFO] Tests run: 6, Failures: 0, Errors: 0, Skipped: 0, Time elapsed: 0.002 s - in org.eclipse.swt.tests.junit.Test_org_eclipse_swt_graphics_RGBA
[INFO] Running org.eclipse.swt.tests.junit.Test_org_eclipse_swt_graphics_TextLayout
[INFO] Tests run: 17, Failures: 0, Errors: 0, Skipped: 0, Time elapsed: 0.021 s - in org.eclipse.swt.tests.junit.Test_org_eclipse_swt_graphics_TextLayout
[INFO] Running org.eclipse.swt.tests.junit.Test_org_eclipse_swt_graphics_ImageLoader
[INFO] Tests run: 7, Failures: 0, Errors: 0, Skipped: 0, Time elapsed: 0.075 s - in org.eclipse.swt.tests.junit.Test_org_eclipse_swt_graphics_ImageLoader
[INFO] Running org.eclipse.swt.tests.junit.Test_org_eclipse_swt_graphics_ImageLoaderEvent
[INFO] Tests run: 2, Failures: 0, Errors: 0, Skipped: 0, Time elapsed: 0.002 s - in org.eclipse.swt.tests.junit.Test_org_eclipse_swt_graphics_ImageLoaderEvent
[INFO] Running org.eclipse.swt.tests.junit.Test_org_eclipse_swt_widgets_Shell
Test_org_eclipse_swt_widgets_Shell.test_setAlpha(): expected 128, but was 255. Probably missing window manager functionality, see bug 498208.
[INFO] Tests run: 134, Failures: 0, Errors: 0, Skipped: 0, Time elapsed: 1.648 s - in org.eclipse.swt.tests.junit.Test_org_eclipse_swt_widgets_Shell
[INFO] Running org.eclipse.swt.tests.junit.Test_org_eclipse_swt_widgets_ExpandItem
[INFO] Tests run: 19, Failures: 0, Errors: 0, Skipped: 0, Time elapsed: 0.22 s - in org.eclipse.swt.tests.junit.Test_org_eclipse_swt_widgets_ExpandItem
[INFO] Running org.eclipse.swt.tests.junit.Test_org_eclipse_swt_widgets_MenuItem
[INFO] Tests run: 25, Failures: 0, Errors: 0, Skipped: 0, Time elapsed: 0.2 s - in org.eclipse.swt.tests.junit.Test_org_eclipse_swt_widgets_MenuItem
[INFO] Running org.eclipse.swt.tests.junit.Test_org_eclipse_swt_widgets_ToolItem
[INFO] Tests run: 15, Failures: 0, Errors: 0, Skipped: 0, Time elapsed: 0.138 s - in org.eclipse.swt.tests.junit.Test_org_eclipse_swt_widgets_ToolItem
[INFO] Running org.eclipse.swt.tests.junit.Test_org_eclipse_swt_widgets_TabItem
[INFO] Tests run: 17, Failures: 0, Errors: 0, Skipped: 0, Time elapsed: 0.161 s - in org.eclipse.swt.tests.junit.Test_org_eclipse_swt_widgets_TabItem
[INFO] Running org.eclipse.swt.tests.junit.Test_org_eclipse_swt_widgets_TableItem
[INFO] Tests run: 30, Failures: 0, Errors: 0, Skipped: 0, Time elapsed: 0.446 s - in org.eclipse.swt.tests.junit.Test_org_eclipse_swt_widgets_TableItem
[INFO] Running org.eclipse.swt.tests.junit.Test_org_eclipse_swt_widgets_TableColumn
[INFO] Tests run: 21, Failures: 0, Errors: 0, Skipped: 0, Time elapsed: 0.261 s - in org.eclipse.swt.tests.junit.Test_org_eclipse_swt_widgets_TableColumn
[INFO] Running org.eclipse.swt.tests.junit.Test_org_eclipse_swt_widgets_TreeItem
[INFO] Tests run: 38, Failures: 0, Errors: 0, Skipped: 0, Time elapsed: 0.556 s - in org.eclipse.swt.tests.junit.Test_org_eclipse_swt_widgets_TreeItem
[INFO] Running org.eclipse.swt.tests.junit.Test_org_eclipse_swt_widgets_Caret
[INFO] Tests run: 19, Failures: 0, Errors: 0, Skipped: 0, Time elapsed: 0.107 s - in org.eclipse.swt.tests.junit.Test_org_eclipse_swt_widgets_Caret
[INFO] Running org.eclipse.swt.tests.junit.Test_org_eclipse_swt_widgets_Event
[INFO] Tests run: 2, Failures: 0, Errors: 0, Skipped: 0, Time elapsed: 0.001 s - in org.eclipse.swt.tests.junit.Test_org_eclipse_swt_widgets_Event
[INFO] Running org.eclipse.swt.tests.junit.Test_org_eclipse_swt_widgets_Menu
[INFO] Tests run: 30, Failures: 0, Errors: 0, Skipped: 0, Time elapsed: 0.14 s - in org.eclipse.swt.tests.junit.Test_org_eclipse_swt_widgets_Menu
[INFO] Running org.eclipse.swt.tests.junit.Test_org_eclipse_swt_widgets_Label
[INFO] Tests run: 86, Failures: 0, Errors: 0, Skipped: 0, Time elapsed: 0.429 s - in org.eclipse.swt.tests.junit.Test_org_eclipse_swt_widgets_Label
[INFO] Running org.eclipse.swt.tests.junit.Test_org_eclipse_swt_widgets_Button
[INFO] Tests run: 98, Failures: 0, Errors: 0, Skipped: 0, Time elapsed: 0.579 s - in org.eclipse.swt.tests.junit.Test_org_eclipse_swt_widgets_Button
[INFO] Running org.eclipse.swt.tests.junit.Test_org_eclipse_swt_widgets_ExpandBar
[INFO] Tests run: 101, Failures: 0, Errors: 0, Skipped: 0, Time elapsed: 0.634 s - in org.eclipse.swt.tests.junit.Test_org_eclipse_swt_widgets_ExpandBar
[INFO] Running org.eclipse.swt.tests.junit.Test_org_eclipse_swt_widgets_List
[INFO] Tests run: 127, Failures: 0, Errors: 0, Skipped: 0, Time elapsed: 1.003 s - in org.eclipse.swt.tests.junit.Test_org_eclipse_swt_widgets_List
[INFO] Running org.eclipse.swt.tests.junit.Test_org_eclipse_swt_widgets_Text
[INFO] Tests run: 131, Failures: 0, Errors: 0, Skipped: 0, Time elapsed: 1.97 s - in org.eclipse.swt.tests.junit.Test_org_eclipse_swt_widgets_Text
[INFO] Running org.eclipse.swt.tests.junit.Test_org_eclipse_swt_widgets_ScrollBar
[INFO] Tests run: 25, Failures: 0, Errors: 0, Skipped: 0, Time elapsed: 0.378 s - in org.eclipse.swt.tests.junit.Test_org_eclipse_swt_widgets_ScrollBar
[INFO] Running org.eclipse.swt.tests.junit.Test_org_eclipse_swt_widgets_Sash
[INFO] Tests run: 82, Failures: 0, Errors: 0, Skipped: 0, Time elapsed: 0.372 s - in org.eclipse.swt.tests.junit.Test_org_eclipse_swt_widgets_Sash
[INFO] Running org.eclipse.swt.tests.junit.Test_org_eclipse_swt_widgets_Tree
[INFO] Tests run: 123, Failures: 0, Errors: 0, Skipped: 0, Time elapsed: 8.316 s - in org.eclipse.swt.tests.junit.Test_org_eclipse_swt_widgets_Tree
[INFO] Running org.eclipse.swt.tests.junit.Test_org_eclipse_swt_widgets_TabFolder
[INFO] Tests run: 104, Failures: 0, Errors: 0, Skipped: 0, Time elapsed: 0.769 s - in org.eclipse.swt.tests.junit.Test_org_eclipse_swt_widgets_TabFolder
[INFO] Running org.eclipse.swt.tests.junit.Test_org_eclipse_swt_widgets_Combo
[INFO] Tests run: 137, Failures: 0, Errors: 0, Skipped: 0, Time elapsed: 1.039 s - in org.eclipse.swt.tests.junit.Test_org_eclipse_swt_widgets_Combo
[INFO] Running org.eclipse.swt.tests.junit.Test_org_eclipse_swt_widgets_Group
[INFO] Tests run: 91, Failures: 0, Errors: 0, Skipped: 0, Time elapsed: 0.468 s - in org.eclipse.swt.tests.junit.Test_org_eclipse_swt_widgets_Group
[INFO] Running org.eclipse.swt.tests.junit.Test_org_eclipse_swt_widgets_ToolBar
[INFO] Tests run: 98, Failures: 0, Errors: 0, Skipped: 0, Time elapsed: 0.563 s - in org.eclipse.swt.tests.junit.Test_org_eclipse_swt_widgets_ToolBar
[INFO] Running org.eclipse.swt.tests.junit.Test_org_eclipse_swt_widgets_Table
[INFO] Tests run: 133, Failures: 0, Errors: 0, Skipped: 0, Time elapsed: 11.464 s - in org.eclipse.swt.tests.junit.Test_org_eclipse_swt_widgets_Table
[INFO] Running org.eclipse.swt.tests.junit.Test_org_eclipse_swt_widgets_Canvas
[INFO] Tests run: 92, Failures: 0, Errors: 0, Skipped: 0, Time elapsed: 0.523 s - in org.eclipse.swt.tests.junit.Test_org_eclipse_swt_widgets_Canvas
[INFO] Running org.eclipse.swt.tests.junit.Test_org_eclipse_swt_widgets_Scale
[INFO] Tests run: 87, Failures: 0, Errors: 0, Skipped: 0, Time elapsed: 0.407 s - in org.eclipse.swt.tests.junit.Test_org_eclipse_swt_widgets_Scale
[INFO] Running org.eclipse.swt.tests.junit.Test_org_eclipse_swt_widgets_Slider
[INFO] Tests run: 98, Failures: 0, Errors: 0, Skipped: 0, Time elapsed: 0.474 s - in org.eclipse.swt.tests.junit.Test_org_eclipse_swt_widgets_Slider
[INFO] Running org.eclipse.swt.tests.junit.Test_org_eclipse_swt_widgets_ProgressBar
[INFO] Tests run: 84, Failures: 0, Errors: 0, Skipped: 0, Time elapsed: 0.342 s - in org.eclipse.swt.tests.junit.Test_org_eclipse_swt_widgets_ProgressBar
[INFO] Running org.eclipse.swt.tests.junit.Test_org_eclipse_swt_widgets_Composite
[INFO] Tests run: 88, Failures: 0, Errors: 0, Skipped: 0, Time elapsed: 0.445 s - in org.eclipse.swt.tests.junit.Test_org_eclipse_swt_widgets_Composite
[INFO] Running org.eclipse.swt.tests.junit.Test_org_eclipse_swt_widgets_Link
[INFO] Tests run: 83, Failures: 0, Errors: 0, Skipped: 0, Time elapsed: 0.393 s - in org.eclipse.swt.tests.junit.Test_org_eclipse_swt_widgets_Link
[INFO] Running org.eclipse.swt.tests.junit.Test_org_eclipse_swt_widgets_DateTime
[INFO] Tests run: 318, Failures: 0, Errors: 0, Skipped: 0, Time elapsed: 2.914 s - in org.eclipse.swt.tests.junit.Test_org_eclipse_swt_widgets_DateTime
[INFO] Running org.eclipse.swt.tests.junit.Test_org_eclipse_swt_widgets_ColorDialog
[INFO] Tests run: 6, Failures: 0, Errors: 0, Skipped: 0, Time elapsed: 0.017 s - in org.eclipse.swt.tests.junit.Test_org_eclipse_swt_widgets_ColorDialog
[INFO] Running org.eclipse.swt.tests.junit.Test_org_eclipse_swt_widgets_FileDialog
[INFO] Tests run: 11, Failures: 0, Errors: 0, Skipped: 0, Time elapsed: 0.04 s - in org.eclipse.swt.tests.junit.Test_org_eclipse_swt_widgets_FileDialog
[INFO] Running org.eclipse.swt.tests.junit.Test_org_eclipse_swt_widgets_DirectoryDialog
[INFO] Tests run: 7, Failures: 0, Errors: 0, Skipped: 0, Time elapsed: 0.025 s - in org.eclipse.swt.tests.junit.Test_org_eclipse_swt_widgets_DirectoryDialog
[INFO] Running org.eclipse.swt.tests.junit.Test_org_eclipse_swt_widgets_FontDialog
[INFO] Tests run: 7, Failures: 0, Errors: 0, Skipped: 0, Time elapsed: 0.024 s - in org.eclipse.swt.tests.junit.Test_org_eclipse_swt_widgets_FontDialog
[INFO] Running org.eclipse.swt.tests.junit.Test_org_eclipse_swt_widgets_MessageBox
[INFO] Tests run: 6, Failures: 0, Errors: 0, Skipped: 0, Time elapsed: 0.021 s - in org.eclipse.swt.tests.junit.Test_org_eclipse_swt_widgets_MessageBox
[INFO] Running org.eclipse.swt.tests.junit.Test_org_eclipse_swt_widgets_Monitor
[INFO] Tests run: 5, Failures: 0, Errors: 0, Skipped: 0, Time elapsed: 0.001 s - in org.eclipse.swt.tests.junit.Test_org_eclipse_swt_widgets_Monitor
[INFO] Running org.eclipse.swt.tests.junit.Test_org_eclipse_swt_custom_StyleRange
[INFO] Tests run: 9, Failures: 0, Errors: 0, Skipped: 0, Time elapsed: 0.001 s - in org.eclipse.swt.tests.junit.Test_org_eclipse_swt_custom_StyleRange
[INFO] Running org.eclipse.swt.tests.junit.Test_org_eclipse_swt_custom_CCombo
[INFO] Tests run: 129, Failures: 0, Errors: 0, Skipped: 0, Time elapsed: 2.171 s - in org.eclipse.swt.tests.junit.Test_org_eclipse_swt_custom_CCombo
[INFO] Running org.eclipse.swt.tests.junit.Test_org_eclipse_swt_custom_CLabel
[INFO] Tests run: 92, Failures: 0, Errors: 0, Skipped: 0, Time elapsed: 0.479 s - in org.eclipse.swt.tests.junit.Test_org_eclipse_swt_custom_CLabel
[INFO] Running org.eclipse.swt.tests.junit.Test_org_eclipse_swt_custom_CTabItem
[INFO] Tests run: 14, Failures: 0, Errors: 0, Skipped: 0, Time elapsed: 0.122 s - in org.eclipse.swt.tests.junit.Test_org_eclipse_swt_custom_CTabItem
[INFO] Running org.eclipse.swt.tests.junit.Test_org_eclipse_swt_custom_StyledText
[INFO] Tests run: 229, Failures: 0, Errors: 0, Skipped: 0, Time elapsed: 3.678 s - in org.eclipse.swt.tests.junit.Test_org_eclipse_swt_custom_StyledText
[INFO] Running org.eclipse.swt.tests.junit.Test_org_eclipse_swt_custom_StyledText_VariableLineHeight
[INFO] Tests run: 4, Failures: 0, Errors: 0, Skipped: 0, Time elapsed: 0.032 s - in org.eclipse.swt.tests.junit.Test_org_eclipse_swt_custom_StyledText_VariableLineHeight
[INFO] Running org.eclipse.swt.tests.junit.Test_org_eclipse_swt_custom_StyledTextLineSpacingProvider
[INFO] Tests run: 2, Failures: 0, Errors: 0, Skipped: 0, Time elapsed: 0.012 s - in org.eclipse.swt.tests.junit.Test_org_eclipse_swt_custom_StyledTextLineSpacingProvider
[INFO] Running org.eclipse.swt.tests.junit.Test_org_eclipse_swt_custom_CTabFolder
[INFO] Tests run: 101, Failures: 0, Errors: 0, Skipped: 0, Time elapsed: 1.37 s - in org.eclipse.swt.tests.junit.Test_org_eclipse_swt_custom_CTabFolder
[INFO] Running org.eclipse.swt.tests.junit.Test_org_eclipse_swt_widgets_Spinner
[INFO] Tests run: 97, Failures: 0, Errors: 0, Skipped: 0, Time elapsed: 1.063 s - in org.eclipse.swt.tests.junit.Test_org_eclipse_swt_widgets_Spinner
[INFO] Running org.eclipse.swt.tests.junit.Test_org_eclipse_swt_widgets_ScrolledComposite
[INFO] Tests run: 98, Failures: 0, Errors: 0, Skipped: 0, Time elapsed: 0.572 s - in org.eclipse.swt.tests.junit.Test_org_eclipse_swt_widgets_ScrolledComposite
[INFO] Running org.eclipse.swt.tests.junit.Test_org_eclipse_swt_layout_GridData
[INFO] Tests run: 3, Failures: 0, Errors: 0, Skipped: 0, Time elapsed: 0.002 s - in org.eclipse.swt.tests.junit.Test_org_eclipse_swt_layout_GridData
[INFO] Running org.eclipse.swt.tests.junit.Test_org_eclipse_swt_events_ControlEvent
[INFO] Tests run: 2, Failures: 0, Errors: 0, Skipped: 0, Time elapsed: 0.003 s - in org.eclipse.swt.tests.junit.Test_org_eclipse_swt_events_ControlEvent
[INFO] Running org.eclipse.swt.tests.junit.Test_org_eclipse_swt_events_ModifyEvent
[INFO] Tests run: 2, Failures: 0, Errors: 0, Skipped: 0, Time elapsed: 0.007 s - in org.eclipse.swt.tests.junit.Test_org_eclipse_swt_events_ModifyEvent
[INFO] Running org.eclipse.swt.tests.junit.Test_org_eclipse_swt_events_ArmEvent
[INFO] Tests run: 2, Failures: 0, Errors: 0, Skipped: 0, Time elapsed: 0.007 s - in org.eclipse.swt.tests.junit.Test_org_eclipse_swt_events_ArmEvent
[INFO] Running org.eclipse.swt.tests.junit.Test_org_eclipse_swt_events_ShellEvent
[INFO] Tests run: 2, Failures: 0, Errors: 0, Skipped: 0, Time elapsed: 0.006 s - in org.eclipse.swt.tests.junit.Test_org_eclipse_swt_events_ShellEvent
[INFO] Running org.eclipse.swt.tests.junit.Test_org_eclipse_swt_events_TypedEvent
[INFO] Tests run: 2, Failures: 0, Errors: 0, Skipped: 0, Time elapsed: 0.002 s - in org.eclipse.swt.tests.junit.Test_org_eclipse_swt_events_TypedEvent
[INFO] Running org.eclipse.swt.tests.junit.Test_org_eclipse_swt_events_PaintEvent
[INFO] Tests run: 2, Failures: 0, Errors: 0, Skipped: 0, Time elapsed: 0.002 s - in org.eclipse.swt.tests.junit.Test_org_eclipse_swt_events_PaintEvent
[INFO] Running org.eclipse.swt.tests.junit.Test_org_eclipse_swt_events_VerifyEvent
[INFO] Tests run: 2, Failures: 0, Errors: 0, Skipped: 0, Time elapsed: 0.002 s - in org.eclipse.swt.tests.junit.Test_org_eclipse_swt_events_VerifyEvent
[INFO] Running org.eclipse.swt.tests.junit.Test_org_eclipse_swt_events_KeyEvent
[INFO] Tests run: 2, Failures: 0, Errors: 0, Skipped: 0, Time elapsed: 0.008 s - in org.eclipse.swt.tests.junit.Test_org_eclipse_swt_events_KeyEvent
[INFO] Running org.eclipse.swt.tests.junit.Test_org_eclipse_swt_events_TraverseEvent
[INFO] Tests run: 2, Failures: 0, Errors: 0, Skipped: 0, Time elapsed: 0.006 s - in org.eclipse.swt.tests.junit.Test_org_eclipse_swt_events_TraverseEvent
[INFO] Running org.eclipse.swt.tests.junit.Test_org_eclipse_swt_events_DisposeEvent
[INFO] Tests run: 2, Failures: 0, Errors: 0, Skipped: 0, Time elapsed: 0.006 s - in org.eclipse.swt.tests.junit.Test_org_eclipse_swt_events_DisposeEvent
[INFO] Running org.eclipse.swt.tests.junit.Test_org_eclipse_swt_events_SelectionEvent
[INFO] Tests run: 2, Failures: 0, Errors: 0, Skipped: 0, Time elapsed: 0.02 s - in org.eclipse.swt.tests.junit.Test_org_eclipse_swt_events_SelectionEvent
[INFO] Running org.eclipse.swt.tests.junit.Test_org_eclipse_swt_events_HelpEvent
[INFO] Tests run: 2, Failures: 0, Errors: 0, Skipped: 0, Time elapsed: 0.007 s - in org.eclipse.swt.tests.junit.Test_org_eclipse_swt_events_HelpEvent
[INFO] Running org.eclipse.swt.tests.junit.Test_org_eclipse_swt_events_FocusEvent
[INFO] Tests run: 2, Failures: 0, Errors: 0, Skipped: 0, Time elapsed: 0.009 s - in org.eclipse.swt.tests.junit.Test_org_eclipse_swt_events_FocusEvent
[INFO] Running org.eclipse.swt.tests.junit.Test_org_eclipse_swt_events_MouseEvent
[INFO] Tests run: 2, Failures: 0, Errors: 0, Skipped: 0, Time elapsed: 0.007 s - in org.eclipse.swt.tests.junit.Test_org_eclipse_swt_events_MouseEvent
[INFO] Running org.eclipse.swt.tests.junit.Test_org_eclipse_swt_events_MenuEvent
[INFO] Tests run: 2, Failures: 0, Errors: 0, Skipped: 0, Time elapsed: 0.006 s - in org.eclipse.swt.tests.junit.Test_org_eclipse_swt_events_MenuEvent
[INFO] Running org.eclipse.swt.tests.junit.Test_org_eclipse_swt_events_TreeEvent
[INFO] Tests run: 2, Failures: 0, Errors: 0, Skipped: 0, Time elapsed: 0.01 s - in org.eclipse.swt.tests.junit.Test_org_eclipse_swt_events_TreeEvent
[INFO] Running org.eclipse.swt.tests.junit.Test_org_eclipse_swt_layout_FormAttachment
[INFO] Tests run: 7, Failures: 0, Errors: 0, Skipped: 0, Time elapsed: 0.05 s - in org.eclipse.swt.tests.junit.Test_org_eclipse_swt_layout_FormAttachment
[INFO] Running org.eclipse.swt.tests.junit.Test_org_eclipse_swt_layout_GridData
[INFO] Tests run: 3, Failures: 0, Errors: 0, Skipped: 0, Time elapsed: 0.002 s - in org.eclipse.swt.tests.junit.Test_org_eclipse_swt_layout_GridData
[INFO] Running org.eclipse.swt.tests.junit.Test_org_eclipse_swt_printing_PrintDialog
[INFO] Tests run: 5, Failures: 0, Errors: 0, Skipped: 0, Time elapsed: 0.002 s - in org.eclipse.swt.tests.junit.Test_org_eclipse_swt_printing_PrintDialog
[INFO] Running org.eclipse.swt.tests.junit.Test_org_eclipse_swt_printing_PrinterData
[INFO] Tests run: 3, Failures: 0, Errors: 0, Skipped: 0, Time elapsed: 0.002 s - in org.eclipse.swt.tests.junit.Test_org_eclipse_swt_printing_PrinterData
[INFO] Running org.eclipse.swt.tests.junit.Test_org_eclipse_swt_printing_Printer
[INFO] Tests run: 9, Failures: 0, Errors: 0, Skipped: 0, Time elapsed: 0.002 s - in org.eclipse.swt.tests.junit.Test_org_eclipse_swt_printing_Printer
[INFO] Running org.eclipse.swt.tests.junit.Test_org_eclipse_swt_program_Program
[INFO] Tests run: 9, Failures: 0, Errors: 0, Skipped: 0, Time elapsed: 0.342 s - in org.eclipse.swt.tests.junit.Test_org_eclipse_swt_program_Program
[INFO] Running org.eclipse.swt.tests.junit.Test_org_eclipse_swt_accessibility_Accessible
[INFO] Tests run: 4, Failures: 0, Errors: 0, Skipped: 0, Time elapsed: 0.018 s - in org.eclipse.swt.tests.junit.Test_org_eclipse_swt_accessibility_Accessible
[INFO] Running org.eclipse.swt.tests.junit.Test_org_eclipse_swt_accessibility_AccessibleControlEvent
[INFO] Tests run: 2, Failures: 0, Errors: 0, Skipped: 0, Time elapsed: 0.01 s - in org.eclipse.swt.tests.junit.Test_org_eclipse_swt_accessibility_AccessibleControlEvent
[INFO] Running org.eclipse.swt.tests.junit.Test_org_eclipse_swt_accessibility_AccessibleEvent
[INFO] Tests run: 2, Failures: 0, Errors: 0, Skipped: 0, Time elapsed: 0.013 s - in org.eclipse.swt.tests.junit.Test_org_eclipse_swt_accessibility_AccessibleEvent
[INFO] Running org.eclipse.swt.tests.junit.Test_org_eclipse_swt_accessibility_AccessibleTextEvent
[INFO] Tests run: 2, Failures: 0, Errors: 0, Skipped: 0, Time elapsed: 0.01 s - in org.eclipse.swt.tests.junit.Test_org_eclipse_swt_accessibility_AccessibleTextEvent
[INFO] Running org.eclipse.swt.tests.junit.Test_org_eclipse_swt_browser_Browser
Running Test_org_eclipse_swt_browser_Browser#test_TitleListener_removeWithNullArg
Running Test_org_eclipse_swt_browser_Browser#test_getText_html
Running Test_org_eclipse_swt_browser_Browser#test_LocationListener_then_ProgressListener
Running Test_org_eclipse_swt_browser_Browser#test_OpenWindowListener_closeShell
Running Test_org_eclipse_swt_browser_Browser#test_LocationListener_addAndRemove
Running Test_org_eclipse_swt_browser_Browser#test_forward
Running Test_org_eclipse_swt_browser_Browser#test_ProgressListener_addAndRemove
Running Test_org_eclipse_swt_browser_Browser#test_CloseWindowListener_removeWithNullArg
Running Test_org_eclipse_swt_browser_Browser#test_TitleListener_addAndRemove
Running Test_org_eclipse_swt_browser_Browser#test_VisibilityWindowListener_eventSize
Running Test_org_eclipse_swt_browser_Browser#test_OpenWindowListener_open_ChildPopup
Running Test_org_eclipse_swt_browser_Browser#test_BrowserFunction_callback_with_multipleValues
Running Test_org_eclipse_swt_browser_Browser#test_setUrlWithNullArg
Running Test_org_eclipse_swt_browser_Browser#test_CloseWindowListener_close
Running Test_org_eclipse_swt_browser_Browser#test_BrowserFunction_callback_with_String
Running Test_org_eclipse_swt_browser_Browser#test_ProgressListener_addWithNullArg
Running Test_org_eclipse_swt_browser_Browser#test_evaluate_null
Running Test_org_eclipse_swt_browser_Browser#test_getText
Running Test_org_eclipse_swt_browser_Browser#test_ProgressListener_newProgressAdapter_closeShell
Running Test_org_eclipse_swt_browser_Browser#test_back
Running Test_org_eclipse_swt_browser_Browser#test_stop
Running Test_org_eclipse_swt_browser_Browser#test_isBackEnabled
Running Test_org_eclipse_swt_browser_Browser#test_VisibilityWindowListener_multiple_shells
Running Test_org_eclipse_swt_browser_Browser#test_evaluate_number_negative
Running Test_org_eclipse_swt_browser_Browser#test_setUrl_remote
Running Test_org_eclipse_swt_browser_Browser#test_BrowserFunction_callback_afterPageReload
Running Test_org_eclipse_swt_browser_Browser#test_evaluate_boolean
Running Test_org_eclipse_swt_browser_Browser#test_OpenWindowListener_evaluateInCallback
Running Test_org_eclipse_swt_browser_Browser#test_TitleListener_addwithNull
Running Test_org_eclipse_swt_browser_Browser#test_ProgressListener_newProgressAdapter
Running Test_org_eclipse_swt_browser_Browser#test_execute_and_closeListener
Running Test_org_eclipse_swt_browser_Browser#test_OpenWindow_Progress_Listener_ValidateEventOrder
Running Test_org_eclipse_swt_browser_Browser#test_VisibilityWindowListener_addWithNull
Running Test_org_eclipse_swt_browser_Browser#test_evaluate_evaluation_failed_exception
Running Test_org_eclipse_swt_browser_Browser#test_LocationListener_changed
Running Test_org_eclipse_swt_browser_Browser#test_getUrl
Running Test_org_eclipse_swt_browser_Browser#test_BrowserFunction_callback_with_boolean
Running Test_org_eclipse_swt_browser_Browser#test_evaluate_invalid_return_value
Running Test_org_eclipse_swt_browser_Browser#test_LocationListener_ProgressListener_noExtraEvents
Running Test_org_eclipse_swt_browser_Browser#test_setJavascriptEnabled
Running Test_org_eclipse_swt_browser_Browser#test_OpenWindowListener_openHasValidEventDetails
Running Test_org_eclipse_swt_browser_Browser#test_TitleListener_event
Running Test_org_eclipse_swt_browser_Browser#test_LocationListener_removeWithNullArg
Running Test_org_eclipse_swt_browser_Browser#test_getChildren
Running Test_org_eclipse_swt_browser_Browser#test_evaluate_array_numbers
Running Test_org_eclipse_swt_browser_Browser#test_getText_doctype
Running Test_org_eclipse_swt_browser_Browser#test_refresh
Running Test_org_eclipse_swt_browser_Browser#test_evaluate_number_big
Running Test_org_eclipse_swt_browser_Browser#test_evaluate_array_strings
Running Test_org_eclipse_swt_browser_Browser#test_OpenWindowListener_addWithNulArg
Running Test_org_eclipse_swt_browser_Browser#test_execute_withNullArg
Running Test_org_eclipse_swt_browser_Browser#test_CloseWindowListener_closeShell
Running Test_org_eclipse_swt_browser_Browser#test_isVisible
Running Test_org_eclipse_swt_browser_Browser#test_VisibilityWindowListener_newAdapter
Running Test_org_eclipse_swt_browser_Browser#test_setUrl_remote_with_post
Running Test_org_eclipse_swt_browser_Browser#test_evaluate_string
Running Test_org_eclipse_swt_browser_Browser#test_ProgressListener_newListener_closeShell
Running Test_org_eclipse_swt_browser_Browser#test_evaluate_returnMoved
Running Test_org_eclipse_swt_browser_Browser#test_VisibilityWindowListener_addAndRemove
Running Test_org_eclipse_swt_browser_Browser#test_setUrl_local
Running Test_org_eclipse_swt_browser_Browser#test_ClearAllSessionCookies
Running Test_org_eclipse_swt_browser_Browser#test_LocationListener_evaluateInCallback
Running Test_org_eclipse_swt_browser_Browser#test_BrowserFunction_callback
Running Test_org_eclipse_swt_browser_Browser#test_StatusTextListener_addWithNull
Running Test_org_eclipse_swt_browser_Browser#test_evaluate_number_normal
Running Test_org_eclipse_swt_browser_Browser#test_setText
Running Test_org_eclipse_swt_browser_Browser#test_setFocus_toChild_beforeOpen
Running Test_org_eclipse_swt_browser_Browser#test_StatusTextListener_addAndRemove
Running Test_org_eclipse_swt_browser_Browser#test_ProgressListener_completed_Called
Running Test_org_eclipse_swt_browser_Browser#test_LocationListener_addWithNullArg
Running Test_org_eclipse_swt_browser_Browser#test_getText_script
Running Test_org_eclipse_swt_browser_Browser#test_evaluate_array_mixedTypes
Running Test_org_eclipse_swt_browser_Browser#test_evalute_Cookies
Running Test_org_eclipse_swt_browser_Browser#test_VisibilityWindowListener_newListener_closeShell
Running Test_org_eclipse_swt_browser_Browser#test_LocationListener_ProgressListener_cancledLoad
Running Test_org_eclipse_swt_browser_Browser#test_VisibilityWindowListener_removeWithNullArg
Running Test_org_eclipse_swt_browser_Browser#test_BrowserFunction_callback_with_javaReturningInt
Running Test_org_eclipse_swt_browser_Browser#test_LocationListener_adapter_closeShell
Running Test_org_eclipse_swt_browser_Browser#test_VisibilityWindowListener_newAdapter_closeShell
Running Test_org_eclipse_swt_browser_Browser#test_setTextNull
Running Test_org_eclipse_swt_browser_Browser#test_setFocus_toChild_afterOpen
Running Test_org_eclipse_swt_browser_Browser#test_BrowserFunction_callback_with_integer
Running Test_org_eclipse_swt_browser_Browser#test_OpenWindowListener_removeWithNullArg
Running Test_org_eclipse_swt_browser_Browser#test_isForwardEnabled
Running Test_org_eclipse_swt_browser_Browser#test_StatusTextListener_hoverMouseOverLink
Running Test_org_eclipse_swt_browser_Browser#test_CloseWindowListener_addAndRemove
Running Test_org_eclipse_swt_browser_Browser#test_TitleListener_addListener_closeShell
Running Test_org_eclipse_swt_browser_Browser#test_ConstructorLorg_eclipse_swt_widgets_CompositeI
Running Test_org_eclipse_swt_browser_Browser#test_LocationListener_changing
Running Test_org_eclipse_swt_browser_Browser#test_LocationListener_changingAndOnlyThenChanged
Running Test_org_eclipse_swt_browser_Browser#test_StatusTextListener_removeWithNullArg
Running Test_org_eclipse_swt_browser_Browser#test_ProgressListener_removeWithNullArg
Running Test_org_eclipse_swt_browser_Browser#test_get_set_Cookies
Running Test_org_eclipse_swt_browser_Browser#test_CloseWindowListener_addWithNullArg
Running Test_org_eclipse_swt_browser_Browser#test_setJavascriptEnabled_multipleInstances
Running Test_org_eclipse_swt_browser_Browser#test_OpenWindowListener_addAndRemove
Running Test_org_eclipse_swt_browser_Browser#test_setTabList$Lorg_eclipse_swt_widgets_Control
Running Test_org_eclipse_swt_browser_Browser#test_setVisibility_and_sizing
Running Test_org_eclipse_swt_browser_Browser#test_computeTrimIIII
Running Test_org_eclipse_swt_browser_Browser#test_getVerticalBar
Running Test_org_eclipse_swt_browser_Browser#test_getClientArea
Running Test_org_eclipse_swt_browser_Browser#test_getHorizontalBar
Running Test_org_eclipse_swt_browser_Browser#test_setCaptureZ
Running Test_org_eclipse_swt_browser_Browser#test_isEnabled
Running Test_org_eclipse_swt_browser_Browser#test_setForegroundDisposedColorLorg_eclipse_swt_graphics_Color
Running Test_org_eclipse_swt_browser_Browser#test_addFocusListenerLorg_eclipse_swt_events_FocusListener
Running Test_org_eclipse_swt_browser_Browser#test_addMouseTrackListenerMouseHoverAdapterLorg_eclipse_swt_events_MouseTrackListener
Running Test_org_eclipse_swt_browser_Browser#test_getBorderWidth
Running Test_org_eclipse_swt_browser_Browser#test_setBoundsIIII
Running Test_org_eclipse_swt_browser_Browser#test_addFocusListenerFocusGainedAdapterLorg_eclipse_swt_events_FocusListener
Running Test_org_eclipse_swt_browser_Browser#test_setTextDirection
Running Test_org_eclipse_swt_browser_Browser#test_addControlListenerLorg_eclipse_swt_events_ControlListener
Running Test_org_eclipse_swt_browser_Browser#test_setRedrawZ
Running Test_org_eclipse_swt_browser_Browser#test_pack
Running Test_org_eclipse_swt_browser_Browser#test_setForegroundLorg_eclipse_swt_graphics_Color
Running Test_org_eclipse_swt_browser_Browser#test_redrawIIIIZ
Running Test_org_eclipse_swt_browser_Browser#test_moveAboveLorg_eclipse_swt_widgets_Control
Running Test_org_eclipse_swt_browser_Browser#test_addControlListenerControlMovedAdapterLorg_eclipse_swt_events_ControlListener
Running Test_org_eclipse_swt_browser_Browser#test_addControlListenerControlResizedAdapterLorg_eclipse_swt_events_ControlListener
Running Test_org_eclipse_swt_browser_Browser#test_toControlII
Running Test_org_eclipse_swt_browser_Browser#test_setMenuLorg_eclipse_swt_widgets_Menu
Running Test_org_eclipse_swt_browser_Browser#test_setLocationLorg_eclipse_swt_graphics_Point
Running Test_org_eclipse_swt_browser_Browser#test_setToolTipTextLjava_lang_String
Running Test_org_eclipse_swt_browser_Browser#test_computeSizeII
Running Test_org_eclipse_swt_browser_Browser#test_setVisibleZ
Running Test_org_eclipse_swt_browser_Browser#test_setEnabledZ
Running Test_org_eclipse_swt_browser_Browser#test_toControlLorg_eclipse_swt_graphics_Point
Running Test_org_eclipse_swt_browser_Browser#test_redraw
Running Test_org_eclipse_swt_browser_Browser#test_setFontLorg_eclipse_swt_graphics_Font
Running Test_org_eclipse_swt_browser_Browser#test_update
Running Test_org_eclipse_swt_browser_Browser#test_toDisplayII
Running Test_org_eclipse_swt_browser_Browser#test_setBackgroundAlphaLorg_eclipse_swt_graphics_Color
Running Test_org_eclipse_swt_browser_Browser#test_getLocation
Running Test_org_eclipse_swt_browser_Browser#test_setFocus
Running Test_org_eclipse_swt_browser_Browser#test_setBoundsLorg_eclipse_swt_graphics_Rectangle
Running Test_org_eclipse_swt_browser_Browser#test_addKeyListenerKeyReleasedAdapterLorg_eclipse_swt_events_KeyListener
Running Test_org_eclipse_swt_browser_Browser#test_requestLayoutL
Running Test_org_eclipse_swt_browser_Browser#test_ExceptionsThrownInDisposeListenerDontPreventDisposal
Running Test_org_eclipse_swt_browser_Browser#test_toDisplayLorg_eclipse_swt_graphics_Point
Running Test_org_eclipse_swt_browser_Browser#test_addTraverseListenerLorg_eclipse_swt_events_TraverseListener
Running Test_org_eclipse_swt_browser_Browser#test_addMouseListenerLorg_eclipse_swt_events_MouseListener
Running Test_org_eclipse_swt_browser_Browser#test_addPaintListenerLorg_eclipse_swt_events_PaintListener
Running Test_org_eclipse_swt_browser_Browser#test_setSizeII
Running Test_org_eclipse_swt_browser_Browser#test_setCursorLorg_eclipse_swt_graphics_Cursor
Running Test_org_eclipse_swt_browser_Browser#test_getShell
Running Test_org_eclipse_swt_browser_Browser#test_getParent
Running Test_org_eclipse_swt_browser_Browser#test_addKeyListenerKeyPressedAdapterLorg_eclipse_swt_events_KeyListener
Running Test_org_eclipse_swt_browser_Browser#test_moveBelowLorg_eclipse_swt_widgets_Control
Running Test_org_eclipse_swt_browser_Browser#test_setLocationII
Running Test_org_eclipse_swt_browser_Browser#test_getMonitor
Running Test_org_eclipse_swt_browser_Browser#test_setParentLorg_eclipse_swt_widgets_Composite
Running Test_org_eclipse_swt_browser_Browser#test_setBackgroundDisposedColorLorg_eclipse_swt_graphics_Color
Running Test_org_eclipse_swt_browser_Browser#test_addMouseTrackListenerLorg_eclipse_swt_events_MouseTrackListener
Running Test_org_eclipse_swt_browser_Browser#test_setBackgroundLorg_eclipse_swt_graphics_Color
Running Test_org_eclipse_swt_browser_Browser#test_setSizeLorg_eclipse_swt_graphics_Point
Running Test_org_eclipse_swt_browser_Browser#test_traverseI
Running Test_org_eclipse_swt_browser_Browser#test_addMouseTrackListenerMouseEnterAdapterLorg_eclipse_swt_events_MouseTrackListener
Running Test_org_eclipse_swt_browser_Browser#test_setLayoutDataLjava_lang_Object
Running Test_org_eclipse_swt_browser_Browser#test_addKeyListenerLorg_eclipse_swt_events_KeyListener
Running Test_org_eclipse_swt_browser_Browser#test_addFocusListenerFocusLostAdapterLorg_eclipse_swt_events_FocusListener
Running Test_org_eclipse_swt_browser_Browser#test_setForegroundAlphaLorg_eclipse_swt_graphics_Color
Running Test_org_eclipse_swt_browser_Browser#test_addHelpListenerLorg_eclipse_swt_events_HelpListener
Running Test_org_eclipse_swt_browser_Browser#test_computeSizeIIZ
Running Test_org_eclipse_swt_browser_Browser#test_addMouseTrackListenerMouseExitAdapterLorg_eclipse_swt_events_MouseTrackListener
Running Test_org_eclipse_swt_browser_Browser#test_getAccessible
Running Test_org_eclipse_swt_browser_Browser#test_isReparentable
Running Test_org_eclipse_swt_browser_Browser#test_packZ
Running Test_org_eclipse_swt_browser_Browser#test_addMouseMoveListenerLorg_eclipse_swt_events_MouseMoveListener
Running Test_org_eclipse_swt_browser_Browser#test_isFocusControl
Running Test_org_eclipse_swt_browser_Browser#test_ConstructorLorg_eclipse_swt_widgets_WidgetI
Running Test_org_eclipse_swt_browser_Browser#test_setDataLjava_lang_StringLjava_lang_Object
Running Test_org_eclipse_swt_browser_Browser#test_isDisposed
Running Test_org_eclipse_swt_browser_Browser#test_addListenerILorg_eclipse_swt_widgets_Listener
Running Test_org_eclipse_swt_browser_Browser#test_removeListenerILorg_eclipse_swt_widgets_Listener
Running Test_org_eclipse_swt_browser_Browser#test_notifyListenersILorg_eclipse_swt_widgets_Event
Running Test_org_eclipse_swt_browser_Browser#test_toString
Running Test_org_eclipse_swt_browser_Browser#test_getDisplay
Running Test_org_eclipse_swt_browser_Browser#test_setDataLjava_lang_Object
Running Test_org_eclipse_swt_browser_Browser#test_addDisposeListenerLorg_eclipse_swt_events_DisposeListener
[WARNING] Tests run: 179, Failures: 0, Errors: 0, Skipped: 2, Time elapsed: 10.143 s - in org.eclipse.swt.tests.junit.Test_org_eclipse_swt_browser_Browser
[INFO] 
[INFO] Results:
[INFO] 
[WARNING] Tests run: 3900, Failures: 0, Errors: 0, Skipped: 2
[INFO] 
[INFO] 
[INFO] --- tycho-p2-extras-plugin:1.7.0:compare-version-with-baselines (compare-attached-artifacts-with-release) @ org.eclipse.swt.tests ---
[INFO] Skipped
[INFO] 
[INFO] ----< org.eclipse.swt.tools.feature:org.eclipse.swt.tools.feature >-----
[INFO] Building org.eclipse.swt.tools.feature 3.107.800-SNAPSHOT        [14/15]
[INFO] --------------------------[ eclipse-feature ]---------------------------
[INFO] 
[INFO] --- maven-clean-plugin:3.1.0:clean (default-clean) @ org.eclipse.swt.tools.feature ---
[INFO] Deleting /home/jenkins/agent/workspace/eclipse.platform.swt-SonarQube/features/org.eclipse.swt.tools.feature/target
[INFO] 
[INFO] --- tycho-packaging-plugin:1.7.0:build-qualifier-aggregator (default-build-qualifier-aggregator) @ org.eclipse.swt.tools.feature ---
[INFO] The project's OSGi version is 3.107.800.v20200511-2029
[INFO] 
[INFO] --- tycho-packaging-plugin:1.7.0:validate-id (default-validate-id) @ org.eclipse.swt.tools.feature ---
[INFO] 
[INFO] --- tycho-packaging-plugin:1.7.0:validate-version (default-validate-version) @ org.eclipse.swt.tools.feature ---
[INFO] 
[INFO] --- maven-resources-plugin:3.1.0:copy-resources (saveproperties) @ org.eclipse.swt.tools.feature ---
[INFO] Using 'UTF-8' encoding to copy filtered resources.
[INFO] skip non existing resourceDirectory /home/jenkins/agent/workspace/eclipse.platform.swt-SonarQube/features/org.eclipse.swt.tools.feature/saveproperties
[INFO] 
[INFO] --- maven-enforcer-plugin:3.0.0-M3:enforce (enforce-maven) @ org.eclipse.swt.tools.feature ---
[INFO] 
[INFO] --- jacoco-maven-plugin:0.8.5:prepare-agent (jacoco-agent) @ org.eclipse.swt.tools.feature ---
[INFO] argLine set to -javaagent:/home/jenkins/agent/workspace/eclipse.platform.swt-SonarQube/.repository/org/jacoco/org.jacoco.agent/0.8.5/org.jacoco.agent-0.8.5-runtime.jar=destfile=/home/jenkins/agent/workspace/eclipse.platform.swt-SonarQube/jacoco.exec,append=true
[INFO] 
[INFO] --- eclipse-cbi-plugin:1.1.8-SNAPSHOT:generate-api-build-xml (default) @ org.eclipse.swt.tools.feature ---
[INFO] 
[INFO] --- maven-resources-plugin:3.1.0:resources (filter-resources) @ org.eclipse.swt.tools.feature ---
[INFO] Using 'UTF-8' encoding to copy filtered resources.
[INFO] skip non existing resourceDirectory /home/jenkins/agent/workspace/eclipse.platform.swt-SonarQube/features/org.eclipse.swt.tools.feature/src/main/resources
[INFO] 
[INFO] --- tycho-eclipserun-plugin:1.7.0:eclipse-run (default) @ org.eclipse.swt.tools.feature ---
[INFO] 
[INFO] --- tycho-source-plugin:1.7.0:plugin-source (plugin-source) @ org.eclipse.swt.tools.feature ---
[INFO] 
[INFO] --- target-platform-configuration:1.7.0:target-platform (default-target-platform) @ org.eclipse.swt.tools.feature ---
[INFO] 
[INFO] --- tycho-packaging-plugin:1.7.0:package-feature (default-package-feature) @ org.eclipse.swt.tools.feature ---
[INFO] Building jar: /home/jenkins/agent/workspace/eclipse.platform.swt-SonarQube/features/org.eclipse.swt.tools.feature/target/org.eclipse.swt.tools.feature-3.107.800-SNAPSHOT.jar
[INFO] 
[INFO] --- tycho-p2-plugin:1.7.0:p2-metadata-default (default-p2-metadata-default) @ org.eclipse.swt.tools.feature ---
[WARNING] No repository found at file:/noThanks.
org.eclipse.equinox.p2.core.ProvisionException: No repository found at file:/noThanks.
    at org.eclipse.equinox.internal.p2.repository.helpers.AbstractRepositoryManager.fail (AbstractRepositoryManager.java:396)
    at org.eclipse.equinox.internal.p2.repository.helpers.AbstractRepositoryManager.loadRepository (AbstractRepositoryManager.java:661)
    at org.eclipse.equinox.internal.p2.metadata.repository.MetadataRepositoryManager.loadRepository (MetadataRepositoryManager.java:110)
    at org.eclipse.tycho.p2.remote.RemoteMetadataRepositoryManager.loadRepository (RemoteMetadataRepositoryManager.java:61)
    at org.eclipse.tycho.p2.remote.RemoteMetadataRepositoryManager.loadRepository (RemoteMetadataRepositoryManager.java:53)
    at org.eclipse.tycho.p2.tools.baseline.BaselineServiceImpl.getProjectBaseline (BaselineServiceImpl.java:95)
    at org.eclipse.tycho.plugins.p2.BaselineValidator.validateAndReplace (BaselineValidator.java:88)
    at org.eclipse.tycho.plugins.p2.P2MetadataMojo.attachP2Metadata (P2MetadataMojo.java:183)
    at org.eclipse.tycho.plugins.p2.P2MetadataMojo.execute (P2MetadataMojo.java:137)
    at org.eclipse.tycho.plugins.p2.P2MetadataDefaultMojo.execute (P2MetadataDefaultMojo.java:32)
    at org.apache.maven.plugin.DefaultBuildPluginManager.executeMojo (DefaultBuildPluginManager.java:137)
    at org.apache.maven.lifecycle.internal.MojoExecutor.execute (MojoExecutor.java:210)
    at org.apache.maven.lifecycle.internal.MojoExecutor.execute (MojoExecutor.java:156)
    at org.apache.maven.lifecycle.internal.MojoExecutor.execute (MojoExecutor.java:148)
    at org.apache.maven.lifecycle.internal.LifecycleModuleBuilder.buildProject (LifecycleModuleBuilder.java:117)
    at org.apache.maven.lifecycle.internal.LifecycleModuleBuilder.buildProject (LifecycleModuleBuilder.java:81)
    at org.apache.maven.lifecycle.internal.builder.singlethreaded.SingleThreadedBuilder.build (SingleThreadedBuilder.java:56)
    at org.apache.maven.lifecycle.internal.LifecycleStarter.execute (LifecycleStarter.java:128)
    at org.apache.maven.DefaultMaven.doExecute (DefaultMaven.java:305)
    at org.apache.maven.DefaultMaven.doExecute (DefaultMaven.java:192)
    at org.apache.maven.DefaultMaven.execute (DefaultMaven.java:105)
    at org.apache.maven.cli.MavenCli.execute (MavenCli.java:957)
    at org.apache.maven.cli.MavenCli.doMain (MavenCli.java:289)
    at org.apache.maven.cli.MavenCli.main (MavenCli.java:193)
    at sun.reflect.NativeMethodAccessorImpl.invoke0 (Native Method)
    at sun.reflect.NativeMethodAccessorImpl.invoke (NativeMethodAccessorImpl.java:62)
    at sun.reflect.DelegatingMethodAccessorImpl.invoke (DelegatingMethodAccessorImpl.java:43)
    at java.lang.reflect.Method.invoke (Method.java:498)
    at org.codehaus.plexus.classworlds.launcher.Launcher.launchEnhanced (Launcher.java:282)
    at org.codehaus.plexus.classworlds.launcher.Launcher.launch (Launcher.java:225)
    at org.codehaus.plexus.classworlds.launcher.Launcher.mainWithExitCode (Launcher.java:406)
    at org.codehaus.plexus.classworlds.launcher.Launcher.main (Launcher.java:347)
[INFO] No baseline version MavenProject: org.eclipse.swt.tools.feature:org.eclipse.swt.tools.feature:3.107.800-SNAPSHOT @ /home/jenkins/agent/workspace/eclipse.platform.swt-SonarQube/features/org.eclipse.swt.tools.feature/pom.xml
[INFO] 
[INFO] --- tycho-p2-plugin:1.7.0:feature-p2-metadata (default-feature-p2-metadata) @ org.eclipse.swt.tools.feature ---
[INFO] 
[INFO] --- tycho-source-feature-plugin:1.7.0:source-feature (source-feature) @ org.eclipse.swt.tools.feature ---
[INFO] Building jar: /home/jenkins/agent/workspace/eclipse.platform.swt-SonarQube/features/org.eclipse.swt.tools.feature/target/org.eclipse.swt.tools.feature-3.107.800-SNAPSHOT-sources-feature.jar
[INFO] 
[INFO] --- tycho-p2-plugin:1.7.0:p2-metadata (attached-p2-metadata) @ org.eclipse.swt.tools.feature ---
[WARNING] No repository found at file:/noThanks.
org.eclipse.equinox.p2.core.ProvisionException: No repository found at file:/noThanks.
    at org.eclipse.equinox.internal.p2.repository.helpers.AbstractRepositoryManager.fail (AbstractRepositoryManager.java:396)
    at org.eclipse.equinox.internal.p2.repository.helpers.AbstractRepositoryManager.loadRepository (AbstractRepositoryManager.java:661)
    at org.eclipse.equinox.internal.p2.metadata.repository.MetadataRepositoryManager.loadRepository (MetadataRepositoryManager.java:110)
    at org.eclipse.tycho.p2.remote.RemoteMetadataRepositoryManager.loadRepository (RemoteMetadataRepositoryManager.java:61)
    at org.eclipse.tycho.p2.remote.RemoteMetadataRepositoryManager.loadRepository (RemoteMetadataRepositoryManager.java:53)
    at org.eclipse.tycho.p2.tools.baseline.BaselineServiceImpl.getProjectBaseline (BaselineServiceImpl.java:95)
    at org.eclipse.tycho.plugins.p2.BaselineValidator.validateAndReplace (BaselineValidator.java:88)
    at org.eclipse.tycho.plugins.p2.P2MetadataMojo.attachP2Metadata (P2MetadataMojo.java:183)
    at org.eclipse.tycho.plugins.p2.P2MetadataMojo.execute (P2MetadataMojo.java:137)
    at org.apache.maven.plugin.DefaultBuildPluginManager.executeMojo (DefaultBuildPluginManager.java:137)
    at org.apache.maven.lifecycle.internal.MojoExecutor.execute (MojoExecutor.java:210)
    at org.apache.maven.lifecycle.internal.MojoExecutor.execute (MojoExecutor.java:156)
    at org.apache.maven.lifecycle.internal.MojoExecutor.execute (MojoExecutor.java:148)
    at org.apache.maven.lifecycle.internal.LifecycleModuleBuilder.buildProject (LifecycleModuleBuilder.java:117)
    at org.apache.maven.lifecycle.internal.LifecycleModuleBuilder.buildProject (LifecycleModuleBuilder.java:81)
    at org.apache.maven.lifecycle.internal.builder.singlethreaded.SingleThreadedBuilder.build (SingleThreadedBuilder.java:56)
    at org.apache.maven.lifecycle.internal.LifecycleStarter.execute (LifecycleStarter.java:128)
    at org.apache.maven.DefaultMaven.doExecute (DefaultMaven.java:305)
    at org.apache.maven.DefaultMaven.doExecute (DefaultMaven.java:192)
    at org.apache.maven.DefaultMaven.execute (DefaultMaven.java:105)
    at org.apache.maven.cli.MavenCli.execute (MavenCli.java:957)
    at org.apache.maven.cli.MavenCli.doMain (MavenCli.java:289)
    at org.apache.maven.cli.MavenCli.main (MavenCli.java:193)
    at sun.reflect.NativeMethodAccessorImpl.invoke0 (Native Method)
    at sun.reflect.NativeMethodAccessorImpl.invoke (NativeMethodAccessorImpl.java:62)
    at sun.reflect.DelegatingMethodAccessorImpl.invoke (DelegatingMethodAccessorImpl.java:43)
    at java.lang.reflect.Method.invoke (Method.java:498)
    at org.codehaus.plexus.classworlds.launcher.Launcher.launchEnhanced (Launcher.java:282)
    at org.codehaus.plexus.classworlds.launcher.Launcher.launch (Launcher.java:225)
    at org.codehaus.plexus.classworlds.launcher.Launcher.mainWithExitCode (Launcher.java:406)
    at org.codehaus.plexus.classworlds.launcher.Launcher.main (Launcher.java:347)
[INFO] No baseline version MavenProject: org.eclipse.swt.tools.feature:org.eclipse.swt.tools.feature:3.107.800-SNAPSHOT @ /home/jenkins/agent/workspace/eclipse.platform.swt-SonarQube/features/org.eclipse.swt.tools.feature/pom.xml
[INFO] 
[INFO] --- tycho-p2-extras-plugin:1.7.0:compare-version-with-baselines (compare-attached-artifacts-with-release) @ org.eclipse.swt.tools.feature ---
[INFO] Skipped
[INFO] 
[INFO] -------------< org.eclipse.swt:org.eclipse.swt.tests.gtk >--------------
[INFO] Building org.eclipse.swt.tests.gtk 3.107.200-SNAPSHOT            [15/15]
[INFO] ------------------------[ eclipse-test-plugin ]-------------------------
[INFO] 
[INFO] --- maven-clean-plugin:3.1.0:clean (default-clean) @ org.eclipse.swt.tests.gtk ---
[INFO] 
[INFO] --- tycho-packaging-plugin:1.7.0:build-qualifier (default-build-qualifier) @ org.eclipse.swt.tests.gtk ---
[INFO] The project's OSGi version is 3.107.200.v20200514-0720
[INFO] 
[INFO] --- tycho-packaging-plugin:1.7.0:validate-id (default-validate-id) @ org.eclipse.swt.tests.gtk ---
[INFO] 
[INFO] --- tycho-packaging-plugin:1.7.0:validate-version (default-validate-version) @ org.eclipse.swt.tests.gtk ---
[INFO] 
[INFO] --- maven-resources-plugin:3.1.0:copy-resources (saveproperties) @ org.eclipse.swt.tests.gtk ---
[INFO] Using 'UTF-8' encoding to copy filtered resources.
[INFO] skip non existing resourceDirectory /home/jenkins/agent/workspace/eclipse.platform.swt-SonarQube/tests/org.eclipse.swt.tests.gtk/saveproperties
[INFO] 
[INFO] --- maven-enforcer-plugin:3.0.0-M3:enforce (enforce-maven) @ org.eclipse.swt.tests.gtk ---
[INFO] 
[INFO] --- jacoco-maven-plugin:0.8.5:prepare-agent (jacoco-agent) @ org.eclipse.swt.tests.gtk ---
[INFO] tycho.testArgLine set to -javaagent:/home/jenkins/agent/workspace/eclipse.platform.swt-SonarQube/.repository/org/jacoco/org.jacoco.agent/0.8.5/org.jacoco.agent-0.8.5-runtime.jar=destfile=/home/jenkins/agent/workspace/eclipse.platform.swt-SonarQube/jacoco.exec,append=true
[INFO] 
[INFO] --- eclipse-cbi-plugin:1.1.8-SNAPSHOT:generate-api-build-xml (default) @ org.eclipse.swt.tests.gtk ---
[INFO] 
[INFO] --- maven-resources-plugin:3.1.0:resources (default-resources) @ org.eclipse.swt.tests.gtk ---
[INFO] Using 'UTF-8' encoding to copy filtered resources.
[INFO] skip non existing resourceDirectory /home/jenkins/agent/workspace/eclipse.platform.swt-SonarQube/tests/org.eclipse.swt.tests.gtk/src/main/resources
[INFO] 
[INFO] --- maven-resources-plugin:3.1.0:resources (filter-resources) @ org.eclipse.swt.tests.gtk ---
[INFO] Using 'UTF-8' encoding to copy filtered resources.
[INFO] skip non existing resourceDirectory /home/jenkins/agent/workspace/eclipse.platform.swt-SonarQube/tests/org.eclipse.swt.tests.gtk/src/main/resources
[INFO] 
[INFO] --- tycho-compiler-plugin:1.7.0:compile (default-compile) @ org.eclipse.swt.tests.gtk ---
[INFO] Compiling 338 source files to /home/jenkins/agent/workspace/eclipse.platform.swt-SonarQube/tests/org.eclipse.swt.tests.gtk/target/classes
[INFO] 
[INFO] --- tycho-eclipserun-plugin:1.7.0:eclipse-run (default) @ org.eclipse.swt.tests.gtk ---
[INFO] 
[INFO] --- maven-resources-plugin:3.1.0:testResources (default-testResources) @ org.eclipse.swt.tests.gtk ---
[INFO] Using 'UTF-8' encoding to copy filtered resources.
[INFO] skip non existing resourceDirectory /home/jenkins/agent/workspace/eclipse.platform.swt-SonarQube/tests/org.eclipse.swt.tests.gtk/src/test/resources
[INFO] 
[INFO] --- tycho-source-plugin:1.7.0:plugin-source (plugin-source) @ org.eclipse.swt.tests.gtk ---
[WARNING] Bundle-Name header not found in /home/jenkins/agent/workspace/eclipse.platform.swt-SonarQube/tests/org.eclipse.swt.tests.gtk/META-INF/MANIFEST.MF, fallback to Bundle-SymbolicName for source bundle
[WARNING] Bundle-Vendor header not found in /home/jenkins/agent/workspace/eclipse.platform.swt-SonarQube/tests/org.eclipse.swt.tests.gtk/META-INF/MANIFEST.MF, fallback to 'unknown' for source bundle
[INFO] Building jar: /home/jenkins/agent/workspace/eclipse.platform.swt-SonarQube/tests/org.eclipse.swt.tests.gtk/target/org.eclipse.swt.tests.gtk-3.107.200-SNAPSHOT-sources.jar
[INFO] 
[INFO] --- target-platform-configuration:1.7.0:target-platform (default-target-platform) @ org.eclipse.swt.tests.gtk ---
[INFO] 
[INFO] --- tycho-packaging-plugin:1.7.0:package-plugin (default-package-plugin) @ org.eclipse.swt.tests.gtk ---
[INFO] Building jar: /home/jenkins/agent/workspace/eclipse.platform.swt-SonarQube/tests/org.eclipse.swt.tests.gtk/target/org.eclipse.swt.tests.gtk-3.107.200-SNAPSHOT.jar
[INFO] 
[INFO] --- tycho-p2-plugin:1.7.0:p2-metadata-default (default-p2-metadata-default) @ org.eclipse.swt.tests.gtk ---
[WARNING] No repository found at file:/noThanks.
org.eclipse.equinox.p2.core.ProvisionException: No repository found at file:/noThanks.
    at org.eclipse.equinox.internal.p2.repository.helpers.AbstractRepositoryManager.fail (AbstractRepositoryManager.java:396)
    at org.eclipse.equinox.internal.p2.repository.helpers.AbstractRepositoryManager.loadRepository (AbstractRepositoryManager.java:661)
    at org.eclipse.equinox.internal.p2.metadata.repository.MetadataRepositoryManager.loadRepository (MetadataRepositoryManager.java:110)
    at org.eclipse.tycho.p2.remote.RemoteMetadataRepositoryManager.loadRepository (RemoteMetadataRepositoryManager.java:61)
    at org.eclipse.tycho.p2.remote.RemoteMetadataRepositoryManager.loadRepository (RemoteMetadataRepositoryManager.java:53)
    at org.eclipse.tycho.p2.tools.baseline.BaselineServiceImpl.getProjectBaseline (BaselineServiceImpl.java:95)
    at org.eclipse.tycho.plugins.p2.BaselineValidator.validateAndReplace (BaselineValidator.java:88)
    at org.eclipse.tycho.plugins.p2.P2MetadataMojo.attachP2Metadata (P2MetadataMojo.java:183)
    at org.eclipse.tycho.plugins.p2.P2MetadataMojo.execute (P2MetadataMojo.java:137)
    at org.eclipse.tycho.plugins.p2.P2MetadataDefaultMojo.execute (P2MetadataDefaultMojo.java:32)
    at org.apache.maven.plugin.DefaultBuildPluginManager.executeMojo (DefaultBuildPluginManager.java:137)
    at org.apache.maven.lifecycle.internal.MojoExecutor.execute (MojoExecutor.java:210)
    at org.apache.maven.lifecycle.internal.MojoExecutor.execute (MojoExecutor.java:156)
    at org.apache.maven.lifecycle.internal.MojoExecutor.execute (MojoExecutor.java:148)
    at org.apache.maven.lifecycle.internal.LifecycleModuleBuilder.buildProject (LifecycleModuleBuilder.java:117)
    at org.apache.maven.lifecycle.internal.LifecycleModuleBuilder.buildProject (LifecycleModuleBuilder.java:81)
    at org.apache.maven.lifecycle.internal.builder.singlethreaded.SingleThreadedBuilder.build (SingleThreadedBuilder.java:56)
    at org.apache.maven.lifecycle.internal.LifecycleStarter.execute (LifecycleStarter.java:128)
    at org.apache.maven.DefaultMaven.doExecute (DefaultMaven.java:305)
    at org.apache.maven.DefaultMaven.doExecute (DefaultMaven.java:192)
    at org.apache.maven.DefaultMaven.execute (DefaultMaven.java:105)
    at org.apache.maven.cli.MavenCli.execute (MavenCli.java:957)
    at org.apache.maven.cli.MavenCli.doMain (MavenCli.java:289)
    at org.apache.maven.cli.MavenCli.main (MavenCli.java:193)
    at sun.reflect.NativeMethodAccessorImpl.invoke0 (Native Method)
    at sun.reflect.NativeMethodAccessorImpl.invoke (NativeMethodAccessorImpl.java:62)
    at sun.reflect.DelegatingMethodAccessorImpl.invoke (DelegatingMethodAccessorImpl.java:43)
    at java.lang.reflect.Method.invoke (Method.java:498)
    at org.codehaus.plexus.classworlds.launcher.Launcher.launchEnhanced (Launcher.java:282)
    at org.codehaus.plexus.classworlds.launcher.Launcher.launch (Launcher.java:225)
    at org.codehaus.plexus.classworlds.launcher.Launcher.mainWithExitCode (Launcher.java:406)
    at org.codehaus.plexus.classworlds.launcher.Launcher.main (Launcher.java:347)
[INFO] No baseline version MavenProject: org.eclipse.swt:org.eclipse.swt.tests.gtk:3.107.200-SNAPSHOT @ /home/jenkins/agent/workspace/eclipse.platform.swt-SonarQube/tests/org.eclipse.swt.tests.gtk/pom.xml
[INFO] 
[INFO] --- tycho-surefire-plugin:1.7.0:test (default-test) @ org.eclipse.swt.tests.gtk ---
[INFO] Skipping tests
[INFO] 
[INFO] --- tycho-p2-extras-plugin:1.7.0:compare-version-with-baselines (compare-attached-artifacts-with-release) @ org.eclipse.swt.tests.gtk ---
[INFO] Skipped
[INFO] ------------------------------------------------------------------------
[INFO] Reactor Summary:
[INFO] 
[INFO] eclipse.platform.swt 4.16.0-SNAPSHOT ............... SUCCESS [ 42.192 s]
[INFO] org.eclipse.swt 3.114.100-SNAPSHOT ................. SUCCESS [ 16.551 s]
[INFO] org.eclipse.swt.fragments.localbuild 3.105.0-SNAPSHOT SUCCESS [  0.643 s]
[INFO] org.eclipse.swt.tools.base 3.107.300-SNAPSHOT ...... SUCCESS [  0.607 s]
[INFO] org.eclipse.swt.tools.spies 3.107.100-SNAPSHOT ..... SUCCESS [  1.868 s]
[INFO] org.eclipse.swt.tools 3.108.300-SNAPSHOT ........... SUCCESS [  2.212 s]
[INFO] org.eclipse.swt.examples 3.106.900-SNAPSHOT ........ SUCCESS [  3.226 s]
[INFO] org.eclipse.swt.examples.browser.demos 3.106.400-SNAPSHOT SUCCESS [  0.708 s]
[INFO] org.eclipse.swt.examples.launcher 3.106.300-SNAPSHOT SUCCESS [  0.683 s]
[INFO] org.eclipse.swt.examples.ole.win32 3.107.400-SNAPSHOT SUCCESS [  0.674 s]
[INFO] org.eclipse.swt.examples.views 3.106.300-SNAPSHOT .. SUCCESS [  0.567 s]
[INFO] org.eclipse.swt.tests.fragments.feature 3.106.0-SNAPSHOT SUCCESS [  0.236 s]
[INFO] org.eclipse.swt.tests 3.106.900-SNAPSHOT ........... SUCCESS [01:24 min]
[INFO] org.eclipse.swt.tools.feature 3.107.800-SNAPSHOT ... SUCCESS [  0.393 s]
[INFO] org.eclipse.swt.tests.gtk 3.107.200-SNAPSHOT ....... SUCCESS [  1.917 s]
[INFO] ------------------------------------------------------------------------
[INFO] BUILD SUCCESS
[INFO] ------------------------------------------------------------------------
[INFO] Total time:  04:16 min
[INFO] Finished at: 2020-05-15T08:31:46Z
[INFO] ------------------------------------------------------------------------
Terminating xvnc.
[eclipse.platform.swt-SonarQube] $ /opt/tools/apache-maven/latest/bin/mvn -f /home/jenkins/agent/workspace/eclipse.platform.swt-SonarQube/pom.xml -e -B org.sonarsource.scanner.maven:sonar-maven-plugin:3.3.0.603:sonar -Pbuild-individual-bundles -Pcoverage -Dmaven.repo.local=/home/jenkins/agent/workspace/eclipse.platform.swt-SonarQube/.maven/.repo -Djacoco.destFile=/home/jenkins/agent/workspace/eclipse.platform.swt-SonarQube/jacoco.exec -Dsonar.jdbc.url=jdbc:mysql://dbmaster:3306/sonar?autoReconnect=true&useUnicode=true&characterEncoding=utf8 ******** ******** -Dsonar.host.url=https://sonar.eclipse.org
Apache Maven 3.6.3 (cecedd343002696d0abb50b32b541b8a6ba2883f)
Maven home: /opt/tools/apache-maven/latest
Java version: 1.8.0_202, vendor: Oracle Corporation, runtime: /opt/tools/java/oracle/jdk-8/1.8.0_202/jre
Default locale: en_US, platform encoding: UTF-8
OS name: "linux", version: "3.10.0-1127.el7.x86_64", arch: "amd64", family: "unix"
[INFO] Error stacktraces are turned on.
[INFO] Scanning for projects...
[WARNING] No explicit target runtime environment configuration. Build is platform dependent.
[WARNING] No explicit target runtime environment configuration. Build is platform dependent.
[INFO] Computing target platform for MavenProject: org.eclipse.swt:org.eclipse.swt:3.114.100-SNAPSHOT @ /home/jenkins/agent/workspace/eclipse.platform.swt-SonarQube/bundles/org.eclipse.swt/pom.xml
[INFO] Fetching p2.index from https://download.eclipse.org/tools/orbit/downloads/drops/S20200427151422/repository/
[INFO] Adding repository https://download.eclipse.org/tools/orbit/downloads/drops/S20200427151422/repository
[INFO] Fetching compositeContent.xml from https://download.eclipse.org/tools/orbit/downloads/drops/S20200427151422/repository/
[INFO] Fetching content.jar from https://download.eclipse.org/tools/orbit/downloads/drops/R20191115185527/repository/ (107.42kB)
[INFO] Fetching p2.index from https://download.eclipse.org/tools/orbit/downloads/drops2/S20200427151422/repository/
[INFO] Fetching content.xml.xz from https://download.eclipse.org/tools/orbit/downloads/drops2/S20200427151422/repository/
[INFO] Fetching p2.index from https://download.eclipse.org/modeling/emf/emf/builds/milestone/S202004270812/
[INFO] Adding repository https://download.eclipse.org/modeling/emf/emf/builds/milestone/S202004270812
[INFO] Fetching content.xml.xz from https://download.eclipse.org/modeling/emf/emf/builds/milestone/S202004270812/
[INFO] Adding repository https://download.eclipse.org/jetty/updates/jetty-bundles-9.x/9.4.28.v20200408
[INFO] Fetching content.jar from https://download.eclipse.org/jetty/updates/jetty-bundles-9.x/9.4.28.v20200408/ (19.49kB)
[INFO] Fetching p2.index from https://download.eclipse.org/rt/ecf/3.14.7/site.p2/
[INFO] Adding repository https://download.eclipse.org/rt/ecf/3.14.7/site.p2
[INFO] Fetching content.xml.xz from https://download.eclipse.org/rt/ecf/3.14.7/site.p2/
[INFO] Fetching p2.index from https://download.eclipse.org/cbi/updates/license/2.0.2.v20181016-2210/
[INFO] Adding repository https://download.eclipse.org/cbi/updates/license/2.0.2.v20181016-2210
[INFO] Fetching content.xml.xz from https://download.eclipse.org/cbi/updates/license/2.0.2.v20181016-2210/
[INFO] Fetching p2.index from https://download.eclipse.org/egit/updates-5.7/
[INFO] Adding repository https://download.eclipse.org/egit/updates-5.7
[INFO] Fetching content.xml.xz from https://download.eclipse.org/egit/updates-5.7/
[INFO] Fetching p2.index from https://download.eclipse.org/reddeer/releases/2.9.0/
[INFO] Adding repository https://download.eclipse.org/reddeer/releases/2.9.0
[INFO] Fetching content.xml.xz from https://download.eclipse.org/reddeer/releases/2.9.0/
[INFO] Fetching p2.index from https://download.eclipse.org/eclipse/updates/4.16-I-builds/
[INFO] Adding repository https://download.eclipse.org/eclipse/updates/4.16-I-builds
[INFO] Fetching compositeContent.jar from https://download.eclipse.org/eclipse/updates/4.16-I-builds/ (455B)
[INFO] Fetching content.jar from https://download.eclipse.org/eclipse/updates/4.16-I-builds/categories/ (1.46kB)
[INFO] Fetching p2.index from https://download.eclipse.org/eclipse/updates/4.16-I-builds/I20200511-1800/
[INFO] Fetching content.xml from https://download.eclipse.org/eclipse/updates/4.16-I-builds/I20200511-1800/
[INFO] Fetching p2.index from https://download.eclipse.org/eclipse/updates/4.16-I-builds/I20200512-1800/
[INFO] Fetching content.xml from https://download.eclipse.org/eclipse/updates/4.16-I-builds/I20200512-1800/
[INFO] Fetching p2.index from https://download.eclipse.org/eclipse/updates/4.16-I-builds/I20200513-1800/
[INFO] Fetching content.xml from https://download.eclipse.org/eclipse/updates/4.16-I-builds/I20200513-1800/
[INFO] Fetching p2.index from https://download.eclipse.org/eclipse/updates/4.16-I-builds/I20200514-1800/
[INFO] Fetching content.xml from https://download.eclipse.org/eclipse/updates/4.16-I-builds/I20200514-1800/
[INFO] Resolving dependencies of MavenProject: org.eclipse.swt:org.eclipse.swt:3.114.100-SNAPSHOT @ /home/jenkins/agent/workspace/eclipse.platform.swt-SonarQube/bundles/org.eclipse.swt/pom.xml
[INFO] Resolving class path of MavenProject: org.eclipse.swt:org.eclipse.swt:3.114.100-SNAPSHOT @ /home/jenkins/agent/workspace/eclipse.platform.swt-SonarQube/bundles/org.eclipse.swt/pom.xml
[INFO] Computing target platform for MavenProject: org.eclipse.swt:org.eclipse.swt.fragments.localbuild:3.105.0-SNAPSHOT @ /home/jenkins/agent/workspace/eclipse.platform.swt-SonarQube/local-build/org.eclipse.swt.fragments.localbuild/pom.xml
[INFO] Resolving dependencies of MavenProject: org.eclipse.swt:org.eclipse.swt.fragments.localbuild:3.105.0-SNAPSHOT @ /home/jenkins/agent/workspace/eclipse.platform.swt-SonarQube/local-build/org.eclipse.swt.fragments.localbuild/pom.xml
[INFO] Fetching org.eclipse.swt.gtk.linux.x86_64_3.114.100.v20200514-2203.jar.pack.gz from https://download.eclipse.org/eclipse/updates/4.16-I-builds/I20200514-1800/plugins/ (955.99kB)
May 15, 2020 8:33:04 AM org.apache.http.impl.execchain.RetryExec execute
INFO: I/O exception (org.apache.http.NoHttpResponseException) caught when processing request to {s}->https://download.eclipse.org:443: The target server failed to respond
May 15, 2020 8:33:04 AM org.apache.http.impl.execchain.RetryExec execute
INFO: Retrying request to {s}->https://download.eclipse.org:443
[INFO] Fetching org.eclipse.swt.gtk.linux.ppc64le_3.114.100.v20200514-2203.jar.pack.gz from https://download.eclipse.org/eclipse/updates/4.16-I-builds/I20200514-1800/plugins/ (914.8kB)
May 15, 2020 8:33:06 AM org.apache.http.impl.execchain.RetryExec execute
INFO: I/O exception (org.apache.http.NoHttpResponseException) caught when processing request to {s}->https://download.eclipse.org:443: The target server failed to respond
May 15, 2020 8:33:06 AM org.apache.http.impl.execchain.RetryExec execute
INFO: Retrying request to {s}->https://download.eclipse.org:443
[INFO] Fetching org.eclipse.swt.win32.win32.x86_64_3.114.100.v20200514-2203.jar.pack.gz from https://download.eclipse.org/eclipse/updates/4.16-I-builds/I20200514-1800/plugins/ (1.13MB)
[INFO] Fetching org.eclipse.swt.cocoa.macosx.x86_64_3.114.100.v20200514-2203.jar.pack.gz from https://download.eclipse.org/eclipse/updates/4.16-I-builds/I20200514-1800/plugins/ (834.95kB)
[INFO] Resolving class path of MavenProject: org.eclipse.swt:org.eclipse.swt.fragments.localbuild:3.105.0-SNAPSHOT @ /home/jenkins/agent/workspace/eclipse.platform.swt-SonarQube/local-build/org.eclipse.swt.fragments.localbuild/pom.xml
[INFO] Computing target platform for MavenProject: org.eclipse.swt:org.eclipse.swt.tools.base:3.107.300-SNAPSHOT @ /home/jenkins/agent/workspace/eclipse.platform.swt-SonarQube/bundles/org.eclipse.swt.tools.base/pom.xml
[INFO] Resolving dependencies of MavenProject: org.eclipse.swt:org.eclipse.swt.tools.base:3.107.300-SNAPSHOT @ /home/jenkins/agent/workspace/eclipse.platform.swt-SonarQube/bundles/org.eclipse.swt.tools.base/pom.xml
May 15, 2020 8:33:08 AM org.apache.http.impl.execchain.RetryExec execute
INFO: I/O exception (org.apache.http.NoHttpResponseException) caught when processing request to {s}->https://download.eclipse.org:443: The target server failed to respond
May 15, 2020 8:33:08 AM org.apache.http.impl.execchain.RetryExec execute
INFO: Retrying request to {s}->https://download.eclipse.org:443
[INFO] Fetching com.ibm.icu_64.2.0.v20190507-1337.jar.pack.gz from https://download.eclipse.org/eclipse/updates/4.16-I-builds/I20200511-1800/plugins/ (9.5MB)
[INFO] Fetching org.eclipse.osgi_3.15.300.v20200508-1552.jar.pack.gz from https://download.eclipse.org/eclipse/updates/4.16-I-builds/I20200511-1800/plugins/ (459.23kB)
[INFO] Fetching org.apache.batik.constants_1.11.0.v20190515-0436.jar.pack.gz from https://download.eclipse.org/eclipse/updates/4.16-I-builds/I20200511-1800/plugins/ (13.03kB)
[INFO] Fetching org.apache.batik.css_1.11.0.v20190515-0436.jar.pack.gz from https://download.eclipse.org/eclipse/updates/4.16-I-builds/I20200511-1800/plugins/ (101.68kB)
[INFO] Fetching org.apache.batik.util_1.11.0.v20190515-0436.jar.pack.gz from https://download.eclipse.org/eclipse/updates/4.16-I-builds/I20200511-1800/plugins/ (63.49kB)
[INFO] Fetching org.apache.batik.i18n_1.11.0.v20190515-0436.jar.pack.gz from https://download.eclipse.org/eclipse/updates/4.16-I-builds/I20200511-1800/plugins/ (14.52kB)
[INFO] Fetching org.apache.xmlgraphics_2.3.0.v20190515-0436.jar.pack.gz from https://download.eclipse.org/eclipse/updates/4.16-I-builds/I20200511-1800/plugins/ (258.72kB)
[INFO] Fetching org.w3c.dom.svg_1.1.0.v201011041433.jar from https://download.eclipse.org/eclipse/updates/4.16-I-builds/I20200511-1800/plugins/ (95.26kB)
[INFO] Fetching org.w3c.dom.events_3.0.0.draft20060413_v201105210656.jar from https://download.eclipse.org/eclipse/updates/4.16-I-builds/I20200511-1800/plugins/ (15.35kB)
[INFO] Fetching org.w3c.css.sac_1.3.1.v200903091627.jar from https://download.eclipse.org/eclipse/updates/4.16-I-builds/I20200511-1800/plugins/ (35.59kB)
[INFO] Fetching org.apache.commons.io_2.6.0.v20190123-2029.jar.pack.gz from https://download.eclipse.org/eclipse/updates/4.16-I-builds/I20200511-1800/plugins/ (82.7kB)
[INFO] Fetching org.apache.commons.logging_1.2.0.v20180409-1502.jar.pack.gz from https://download.eclipse.org/eclipse/updates/4.16-I-builds/I20200511-1800/plugins/ (33.71kB)
[INFO] Fetching org.apache.felix.scr_2.1.16.v20200110-1820.jar.pack.gz from https://download.eclipse.org/eclipse/updates/4.16-I-builds/I20200511-1800/plugins/ (155.55kB)
[INFO] Fetching org.eclipse.osgi.services_3.8.0.v20190206-2147.jar.pack.gz from https://download.eclipse.org/eclipse/updates/4.16-I-builds/I20200511-1800/plugins/ (44.03kB)
[INFO] Fetching org.eclipse.osgi.util_3.5.300.v20190708-1141.jar.pack.gz from https://download.eclipse.org/eclipse/updates/4.16-I-builds/I20200511-1800/plugins/ (30.65kB)
[INFO] Fetching org.eclipse.core.commands_3.9.700.v20191217-1850.jar.pack.gz from https://download.eclipse.org/eclipse/updates/4.16-I-builds/I20200511-1800/plugins/ (43.01kB)
[INFO] Fetching org.eclipse.equinox.common_3.12.0.v20200504-1602.jar.pack.gz from https://download.eclipse.org/eclipse/updates/4.16-I-builds/I20200511-1800/plugins/ (55.07kB)
[INFO] Fetching org.eclipse.equinox.preferences_3.8.0.v20200422-1833.jar.pack.gz from https://download.eclipse.org/eclipse/updates/4.16-I-builds/I20200511-1800/plugins/ (55.59kB)
[INFO] Fetching org.eclipse.equinox.registry_3.8.800.v20200406-0956.jar.pack.gz from https://download.eclipse.org/eclipse/updates/4.16-I-builds/I20200511-1800/plugins/ (77.27kB)
[INFO] Fetching org.eclipse.core.contenttype_3.7.700.v20200514-1842.jar.pack.gz from https://download.eclipse.org/eclipse/updates/4.16-I-builds/I20200514-1800/plugins/ (41.42kB)
[INFO] Fetching org.eclipse.core.databinding_1.9.0.v20200507-1701.jar.pack.gz from https://download.eclipse.org/eclipse/updates/4.16-I-builds/I20200511-1800/plugins/ (56.81kB)
[INFO] Fetching org.eclipse.core.databinding.observable_1.9.0.v20200205-2119.jar.pack.gz from https://download.eclipse.org/eclipse/updates/4.16-I-builds/I20200511-1800/plugins/ (82.47kB)
[INFO] Fetching org.eclipse.core.databinding.property_1.8.0.v20200124-0715.jar.pack.gz from https://download.eclipse.org/eclipse/updates/4.16-I-builds/I20200511-1800/plugins/ (44.98kB)
[INFO] Fetching org.eclipse.core.expressions_3.6.800.v20200319-0911.jar.pack.gz from https://download.eclipse.org/eclipse/updates/4.16-I-builds/I20200511-1800/plugins/ (33.96kB)
[INFO] Fetching org.eclipse.core.runtime_3.18.0.v20200506-2143.jar.pack.gz from https://download.eclipse.org/eclipse/updates/4.16-I-builds/I20200511-1800/plugins/ (33.65kB)
[INFO] Fetching org.eclipse.core.jobs_3.10.800.v20200421-0950.jar.pack.gz from https://download.eclipse.org/eclipse/updates/4.16-I-builds/I20200511-1800/plugins/ (46.11kB)
[INFO] Fetching org.eclipse.equinox.app_1.4.500.v20200422-1833.jar.pack.gz from https://download.eclipse.org/eclipse/updates/4.16-I-builds/I20200511-1800/plugins/ (42.05kB)
[INFO] Fetching org.eclipse.e4.core.commands_0.12.900.v20200110-1732.jar.pack.gz from https://download.eclipse.org/eclipse/updates/4.16-I-builds/I20200511-1800/plugins/ (13.76kB)
[INFO] Fetching org.eclipse.e4.core.di_1.7.600.v20200428-0912.jar.pack.gz from https://download.eclipse.org/eclipse/updates/4.16-I-builds/I20200511-1800/plugins/ (25.88kB)
[INFO] Fetching javax.inject_1.0.0.v20091030.jar from https://download.eclipse.org/eclipse/updates/4.16-I-builds/I20200511-1800/plugins/ (14.07kB)
[INFO] Fetching org.eclipse.e4.core.contexts_1.8.400.v20191217-1710.jar.pack.gz from https://download.eclipse.org/eclipse/updates/4.16-I-builds/I20200511-1800/plugins/ (22.66kB)
[INFO] Fetching org.eclipse.e4.core.services_2.2.300.v20200422-1846.jar.pack.gz from https://download.eclipse.org/eclipse/updates/4.16-I-builds/I20200511-1800/plugins/ (28.06kB)
[INFO] Fetching org.eclipse.e4.core.di.annotations_1.6.600.v20191216-2352.jar.pack.gz from https://download.eclipse.org/eclipse/updates/4.16-I-builds/I20200511-1800/plugins/ (7.68kB)
[INFO] Fetching org.eclipse.e4.core.di.extensions_0.16.0.v20200507-0938.jar.pack.gz from https://download.eclipse.org/eclipse/updates/4.16-I-builds/I20200511-1800/plugins/ (7.72kB)
[INFO] Fetching org.eclipse.e4.core.di.extensions.supplier_0.15.600.v20200311-0642.jar.pack.gz from https://download.eclipse.org/eclipse/updates/4.16-I-builds/I20200511-1800/plugins/ (16.65kB)
[INFO] Fetching org.eclipse.e4.emf.xpath_0.2.700.v20200318-1219.jar.pack.gz from https://download.eclipse.org/eclipse/updates/4.16-I-builds/I20200511-1800/plugins/ (21.82kB)
[INFO] Fetching org.apache.commons.jxpath_1.3.0.v200911051830.jar.pack.gz from https://download.eclipse.org/eclipse/updates/4.16-I-builds/I20200511-1800/plugins/ (107.16kB)
[INFO] Fetching org.eclipse.emf.ecore_2.22.0.v20200324-0932.jar.pack.gz from https://download.eclipse.org/eclipse/updates/4.16-I-builds/I20200511-1800/plugins/ (487.25kB)
[INFO] Fetching org.eclipse.e4.ui.services_1.3.700.v20190930-1643.jar.pack.gz from https://download.eclipse.org/eclipse/updates/4.16-I-builds/I20200511-1800/plugins/ (13.16kB)
[INFO] Fetching org.eclipse.jface_3.20.0.v20200505-1952.jar.pack.gz from https://download.eclipse.org/eclipse/updates/4.16-I-builds/I20200511-1800/plugins/ (361.92kB)
[INFO] Fetching org.eclipse.e4.ui.bindings_0.12.900.v20200513-0930.jar.pack.gz from https://download.eclipse.org/eclipse/updates/4.16-I-builds/I20200513-1800/plugins/ (23.02kB)
[INFO] Fetching org.eclipse.e4.ui.css.core_0.12.1200.v20200513-0930.jar.pack.gz from https://download.eclipse.org/eclipse/updates/4.16-I-builds/I20200513-1800/plugins/ (66.16kB)
[INFO] Fetching org.eclipse.e4.ui.css.swt_0.13.1000.v20200514-1613.jar.pack.gz from https://download.eclipse.org/eclipse/updates/4.16-I-builds/I20200514-1800/plugins/ (65.73kB)
[INFO] Fetching org.eclipse.e4.ui.css.swt.theme_0.12.700.v20200508-1201.jar.pack.gz from https://download.eclipse.org/eclipse/updates/4.16-I-builds/I20200511-1800/plugins/ (16.41kB)
[INFO] Fetching org.eclipse.e4.ui.di_1.2.800.v20200128-0855.jar.pack.gz from https://download.eclipse.org/eclipse/updates/4.16-I-builds/I20200511-1800/plugins/ (9.76kB)
[INFO] Fetching org.eclipse.e4.ui.dialogs_1.1.800.v20200428-1429.jar.pack.gz from https://download.eclipse.org/eclipse/updates/4.16-I-builds/I20200511-1800/plugins/ (27.97kB)
[INFO] Fetching org.eclipse.e4.ui.model.workbench_2.1.700.v20200113-1422.jar.pack.gz from https://download.eclipse.org/eclipse/updates/4.16-I-builds/I20200511-1800/plugins/ (111.14kB)
[INFO] Fetching org.eclipse.equinox.event_1.5.400.v20200511-1702.jar.pack.gz from https://download.eclipse.org/eclipse/updates/4.16-I-builds/I20200511-1800/plugins/ (16.62kB)
[INFO] Fetching org.eclipse.e4.ui.widgets_1.2.700.v20191222-1048.jar.pack.gz from https://download.eclipse.org/eclipse/updates/4.16-I-builds/I20200511-1800/plugins/ (9.45kB)
[INFO] Fetching org.eclipse.emf.ecore.change_2.14.0.v20190528-0725.jar.pack.gz from https://download.eclipse.org/eclipse/updates/4.16-I-builds/I20200511-1800/plugins/ (50.85kB)
[INFO] Fetching org.eclipse.emf.ecore.xmi_2.16.0.v20190528-0725.jar.pack.gz from https://download.eclipse.org/eclipse/updates/4.16-I-builds/I20200511-1800/plugins/ (84.01kB)
[INFO] Fetching org.eclipse.e4.ui.workbench_1.11.300.v20200514-1625.jar.pack.gz from https://download.eclipse.org/eclipse/updates/4.16-I-builds/I20200514-1800/plugins/ (85.1kB)
[INFO] Fetching org.eclipse.e4.ui.workbench.renderers.swt_0.14.1200.v20200513-2050.jar.pack.gz from https://download.eclipse.org/eclipse/updates/4.16-I-builds/I20200513-1800/plugins/ (94.52kB)
[INFO] Fetching org.eclipse.e4.ui.workbench.swt_0.14.1000.v20200514-1625.jar.pack.gz from https://download.eclipse.org/eclipse/updates/4.16-I-builds/I20200514-1800/plugins/ (60.86kB)
[INFO] Fetching org.eclipse.e4.ui.workbench.addons.swt_1.3.1000.v20200514-1625.jar.pack.gz from https://download.eclipse.org/eclipse/updates/4.16-I-builds/I20200514-1800/plugins/ (49.93kB)
[INFO] Fetching org.eclipse.jface.databinding_1.11.100.v20200318-1219.jar.pack.gz from https://download.eclipse.org/eclipse/updates/4.16-I-builds/I20200511-1800/plugins/ (77.92kB)
[INFO] Fetching org.eclipse.e4.ui.workbench3_0.15.400.v20191216-0805.jar.pack.gz from https://download.eclipse.org/eclipse/updates/4.16-I-builds/I20200511-1800/plugins/ (13.07kB)
[INFO] Fetching org.eclipse.urischeme_1.1.0.v20200513-0919.jar.pack.gz from https://download.eclipse.org/eclipse/updates/4.16-I-builds/I20200513-1800/plugins/ (22.33kB)
[INFO] Fetching org.eclipse.emf.common_2.19.0.v20200324-0932.jar.pack.gz from https://download.eclipse.org/eclipse/updates/4.16-I-builds/I20200511-1800/plugins/ (115.33kB)
[INFO] Fetching org.eclipse.help_3.8.800.v20200510-2103.jar.pack.gz from https://download.eclipse.org/eclipse/updates/4.16-I-builds/I20200511-1800/plugins/ (120.6kB)
[INFO] Fetching org.eclipse.ui_3.117.0.v20200414-1247.jar.pack.gz from https://download.eclipse.org/eclipse/updates/4.16-I-builds/I20200511-1800/plugins/ (363.8kB)
[INFO] Fetching org.eclipse.ui.workbench_3.119.0.v20200514-1909.jar.pack.gz from https://download.eclipse.org/eclipse/updates/4.16-I-builds/I20200514-1800/plugins/ (997.69kB)
May 15, 2020 8:33:27 AM org.apache.http.impl.execchain.RetryExec execute
INFO: I/O exception (org.apache.http.NoHttpResponseException) caught when processing request to {s}->https://download.eclipse.org:443: The target server failed to respond
May 15, 2020 8:33:27 AM org.apache.http.impl.execchain.RetryExec execute
INFO: Retrying request to {s}->https://download.eclipse.org:443
[INFO] Fetching org.w3c.dom.smil_1.0.1.v200903091627.jar.pack.gz from https://download.eclipse.org/eclipse/updates/4.16-I-builds/I20200511-1800/plugins/ (16.71kB)
[INFO] Resolving class path of MavenProject: org.eclipse.swt:org.eclipse.swt.tools.base:3.107.300-SNAPSHOT @ /home/jenkins/agent/workspace/eclipse.platform.swt-SonarQube/bundles/org.eclipse.swt.tools.base/pom.xml
[INFO] Computing target platform for MavenProject: org.eclipse.swt:org.eclipse.swt.tools.spies:3.107.100-SNAPSHOT @ /home/jenkins/agent/workspace/eclipse.platform.swt-SonarQube/bundles/org.eclipse.swt.tools.spies/pom.xml
[INFO] Resolving dependencies of MavenProject: org.eclipse.swt:org.eclipse.swt.tools.spies:3.107.100-SNAPSHOT @ /home/jenkins/agent/workspace/eclipse.platform.swt-SonarQube/bundles/org.eclipse.swt.tools.spies/pom.xml
[INFO] Fetching javax.annotation_1.2.0.v201602091430.jar.pack.gz from https://download.eclipse.org/eclipse/updates/4.16-I-builds/I20200511-1800/plugins/ (21.32kB)
[INFO] Resolving class path of MavenProject: org.eclipse.swt:org.eclipse.swt.tools.spies:3.107.100-SNAPSHOT @ /home/jenkins/agent/workspace/eclipse.platform.swt-SonarQube/bundles/org.eclipse.swt.tools.spies/pom.xml
[INFO] Computing target platform for MavenProject: org.eclipse.swt:org.eclipse.swt.tools:3.108.300-SNAPSHOT @ /home/jenkins/agent/workspace/eclipse.platform.swt-SonarQube/bundles/org.eclipse.swt.tools/pom.xml
[INFO] Resolving dependencies of MavenProject: org.eclipse.swt:org.eclipse.swt.tools:3.108.300-SNAPSHOT @ /home/jenkins/agent/workspace/eclipse.platform.swt-SonarQube/bundles/org.eclipse.swt.tools/pom.xml
[INFO] Fetching org.eclipse.core.filesystem_1.7.700.v20200110-1734.jar.pack.gz from https://download.eclipse.org/eclipse/updates/4.16-I-builds/I20200511-1800/plugins/ (27.79kB)
[INFO] Fetching org.eclipse.core.resources_3.13.700.v20200209-1624.jar from https://download.eclipse.org/eclipse/updates/4.16-I-builds/I20200511-1800/plugins/ (873.17kB)
[INFO] Fetching org.eclipse.text_3.10.200.v20200428-0633.jar.pack.gz from https://download.eclipse.org/eclipse/updates/4.16-I-builds/I20200511-1800/plugins/ (100.5kB)
[INFO] Fetching org.eclipse.jdt.core_3.22.0.v20200514-1920.jar from https://download.eclipse.org/eclipse/updates/4.16-I-builds/I20200514-1800/plugins/ (6.83MB)
[INFO] Fetching org.eclipse.jface.text_3.16.300.v20200411-1324.jar.pack.gz from https://download.eclipse.org/eclipse/updates/4.16-I-builds/I20200511-1800/plugins/ (317.11kB)
[INFO] Resolving class path of MavenProject: org.eclipse.swt:org.eclipse.swt.tools:3.108.300-SNAPSHOT @ /home/jenkins/agent/workspace/eclipse.platform.swt-SonarQube/bundles/org.eclipse.swt.tools/pom.xml
[INFO] Computing target platform for MavenProject: org.eclipse.swt:org.eclipse.swt.examples:3.106.900-SNAPSHOT @ /home/jenkins/agent/workspace/eclipse.platform.swt-SonarQube/examples/org.eclipse.swt.examples/pom.xml
[INFO] Resolving dependencies of MavenProject: org.eclipse.swt:org.eclipse.swt.examples:3.106.900-SNAPSHOT @ /home/jenkins/agent/workspace/eclipse.platform.swt-SonarQube/examples/org.eclipse.swt.examples/pom.xml
[INFO] Resolving class path of MavenProject: org.eclipse.swt:org.eclipse.swt.examples:3.106.900-SNAPSHOT @ /home/jenkins/agent/workspace/eclipse.platform.swt-SonarQube/examples/org.eclipse.swt.examples/pom.xml
[INFO] Computing target platform for MavenProject: org.eclipse.swt:org.eclipse.swt.examples.browser.demos:3.106.400-SNAPSHOT @ /home/jenkins/agent/workspace/eclipse.platform.swt-SonarQube/examples/org.eclipse.swt.examples.browser.demos/pom.xml
[INFO] Resolving dependencies of MavenProject: org.eclipse.swt:org.eclipse.swt.examples.browser.demos:3.106.400-SNAPSHOT @ /home/jenkins/agent/workspace/eclipse.platform.swt-SonarQube/examples/org.eclipse.swt.examples.browser.demos/pom.xml
[INFO] Resolving class path of MavenProject: org.eclipse.swt:org.eclipse.swt.examples.browser.demos:3.106.400-SNAPSHOT @ /home/jenkins/agent/workspace/eclipse.platform.swt-SonarQube/examples/org.eclipse.swt.examples.browser.demos/pom.xml
[INFO] Computing target platform for MavenProject: org.eclipse.swt:org.eclipse.swt.examples.launcher:3.106.300-SNAPSHOT @ /home/jenkins/agent/workspace/eclipse.platform.swt-SonarQube/examples/org.eclipse.swt.examples.launcher/pom.xml
[INFO] Resolving dependencies of MavenProject: org.eclipse.swt:org.eclipse.swt.examples.launcher:3.106.300-SNAPSHOT @ /home/jenkins/agent/workspace/eclipse.platform.swt-SonarQube/examples/org.eclipse.swt.examples.launcher/pom.xml
[INFO] Resolving class path of MavenProject: org.eclipse.swt:org.eclipse.swt.examples.launcher:3.106.300-SNAPSHOT @ /home/jenkins/agent/workspace/eclipse.platform.swt-SonarQube/examples/org.eclipse.swt.examples.launcher/pom.xml
[INFO] Computing target platform for MavenProject: org.eclipse.swt:org.eclipse.swt.examples.ole.win32:3.107.400-SNAPSHOT @ /home/jenkins/agent/workspace/eclipse.platform.swt-SonarQube/examples/org.eclipse.swt.examples.ole.win32/pom.xml
[INFO] Resolving dependencies of MavenProject: org.eclipse.swt:org.eclipse.swt.examples.ole.win32:3.107.400-SNAPSHOT @ /home/jenkins/agent/workspace/eclipse.platform.swt-SonarQube/examples/org.eclipse.swt.examples.ole.win32/pom.xml
May 15, 2020 8:33:32 AM org.apache.http.impl.execchain.RetryExec execute
INFO: I/O exception (org.apache.http.NoHttpResponseException) caught when processing request to {s}->https://download.eclipse.org:443: The target server failed to respond
May 15, 2020 8:33:32 AM org.apache.http.impl.execchain.RetryExec execute
INFO: Retrying request to {s}->https://download.eclipse.org:443
[INFO] Fetching org.eclipse.compare.core_3.6.900.v20200412-2017.jar.pack.gz from https://download.eclipse.org/eclipse/updates/4.16-I-builds/I20200511-1800/plugins/ (32.85kB)
[INFO] Fetching org.eclipse.core.filebuffers_3.6.1000.v20200409-1035.jar.pack.gz from https://download.eclipse.org/eclipse/updates/4.16-I-builds/I20200511-1800/plugins/ (41.15kB)
[INFO] Fetching org.eclipse.e4.ui.ide_3.15.100.v20200323-2111.jar.pack.gz from https://download.eclipse.org/eclipse/updates/4.16-I-builds/I20200511-1800/plugins/ (7.94kB)
[INFO] Fetching org.eclipse.equinox.bidi_1.2.300.v20191213-1901.jar.pack.gz from https://download.eclipse.org/eclipse/updates/4.16-I-builds/I20200511-1800/plugins/ (23.95kB)
[INFO] Fetching org.eclipse.equinox.p2.core_2.6.300.v20200211-1504.jar.pack.gz from https://download.eclipse.org/eclipse/updates/4.16-I-builds/I20200511-1800/plugins/ (32.04kB)
[INFO] Fetching org.eclipse.equinox.p2.engine_2.6.700.v20200511-1530.jar.pack.gz from https://download.eclipse.org/eclipse/updates/4.16-I-builds/I20200511-1800/plugins/ (74.47kB)
[INFO] Fetching org.eclipse.equinox.p2.metadata_2.5.0.v20200511-1530.jar.pack.gz from https://download.eclipse.org/eclipse/updates/4.16-I-builds/I20200511-1800/plugins/ (107.88kB)
[INFO] Fetching org.eclipse.equinox.p2.metadata.repository_1.3.400.v20191211-1528.jar.pack.gz from https://download.eclipse.org/eclipse/updates/4.16-I-builds/I20200511-1800/plugins/ (50.94kB)
[INFO] Fetching org.eclipse.equinox.p2.repository_2.4.700.v20200110-2121.jar.pack.gz from https://download.eclipse.org/eclipse/updates/4.16-I-builds/I20200511-1800/plugins/ (55.47kB)
[INFO] Fetching org.tukaani.xz_1.8.0.v20180207-1613.jar.pack.gz from https://download.eclipse.org/eclipse/updates/4.16-I-builds/I20200511-1800/plugins/ (44.42kB)
[INFO] Fetching org.eclipse.equinox.security_1.3.500.v20200114-1637.jar.pack.gz from https://download.eclipse.org/eclipse/updates/4.16-I-builds/I20200511-1800/plugins/ (44.56kB)
[INFO] Fetching org.eclipse.ui.workbench.texteditor_3.14.200.v20200421-1954.jar.pack.gz from https://download.eclipse.org/eclipse/updates/4.16-I-builds/I20200511-1800/plugins/ (233.97kB)
[INFO] Fetching org.eclipse.ui.views_3.10.300.v20200311-1018.jar.pack.gz from https://download.eclipse.org/eclipse/updates/4.16-I-builds/I20200511-1800/plugins/ (48.59kB)
[INFO] Fetching org.eclipse.ui.editors_3.13.200.v20200501-2307.jar.pack.gz from https://download.eclipse.org/eclipse/updates/4.16-I-builds/I20200511-1800/plugins/ (199.91kB)
[INFO] Fetching org.eclipse.ui.ide_3.17.100.v20200513-0930.jar.pack.gz from https://download.eclipse.org/eclipse/updates/4.16-I-builds/I20200513-1800/plugins/ (957.89kB)
[INFO] Fetching org.eclipse.ui.navigator_3.9.300.v20200513-0930.jar.pack.gz from https://download.eclipse.org/eclipse/updates/4.16-I-builds/I20200513-1800/plugins/ (131.02kB)
[INFO] Resolving class path of MavenProject: org.eclipse.swt:org.eclipse.swt.examples.ole.win32:3.107.400-SNAPSHOT @ /home/jenkins/agent/workspace/eclipse.platform.swt-SonarQube/examples/org.eclipse.swt.examples.ole.win32/pom.xml
[INFO] Computing target platform for MavenProject: org.eclipse.swt:org.eclipse.swt.examples.views:3.106.300-SNAPSHOT @ /home/jenkins/agent/workspace/eclipse.platform.swt-SonarQube/examples/org.eclipse.swt.examples.views/pom.xml
[INFO] Resolving dependencies of MavenProject: org.eclipse.swt:org.eclipse.swt.examples.views:3.106.300-SNAPSHOT @ /home/jenkins/agent/workspace/eclipse.platform.swt-SonarQube/examples/org.eclipse.swt.examples.views/pom.xml
[INFO] Resolving class path of MavenProject: org.eclipse.swt:org.eclipse.swt.examples.views:3.106.300-SNAPSHOT @ /home/jenkins/agent/workspace/eclipse.platform.swt-SonarQube/examples/org.eclipse.swt.examples.views/pom.xml
[INFO] Computing target platform for MavenProject: org.eclipse.swt.tests:org.eclipse.swt.tests.fragments.feature:3.106.0-SNAPSHOT @ /home/jenkins/agent/workspace/eclipse.platform.swt-SonarQube/tests/org.eclipse.swt.tests.fragments.feature/pom.xml
[INFO] Resolving dependencies of MavenProject: org.eclipse.swt.tests:org.eclipse.swt.tests.fragments.feature:3.106.0-SNAPSHOT @ /home/jenkins/agent/workspace/eclipse.platform.swt-SonarQube/tests/org.eclipse.swt.tests.fragments.feature/pom.xml
[INFO] Fetching org.eclipse.license_2.0.2.v20181016-2210.jar from https://download.eclipse.org/cbi/updates/license/2.0.2.v20181016-2210/features/ (13.05kB)
[INFO] Resolving class path of MavenProject: org.eclipse.swt.tests:org.eclipse.swt.tests.fragments.feature:3.106.0-SNAPSHOT @ /home/jenkins/agent/workspace/eclipse.platform.swt-SonarQube/tests/org.eclipse.swt.tests.fragments.feature/pom.xml
[INFO] Computing target platform for MavenProject: org.eclipse.swt:org.eclipse.swt.tests:3.106.900-SNAPSHOT @ /home/jenkins/agent/workspace/eclipse.platform.swt-SonarQube/tests/org.eclipse.swt.tests/pom.xml
[INFO] Resolving dependencies of MavenProject: org.eclipse.swt:org.eclipse.swt.tests:3.106.900-SNAPSHOT @ /home/jenkins/agent/workspace/eclipse.platform.swt-SonarQube/tests/org.eclipse.swt.tests/pom.xml
[INFO] Fetching org.eclipse.compare_3.7.1000.v20200511-1203.jar.pack.gz from https://download.eclipse.org/eclipse/updates/4.16-I-builds/I20200511-1800/plugins/ (306.31kB)
[INFO] Fetching org.eclipse.ui.forms_3.9.100.v20200413-1417.jar.pack.gz from https://download.eclipse.org/eclipse/updates/4.16-I-builds/I20200511-1800/plugins/ (124.18kB)
[INFO] Fetching org.eclipse.core.net_1.3.900.v20200428-1255.jar.pack.gz from https://download.eclipse.org/eclipse/updates/4.16-I-builds/I20200511-1800/plugins/ (31.74kB)
[INFO] Fetching org.eclipse.equinox.launcher_1.5.700.v20200207-2156.jar.pack.gz from https://download.eclipse.org/eclipse/updates/4.16-I-builds/I20200511-1800/plugins/ (29.85kB)
[INFO] Fetching org.eclipse.ltk.core.refactoring_3.10.500.v20200501-1429.jar.pack.gz from https://download.eclipse.org/eclipse/updates/4.16-I-builds/I20200511-1800/plugins/ (105.64kB)
[INFO] Fetching org.eclipse.ltk.ui.refactoring_3.10.300.v20200501-1429.jar.pack.gz from https://download.eclipse.org/eclipse/updates/4.16-I-builds/I20200511-1800/plugins/ (176.84kB)
[INFO] Fetching org.eclipse.team.core_3.8.1000.v20200428-1255.jar.pack.gz from https://download.eclipse.org/eclipse/updates/4.16-I-builds/I20200511-1800/plugins/ (124.89kB)
[INFO] Fetching org.eclipse.team.ui_3.8.900.v20200422-1935.jar.pack.gz from https://download.eclipse.org/eclipse/updates/4.16-I-builds/I20200511-1800/plugins/ (492.92kB)
[INFO] Fetching org.junit_4.13.0.v20200204-1500.jar.pack.gz from https://download.eclipse.org/eclipse/updates/4.16-I-builds/I20200511-1800/plugins/ (123kB)
[INFO] Fetching org.eclipse.test.performance_3.15.0.v20200513-0959.jar.pack.gz from https://download.eclipse.org/eclipse/updates/4.16-I-builds/I20200513-1800/plugins/ (56.99kB)
[INFO] Fetching org.eclipse.ui.navigator.resources_3.7.300.v20200417-1241.jar.pack.gz from https://download.eclipse.org/eclipse/updates/4.16-I-builds/I20200511-1800/plugins/ (71.64kB)
[INFO] Fetching org.eclipse.ui.ide.application_1.3.700.v20200513-0919.jar.pack.gz from https://download.eclipse.org/eclipse/updates/4.16-I-builds/I20200513-1800/plugins/ (56.87kB)
[INFO] Fetching org.eclipse.ui.views.properties.tabbed_3.8.900.v20200513-0930.jar.pack.gz from https://download.eclipse.org/eclipse/updates/4.16-I-builds/I20200513-1800/plugins/ (40.75kB)
[INFO] Fetching org.hamcrest.core_1.3.0.v20180420-1519.jar.pack.gz from https://download.eclipse.org/eclipse/updates/4.16-I-builds/I20200511-1800/plugins/ (29.18kB)
[INFO] Resolving class path of MavenProject: org.eclipse.swt:org.eclipse.swt.tests:3.106.900-SNAPSHOT @ /home/jenkins/agent/workspace/eclipse.platform.swt-SonarQube/tests/org.eclipse.swt.tests/pom.xml
[INFO] Computing target platform for MavenProject: org.eclipse.swt.tools.feature:org.eclipse.swt.tools.feature:3.107.800-SNAPSHOT @ /home/jenkins/agent/workspace/eclipse.platform.swt-SonarQube/features/org.eclipse.swt.tools.feature/pom.xml
[INFO] Resolving dependencies of MavenProject: org.eclipse.swt.tools.feature:org.eclipse.swt.tools.feature:3.107.800-SNAPSHOT @ /home/jenkins/agent/workspace/eclipse.platform.swt-SonarQube/features/org.eclipse.swt.tools.feature/pom.xml
[INFO] Resolving class path of MavenProject: org.eclipse.swt.tools.feature:org.eclipse.swt.tools.feature:3.107.800-SNAPSHOT @ /home/jenkins/agent/workspace/eclipse.platform.swt-SonarQube/features/org.eclipse.swt.tools.feature/pom.xml
[INFO] Computing target platform for MavenProject: org.eclipse.swt:org.eclipse.swt.tests.gtk:3.107.200-SNAPSHOT @ /home/jenkins/agent/workspace/eclipse.platform.swt-SonarQube/tests/org.eclipse.swt.tests.gtk/pom.xml
[INFO] Resolving dependencies of MavenProject: org.eclipse.swt:org.eclipse.swt.tests.gtk:3.107.200-SNAPSHOT @ /home/jenkins/agent/workspace/eclipse.platform.swt-SonarQube/tests/org.eclipse.swt.tests.gtk/pom.xml
[INFO] Resolving class path of MavenProject: org.eclipse.swt:org.eclipse.swt.tests.gtk:3.107.200-SNAPSHOT @ /home/jenkins/agent/workspace/eclipse.platform.swt-SonarQube/tests/org.eclipse.swt.tests.gtk/pom.xml
[INFO] ------------------------------------------------------------------------
[INFO] Reactor Build Order:
[INFO] 
[INFO] eclipse.platform.swt                                               [pom]
[INFO] org.eclipse.swt                                         [eclipse-plugin]
[INFO] org.eclipse.swt.fragments.localbuild                    [eclipse-plugin]
[INFO] org.eclipse.swt.tools.base                              [eclipse-plugin]
[INFO] org.eclipse.swt.tools.spies                             [eclipse-plugin]
[INFO] org.eclipse.swt.tools                                   [eclipse-plugin]
[INFO] org.eclipse.swt.examples                                [eclipse-plugin]
[INFO] org.eclipse.swt.examples.browser.demos                  [eclipse-plugin]
[INFO] org.eclipse.swt.examples.launcher                       [eclipse-plugin]
[INFO] org.eclipse.swt.examples.ole.win32                      [eclipse-plugin]
[INFO] org.eclipse.swt.examples.views                          [eclipse-plugin]
[INFO] org.eclipse.swt.tests.fragments.feature                [eclipse-feature]
[INFO] org.eclipse.swt.tests                              [eclipse-test-plugin]
[INFO] org.eclipse.swt.tools.feature                          [eclipse-feature]
[INFO] org.eclipse.swt.tests.gtk                          [eclipse-test-plugin]
[INFO] 
[INFO] -------------< eclipse.platform.swt:eclipse.platform.swt >--------------
[INFO] Building eclipse.platform.swt 4.16.0-SNAPSHOT                     [1/15]
[INFO] --------------------------------[ pom ]---------------------------------
[WARNING] The following dependencies could not be resolved at this point of the build but seem to be part of the reactor:
[WARNING] o org.eclipse.swt:org.eclipse.swt:jar:3.114.100-SNAPSHOT (provided)
[WARNING] Try running the build up to the lifecycle phase "package"
[WARNING] The following dependencies could not be resolved at this point of the build but seem to be part of the reactor:
[WARNING] o org.eclipse.swt:org.eclipse.swt:jar:3.114.100-SNAPSHOT (provided)
[WARNING] o org.eclipse.swt:org.eclipse.swt.fragments.localbuild:jar:3.105.0-SNAPSHOT (provided)
[WARNING] Try running the build up to the lifecycle phase "package"
[WARNING] The following dependencies could not be resolved at this point of the build but seem to be part of the reactor:
[WARNING] o org.eclipse.swt:org.eclipse.swt:jar:3.114.100-SNAPSHOT (provided)
[WARNING] o org.eclipse.swt:org.eclipse.swt.fragments.localbuild:jar:3.105.0-SNAPSHOT (provided)
[WARNING] o org.eclipse.swt:org.eclipse.swt.tools.base:jar:3.107.300-SNAPSHOT (provided)
[WARNING] Try running the build up to the lifecycle phase "package"
[WARNING] The following dependencies could not be resolved at this point of the build but seem to be part of the reactor:
[WARNING] o org.eclipse.swt:org.eclipse.swt:jar:3.114.100-SNAPSHOT (provided)
[WARNING] o org.eclipse.swt:org.eclipse.swt.fragments.localbuild:jar:3.105.0-SNAPSHOT (provided)
[WARNING] o org.eclipse.swt:org.eclipse.swt.tools.base:jar:3.107.300-SNAPSHOT (provided)
[WARNING] o org.eclipse.swt:org.eclipse.swt.tools.spies:jar:3.107.100-SNAPSHOT (provided)
[WARNING] Try running the build up to the lifecycle phase "package"
[WARNING] The following dependencies could not be resolved at this point of the build but seem to be part of the reactor:
[WARNING] o org.eclipse.swt:org.eclipse.swt:jar:3.114.100-SNAPSHOT (provided)
[WARNING] o org.eclipse.swt:org.eclipse.swt.fragments.localbuild:jar:3.105.0-SNAPSHOT (provided)
[WARNING] Try running the build up to the lifecycle phase "package"
[WARNING] The following dependencies could not be resolved at this point of the build but seem to be part of the reactor:
[WARNING] o org.eclipse.swt:org.eclipse.swt:jar:3.114.100-SNAPSHOT (provided)
[WARNING] o org.eclipse.swt:org.eclipse.swt.fragments.localbuild:jar:3.105.0-SNAPSHOT (provided)
[WARNING] Try running the build up to the lifecycle phase "package"
[WARNING] The following dependencies could not be resolved at this point of the build but seem to be part of the reactor:
[WARNING] o org.eclipse.swt:org.eclipse.swt:jar:3.114.100-SNAPSHOT (provided)
[WARNING] o org.eclipse.swt:org.eclipse.swt.fragments.localbuild:jar:3.105.0-SNAPSHOT (provided)
[WARNING] Try running the build up to the lifecycle phase "package"
[WARNING] The following dependencies could not be resolved at this point of the build but seem to be part of the reactor:
[WARNING] o org.eclipse.swt:org.eclipse.swt:jar:3.114.100-SNAPSHOT (provided)
[WARNING] Try running the build up to the lifecycle phase "package"
[WARNING] The following dependencies could not be resolved at this point of the build but seem to be part of the reactor:
[WARNING] o org.eclipse.swt:org.eclipse.swt:jar:3.114.100-SNAPSHOT (provided)
[WARNING] o org.eclipse.swt:org.eclipse.swt.examples:jar:3.106.900-SNAPSHOT (provided)
[WARNING] o org.eclipse.swt:org.eclipse.swt.fragments.localbuild:jar:3.105.0-SNAPSHOT (provided)
[WARNING] Try running the build up to the lifecycle phase "package"
[WARNING] The following dependencies could not be resolved at this point of the build but seem to be part of the reactor:
[WARNING] o org.eclipse.swt:org.eclipse.swt:jar:3.114.100-SNAPSHOT (provided)
[WARNING] Try running the build up to the lifecycle phase "package"
[WARNING] The following dependencies could not be resolved at this point of the build but seem to be part of the reactor:
[WARNING] o org.eclipse.swt:org.eclipse.swt:jar:3.114.100-SNAPSHOT (provided)
[WARNING] o org.eclipse.swt.tests:org.eclipse.swt.tests.fragments.feature:jar:3.106.0-SNAPSHOT (provided)
[WARNING] Try running the build up to the lifecycle phase "package"
[WARNING] The following dependencies could not be resolved at this point of the build but seem to be part of the reactor:
[WARNING] o org.eclipse.swt:org.eclipse.swt:jar:3.114.100-SNAPSHOT (provided)
[WARNING] o org.eclipse.swt:org.eclipse.swt.tools:jar:3.108.300-SNAPSHOT (provided)
[WARNING] o org.eclipse.swt:org.eclipse.swt.tools.base:jar:3.107.300-SNAPSHOT (provided)
[WARNING] o org.eclipse.swt:org.eclipse.swt.tools.spies:jar:3.107.100-SNAPSHOT (provided)
[WARNING] Try running the build up to the lifecycle phase "package"
[WARNING] The following dependencies could not be resolved at this point of the build but seem to be part of the reactor:
[WARNING] o org.eclipse.swt:org.eclipse.swt:jar:3.114.100-SNAPSHOT (provided)
[WARNING] o org.eclipse.swt.tests:org.eclipse.swt.tests.fragments.feature:jar:3.106.0-SNAPSHOT (provided)
[WARNING] Try running the build up to the lifecycle phase "package"
[INFO] 
[INFO] --- sonar-maven-plugin:3.3.0.603:sonar (default-cli) @ eclipse.platform.swt ---
[INFO] User cache: /home/jenkins/.sonar/cache
[INFO] SonarQube version: 4.5.7
[INFO] Default locale: "en_US", source code encoding: "UTF-8"
08:33:50.152 INFO  - Load global referentials...
08:33:50.295 INFO  - Load global referentials done: 146 ms
08:33:50.376 INFO  - User cache: /home/jenkins/.sonar/cache
08:33:50.386 INFO  - Install plugins
08:33:50.419 INFO  - Download sonar-core-plugin-4.5.7.jar
08:33:50.444 INFO  - Download sonar-email-notifications-plugin-4.5.7.jar
08:33:50.484 INFO  - Download sonar-findbugs-plugin-3.3.jar
08:33:51.043 INFO  - Download sonar-java-plugin-3.9.jar
08:33:51.406 INFO  - Download sonar-ldap-plugin-1.4.jar
08:33:51.412 INFO  - Download sonar-pmd-plugin-2.6.jar
08:33:51.740 INFO  - Download sonar-cpd-plugin-4.5.7.jar
08:33:51.746 INFO  - Download sonar-dbcleaner-plugin-4.5.7.jar
08:33:51.751 INFO  - Download sonar-design-plugin-4.5.7.jar
08:33:51.755 INFO  - Download sonar-l10n-en-plugin-4.5.7.jar
08:33:51.776 INFO  - Download sonar-checkstyle-plugin-2.3.jar
08:33:52.127 INFO  - Install JDBC driver
08:33:52.143 INFO  - Download mysql-connector-java-5.1.27.jar
08:33:52.191 INFO  - Create JDBC datasource for jdbc:mysql://dbmaster:3306/sonar?autoReconnect=true&useUnicode=true&characterEncoding=utf8
08:33:53.448 INFO  - Initializing Hibernate
08:33:55.421 INFO  - Load project referentials...
08:33:55.461 INFO  - Load project referentials done: 40 ms
[INFO] ------------------------------------------------------------------------
[INFO] Reactor Summary:
[INFO] 
[INFO] eclipse.platform.swt 4.16.0-SNAPSHOT ............... FAILURE [ 14.188 s]
[INFO] org.eclipse.swt 3.114.100-SNAPSHOT ................. SKIPPED
[INFO] org.eclipse.swt.fragments.localbuild 3.105.0-SNAPSHOT SKIPPED
[INFO] org.eclipse.swt.tools.base 3.107.300-SNAPSHOT ...... SKIPPED
[INFO] org.eclipse.swt.tools.spies 3.107.100-SNAPSHOT ..... SKIPPED
[INFO] org.eclipse.swt.tools 3.108.300-SNAPSHOT ........... SKIPPED
[INFO] org.eclipse.swt.examples 3.106.900-SNAPSHOT ........ SKIPPED
[INFO] org.eclipse.swt.examples.browser.demos 3.106.400-SNAPSHOT SKIPPED
[INFO] org.eclipse.swt.examples.launcher 3.106.300-SNAPSHOT SKIPPED
[INFO] org.eclipse.swt.examples.ole.win32 3.107.400-SNAPSHOT SKIPPED
[INFO] org.eclipse.swt.examples.views 3.106.300-SNAPSHOT .. SKIPPED
[INFO] org.eclipse.swt.tests.fragments.feature 3.106.0-SNAPSHOT SKIPPED
[INFO] org.eclipse.swt.tests 3.106.900-SNAPSHOT ........... SKIPPED
[INFO] org.eclipse.swt.tools.feature 3.107.800-SNAPSHOT ... SKIPPED
[INFO] org.eclipse.swt.tests.gtk 3.107.200-SNAPSHOT ....... SKIPPED
[INFO] ------------------------------------------------------------------------
[INFO] BUILD FAILURE
[INFO] ------------------------------------------------------------------------
[INFO] Total time:  01:49 min
[INFO] Finished at: 2020-05-15T08:33:55Z
[INFO] ------------------------------------------------------------------------
[ERROR] Failed to execute goal org.sonarsource.scanner.maven:sonar-maven-plugin:3.3.0.603:sonar (default-cli) on project eclipse.platform.swt: Fail to execute request [code=500, url=https://sonar.eclipse.org/batch/project?key=eclipse.platform.swt:eclipse.platform.swt&amp;preview=false]: Fail to download [https://sonar.eclipse.org/batch/project?key=eclipse.platform.swt:eclipse.platform.swt&amp;preview=false]. Response code: 500 -> [Help 1]
org.apache.maven.lifecycle.LifecycleExecutionException: Failed to execute goal org.sonarsource.scanner.maven:sonar-maven-plugin:3.3.0.603:sonar (default-cli) on project eclipse.platform.swt: Fail to execute request [code=500, url=https://sonar.eclipse.org/batch/project?key=eclipse.platform.swt:eclipse.platform.swt&amp;preview=false]
    at org.apache.maven.lifecycle.internal.MojoExecutor.execute (MojoExecutor.java:215)
    at org.apache.maven.lifecycle.internal.MojoExecutor.execute (MojoExecutor.java:156)
    at org.apache.maven.lifecycle.internal.MojoExecutor.execute (MojoExecutor.java:148)
    at org.apache.maven.lifecycle.internal.LifecycleModuleBuilder.buildProject (LifecycleModuleBuilder.java:117)
    at org.apache.maven.lifecycle.internal.LifecycleModuleBuilder.buildProject (LifecycleModuleBuilder.java:81)
    at org.apache.maven.lifecycle.internal.builder.singlethreaded.SingleThreadedBuilder.build (SingleThreadedBuilder.java:56)
    at org.apache.maven.lifecycle.internal.LifecycleStarter.execute (LifecycleStarter.java:128)
    at org.apache.maven.DefaultMaven.doExecute (DefaultMaven.java:305)
    at org.apache.maven.DefaultMaven.doExecute (DefaultMaven.java:192)
    at org.apache.maven.DefaultMaven.execute (DefaultMaven.java:105)
    at org.apache.maven.cli.MavenCli.execute (MavenCli.java:957)
    at org.apache.maven.cli.MavenCli.doMain (MavenCli.java:289)
    at org.apache.maven.cli.MavenCli.main (MavenCli.java:193)
    at sun.reflect.NativeMethodAccessorImpl.invoke0 (Native Method)
    at sun.reflect.NativeMethodAccessorImpl.invoke (NativeMethodAccessorImpl.java:62)
    at sun.reflect.DelegatingMethodAccessorImpl.invoke (DelegatingMethodAccessorImpl.java:43)
    at java.lang.reflect.Method.invoke (Method.java:498)
    at org.codehaus.plexus.classworlds.launcher.Launcher.launchEnhanced (Launcher.java:282)
    at org.codehaus.plexus.classworlds.launcher.Launcher.launch (Launcher.java:225)
    at org.codehaus.plexus.classworlds.launcher.Launcher.mainWithExitCode (Launcher.java:406)
    at org.codehaus.plexus.classworlds.launcher.Launcher.main (Launcher.java:347)
Caused by: org.apache.maven.plugin.MojoExecutionException: Fail to execute request [code=500, url=https://sonar.eclipse.org/batch/project?key=eclipse.platform.swt:eclipse.platform.swt&amp;preview=false]
    at org.sonarsource.scanner.maven.bootstrap.ExceptionHandling.handle (ExceptionHandling.java:36)
    at org.sonarsource.scanner.maven.bootstrap.ScannerBootstrapper.execute (ScannerBootstrapper.java:80)
    at org.sonarsource.scanner.maven.SonarQubeMojo.execute (SonarQubeMojo.java:139)
    at org.apache.maven.plugin.DefaultBuildPluginManager.executeMojo (DefaultBuildPluginManager.java:137)
    at org.apache.maven.lifecycle.internal.MojoExecutor.execute (MojoExecutor.java:210)
    at org.apache.maven.lifecycle.internal.MojoExecutor.execute (MojoExecutor.java:156)
    at org.apache.maven.lifecycle.internal.MojoExecutor.execute (MojoExecutor.java:148)
    at org.apache.maven.lifecycle.internal.LifecycleModuleBuilder.buildProject (LifecycleModuleBuilder.java:117)
    at org.apache.maven.lifecycle.internal.LifecycleModuleBuilder.buildProject (LifecycleModuleBuilder.java:81)
    at org.apache.maven.lifecycle.internal.builder.singlethreaded.SingleThreadedBuilder.build (SingleThreadedBuilder.java:56)
    at org.apache.maven.lifecycle.internal.LifecycleStarter.execute (LifecycleStarter.java:128)
    at org.apache.maven.DefaultMaven.doExecute (DefaultMaven.java:305)
    at org.apache.maven.DefaultMaven.doExecute (DefaultMaven.java:192)
    at org.apache.maven.DefaultMaven.execute (DefaultMaven.java:105)
    at org.apache.maven.cli.MavenCli.execute (MavenCli.java:957)
    at org.apache.maven.cli.MavenCli.doMain (MavenCli.java:289)
    at org.apache.maven.cli.MavenCli.main (MavenCli.java:193)
    at sun.reflect.NativeMethodAccessorImpl.invoke0 (Native Method)
    at sun.reflect.NativeMethodAccessorImpl.invoke (NativeMethodAccessorImpl.java:62)
    at sun.reflect.DelegatingMethodAccessorImpl.invoke (DelegatingMethodAccessorImpl.java:43)
    at java.lang.reflect.Method.invoke (Method.java:498)
    at org.codehaus.plexus.classworlds.launcher.Launcher.launchEnhanced (Launcher.java:282)
    at org.codehaus.plexus.classworlds.launcher.Launcher.launch (Launcher.java:225)
    at org.codehaus.plexus.classworlds.launcher.Launcher.mainWithExitCode (Launcher.java:406)
    at org.codehaus.plexus.classworlds.launcher.Launcher.main (Launcher.java:347)
Caused by: java.lang.IllegalStateException: Fail to execute request [code=500, url=https://sonar.eclipse.org/batch/project?key=eclipse.platform.swt:eclipse.platform.swt&amp;preview=false]
    at org.sonar.batch.bootstrap.ServerClient.handleHttpException (ServerClient.java:130)
    at org.sonar.batch.bootstrap.ServerClient.request (ServerClient.java:91)
    at org.sonar.batch.bootstrap.ServerClient.request (ServerClient.java:83)
    at org.sonar.batch.bootstrap.ServerClient.request (ServerClient.java:79)
    at org.sonar.batch.referential.DefaultProjectReferentialsLoader.load (DefaultProjectReferentialsLoader.java:54)
    at org.sonar.batch.referential.ProjectReferentialsProvider.provide (ProjectReferentialsProvider.java:40)
    at sun.reflect.NativeMethodAccessorImpl.invoke0 (Native Method)
    at sun.reflect.NativeMethodAccessorImpl.invoke (NativeMethodAccessorImpl.java:62)
    at sun.reflect.DelegatingMethodAccessorImpl.invoke (DelegatingMethodAccessorImpl.java:43)
    at java.lang.reflect.Method.invoke (Method.java:498)
    at org.picocontainer.injectors.MethodInjector.invokeMethod (MethodInjector.java:129)
    at org.picocontainer.injectors.MethodInjector.access$000 (MethodInjector.java:39)
    at org.picocontainer.injectors.MethodInjector$2.run (MethodInjector.java:113)
    at org.picocontainer.injectors.AbstractInjector$ThreadLocalCyclicDependencyGuard.observe (AbstractInjector.java:270)
    at org.picocontainer.injectors.MethodInjector.decorateComponentInstance (MethodInjector.java:120)
    at org.picocontainer.injectors.CompositeInjector.decorateComponentInstance (CompositeInjector.java:58)
    at org.picocontainer.injectors.Reinjector.reinject (Reinjector.java:142)
    at org.picocontainer.injectors.ProviderAdapter.getComponentInstance (ProviderAdapter.java:96)
    at org.picocontainer.DefaultPicoContainer.getInstance (DefaultPicoContainer.java:698)
    at org.picocontainer.DefaultPicoContainer.getComponent (DefaultPicoContainer.java:646)
    at org.picocontainer.DefaultPicoContainer.getComponent (DefaultPicoContainer.java:631)
    at org.picocontainer.parameters.BasicComponentParameter$1.resolveInstance (BasicComponentParameter.java:118)
    at org.picocontainer.parameters.ComponentParameter$1.resolveInstance (ComponentParameter.java:136)
    at org.picocontainer.injectors.SingleMemberInjector.getParameter (SingleMemberInjector.java:78)
    at org.picocontainer.injectors.ConstructorInjector$CtorAndAdapters.getParameterArguments (ConstructorInjector.java:309)
    at org.picocontainer.injectors.ConstructorInjector$1.run (ConstructorInjector.java:335)
    at org.picocontainer.injectors.AbstractInjector$ThreadLocalCyclicDependencyGuard.observe (AbstractInjector.java:270)
    at org.picocontainer.injectors.ConstructorInjector.getComponentInstance (ConstructorInjector.java:364)
    at org.picocontainer.injectors.AbstractInjectionFactory$LifecycleAdapter.getComponentInstance (AbstractInjectionFactory.java:56)
    at org.picocontainer.behaviors.AbstractBehavior.getComponentInstance (AbstractBehavior.java:64)
    at org.picocontainer.behaviors.Stored.getComponentInstance (Stored.java:91)
    at org.picocontainer.DefaultPicoContainer.getInstance (DefaultPicoContainer.java:698)
    at org.picocontainer.DefaultPicoContainer.getComponent (DefaultPicoContainer.java:646)
    at org.picocontainer.DefaultPicoContainer.getComponent (DefaultPicoContainer.java:677)
    at org.sonar.api.platform.ComponentContainer.getComponentByType (ComponentContainer.java:209)
    at org.sonar.batch.scan.ProjectScanContainer.doBeforeStart (ProjectScanContainer.java:102)
    at org.sonar.api.platform.ComponentContainer.startComponents (ComponentContainer.java:91)
    at org.sonar.api.platform.ComponentContainer.execute (ComponentContainer.java:78)
    at org.sonar.batch.scan.ScanTask.scan (ScanTask.java:64)
    at org.sonar.batch.scan.ScanTask.execute (ScanTask.java:51)
    at org.sonar.batch.bootstrap.TaskContainer.doAfterStart (TaskContainer.java:125)
    at org.sonar.api.platform.ComponentContainer.startComponents (ComponentContainer.java:93)
    at org.sonar.api.platform.ComponentContainer.execute (ComponentContainer.java:78)
    at org.sonar.batch.bootstrap.BootstrapContainer.executeTask (BootstrapContainer.java:173)
    at org.sonar.batch.bootstrapper.Batch.executeTask (Batch.java:95)
    at org.sonar.batch.bootstrapper.Batch.execute (Batch.java:67)
    at org.sonarsource.scanner.api.internal.batch.BatchIsolatedLauncher.executeOldVersion (BatchIsolatedLauncher.java:71)
    at sun.reflect.NativeMethodAccessorImpl.invoke0 (Native Method)
    at sun.reflect.NativeMethodAccessorImpl.invoke (NativeMethodAccessorImpl.java:62)
    at sun.reflect.DelegatingMethodAccessorImpl.invoke (DelegatingMethodAccessorImpl.java:43)
    at java.lang.reflect.Method.invoke (Method.java:498)
    at org.sonarsource.scanner.api.internal.IsolatedLauncherProxy.invoke (IsolatedLauncherProxy.java:60)
    at com.sun.proxy.$Proxy25.executeOldVersion (Unknown Source)
    at org.sonarsource.scanner.api.EmbeddedScanner.doExecute (EmbeddedScanner.java:238)
    at org.sonarsource.scanner.api.EmbeddedScanner.runAnalysis (EmbeddedScanner.java:151)
    at org.sonarsource.scanner.maven.bootstrap.ScannerBootstrapper.execute (ScannerBootstrapper.java:77)
    at org.sonarsource.scanner.maven.SonarQubeMojo.execute (SonarQubeMojo.java:139)
    at org.apache.maven.plugin.DefaultBuildPluginManager.executeMojo (DefaultBuildPluginManager.java:137)
    at org.apache.maven.lifecycle.internal.MojoExecutor.execute (MojoExecutor.java:210)
    at org.apache.maven.lifecycle.internal.MojoExecutor.execute (MojoExecutor.java:156)
    at org.apache.maven.lifecycle.internal.MojoExecutor.execute (MojoExecutor.java:148)
    at org.apache.maven.lifecycle.internal.LifecycleModuleBuilder.buildProject (LifecycleModuleBuilder.java:117)
    at org.apache.maven.lifecycle.internal.LifecycleModuleBuilder.buildProject (LifecycleModuleBuilder.java:81)
    at org.apache.maven.lifecycle.internal.builder.singlethreaded.SingleThreadedBuilder.build (SingleThreadedBuilder.java:56)
    at org.apache.maven.lifecycle.internal.LifecycleStarter.execute (LifecycleStarter.java:128)
    at org.apache.maven.DefaultMaven.doExecute (DefaultMaven.java:305)
    at org.apache.maven.DefaultMaven.doExecute (DefaultMaven.java:192)
    at org.apache.maven.DefaultMaven.execute (DefaultMaven.java:105)
    at org.apache.maven.cli.MavenCli.execute (MavenCli.java:957)
    at org.apache.maven.cli.MavenCli.doMain (MavenCli.java:289)
    at org.apache.maven.cli.MavenCli.main (MavenCli.java:193)
    at sun.reflect.NativeMethodAccessorImpl.invoke0 (Native Method)
    at sun.reflect.NativeMethodAccessorImpl.invoke (NativeMethodAccessorImpl.java:62)
    at sun.reflect.DelegatingMethodAccessorImpl.invoke (DelegatingMethodAccessorImpl.java:43)
    at java.lang.reflect.Method.invoke (Method.java:498)
    at org.codehaus.plexus.classworlds.launcher.Launcher.launchEnhanced (Launcher.java:282)
    at org.codehaus.plexus.classworlds.launcher.Launcher.launch (Launcher.java:225)
    at org.codehaus.plexus.classworlds.launcher.Launcher.mainWithExitCode (Launcher.java:406)
    at org.codehaus.plexus.classworlds.launcher.Launcher.main (Launcher.java:347)
Caused by: org.sonar.api.utils.HttpDownloader$HttpException: Fail to download [https://sonar.eclipse.org/batch/project?key=eclipse.platform.swt:eclipse.platform.swt&amp;preview=false]. Response code: 500
    at org.sonar.api.utils.HttpDownloader$BaseHttpDownloader$HttpInputSupplier.getInput (HttpDownloader.java:281)
    at org.sonar.api.utils.HttpDownloader$BaseHttpDownloader$HttpInputSupplier.getInput (HttpDownloader.java:235)
    at org.sonar.batch.bootstrap.ServerClient.request (ServerClient.java:89)
    at org.sonar.batch.bootstrap.ServerClient.request (ServerClient.java:83)
    at org.sonar.batch.bootstrap.ServerClient.request (ServerClient.java:79)
    at org.sonar.batch.referential.DefaultProjectReferentialsLoader.load (DefaultProjectReferentialsLoader.java:54)
    at org.sonar.batch.referential.ProjectReferentialsProvider.provide (ProjectReferentialsProvider.java:40)
    at sun.reflect.NativeMethodAccessorImpl.invoke0 (Native Method)
    at sun.reflect.NativeMethodAccessorImpl.invoke (NativeMethodAccessorImpl.java:62)
    at sun.reflect.DelegatingMethodAccessorImpl.invoke (DelegatingMethodAccessorImpl.java:43)
    at java.lang.reflect.Method.invoke (Method.java:498)
    at org.picocontainer.injectors.MethodInjector.invokeMethod (MethodInjector.java:129)
    at org.picocontainer.injectors.MethodInjector.access$000 (MethodInjector.java:39)
    at org.picocontainer.injectors.MethodInjector$2.run (MethodInjector.java:113)
    at org.picocontainer.injectors.AbstractInjector$ThreadLocalCyclicDependencyGuard.observe (AbstractInjector.java:270)
    at org.picocontainer.injectors.MethodInjector.decorateComponentInstance (MethodInjector.java:120)
    at org.picocontainer.injectors.CompositeInjector.decorateComponentInstance (CompositeInjector.java:58)
    at org.picocontainer.injectors.Reinjector.reinject (Reinjector.java:142)
    at org.picocontainer.injectors.ProviderAdapter.getComponentInstance (ProviderAdapter.java:96)
    at org.picocontainer.DefaultPicoContainer.getInstance (DefaultPicoContainer.java:698)
    at org.picocontainer.DefaultPicoContainer.getComponent (DefaultPicoContainer.java:646)
    at org.picocontainer.DefaultPicoContainer.getComponent (DefaultPicoContainer.java:631)
    at org.picocontainer.parameters.BasicComponentParameter$1.resolveInstance (BasicComponentParameter.java:118)
    at org.picocontainer.parameters.ComponentParameter$1.resolveInstance (ComponentParameter.java:136)
    at org.picocontainer.injectors.SingleMemberInjector.getParameter (SingleMemberInjector.java:78)
    at org.picocontainer.injectors.ConstructorInjector$CtorAndAdapters.getParameterArguments (ConstructorInjector.java:309)
    at org.picocontainer.injectors.ConstructorInjector$1.run (ConstructorInjector.java:335)
    at org.picocontainer.injectors.AbstractInjector$ThreadLocalCyclicDependencyGuard.observe (AbstractInjector.java:270)
    at org.picocontainer.injectors.ConstructorInjector.getComponentInstance (ConstructorInjector.java:364)
    at org.picocontainer.injectors.AbstractInjectionFactory$LifecycleAdapter.getComponentInstance (AbstractInjectionFactory.java:56)
    at org.picocontainer.behaviors.AbstractBehavior.getComponentInstance (AbstractBehavior.java:64)
    at org.picocontainer.behaviors.Stored.getComponentInstance (Stored.java:91)
    at org.picocontainer.DefaultPicoContainer.getInstance (DefaultPicoContainer.java:698)
    at org.picocontainer.DefaultPicoContainer.getComponent (DefaultPicoContainer.java:646)
    at org.picocontainer.DefaultPicoContainer.getComponent (DefaultPicoContainer.java:677)
    at org.sonar.api.platform.ComponentContainer.getComponentByType (ComponentContainer.java:209)
    at org.sonar.batch.scan.ProjectScanContainer.doBeforeStart (ProjectScanContainer.java:102)
    at org.sonar.api.platform.ComponentContainer.startComponents (ComponentContainer.java:91)
    at org.sonar.api.platform.ComponentContainer.execute (ComponentContainer.java:78)
    at org.sonar.batch.scan.ScanTask.scan (ScanTask.java:64)
    at org.sonar.batch.scan.ScanTask.execute (ScanTask.java:51)
    at org.sonar.batch.bootstrap.TaskContainer.doAfterStart (TaskContainer.java:125)
    at org.sonar.api.platform.ComponentContainer.startComponents (ComponentContainer.java:93)
    at org.sonar.api.platform.ComponentContainer.execute (ComponentContainer.java:78)
    at org.sonar.batch.bootstrap.BootstrapContainer.executeTask (BootstrapContainer.java:173)
    at org.sonar.batch.bootstrapper.Batch.executeTask (Batch.java:95)
    at org.sonar.batch.bootstrapper.Batch.execute (Batch.java:67)
    at org.sonarsource.scanner.api.internal.batch.BatchIsolatedLauncher.executeOldVersion (BatchIsolatedLauncher.java:71)
    at sun.reflect.NativeMethodAccessorImpl.invoke0 (Native Method)
    at sun.reflect.NativeMethodAccessorImpl.invoke (NativeMethodAccessorImpl.java:62)
    at sun.reflect.DelegatingMethodAccessorImpl.invoke (DelegatingMethodAccessorImpl.java:43)
    at java.lang.reflect.Method.invoke (Method.java:498)
    at org.sonarsource.scanner.api.internal.IsolatedLauncherProxy.invoke (IsolatedLauncherProxy.java:60)
    at com.sun.proxy.$Proxy25.executeOldVersion (Unknown Source)
    at org.sonarsource.scanner.api.EmbeddedScanner.doExecute (EmbeddedScanner.java:238)
    at org.sonarsource.scanner.api.EmbeddedScanner.runAnalysis (EmbeddedScanner.java:151)
    at org.sonarsource.scanner.maven.bootstrap.ScannerBootstrapper.execute (ScannerBootstrapper.java:77)
    at org.sonarsource.scanner.maven.SonarQubeMojo.execute (SonarQubeMojo.java:139)
    at org.apache.maven.plugin.DefaultBuildPluginManager.executeMojo (DefaultBuildPluginManager.java:137)
    at org.apache.maven.lifecycle.internal.MojoExecutor.execute (MojoExecutor.java:210)
    at org.apache.maven.lifecycle.internal.MojoExecutor.execute (MojoExecutor.java:156)
    at org.apache.maven.lifecycle.internal.MojoExecutor.execute (MojoExecutor.java:148)
    at org.apache.maven.lifecycle.internal.LifecycleModuleBuilder.buildProject (LifecycleModuleBuilder.java:117)
    at org.apache.maven.lifecycle.internal.LifecycleModuleBuilder.buildProject (LifecycleModuleBuilder.java:81)
    at org.apache.maven.lifecycle.internal.builder.singlethreaded.SingleThreadedBuilder.build (SingleThreadedBuilder.java:56)
    at org.apache.maven.lifecycle.internal.LifecycleStarter.execute (LifecycleStarter.java:128)
    at org.apache.maven.DefaultMaven.doExecute (DefaultMaven.java:305)
    at org.apache.maven.DefaultMaven.doExecute (DefaultMaven.java:192)
    at org.apache.maven.DefaultMaven.execute (DefaultMaven.java:105)
    at org.apache.maven.cli.MavenCli.execute (MavenCli.java:957)
    at org.apache.maven.cli.MavenCli.doMain (MavenCli.java:289)
    at org.apache.maven.cli.MavenCli.main (MavenCli.java:193)
    at sun.reflect.NativeMethodAccessorImpl.invoke0 (Native Method)
    at sun.reflect.NativeMethodAccessorImpl.invoke (NativeMethodAccessorImpl.java:62)
    at sun.reflect.DelegatingMethodAccessorImpl.invoke (DelegatingMethodAccessorImpl.java:43)
    at java.lang.reflect.Method.invoke (Method.java:498)
    at org.codehaus.plexus.classworlds.launcher.Launcher.launchEnhanced (Launcher.java:282)
    at org.codehaus.plexus.classworlds.launcher.Launcher.launch (Launcher.java:225)
    at org.codehaus.plexus.classworlds.launcher.Launcher.mainWithExitCode (Launcher.java:406)
    at org.codehaus.plexus.classworlds.launcher.Launcher.main (Launcher.java:347)
[ERROR] 
[ERROR] Re-run Maven using the -X switch to enable full debug logging.
[ERROR] 
[ERROR] For more information about the errors and possible solutions, please read the following articles:
[ERROR] [Help 1] http://cwiki.apache.org/confluence/display/MAVEN/MojoExecutionException
SonarQube analysis completed: FAILURE
Build step 'SonarQube analysis with Maven' changed build result to FAILURE
Build step 'SonarQube analysis with Maven' marked build as failure
Recording test results
Archiving artifacts
Finished: FAILURE