FailedConsole Output

Skipping 172 KB.. Full Log
e.e4.core.services-apiBaseline.target, -dependencyList, /home/jenkins/agent/workspace/eclipse.platform.runtime-Gerrit/bundles/org.eclipse.e4.core.services/target/dependencies-list.txt, -failOnError]
Picked up JAVA_TOOL_OPTIONS: -XX:+IgnoreUnrecognizedVMOptions -XX:+UseContainerSupport -XX:+UnlockExperimentalVMOptions -XX:+UseCGroupMemoryLimitForHeap
Picked up _JAVA_OPTIONS: -XX:MaxRAMPercentage=64.0
0 API ERRORS
0 API warnings
[INFO] 
[INFO] -----< org.eclipse.core.feature:org.eclipse.core.runtime.feature >------
[INFO] Building org.eclipse.core.runtime.feature 1.2.800-SNAPSHOT       [12/18]
[INFO] --------------------------[ eclipse-feature ]---------------------------
[INFO] 
[INFO] --- maven-clean-plugin:3.1.0:clean (default-clean) @ org.eclipse.core.runtime.feature ---
[INFO] 
[INFO] --- tycho-packaging-plugin:1.6.0-SNAPSHOT:build-qualifier-aggregator (default-build-qualifier-aggregator) @ org.eclipse.core.runtime.feature ---
[INFO] The project's OSGi version is 1.2.800.v20200114-2232
[INFO] 
[INFO] --- tycho-packaging-plugin:1.6.0-SNAPSHOT:validate-id (default-validate-id) @ org.eclipse.core.runtime.feature ---
[INFO] 
[INFO] --- tycho-packaging-plugin:1.6.0-SNAPSHOT:validate-version (default-validate-version) @ org.eclipse.core.runtime.feature ---
[INFO] 
[INFO] --- maven-resources-plugin:3.1.0:copy-resources (saveproperties) @ org.eclipse.core.runtime.feature ---
[INFO] Using 'UTF-8' encoding to copy filtered resources.
[INFO] skip non existing resourceDirectory /home/jenkins/agent/workspace/eclipse.platform.runtime-Gerrit/features/org.eclipse.core.runtime.feature/saveproperties
[INFO] 
[INFO] --- maven-enforcer-plugin:3.0.0-M3:enforce (enforce-maven) @ org.eclipse.core.runtime.feature ---
[INFO] 
[INFO] --- eclipse-cbi-plugin:1.1.8-SNAPSHOT:generate-api-build-xml (default) @ org.eclipse.core.runtime.feature ---
[INFO] 
[INFO] --- maven-resources-plugin:3.1.0:resources (filter-resources) @ org.eclipse.core.runtime.feature ---
[INFO] Using 'UTF-8' encoding to copy filtered resources.
[INFO] skip non existing resourceDirectory /home/jenkins/agent/workspace/eclipse.platform.runtime-Gerrit/features/org.eclipse.core.runtime.feature/src/main/resources
[INFO] 
[INFO] --- tycho-eclipserun-plugin:1.6.0-SNAPSHOT:eclipse-run (default) @ org.eclipse.core.runtime.feature ---
[INFO] 
[INFO] --- tycho-source-plugin:1.6.0-SNAPSHOT:plugin-source (plugin-source) @ org.eclipse.core.runtime.feature ---
[INFO] 
[INFO] --- target-platform-configuration:1.6.0-SNAPSHOT:target-platform (default-target-platform) @ org.eclipse.core.runtime.feature ---
[INFO] 
[INFO] --- tycho-packaging-plugin:1.6.0-SNAPSHOT:package-feature (default-package-feature) @ org.eclipse.core.runtime.feature ---
[INFO] Building jar: /home/jenkins/agent/workspace/eclipse.platform.runtime-Gerrit/features/org.eclipse.core.runtime.feature/target/org.eclipse.core.runtime.feature-1.2.800-SNAPSHOT.jar
[INFO] 
[INFO] --- tycho-p2-plugin:1.6.0-SNAPSHOT:p2-metadata-default (default-p2-metadata-default) @ org.eclipse.core.runtime.feature ---
[INFO] MavenProject: org.eclipse.core.feature:org.eclipse.core.runtime.feature:1.2.800-SNAPSHOT @ /home/jenkins/agent/workspace/eclipse.platform.runtime-Gerrit/features/org.eclipse.core.runtime.feature/pom.xml
    The main artifact has been replaced with the baseline version.

[INFO] 
[INFO] --- tycho-p2-plugin:1.6.0-SNAPSHOT:feature-p2-metadata (default-feature-p2-metadata) @ org.eclipse.core.runtime.feature ---
[INFO] 
[INFO] --- tycho-p2-extras-plugin:1.6.0-SNAPSHOT:compare-version-with-baselines (compare-attached-artifacts-with-release) @ org.eclipse.core.runtime.feature ---
[INFO] Fetching org.eclipse.core.runtime.feature_1.2.700.v20191122-2104.jar from https://download.eclipse.org/eclipse/updates/4.14/R-4.14-201912100610/features/ (19.09kB)
[INFO] 
[INFO] --- maven-antrun-plugin:1.8:run (check-skip-api-analysis) @ org.eclipse.core.runtime.feature ---
[INFO] Executing tasks

main:
[INFO] Executed tasks
[INFO] 
[INFO] --- tycho-dependency-tools-plugin:1.6.0-SNAPSHOT:list-dependencies (list-dependencies) @ org.eclipse.core.runtime.feature ---
[INFO] Skipped
[INFO] 
[INFO] --- tycho-eclipserun-plugin:1.6.0-SNAPSHOT:eclipse-run (api-analysis) @ org.eclipse.core.runtime.feature ---
[INFO] 
[INFO] ------< eclipse.platform.runtime:eclipse.platform.runtime.tests >-------
[INFO] Building eclipse.platform.runtime.tests 4.15.0-SNAPSHOT          [13/18]
[INFO] --------------------------------[ pom ]---------------------------------
[INFO] 
[INFO] --- maven-clean-plugin:3.1.0:clean (default-clean) @ eclipse.platform.runtime.tests ---
[INFO] 
[INFO] --- maven-resources-plugin:3.1.0:copy-resources (saveproperties) @ eclipse.platform.runtime.tests ---
[INFO] Using 'UTF-8' encoding to copy filtered resources.
[INFO] skip non existing resourceDirectory /home/jenkins/agent/workspace/eclipse.platform.runtime-Gerrit/tests/saveproperties
[INFO] 
[INFO] --- maven-enforcer-plugin:3.0.0-M3:enforce (enforce-maven) @ eclipse.platform.runtime.tests ---
[INFO] 
[INFO] --- eclipse-cbi-plugin:1.1.8-SNAPSHOT:generate-api-build-xml (default) @ eclipse.platform.runtime.tests ---
[INFO] 
[INFO] --- maven-resources-plugin:3.1.0:resources (filter-resources) @ eclipse.platform.runtime.tests ---
[INFO] Using 'UTF-8' encoding to copy filtered resources.
[INFO] skip non existing resourceDirectory /home/jenkins/agent/workspace/eclipse.platform.runtime-Gerrit/tests/src/main/resources
[INFO] 
[INFO] --- tycho-eclipserun-plugin:1.6.0-SNAPSHOT:eclipse-run (default) @ eclipse.platform.runtime.tests ---
[INFO] 
[INFO] --- tycho-source-plugin:1.6.0-SNAPSHOT:plugin-source (plugin-source) @ eclipse.platform.runtime.tests ---
[INFO] 
[INFO] --- tycho-p2-extras-plugin:1.6.0-SNAPSHOT:compare-version-with-baselines (compare-attached-artifacts-with-release) @ eclipse.platform.runtime.tests ---
[INFO] 
[INFO] --- maven-antrun-plugin:1.8:run (check-skip-api-analysis) @ eclipse.platform.runtime.tests ---
[INFO] Executing tasks

main:
[INFO] Executed tasks
[INFO] 
[INFO] --- tycho-dependency-tools-plugin:1.6.0-SNAPSHOT:list-dependencies (list-dependencies) @ eclipse.platform.runtime.tests ---
[INFO] Skipped
[INFO] 
[INFO] --- tycho-eclipserun-plugin:1.6.0-SNAPSHOT:eclipse-run (api-analysis) @ eclipse.platform.runtime.tests ---
[INFO] 
[INFO] --------< org.eclipse.core:org.eclipse.core.expressions.tests >---------
[INFO] Building org.eclipse.core.expressions.tests 3.5.600-SNAPSHOT     [14/18]
[INFO] ------------------------[ eclipse-test-plugin ]-------------------------
[INFO] 
[INFO] --- maven-clean-plugin:3.1.0:clean (default-clean) @ org.eclipse.core.expressions.tests ---
[INFO] 
[INFO] --- tycho-packaging-plugin:1.6.0-SNAPSHOT:build-qualifier (default-build-qualifier) @ org.eclipse.core.expressions.tests ---
[INFO] The project's OSGi version is 3.5.600.v20190925-0538
[INFO] 
[INFO] --- tycho-packaging-plugin:1.6.0-SNAPSHOT:validate-id (default-validate-id) @ org.eclipse.core.expressions.tests ---
[INFO] 
[INFO] --- tycho-packaging-plugin:1.6.0-SNAPSHOT:validate-version (default-validate-version) @ org.eclipse.core.expressions.tests ---
[INFO] 
[INFO] --- maven-resources-plugin:3.1.0:copy-resources (saveproperties) @ org.eclipse.core.expressions.tests ---
[INFO] Using 'UTF-8' encoding to copy filtered resources.
[INFO] skip non existing resourceDirectory /home/jenkins/agent/workspace/eclipse.platform.runtime-Gerrit/tests/org.eclipse.core.expressions.tests/saveproperties
[INFO] 
[INFO] --- maven-enforcer-plugin:3.0.0-M3:enforce (enforce-maven) @ org.eclipse.core.expressions.tests ---
[INFO] 
[INFO] --- eclipse-cbi-plugin:1.1.8-SNAPSHOT:generate-api-build-xml (default) @ org.eclipse.core.expressions.tests ---
[INFO] 
[INFO] --- maven-resources-plugin:3.1.0:resources (default-resources) @ org.eclipse.core.expressions.tests ---
[INFO] Using 'UTF-8' encoding to copy filtered resources.
[INFO] skip non existing resourceDirectory /home/jenkins/agent/workspace/eclipse.platform.runtime-Gerrit/tests/org.eclipse.core.expressions.tests/src/main/resources
[INFO] 
[INFO] --- maven-resources-plugin:3.1.0:resources (filter-resources) @ org.eclipse.core.expressions.tests ---
[INFO] Using 'UTF-8' encoding to copy filtered resources.
[INFO] skip non existing resourceDirectory /home/jenkins/agent/workspace/eclipse.platform.runtime-Gerrit/tests/org.eclipse.core.expressions.tests/src/main/resources
[INFO] 
[INFO] --- tycho-compiler-plugin:1.6.0-SNAPSHOT:compile (default-compile) @ org.eclipse.core.expressions.tests ---
[INFO] Compiling 20 source files to /home/jenkins/agent/workspace/eclipse.platform.runtime-Gerrit/tests/org.eclipse.core.expressions.tests/target/classes
[INFO] 
[INFO] --- tycho-eclipserun-plugin:1.6.0-SNAPSHOT:eclipse-run (default) @ org.eclipse.core.expressions.tests ---
[INFO] 
[INFO] --- maven-resources-plugin:3.1.0:testResources (default-testResources) @ org.eclipse.core.expressions.tests ---
[INFO] Using 'UTF-8' encoding to copy filtered resources.
[INFO] skip non existing resourceDirectory /home/jenkins/agent/workspace/eclipse.platform.runtime-Gerrit/tests/org.eclipse.core.expressions.tests/src/test/resources
[INFO] 
[INFO] --- tycho-source-plugin:1.6.0-SNAPSHOT:plugin-source (plugin-source) @ org.eclipse.core.expressions.tests ---
[INFO] Building jar: /home/jenkins/agent/workspace/eclipse.platform.runtime-Gerrit/tests/org.eclipse.core.expressions.tests/target/org.eclipse.core.expressions.tests-3.5.600-SNAPSHOT-sources.jar
[INFO] 
[INFO] --- target-platform-configuration:1.6.0-SNAPSHOT:target-platform (default-target-platform) @ org.eclipse.core.expressions.tests ---
[INFO] 
[INFO] --- tycho-packaging-plugin:1.6.0-SNAPSHOT:package-plugin (default-package-plugin) @ org.eclipse.core.expressions.tests ---
[INFO] Building jar: /home/jenkins/agent/workspace/eclipse.platform.runtime-Gerrit/tests/org.eclipse.core.expressions.tests/target/org.eclipse.core.expressions.tests-3.5.600-SNAPSHOT.jar
[INFO] 
[INFO] --- tycho-p2-plugin:1.6.0-SNAPSHOT:p2-metadata-default (default-p2-metadata-default) @ org.eclipse.core.expressions.tests ---
Jan 17, 2020 6:06:28 PM org.apache.http.impl.execchain.RetryExec execute
INFO: I/O exception (org.apache.http.NoHttpResponseException) caught when processing request to {s}->https://download.eclipse.org:443: The target server failed to respond
Jan 17, 2020 6:06:28 PM org.apache.http.impl.execchain.RetryExec execute
INFO: Retrying request to {s}->https://download.eclipse.org:443
[WARNING] MavenProject: org.eclipse.core:org.eclipse.core.expressions.tests:3.5.600-SNAPSHOT @ /home/jenkins/agent/workspace/eclipse.platform.runtime-Gerrit/tests/org.eclipse.core.expressions.tests/pom.xml: baseline and build artifacts have same version but different contents
   classifier-sources: not present in baseline

[INFO] MavenProject: org.eclipse.core:org.eclipse.core.expressions.tests:3.5.600-SNAPSHOT @ /home/jenkins/agent/workspace/eclipse.platform.runtime-Gerrit/tests/org.eclipse.core.expressions.tests/pom.xml
    The main artifact has been replaced with the baseline version.
    The following attached artifacts are not present in the baseline and have been removed: [sources]

[INFO] 
[INFO] --- tycho-surefire-plugin:1.6.0-SNAPSHOT:test (default-test) @ org.eclipse.core.expressions.tests ---
[INFO] Expected eclipse log file: /home/jenkins/agent/workspace/eclipse.platform.runtime-Gerrit/tests/org.eclipse.core.expressions.tests/target/work/data/.metadata/.log
[INFO] Command line:
	[/opt/tools/java/openjdk/jdk-11/11.0.4/bin/java, -Dosgi.noShutdown=false, -Dosgi.os=linux, -Dosgi.ws=gtk, -Dosgi.arch=x86_64, --add-modules=ALL-SYSTEM, -Dosgi.clean=true, -ea, -jar, /home/jenkins/agent/workspace/eclipse.platform.runtime-Gerrit/.repository/p2/osgi/bundle/org.eclipse.equinox.launcher/1.5.700.v20200107-1357/org.eclipse.equinox.launcher-1.5.700.v20200107-1357.jar, -data, /home/jenkins/agent/workspace/eclipse.platform.runtime-Gerrit/tests/org.eclipse.core.expressions.tests/target/work/data, -install, /home/jenkins/agent/workspace/eclipse.platform.runtime-Gerrit/tests/org.eclipse.core.expressions.tests/target/work, -configuration, /home/jenkins/agent/workspace/eclipse.platform.runtime-Gerrit/tests/org.eclipse.core.expressions.tests/target/work/configuration, -application, org.eclipse.tycho.surefire.osgibooter.uitest, -testproperties, /home/jenkins/agent/workspace/eclipse.platform.runtime-Gerrit/tests/org.eclipse.core.expressions.tests/target/surefire.properties]
Picked up JAVA_TOOL_OPTIONS: -XX:+IgnoreUnrecognizedVMOptions -XX:+UseContainerSupport -XX:+UnlockExperimentalVMOptions -XX:+UseCGroupMemoryLimitForHeap
Picked up _JAVA_OPTIONS: -XX:MaxRAMPercentage=64.0
An error has occurred. See the log file
/home/jenkins/agent/workspace/eclipse.platform.runtime-Gerrit/tests/org.eclipse.core.expressions.tests/target/work/data/.metadata/.log.
[INFO] 
[INFO] ----------< org.eclipse.core:org.eclipse.core.tests.harness >-----------
[INFO] Building org.eclipse.core.tests.harness 3.11.700-SNAPSHOT        [15/18]
[INFO] ---------------------------[ eclipse-plugin ]---------------------------
[INFO] 
[INFO] --- maven-clean-plugin:3.1.0:clean (default-clean) @ org.eclipse.core.tests.harness ---
[INFO] 
[INFO] --- tycho-packaging-plugin:1.6.0-SNAPSHOT:build-qualifier (default-build-qualifier) @ org.eclipse.core.tests.harness ---
[INFO] The project's OSGi version is 3.11.700.v20200114-1249
[INFO] 
[INFO] --- tycho-packaging-plugin:1.6.0-SNAPSHOT:validate-id (default-validate-id) @ org.eclipse.core.tests.harness ---
[INFO] 
[INFO] --- tycho-packaging-plugin:1.6.0-SNAPSHOT:validate-version (default-validate-version) @ org.eclipse.core.tests.harness ---
[INFO] 
[INFO] --- maven-resources-plugin:3.1.0:copy-resources (saveproperties) @ org.eclipse.core.tests.harness ---
[INFO] Using 'UTF-8' encoding to copy filtered resources.
[INFO] skip non existing resourceDirectory /home/jenkins/agent/workspace/eclipse.platform.runtime-Gerrit/tests/org.eclipse.core.tests.harness/saveproperties
[INFO] 
[INFO] --- maven-enforcer-plugin:3.0.0-M3:enforce (enforce-maven) @ org.eclipse.core.tests.harness ---
[INFO] 
[INFO] --- eclipse-cbi-plugin:1.1.8-SNAPSHOT:generate-api-build-xml (default) @ org.eclipse.core.tests.harness ---
[INFO] 
[INFO] --- maven-resources-plugin:3.1.0:resources (default-resources) @ org.eclipse.core.tests.harness ---
[INFO] Using 'UTF-8' encoding to copy filtered resources.
[INFO] skip non existing resourceDirectory /home/jenkins/agent/workspace/eclipse.platform.runtime-Gerrit/tests/org.eclipse.core.tests.harness/src/main/resources
[INFO] 
[INFO] --- maven-resources-plugin:3.1.0:resources (filter-resources) @ org.eclipse.core.tests.harness ---
[INFO] Using 'UTF-8' encoding to copy filtered resources.
[INFO] skip non existing resourceDirectory /home/jenkins/agent/workspace/eclipse.platform.runtime-Gerrit/tests/org.eclipse.core.tests.harness/src/main/resources
[INFO] 
[INFO] --- tycho-compiler-plugin:1.6.0-SNAPSHOT:compile (default-compile) @ org.eclipse.core.tests.harness ---
[INFO] Compiling 34 source files to /home/jenkins/agent/workspace/eclipse.platform.runtime-Gerrit/tests/org.eclipse.core.tests.harness/target/classes
[INFO] 
[INFO] --- tycho-eclipserun-plugin:1.6.0-SNAPSHOT:eclipse-run (default) @ org.eclipse.core.tests.harness ---
[INFO] 
[INFO] --- maven-resources-plugin:3.1.0:testResources (default-testResources) @ org.eclipse.core.tests.harness ---
[INFO] Using 'UTF-8' encoding to copy filtered resources.
[INFO] skip non existing resourceDirectory /home/jenkins/agent/workspace/eclipse.platform.runtime-Gerrit/tests/org.eclipse.core.tests.harness/src/test/resources
[INFO] 
[INFO] --- tycho-source-plugin:1.6.0-SNAPSHOT:plugin-source (plugin-source) @ org.eclipse.core.tests.harness ---
[INFO] Building jar: /home/jenkins/agent/workspace/eclipse.platform.runtime-Gerrit/tests/org.eclipse.core.tests.harness/target/org.eclipse.core.tests.harness-3.11.700-SNAPSHOT-sources.jar
[INFO] 
[INFO] --- target-platform-configuration:1.6.0-SNAPSHOT:target-platform (default-target-platform) @ org.eclipse.core.tests.harness ---
[INFO] 
[INFO] --- tycho-packaging-plugin:1.6.0-SNAPSHOT:package-plugin (default-package-plugin) @ org.eclipse.core.tests.harness ---
[INFO] Building jar: /home/jenkins/agent/workspace/eclipse.platform.runtime-Gerrit/tests/org.eclipse.core.tests.harness/target/org.eclipse.core.tests.harness-3.11.700-SNAPSHOT.jar
[INFO] 
[INFO] --- tycho-p2-plugin:1.6.0-SNAPSHOT:p2-metadata-default (default-p2-metadata-default) @ org.eclipse.core.tests.harness ---
[WARNING] MavenProject: org.eclipse.core:org.eclipse.core.tests.harness:3.11.700-SNAPSHOT @ /home/jenkins/agent/workspace/eclipse.platform.runtime-Gerrit/tests/org.eclipse.core.tests.harness/pom.xml: baseline and build artifacts have same version but different contents
   classifier-sources: not present in baseline

[INFO] MavenProject: org.eclipse.core:org.eclipse.core.tests.harness:3.11.700-SNAPSHOT @ /home/jenkins/agent/workspace/eclipse.platform.runtime-Gerrit/tests/org.eclipse.core.tests.harness/pom.xml
    The main artifact has been replaced with the baseline version.
    The following attached artifacts are not present in the baseline and have been removed: [sources]

[INFO] 
[INFO] --- tycho-p2-extras-plugin:1.6.0-SNAPSHOT:compare-version-with-baselines (compare-attached-artifacts-with-release) @ org.eclipse.core.tests.harness ---
[INFO] Fetching org.eclipse.core.tests.harness_3.11.600.v20190620-1426.jar.pack.gz from https://download.eclipse.org/eclipse/updates/4.14/R-4.14-201912100610/plugins/ (39.18kB)
[INFO] 
[INFO] --- maven-antrun-plugin:1.8:run (check-skip-api-analysis) @ org.eclipse.core.tests.harness ---
[INFO] Executing tasks

main:
[INFO] Executed tasks
[INFO] 
[INFO] --- tycho-dependency-tools-plugin:1.6.0-SNAPSHOT:list-dependencies (list-dependencies) @ org.eclipse.core.tests.harness ---
[INFO] 
[INFO] --- tycho-eclipserun-plugin:1.6.0-SNAPSHOT:eclipse-run (api-analysis) @ org.eclipse.core.tests.harness ---
[INFO] Toolchain in tycho-eclipserun-plugin: JDK[/opt/tools/java/oracle/jdk-8/latest/jre]
[INFO] Expected eclipse log file: /home/jenkins/agent/workspace/eclipse.platform.runtime-Gerrit/tests/org.eclipse.core.tests.harness/target/eclipserun-work/data/.metadata/.log
[INFO] Command line:
	[/opt/tools/java/oracle/jdk-8/latest/jre/bin/java, -Xmx2048M, -jar, /home/jenkins/agent/workspace/eclipse.platform.runtime-Gerrit/.repository/p2/osgi/bundle/org.eclipse.equinox.launcher/1.5.700.v20200107-1357/org.eclipse.equinox.launcher-1.5.700.v20200107-1357.jar, -install, /home/jenkins/agent/workspace/eclipse.platform.runtime-Gerrit/tests/org.eclipse.core.tests.harness/target/eclipserun-work, -configuration, /home/jenkins/agent/workspace/eclipse.platform.runtime-Gerrit/tests/org.eclipse.core.tests.harness/target/eclipserun-work/configuration, -data, /home/jenkins/agent/workspace/eclipse.platform.runtime-Gerrit/tests/org.eclipse.core.tests.harness/../target/org.eclipse.core.tests.harness-apiAnalyzer-workspace, -application, org.eclipse.pde.api.tools.apiAnalyzer, -project, /home/jenkins/agent/workspace/eclipse.platform.runtime-Gerrit/tests/org.eclipse.core.tests.harness, -baseline, /home/jenkins/agent/workspace/eclipse.platform.runtime-Gerrit/tests/org.eclipse.core.tests.harness/target/org.eclipse.core.tests.harness-apiBaseline.target, -dependencyList, /home/jenkins/agent/workspace/eclipse.platform.runtime-Gerrit/tests/org.eclipse.core.tests.harness/target/dependencies-list.txt, -failOnError]
Picked up JAVA_TOOL_OPTIONS: -XX:+IgnoreUnrecognizedVMOptions -XX:+UseContainerSupport -XX:+UnlockExperimentalVMOptions -XX:+UseCGroupMemoryLimitForHeap
Picked up _JAVA_OPTIONS: -XX:MaxRAMPercentage=64.0
0 API ERRORS
0 API warnings
[INFO] 
[INFO] ----------< org.eclipse.core:org.eclipse.core.tests.runtime >-----------
[INFO] Building org.eclipse.core.tests.runtime 3.11.1000-SNAPSHOT       [16/18]
[INFO] ------------------------[ eclipse-test-plugin ]-------------------------
[INFO] 
[INFO] --- maven-clean-plugin:3.1.0:clean (default-clean) @ org.eclipse.core.tests.runtime ---
[INFO] 
[INFO] --- tycho-packaging-plugin:1.6.0-SNAPSHOT:build-qualifier (default-build-qualifier) @ org.eclipse.core.tests.runtime ---
[INFO] The project's OSGi version is 3.11.1000.v20200113-1200
[INFO] 
[INFO] --- tycho-packaging-plugin:1.6.0-SNAPSHOT:validate-id (default-validate-id) @ org.eclipse.core.tests.runtime ---
[INFO] 
[INFO] --- tycho-packaging-plugin:1.6.0-SNAPSHOT:validate-version (default-validate-version) @ org.eclipse.core.tests.runtime ---
[INFO] 
[INFO] --- maven-resources-plugin:3.1.0:copy-resources (saveproperties) @ org.eclipse.core.tests.runtime ---
[INFO] Using 'UTF-8' encoding to copy filtered resources.
[INFO] skip non existing resourceDirectory /home/jenkins/agent/workspace/eclipse.platform.runtime-Gerrit/tests/org.eclipse.core.tests.runtime/saveproperties
[INFO] 
[INFO] --- maven-enforcer-plugin:3.0.0-M3:enforce (enforce-maven) @ org.eclipse.core.tests.runtime ---
[INFO] 
[INFO] --- eclipse-cbi-plugin:1.1.8-SNAPSHOT:generate-api-build-xml (default) @ org.eclipse.core.tests.runtime ---
[INFO] 
[INFO] --- maven-resources-plugin:3.1.0:resources (default-resources) @ org.eclipse.core.tests.runtime ---
[INFO] Using 'UTF-8' encoding to copy filtered resources.
[INFO] skip non existing resourceDirectory /home/jenkins/agent/workspace/eclipse.platform.runtime-Gerrit/tests/org.eclipse.core.tests.runtime/src/main/resources
[INFO] 
[INFO] --- maven-resources-plugin:3.1.0:resources (filter-resources) @ org.eclipse.core.tests.runtime ---
[INFO] Using 'UTF-8' encoding to copy filtered resources.
[INFO] skip non existing resourceDirectory /home/jenkins/agent/workspace/eclipse.platform.runtime-Gerrit/tests/org.eclipse.core.tests.runtime/src/main/resources
[INFO] 
[INFO] --- tycho-compiler-plugin:1.6.0-SNAPSHOT:compile (default-compile) @ org.eclipse.core.tests.runtime ---
[INFO] Compiling 73 source files to /home/jenkins/agent/workspace/eclipse.platform.runtime-Gerrit/tests/org.eclipse.core.tests.runtime/target/classes
[INFO] 
[INFO] --- tycho-eclipserun-plugin:1.6.0-SNAPSHOT:eclipse-run (default) @ org.eclipse.core.tests.runtime ---
[INFO] 
[INFO] --- maven-resources-plugin:3.1.0:testResources (default-testResources) @ org.eclipse.core.tests.runtime ---
[INFO] Using 'UTF-8' encoding to copy filtered resources.
[INFO] skip non existing resourceDirectory /home/jenkins/agent/workspace/eclipse.platform.runtime-Gerrit/tests/org.eclipse.core.tests.runtime/src/test/resources
[INFO] 
[INFO] --- tycho-source-plugin:1.6.0-SNAPSHOT:plugin-source (plugin-source) @ org.eclipse.core.tests.runtime ---
[INFO] Building jar: /home/jenkins/agent/workspace/eclipse.platform.runtime-Gerrit/tests/org.eclipse.core.tests.runtime/target/org.eclipse.core.tests.runtime-3.11.1000-SNAPSHOT-sources.jar
[INFO] 
[INFO] --- target-platform-configuration:1.6.0-SNAPSHOT:target-platform (default-target-platform) @ org.eclipse.core.tests.runtime ---
[INFO] 
[INFO] --- tycho-packaging-plugin:1.6.0-SNAPSHOT:package-plugin (default-package-plugin) @ org.eclipse.core.tests.runtime ---
[INFO] Building jar: /home/jenkins/agent/workspace/eclipse.platform.runtime-Gerrit/tests/org.eclipse.core.tests.runtime/target/org.eclipse.core.tests.runtime-3.11.1000-SNAPSHOT.jar
[INFO] 
[INFO] --- tycho-p2-plugin:1.6.0-SNAPSHOT:p2-metadata-default (default-p2-metadata-default) @ org.eclipse.core.tests.runtime ---
[WARNING] MavenProject: org.eclipse.core:org.eclipse.core.tests.runtime:3.11.1000-SNAPSHOT @ /home/jenkins/agent/workspace/eclipse.platform.runtime-Gerrit/tests/org.eclipse.core.tests.runtime/pom.xml: baseline and build artifacts have same version but different contents
   classifier-sources: not present in baseline

[INFO] MavenProject: org.eclipse.core:org.eclipse.core.tests.runtime:3.11.1000-SNAPSHOT @ /home/jenkins/agent/workspace/eclipse.platform.runtime-Gerrit/tests/org.eclipse.core.tests.runtime/pom.xml
    The main artifact has been replaced with the baseline version.
    The following attached artifacts are not present in the baseline and have been removed: [sources]

[INFO] 
[INFO] --- tycho-surefire-plugin:1.6.0-SNAPSHOT:test (default-test) @ org.eclipse.core.tests.runtime ---
[INFO] Expected eclipse log file: /home/jenkins/agent/workspace/eclipse.platform.runtime-Gerrit/tests/org.eclipse.core.tests.runtime/target/work/data/.metadata/.log
[INFO] Command line:
	[/opt/tools/java/openjdk/jdk-11/11.0.4/bin/java, -Dosgi.noShutdown=false, -Dosgi.os=linux, -Dosgi.ws=gtk, -Dosgi.arch=x86_64, --add-modules=ALL-SYSTEM, -Dosgi.clean=true, -ea, -jar, /home/jenkins/agent/workspace/eclipse.platform.runtime-Gerrit/.repository/p2/osgi/bundle/org.eclipse.equinox.launcher/1.5.700.v20200107-1357/org.eclipse.equinox.launcher-1.5.700.v20200107-1357.jar, -data, /home/jenkins/agent/workspace/eclipse.platform.runtime-Gerrit/tests/org.eclipse.core.tests.runtime/target/work/data, -install, /home/jenkins/agent/workspace/eclipse.platform.runtime-Gerrit/tests/org.eclipse.core.tests.runtime/target/work, -configuration, /home/jenkins/agent/workspace/eclipse.platform.runtime-Gerrit/tests/org.eclipse.core.tests.runtime/target/work/configuration, -application, org.eclipse.tycho.surefire.osgibooter.headlesstest, -testproperties, /home/jenkins/agent/workspace/eclipse.platform.runtime-Gerrit/tests/org.eclipse.core.tests.runtime/target/surefire.properties]
Picked up JAVA_TOOL_OPTIONS: -XX:+IgnoreUnrecognizedVMOptions -XX:+UseContainerSupport -XX:+UnlockExperimentalVMOptions -XX:+UseCGroupMemoryLimitForHeap
Picked up _JAVA_OPTIONS: -XX:MaxRAMPercentage=64.0
Running org.eclipse.core.tests.runtime.AutomatedTests
Picked up JAVA_TOOL_OPTIONS: -XX:+IgnoreUnrecognizedVMOptions -XX:+UseContainerSupport -XX:+UnlockExperimentalVMOptions -XX:+UseCGroupMemoryLimitForHeap
Picked up _JAVA_OPTIONS: -XX:MaxRAMPercentage=64.0
Picked up JAVA_TOOL_OPTIONS: -XX:+IgnoreUnrecognizedVMOptions -XX:+UseContainerSupport -XX:+UnlockExperimentalVMOptions -XX:+UseCGroupMemoryLimitForHeap
Picked up _JAVA_OPTIONS: -XX:MaxRAMPercentage=64.0
Picked up JAVA_TOOL_OPTIONS: -XX:+IgnoreUnrecognizedVMOptions -XX:+UseContainerSupport -XX:+UnlockExperimentalVMOptions -XX:+UseCGroupMemoryLimitForHeap
Picked up _JAVA_OPTIONS: -XX:MaxRAMPercentage=64.0
/home/jenkins/agent/workspace/eclipse.platform.runtime-Gerrit/tests/org.eclipse.core.tests.runtime/target/work/data/.metadata/.log
/home/jenkins/agent/workspace/eclipse.platform.runtime-Gerrit/tests/org.eclipse.core.tests.runtime/target/work/data/.metadata/.log
Picked up JAVA_TOOL_OPTIONS: -XX:+IgnoreUnrecognizedVMOptions -XX:+UseContainerSupport -XX:+UnlockExperimentalVMOptions -XX:+UseCGroupMemoryLimitForHeap
Picked up _JAVA_OPTIONS: -XX:MaxRAMPercentage=64.0
Picked up JAVA_TOOL_OPTIONS: -XX:+IgnoreUnrecognizedVMOptions -XX:+UseContainerSupport -XX:+UnlockExperimentalVMOptions -XX:+UseCGroupMemoryLimitForHeap
Picked up _JAVA_OPTIONS: -XX:MaxRAMPercentage=64.0
Picked up JAVA_TOOL_OPTIONS: -XX:+IgnoreUnrecognizedVMOptions -XX:+UseContainerSupport -XX:+UnlockExperimentalVMOptions -XX:+UseCGroupMemoryLimitForHeap
Picked up _JAVA_OPTIONS: -XX:MaxRAMPercentage=64.0
Picked up JAVA_TOOL_OPTIONS: -XX:+IgnoreUnrecognizedVMOptions -XX:+UseContainerSupport -XX:+UnlockExperimentalVMOptions -XX:+UseCGroupMemoryLimitForHeap
Picked up _JAVA_OPTIONS: -XX:MaxRAMPercentage=64.0
Tests run: 296, Failures: 0, Errors: 0, Skipped: 0, Time elapsed: 341.79 s - in org.eclipse.core.tests.runtime.AutomatedTests
testMultiStatus(org.eclipse.core.tests.internal.runtime.LogSerializationTest)  Time elapsed: 0.098 s
testMultiMultiStatusSerialize(org.eclipse.core.tests.internal.runtime.LogSerializationTest)  Time elapsed: 0.215 s
testDeepMultiStatus(org.eclipse.core.tests.internal.runtime.LogSerializationTest)  Time elapsed: 0.091 s
testMultiSerialize(org.eclipse.core.tests.internal.runtime.LogSerializationTest)  Time elapsed: 0.017 s
testSimpleSerialize(org.eclipse.core.tests.internal.runtime.LogSerializationTest)  Time elapsed: 0.005 s
testBug300197_01(org.eclipse.core.tests.internal.runtime.PlatformURLLocalTest)  Time elapsed: 0.066 s
testBug300197_02(org.eclipse.core.tests.internal.runtime.PlatformURLLocalTest)  Time elapsed: 0.008 s
testPlatformURLConfigResolution(org.eclipse.core.tests.internal.runtime.PlatformURLLocalTest)  Time elapsed: 0.001 s
testBug155081(org.eclipse.core.tests.internal.runtime.PlatformURLLocalTest)  Time elapsed: 0.006 s
testPlatformURLMetaResolution(org.eclipse.core.tests.internal.runtime.PlatformURLLocalTest)  Time elapsed: 0.001 s
test0FirstSession(org.eclipse.core.tests.internal.runtime.PlatformURLSessionTest)  Time elapsed: 0 s
test1OutputOnReadOnly(org.eclipse.core.tests.internal.runtime.PlatformURLSessionTest)  Time elapsed: 0 s
test2Resolution(org.eclipse.core.tests.internal.runtime.PlatformURLSessionTest)  Time elapsed: 0 s
testFileLocatorFind(org.eclipse.core.tests.internal.runtime.FileLocatorTest)  Time elapsed: 0.022 s
testFileLocatorGetBundleFile01(org.eclipse.core.tests.internal.runtime.FileLocatorTest)  Time elapsed: 0.006 s
testFileLocatorGetBundleFile02(org.eclipse.core.tests.internal.runtime.FileLocatorTest)  Time elapsed: 0.008 s
testGetLocation(org.eclipse.core.tests.runtime.PlatformTest)  Time elapsed: 0.007 s
testGetSystemBundle(org.eclipse.core.tests.runtime.PlatformTest)  Time elapsed: 0.001 s
testGetBundles(org.eclipse.core.tests.runtime.PlatformTest)  Time elapsed: 0.018 s
testGetCommandLine(org.eclipse.core.tests.runtime.PlatformTest)  Time elapsed: 0 s
testGetBundle(org.eclipse.core.tests.runtime.PlatformTest)  Time elapsed: 0.015 s
testIsFragment(org.eclipse.core.tests.runtime.PlatformTest)  Time elapsed: 0.005 s
testGetResourceBundle(org.eclipse.core.tests.runtime.PlatformTest)  Time elapsed: 0.001 s
testRunnable(org.eclipse.core.tests.runtime.PlatformTest)  Time elapsed: 0.005 s
testGetLogLocation(org.eclipse.core.tests.runtime.PlatformTest)  Time elapsed: 0.002 s
testYieldPingPongBetweenMultipleJobs(org.eclipse.core.tests.runtime.jobs.YieldTest)  Time elapsed: 0.181 s
testThreadRestored(org.eclipse.core.tests.runtime.jobs.YieldTest)  Time elapsed: 0.011 s
testYieldThreadJobToThread(org.eclipse.core.tests.runtime.jobs.YieldTest)  Time elapsed: 0.112 s
testYieldIsInterruptable(org.eclipse.core.tests.runtime.jobs.YieldTest)  Time elapsed: 0.002 s
testYieldJobToJob(org.eclipse.core.tests.runtime.jobs.YieldTest)  Time elapsed: 0.011 s
testYieldJobToJobsInterleaved(org.eclipse.core.tests.runtime.jobs.YieldTest)  Time elapsed: 1.773 s
testYieldThreadJobToBlockedConflictingJob(org.eclipse.core.tests.runtime.jobs.YieldTest)  Time elapsed: 0.112 s
testYieldThreadToJob(org.eclipse.core.tests.runtime.jobs.YieldTest)  Time elapsed: 0.202 s
testNestedAcquireJobIsNotRescheduled(org.eclipse.core.tests.runtime.jobs.YieldTest)  Time elapsed: 0.111 s
testExceptionWhenYieldingNotRunning(org.eclipse.core.tests.runtime.jobs.YieldTest)  Time elapsed: 0 s
testYieldPingPong(org.eclipse.core.tests.runtime.jobs.YieldTest)  Time elapsed: 0.01 s
testYieldJobToJobAndEnsureConflictingRunsBeforeResume(org.eclipse.core.tests.runtime.jobs.YieldTest)  Time elapsed: 0.062 s
testExceptionWhenYieldingNotOwner(org.eclipse.core.tests.runtime.jobs.YieldTest)  Time elapsed: 0.204 s
testYieldThreadToThreadJob(org.eclipse.core.tests.runtime.jobs.YieldTest)  Time elapsed: 0.111 s
testResumingThreadJobIsNotRescheduled(org.eclipse.core.tests.runtime.jobs.YieldTest)  Time elapsed: 0.112 s
testYieldJobToThread(org.eclipse.core.tests.runtime.jobs.YieldTest)  Time elapsed: 0.111 s
testParallelYieldPingPongBetweenMultipleJobs(org.eclipse.core.tests.runtime.jobs.YieldTest)  Time elapsed: 0.027 s
testScheduleRace(org.eclipse.core.tests.runtime.jobs.IJobManagerTest)  Time elapsed: 1.003 s
testBadLocalListener(org.eclipse.core.tests.runtime.jobs.IJobManagerTest)  Time elapsed: 0.102 s
testTransferSameThread(org.eclipse.core.tests.runtime.jobs.IJobManagerTest)  Time elapsed: 0.001 s
testCurrentJob(org.eclipse.core.tests.runtime.jobs.IJobManagerTest)  Time elapsed: 0.105 s
testTwoRules(org.eclipse.core.tests.runtime.jobs.IJobManagerTest)  Time elapsed: 0.91 s
testCancellationPriorToBeginRuleWontHoldRule(org.eclipse.core.tests.runtime.jobs.IJobManagerTest)  Time elapsed: 0.004 s
testJobFamilyJoinLockListener(org.eclipse.core.tests.runtime.jobs.IJobManagerTest)  Time elapsed: 2.506 s
testJobFamilyJoinRepeating(org.eclipse.core.tests.runtime.jobs.IJobManagerTest)  Time elapsed: 0.902 s
testOrder(org.eclipse.core.tests.runtime.jobs.IJobManagerTest)  Time elapsed: 1.553 s
testSleep(org.eclipse.core.tests.runtime.jobs.IJobManagerTest)  Time elapsed: 1.603 s
testJobFamilySleep(org.eclipse.core.tests.runtime.jobs.IJobManagerTest)  Time elapsed: 0.102 s
testBeginInvalidNestedRules(org.eclipse.core.tests.runtime.jobs.IJobManagerTest)  Time elapsed: 0.001 s
testSuspendMultiThreadAccess(org.eclipse.core.tests.runtime.jobs.IJobManagerTest)  Time elapsed: 0.814 s
testTransferToJobWaitingOnChildRule(org.eclipse.core.tests.runtime.jobs.IJobManagerTest)  Time elapsed: 0.212 s
testBug48073(org.eclipse.core.tests.runtime.jobs.IJobManagerTest)  Time elapsed: 0.301 s
testBug57656(org.eclipse.core.tests.runtime.jobs.IJobManagerTest)  Time elapsed: 11.056 s
testSuspendMismatchedBegins(org.eclipse.core.tests.runtime.jobs.IJobManagerTest)  Time elapsed: 0.301 s
testTransferJobToJob(org.eclipse.core.tests.runtime.jobs.IJobManagerTest)  Time elapsed: 0.305 s
testSetInvalidRule(org.eclipse.core.tests.runtime.jobs.IJobManagerTest)  Time elapsed: 0.001 s
testJobFamilyJoinNothing(org.eclipse.core.tests.runtime.jobs.IJobManagerTest)  Time elapsed: 0 s
testBadGlobalListener(org.eclipse.core.tests.runtime.jobs.IJobManagerTest)  Time elapsed: 0.101 s
testSleepOnWait(org.eclipse.core.tests.runtime.jobs.IJobManagerTest)  Time elapsed: 0.111 s
testTransferToJob(org.eclipse.core.tests.runtime.jobs.IJobManagerTest)  Time elapsed: 0.302 s
testCurrentRule(org.eclipse.core.tests.runtime.jobs.IJobManagerTest)  Time elapsed: 0.022 s
testJobFamilyJoinSimple(org.eclipse.core.tests.runtime.jobs.IJobManagerTest)  Time elapsed: 0.403 s
testTransferFailure(org.eclipse.core.tests.runtime.jobs.IJobManagerTest)  Time elapsed: 0.401 s
testJobFamilyCancel(org.eclipse.core.tests.runtime.jobs.IJobManagerTest)  Time elapsed: 0.202 s
testJobFamilyJoinShouldSchedule(org.eclipse.core.tests.runtime.jobs.IJobManagerTest)  Time elapsed: 0.101 s
testTransferSimple(org.eclipse.core.tests.runtime.jobs.IJobManagerTest)  Time elapsed: 0.001 s
testJobFamilyJoinCancelManager(org.eclipse.core.tests.runtime.jobs.IJobManagerTest)  Time elapsed: 0.504 s
testJobFamilyWakeUp(org.eclipse.core.tests.runtime.jobs.IJobManagerTest)  Time elapsed: 1.204 s
testJobFamilyFind(org.eclipse.core.tests.runtime.jobs.IJobManagerTest)  Time elapsed: 0.201 s
testJobFamilyJoin(org.eclipse.core.tests.runtime.jobs.IJobManagerTest)  Time elapsed: 1.304 s
testJobFamilyNULL(org.eclipse.core.tests.runtime.jobs.IJobManagerTest)  Time elapsed: 0.102 s
testReverseOrder(org.eclipse.core.tests.runtime.jobs.IJobManagerTest)  Time elapsed: 4.052 s
testJobFamilyJoinCancelJobs(org.eclipse.core.tests.runtime.jobs.IJobManagerTest)  Time elapsed: 0.403 s
testJobFamilyJoinWhenSuspended_1(org.eclipse.core.tests.runtime.jobs.IJobManagerTest)  Time elapsed: 2.205 s
testJobFamilyJoinWhenSuspended_2(org.eclipse.core.tests.runtime.jobs.IJobManagerTest)  Time elapsed: 2.106 s
testJobFamilyJoinWhenSuspended_3(org.eclipse.core.tests.runtime.jobs.IJobManagerTest)  Time elapsed: 4.208 s
testTransferToWaitingJob(org.eclipse.core.tests.runtime.jobs.IJobManagerTest)  Time elapsed: 0.212 s
testBeginRuleNoEnd(org.eclipse.core.tests.runtime.jobs.IJobManagerTest)  Time elapsed: 0.002 s
testSimple(org.eclipse.core.tests.runtime.jobs.IJobManagerTest)  Time elapsed: 2.106 s
testMutexRule(org.eclipse.core.tests.runtime.jobs.IJobManagerTest)  Time elapsed: 1.009 s
testCancellationWhileWaitingOnRule(org.eclipse.core.tests.runtime.jobs.IJobManagerTest)  Time elapsed: 0.252 s
testDelayedJob(org.eclipse.core.tests.runtime.jobs.IJobManagerTest)  Time elapsed: 6.466 s
testSuspend(org.eclipse.core.tests.runtime.jobs.IJobManagerTest)  Time elapsed: 0 s
testJobManagerPublishesJobGroupResults(org.eclipse.core.tests.runtime.jobs.JobGroupTest)  Time elapsed: 0.102 s
testJoinWithRepeatingJobs(org.eclipse.core.tests.runtime.jobs.JobGroupTest)  Time elapsed: 1.057 s
testJoinWithCancelingMonitor(org.eclipse.core.tests.runtime.jobs.JobGroupTest)  Time elapsed: 0.504 s
testSeedJobsWithRepeatingJobs(org.eclipse.core.tests.runtime.jobs.JobGroupTest)  Time elapsed: 0.201 s
testJobGroupAlongWithNormalJobs(org.eclipse.core.tests.runtime.jobs.JobGroupTest)  Time elapsed: 0.312 s
testSeedJobsWhenSeedJobsAddNewJobs(org.eclipse.core.tests.runtime.jobs.JobGroupTest)  Time elapsed: 1.15 s
testJoiningAJobInTheSameJobGroupFails(org.eclipse.core.tests.runtime.jobs.JobGroupTest)  Time elapsed: 0.211 s
testSeedJobsWhenAllJobsAreKnown(org.eclipse.core.tests.runtime.jobs.JobGroupTest)  Time elapsed: 1.104 s
testDefaultComputeGroupResult(org.eclipse.core.tests.runtime.jobs.JobGroupTest)  Time elapsed: 0.602 s
testGetActiveJobs(org.eclipse.core.tests.runtime.jobs.JobGroupTest)  Time elapsed: 0.602 s
testThrottlingWhenAllJobsAreKnown(org.eclipse.core.tests.runtime.jobs.JobGroupTest)  Time elapsed: 1.104 s
testJoinWithJobManagerSuspended_1(org.eclipse.core.tests.runtime.jobs.JobGroupTest)  Time elapsed: 2.104 s
testJoinWithJobManagerSuspended_2(org.eclipse.core.tests.runtime.jobs.JobGroupTest)  Time elapsed: 0.503 s
testJoinWithJobManagerSuspended_3(org.eclipse.core.tests.runtime.jobs.JobGroupTest)  Time elapsed: 0.502 s
testCustomComputeGroupResult(org.eclipse.core.tests.runtime.jobs.JobGroupTest)  Time elapsed: 0.601 s
testJoinWithProgressMonitor(org.eclipse.core.tests.runtime.jobs.JobGroupTest)  Time elapsed: 1.121 s
testCancel(org.eclipse.core.tests.runtime.jobs.JobGroupTest)  Time elapsed: 0.202 s
testShouldCancel_1(org.eclipse.core.tests.runtime.jobs.JobGroupTest)  Time elapsed: 1.203 s
testShouldCancel_2(org.eclipse.core.tests.runtime.jobs.JobGroupTest)  Time elapsed: 1.103 s
testShouldCancel_3(org.eclipse.core.tests.runtime.jobs.JobGroupTest)  Time elapsed: 1.203 s
testShouldCancel_4(org.eclipse.core.tests.runtime.jobs.JobGroupTest)  Time elapsed: 1.319 s
testSlowComputeGroupResult(org.eclipse.core.tests.runtime.jobs.JobGroupTest)  Time elapsed: 0.501 s
testJoinWithCancelingJobs(org.eclipse.core.tests.runtime.jobs.JobGroupTest)  Time elapsed: 0.403 s
testJoinWithoutTimeout(org.eclipse.core.tests.runtime.jobs.JobGroupTest)  Time elapsed: 1.304 s
testJoinWithTimeout(org.eclipse.core.tests.runtime.jobs.JobGroupTest)  Time elapsed: 1.204 s
testBasic(org.eclipse.core.tests.runtime.jobs.JobQueueTest)  Time elapsed: 0.001 s
testEqualValues(org.eclipse.core.tests.runtime.jobs.JobQueueTest)  Time elapsed: 0 s
testComplex(org.eclipse.core.tests.runtime.jobs.OrderedLockTest)  Time elapsed: 15.42 s
testLockRequestDisappearence(org.eclipse.core.tests.runtime.jobs.OrderedLockTest)  Time elapsed: 0.504 s
testSimple(org.eclipse.core.tests.runtime.jobs.OrderedLockTest)  Time elapsed: 5.602 s
testLockTimeout(org.eclipse.core.tests.runtime.jobs.OrderedLockTest)  Time elapsed: 0.404 s
testLockAcquireInterrupt(org.eclipse.core.tests.runtime.jobs.OrderedLockTest)  Time elapsed: 0.701 s
testIgnoreScheduleThreadJob(org.eclipse.core.tests.runtime.jobs.BeginEndRuleTest)  Time elapsed: 0.251 s
testComplexRuleStarting(org.eclipse.core.tests.runtime.jobs.BeginEndRuleTest)  Time elapsed: 6.211 s
testNestedCase(org.eclipse.core.tests.runtime.jobs.BeginEndRuleTest)  Time elapsed: 0.001 s
testComplexRuleContainment(org.eclipse.core.tests.runtime.jobs.BeginEndRuleTest)  Time elapsed: 0.001 s
testBug44299(org.eclipse.core.tests.runtime.jobs.BeginEndRuleTest)  Time elapsed: 0.301 s
testRunNestedAcquireThreadIsNotRescheduled(org.eclipse.core.tests.runtime.jobs.BeginEndRuleTest)  Time elapsed: 0.251 s
testSimpleRuleStarting(org.eclipse.core.tests.runtime.jobs.BeginEndRuleTest)  Time elapsed: 3.709 s
testFailedNestRuleInJob(org.eclipse.core.tests.runtime.jobs.BeginEndRuleTest)  Time elapsed: 0.101 s
testSimpleOtherThreadAccess(org.eclipse.core.tests.runtime.jobs.BeginEndRuleTest)  Time elapsed: 1.006 s
testRunThreadJobIsNotRescheduled(org.eclipse.core.tests.runtime.jobs.BeginEndRuleTest)  Time elapsed: 0.251 s
testRuleContainment(org.eclipse.core.tests.runtime.jobs.BeginEndRuleTest)  Time elapsed: 0.001 s
testFailureCase(org.eclipse.core.tests.runtime.jobs.BeginEndRuleTest)  Time elapsed: 0 s
testCancelShouldRun(org.eclipse.core.tests.runtime.jobs.JobTest)  Time elapsed: 1.001 s
testAsynchJobComplex(org.eclipse.core.tests.runtime.jobs.JobTest)  Time elapsed: 1.403 s
testJoinWithCancelingMonitor(org.eclipse.core.tests.runtime.jobs.JobTest)  Time elapsed: 0.212 s
testRescheduleCancel(org.eclipse.core.tests.runtime.jobs.JobTest)  Time elapsed: 0.301 s
testRescheduleRepeat(org.eclipse.core.tests.runtime.jobs.JobTest)  Time elapsed: 0.101 s
testRescheduleSimple(org.eclipse.core.tests.runtime.jobs.JobTest)  Time elapsed: 0.501 s
testShouldRun(org.eclipse.core.tests.runtime.jobs.JobTest)  Time elapsed: 0.001 s
testShouldRunFailure(org.eclipse.core.tests.runtime.jobs.JobTest)  Time elapsed: 0.101 s
testJoin(org.eclipse.core.tests.runtime.jobs.JobTest)  Time elapsed: 0.402 s
testAsynchJob(org.eclipse.core.tests.runtime.jobs.JobTest)  Time elapsed: 1.804 s
testJoinRemoveListener(org.eclipse.core.tests.runtime.jobs.JobTest)  Time elapsed: 1.103 s
testJoinSelf(org.eclipse.core.tests.runtime.jobs.JobTest)  Time elapsed: 0.001 s
testAsynchJobConflict(org.eclipse.core.tests.runtime.jobs.JobTest)  Time elapsed: 3.807 s
testJoinLockListener(org.eclipse.core.tests.runtime.jobs.JobTest)  Time elapsed: 0 s
testGetName(org.eclipse.core.tests.runtime.jobs.JobTest)  Time elapsed: 0 s
testGetRule(org.eclipse.core.tests.runtime.jobs.JobTest)  Time elapsed: 0 s
testRescheduleComplex(org.eclipse.core.tests.runtime.jobs.JobTest)  Time elapsed: 0.301 s
testCancelingByMonitor(org.eclipse.core.tests.runtime.jobs.JobTest)  Time elapsed: 0.501 s
testRescheduleWaiting(org.eclipse.core.tests.runtime.jobs.JobTest)  Time elapsed: 0.301 s
testCancelAboutToSchedule(org.eclipse.core.tests.runtime.jobs.JobTest)  Time elapsed: 1.101 s
testSetPriority(org.eclipse.core.tests.runtime.jobs.JobTest)  Time elapsed: 0 s
testGetPriority(org.eclipse.core.tests.runtime.jobs.JobTest)  Time elapsed: 0 s
testJoinInterruptNonUIThread(org.eclipse.core.tests.runtime.jobs.JobTest)  Time elapsed: 0.203 s
testGetProperty(org.eclipse.core.tests.runtime.jobs.JobTest)  Time elapsed: 0.002 s
testIsSystem(org.eclipse.core.tests.runtime.jobs.JobTest)  Time elapsed: 0.001 s
testJoinInterruptUIThread(org.eclipse.core.tests.runtime.jobs.JobTest)  Time elapsed: 100.171 s
testRescheduleRepeatWithDelay(org.eclipse.core.tests.runtime.jobs.JobTest)  Time elapsed: 0.401 s
testCancelFromAboutToRun(org.eclipse.core.tests.runtime.jobs.JobTest)  Time elapsed: 0.002 s
testJoinFailingListener(org.eclipse.core.tests.runtime.jobs.JobTest)  Time elapsed: 1.103 s
testSetProgressGroup(org.eclipse.core.tests.runtime.jobs.JobTest)  Time elapsed: 12.218 s
testJoinWithProgressMonitor(org.eclipse.core.tests.runtime.jobs.JobTest)  Time elapsed: 1.203 s
testCanceling(org.eclipse.core.tests.runtime.jobs.JobTest)  Time elapsed: 0.201 s
testSetThread(org.eclipse.core.tests.runtime.jobs.JobTest)  Time elapsed: 0.803 s
testIsBlocking2(org.eclipse.core.tests.runtime.jobs.JobTest)  Time elapsed: 0.052 s
testGetResult(org.eclipse.core.tests.runtime.jobs.JobTest)  Time elapsed: 1.302 s
testIsUser(org.eclipse.core.tests.runtime.jobs.JobTest)  Time elapsed: 0 s
testGetThread(org.eclipse.core.tests.runtime.jobs.JobTest)  Time elapsed: 0.001 s
testSetRule(org.eclipse.core.tests.runtime.jobs.JobTest)  Time elapsed: 1.016 s
testRescheduleDelay(org.eclipse.core.tests.runtime.jobs.JobTest)  Time elapsed: 0.401 s
testIsBlocking(org.eclipse.core.tests.runtime.jobs.JobTest)  Time elapsed: 1.402 s
testJoinWithTimeout(org.eclipse.core.tests.runtime.jobs.JobTest)  Time elapsed: 1.013 s
testMultipleColumnRemoval(org.eclipse.core.tests.runtime.jobs.DeadlockDetectionTest)  Time elapsed: 0.504 s
testThreeLocks(org.eclipse.core.tests.runtime.jobs.DeadlockDetectionTest)  Time elapsed: 3.33 s
testVeryComplex(org.eclipse.core.tests.runtime.jobs.DeadlockDetectionTest)  Time elapsed: 43.521 s
testRuleHierarchyWaitReplace(org.eclipse.core.tests.runtime.jobs.DeadlockDetectionTest)  Time elapsed: 0.502 s
testRuleLockInteraction(org.eclipse.core.tests.runtime.jobs.DeadlockDetectionTest)  Time elapsed: 0.303 s
testDetectDeadlock(org.eclipse.core.tests.runtime.jobs.DeadlockDetectionTest)  Time elapsed: 0.602 s
testSimpleDeadlock(org.eclipse.core.tests.runtime.jobs.DeadlockDetectionTest)  Time elapsed: 1.983 s
testComplex(org.eclipse.core.tests.runtime.jobs.DeadlockDetectionTest)  Time elapsed: 6.493 s
testImplicitRules(org.eclipse.core.tests.runtime.jobs.DeadlockDetectionTest)  Time elapsed: 0.603 s
testBeginRuleCancelAfterWait(org.eclipse.core.tests.runtime.jobs.DeadlockDetectionTest)  Time elapsed: 0.501 s
testJobRuleLockInteraction(org.eclipse.core.tests.runtime.jobs.DeadlockDetectionTest)  Time elapsed: 0.201 s
testBug(org.eclipse.core.tests.runtime.jobs.Bug_129551)  Time elapsed: 1.211 s
testBug(org.eclipse.core.tests.runtime.jobs.Bug_211799)  Time elapsed: 0.159 s
testInterruptDuringLockAcquireint(org.eclipse.core.tests.runtime.jobs.Bug_307282)  Time elapsed: 1.402 s
testYieldWithlockAcquire(org.eclipse.core.tests.runtime.jobs.Bug_307391)  Time elapsed: 2.202 s
testIsConflicting(org.eclipse.core.tests.runtime.jobs.MultiRuleTest)  Time elapsed: 0 s
testContains(org.eclipse.core.tests.runtime.jobs.MultiRuleTest)  Time elapsed: 0.001 s
testCombine(org.eclipse.core.tests.runtime.jobs.MultiRuleTest)  Time elapsed: 0 s
testBlockingAndUnblockingMonitorUsingYieldAndTransfer(org.eclipse.core.tests.runtime.jobs.Bug_311756)  Time elapsed: 1.101 s
testBlockingAndUnblockingMonitorUsingTransfer(org.eclipse.core.tests.runtime.jobs.Bug_311756)  Time elapsed: 0.304 s
testBlockingAndUnblockingMonitorUsingYield(org.eclipse.core.tests.runtime.jobs.Bug_311756)  Time elapsed: 1.102 s
testBlockingAndUnblockingMonitor(org.eclipse.core.tests.runtime.jobs.Bug_311756)  Time elapsed: 1 s
testInterruptDuringLockRelease(org.eclipse.core.tests.runtime.jobs.Bug_311863)  Time elapsed: 1.103 s
testBug(org.eclipse.core.tests.runtime.jobs.Bug_316839)  Time elapsed: 0.103 s
testBug(org.eclipse.core.tests.runtime.jobs.Bug_320329)  Time elapsed: 6.018 s
testWaitingThreadJob(org.eclipse.core.tests.runtime.jobs.Bug_478634)  Time elapsed: 0.112 s
testReportDoneOncePerSchedule(org.eclipse.core.tests.runtime.jobs.Bug_550738)  Time elapsed: 0.22 s
testCancelSchedule(org.eclipse.core.tests.runtime.jobs.Bug_550738)  Time elapsed: 0.819 s
testRunScenario(org.eclipse.core.tests.runtime.jobs.Bug_412138)  Time elapsed: 3.425 s
testVerifyResult(org.eclipse.core.tests.runtime.jobs.Bug_412138)  Time elapsed: 0 s
testIdleWorkerCap(org.eclipse.core.tests.runtime.jobs.WorkerPoolTest)  Time elapsed: 5.162 s
test_342709(org.eclipse.core.tests.internal.preferences.EclipsePreferencesTest)  Time elapsed: 0.008 s
testGetSegment(org.eclipse.core.tests.internal.preferences.EclipsePreferencesTest)  Time elapsed: 0 s
testInt(org.eclipse.core.tests.internal.preferences.EclipsePreferencesTest)  Time elapsed: 0.005 s
testBytes(org.eclipse.core.tests.internal.preferences.EclipsePreferencesTest)  Time elapsed: 0.001 s
testEncodePath(org.eclipse.core.tests.internal.preferences.EclipsePreferencesTest)  Time elapsed: 0.001 s
testClear(org.eclipse.core.tests.internal.preferences.EclipsePreferencesTest)  Time elapsed: 0 s
testFloat(org.eclipse.core.tests.internal.preferences.EclipsePreferencesTest)  Time elapsed: 0.001 s
testNode3(org.eclipse.core.tests.internal.preferences.EclipsePreferencesTest)  Time elapsed: 0.005 s
testChildrenNames(org.eclipse.core.tests.internal.preferences.EclipsePreferencesTest)  Time elapsed: 0 s
testKeys(org.eclipse.core.tests.internal.preferences.EclipsePreferencesTest)  Time elapsed: 0 s
testLong(org.eclipse.core.tests.internal.preferences.EclipsePreferencesTest)  Time elapsed: 0 s
testName(org.eclipse.core.tests.internal.preferences.EclipsePreferencesTest)  Time elapsed: 0.001 s
testNode(org.eclipse.core.tests.internal.preferences.EclipsePreferencesTest)  Time elapsed: 0 s
testGetByteArray(org.eclipse.core.tests.internal.preferences.EclipsePreferencesTest)  Time elapsed: 0.007 s
testFlushDeadlock(org.eclipse.core.tests.internal.preferences.EclipsePreferencesTest)  Time elapsed: 0.003 s
testBoolean(org.eclipse.core.tests.internal.preferences.EclipsePreferencesTest)  Time elapsed: 0 s
testAbsolutePath(org.eclipse.core.tests.internal.preferences.EclipsePreferencesTest)  Time elapsed: 0 s
testNodeExists(org.eclipse.core.tests.internal.preferences.EclipsePreferencesTest)  Time elapsed: 0 s
testPreferenceChangeListeners(org.eclipse.core.tests.internal.preferences.EclipsePreferencesTest)  Time elapsed: 0.002 s
testRemoveNode(org.eclipse.core.tests.internal.preferences.EclipsePreferencesTest)  Time elapsed: 0 s
testNodeChangeListeners(org.eclipse.core.tests.internal.preferences.EclipsePreferencesTest)  Time elapsed: 0.002 s
testFileFormat(org.eclipse.core.tests.internal.preferences.EclipsePreferencesTest)  Time elapsed: 0.001 s
testAccept(org.eclipse.core.tests.internal.preferences.EclipsePreferencesTest)  Time elapsed: 0.001 s
testDouble(org.eclipse.core.tests.internal.preferences.EclipsePreferencesTest)  Time elapsed: 0.001 s
testLegacy(org.eclipse.core.tests.internal.preferences.EclipsePreferencesTest)  Time elapsed: 0.003 s
testParent(org.eclipse.core.tests.internal.preferences.EclipsePreferencesTest)  Time elapsed: 0 s
testRemove(org.eclipse.core.tests.internal.preferences.EclipsePreferencesTest)  Time elapsed: 0 s
testString(org.eclipse.core.tests.internal.preferences.EclipsePreferencesTest)  Time elapsed: 0 s
testGetSegmentCount(org.eclipse.core.tests.internal.preferences.EclipsePreferencesTest)  Time elapsed: 0 s
test_55410(org.eclipse.core.tests.internal.preferences.EclipsePreferencesTest)  Time elapsed: 0.001 s
test_60590(org.eclipse.core.tests.internal.preferences.EclipsePreferencesTest)  Time elapsed: 0 s
test_68897(org.eclipse.core.tests.internal.preferences.EclipsePreferencesTest)  Time elapsed: 0.192 s
testGet(org.eclipse.core.tests.internal.preferences.PreferencesServiceTest)  Time elapsed: 0.002 s
testExportDefaults(org.eclipse.core.tests.internal.preferences.PreferencesServiceTest)  Time elapsed: 0.001 s
testImportLegacy(org.eclipse.core.tests.internal.preferences.PreferencesServiceTest)  Time elapsed: 0.003 s
testImportExceptions(org.eclipse.core.tests.internal.preferences.PreferencesServiceTest)  Time elapsed: 0 s
testExportExcludes1(org.eclipse.core.tests.internal.preferences.PreferencesServiceTest)  Time elapsed: 0.001 s
testExportExcludes2(org.eclipse.core.tests.internal.preferences.PreferencesServiceTest)  Time elapsed: 0 s
testExportExcludes3(org.eclipse.core.tests.internal.preferences.PreferencesServiceTest)  Time elapsed: 0.001 s
testExportExcludes4(org.eclipse.core.tests.internal.preferences.PreferencesServiceTest)  Time elapsed: 0 s
testExportExcludes5(org.eclipse.core.tests.internal.preferences.PreferencesServiceTest)  Time elapsed: 0.001 s
testValidateVersions(org.eclipse.core.tests.internal.preferences.PreferencesServiceTest)  Time elapsed: 0.007 s
testMatches(org.eclipse.core.tests.internal.preferences.PreferencesServiceTest)  Time elapsed: 0.003 s
testSearchingStringBasics(org.eclipse.core.tests.internal.preferences.PreferencesServiceTest)  Time elapsed: 0.008 s
testExportWithTransfers1(org.eclipse.core.tests.internal.preferences.PreferencesServiceTest)  Time elapsed: 0.002 s
testExportWithTransfers2(org.eclipse.core.tests.internal.preferences.PreferencesServiceTest)  Time elapsed: 0.003 s
testExportWithTransfers3(org.eclipse.core.tests.internal.preferences.PreferencesServiceTest)  Time elapsed: 0.002 s
testExportWithTransfers4(org.eclipse.core.tests.internal.preferences.PreferencesServiceTest)  Time elapsed: 0.002 s
testLookupOrder(org.eclipse.core.tests.internal.preferences.PreferencesServiceTest)  Time elapsed: 0 s
testMatches2(org.eclipse.core.tests.internal.preferences.PreferencesServiceTest)  Time elapsed: 0.001 s
testApplyAndExportedPreferencesNotModified(org.eclipse.core.tests.internal.preferences.PreferencesServiceTest)  Time elapsed: 0.002 s
testDefaultFromInitializer(org.eclipse.core.tests.internal.preferences.PreferencesServiceTest)  Time elapsed: 0.001 s
testApplyWithTransfers(org.eclipse.core.tests.internal.preferences.PreferencesServiceTest)  Time elapsed: 0 s
testImportExportBasic(org.eclipse.core.tests.internal.preferences.PreferencesServiceTest)  Time elapsed: 0.008 s
testGetWithNodes(org.eclipse.core.tests.internal.preferences.PreferencesServiceTest)  Time elapsed: 0.001 s
testBadContext(org.eclipse.core.tests.internal.preferences.IScopeContextTest)  Time elapsed: 0.001 s
testGetNode(org.eclipse.core.tests.internal.preferences.IScopeContextTest)  Time elapsed: 0 s
testBug(org.eclipse.core.tests.internal.preferences.TestBug388004)  Time elapsed: 0 s
testBug(org.eclipse.core.tests.internal.preferences.TestBug380859)  Time elapsed: 0 s
testExportEmptyPreference(org.eclipse.core.tests.runtime.PreferenceExportTest)  Time elapsed: 0.014 s
testKeyIdentityAfterExport(org.eclipse.core.tests.runtime.PreferenceExportTest)  Time elapsed: 0.026 s
testNeedsSaving(org.eclipse.core.tests.runtime.PreferenceForwarderTest)  Time elapsed: 0.007 s
test55138(org.eclipse.core.tests.runtime.PreferenceForwarderTest)  Time elapsed: 0.001 s
testFloat(org.eclipse.core.tests.runtime.PreferenceForwarderTest)  Time elapsed: 0.002 s
testLong(org.eclipse.core.tests.runtime.PreferenceForwarderTest)  Time elapsed: 0.001 s
testListeners(org.eclipse.core.tests.runtime.PreferenceForwarderTest)  Time elapsed: 0.001 s
testBoolean(org.eclipse.core.tests.runtime.PreferenceForwarderTest)  Time elapsed: 0.001 s
testContains(org.eclipse.core.tests.runtime.PreferenceForwarderTest)  Time elapsed: 0 s
testConstants(org.eclipse.core.tests.runtime.PreferenceForwarderTest)  Time elapsed: 0.001 s
testListenerOnRemove(org.eclipse.core.tests.runtime.PreferenceForwarderTest)  Time elapsed: 0.003 s
testPropertyNames(org.eclipse.core.tests.runtime.PreferenceForwarderTest)  Time elapsed: 0 s
testBasics(org.eclipse.core.tests.runtime.PreferenceForwarderTest)  Time elapsed: 0 s
testDouble(org.eclipse.core.tests.runtime.PreferenceForwarderTest)  Time elapsed: 0.002 s
testInteger(org.eclipse.core.tests.runtime.PreferenceForwarderTest)  Time elapsed: 0 s
testString(org.eclipse.core.tests.runtime.PreferenceForwarderTest)  Time elapsed: 0.001 s
testDefaultPropertyNames(org.eclipse.core.tests.runtime.PreferenceForwarderTest)  Time elapsed: 0 s
testLoadStore(org.eclipse.core.tests.runtime.PreferenceForwarderTest)  Time elapsed: 0.003 s
testNeedsSaving(org.eclipse.core.tests.runtime.PreferencesTest)  Time elapsed: 0.001 s
testFloat(org.eclipse.core.tests.runtime.PreferencesTest)  Time elapsed: 0.001 s
testLong(org.eclipse.core.tests.runtime.PreferencesTest)  Time elapsed: 0 s
testListeners(org.eclipse.core.tests.runtime.PreferencesTest)  Time elapsed: 0.002 s
testBoolean(org.eclipse.core.tests.runtime.PreferencesTest)  Time elapsed: 0 s
testContains(org.eclipse.core.tests.runtime.PreferencesTest)  Time elapsed: 0 s
testListeners2(org.eclipse.core.tests.runtime.PreferencesTest)  Time elapsed: 0.001 s
testConstants(org.eclipse.core.tests.runtime.PreferencesTest)  Time elapsed: 0 s
testPropertyNames(org.eclipse.core.tests.runtime.PreferencesTest)  Time elapsed: 0 s
testBasics(org.eclipse.core.tests.runtime.PreferencesTest)  Time elapsed: 0.001 s
testDouble(org.eclipse.core.tests.runtime.PreferencesTest)  Time elapsed: 0.001 s
testInteger(org.eclipse.core.tests.runtime.PreferencesTest)  Time elapsed: 0 s
testString(org.eclipse.core.tests.runtime.PreferencesTest)  Time elapsed: 0 s
testDefaultPropertyNames(org.eclipse.core.tests.runtime.PreferencesTest)  Time elapsed: 0.001 s
testLoadStore(org.eclipse.core.tests.runtime.PreferencesTest)  Time elapsed: 0.001 s

Results:

Tests run: 296, Failures: 0, Errors: 0, Skipped: 0

[INFO] All tests passed!
[INFO] 
[INFO] --- tycho-p2-extras-plugin:1.6.0-SNAPSHOT:compare-version-with-baselines (compare-attached-artifacts-with-release) @ org.eclipse.core.tests.runtime ---
[INFO] Fetching org.eclipse.core.tests.runtime_3.11.900.v20191122-2104.jar.pack.gz from https://download.eclipse.org/eclipse/updates/4.14/R-4.14-201912100610/plugins/ (134.24kB)
[INFO] 
[INFO] --- maven-antrun-plugin:1.8:run (check-skip-api-analysis) @ org.eclipse.core.tests.runtime ---
[INFO] Executing tasks

main:
[INFO] Executed tasks
[INFO] 
[INFO] --- tycho-dependency-tools-plugin:1.6.0-SNAPSHOT:list-dependencies (list-dependencies) @ org.eclipse.core.tests.runtime ---
[INFO] 
[INFO] --- tycho-eclipserun-plugin:1.6.0-SNAPSHOT:eclipse-run (api-analysis) @ org.eclipse.core.tests.runtime ---
[INFO] Toolchain in tycho-eclipserun-plugin: JDK[/opt/tools/java/oracle/jdk-8/latest/jre]
[INFO] Expected eclipse log file: /home/jenkins/agent/workspace/eclipse.platform.runtime-Gerrit/tests/org.eclipse.core.tests.runtime/target/eclipserun-work/data/.metadata/.log
[INFO] Command line:
	[/opt/tools/java/oracle/jdk-8/latest/jre/bin/java, -Xmx2048M, -jar, /home/jenkins/agent/workspace/eclipse.platform.runtime-Gerrit/.repository/p2/osgi/bundle/org.eclipse.equinox.launcher/1.5.700.v20200107-1357/org.eclipse.equinox.launcher-1.5.700.v20200107-1357.jar, -install, /home/jenkins/agent/workspace/eclipse.platform.runtime-Gerrit/tests/org.eclipse.core.tests.runtime/target/eclipserun-work, -configuration, /home/jenkins/agent/workspace/eclipse.platform.runtime-Gerrit/tests/org.eclipse.core.tests.runtime/target/eclipserun-work/configuration, -data, /home/jenkins/agent/workspace/eclipse.platform.runtime-Gerrit/tests/org.eclipse.core.tests.runtime/../target/org.eclipse.core.tests.runtime-apiAnalyzer-workspace, -application, org.eclipse.pde.api.tools.apiAnalyzer, -project, /home/jenkins/agent/workspace/eclipse.platform.runtime-Gerrit/tests/org.eclipse.core.tests.runtime, -baseline, /home/jenkins/agent/workspace/eclipse.platform.runtime-Gerrit/tests/org.eclipse.core.tests.runtime/target/org.eclipse.core.tests.runtime-apiBaseline.target, -dependencyList, /home/jenkins/agent/workspace/eclipse.platform.runtime-Gerrit/tests/org.eclipse.core.tests.runtime/target/dependencies-list.txt, -failOnError]
Picked up JAVA_TOOL_OPTIONS: -XX:+IgnoreUnrecognizedVMOptions -XX:+UseContainerSupport -XX:+UnlockExperimentalVMOptions -XX:+UseCGroupMemoryLimitForHeap
Picked up _JAVA_OPTIONS: -XX:MaxRAMPercentage=64.0
0 API ERRORS
0 API warnings
[INFO] 
[INFO] --------------< org.eclipse.e4:org.eclipse.e4.core.tests >--------------
[INFO] Building org.eclipse.e4.core.tests 1.1.1000-SNAPSHOT             [17/18]
[INFO] ------------------------[ eclipse-test-plugin ]-------------------------
[INFO] 
[INFO] --- maven-clean-plugin:3.1.0:clean (default-clean) @ org.eclipse.e4.core.tests ---
[INFO] 
[INFO] --- tycho-packaging-plugin:1.6.0-SNAPSHOT:build-qualifier (default-build-qualifier) @ org.eclipse.e4.core.tests ---
[INFO] The project's OSGi version is 1.1.1000.v20200113-1200
[INFO] 
[INFO] --- tycho-packaging-plugin:1.6.0-SNAPSHOT:validate-id (default-validate-id) @ org.eclipse.e4.core.tests ---
[INFO] 
[INFO] --- tycho-packaging-plugin:1.6.0-SNAPSHOT:validate-version (default-validate-version) @ org.eclipse.e4.core.tests ---
[INFO] 
[INFO] --- maven-resources-plugin:3.1.0:copy-resources (saveproperties) @ org.eclipse.e4.core.tests ---
[INFO] Using 'UTF-8' encoding to copy filtered resources.
[INFO] skip non existing resourceDirectory /home/jenkins/agent/workspace/eclipse.platform.runtime-Gerrit/tests/org.eclipse.e4.core.tests/saveproperties
[INFO] 
[INFO] --- maven-enforcer-plugin:3.0.0-M3:enforce (enforce-maven) @ org.eclipse.e4.core.tests ---
[INFO] 
[INFO] --- eclipse-cbi-plugin:1.1.8-SNAPSHOT:generate-api-build-xml (default) @ org.eclipse.e4.core.tests ---
[INFO] 
[INFO] --- maven-resources-plugin:3.1.0:resources (default-resources) @ org.eclipse.e4.core.tests ---
[INFO] Using 'UTF-8' encoding to copy filtered resources.
[INFO] skip non existing resourceDirectory /home/jenkins/agent/workspace/eclipse.platform.runtime-Gerrit/tests/org.eclipse.e4.core.tests/src/main/resources
[INFO] 
[INFO] --- maven-resources-plugin:3.1.0:resources (filter-resources) @ org.eclipse.e4.core.tests ---
[INFO] Using 'UTF-8' encoding to copy filtered resources.
[INFO] skip non existing resourceDirectory /home/jenkins/agent/workspace/eclipse.platform.runtime-Gerrit/tests/org.eclipse.e4.core.tests/src/main/resources
[INFO] 
[INFO] --- tycho-compiler-plugin:1.6.0-SNAPSHOT:compile (default-compile) @ org.eclipse.e4.core.tests ---
[INFO] Compiling 88 source files to /home/jenkins/agent/workspace/eclipse.platform.runtime-Gerrit/tests/org.eclipse.e4.core.tests/target/classes
[INFO] 
[INFO] --- tycho-eclipserun-plugin:1.6.0-SNAPSHOT:eclipse-run (default) @ org.eclipse.e4.core.tests ---
[INFO] 
[INFO] --- maven-resources-plugin:3.1.0:testResources (default-testResources) @ org.eclipse.e4.core.tests ---
[INFO] Using 'UTF-8' encoding to copy filtered resources.
[INFO] skip non existing resourceDirectory /home/jenkins/agent/workspace/eclipse.platform.runtime-Gerrit/tests/org.eclipse.e4.core.tests/src/test/resources
[INFO] 
[INFO] --- tycho-source-plugin:1.6.0-SNAPSHOT:plugin-source (plugin-source) @ org.eclipse.e4.core.tests ---
[INFO] Building jar: /home/jenkins/agent/workspace/eclipse.platform.runtime-Gerrit/tests/org.eclipse.e4.core.tests/target/org.eclipse.e4.core.tests-1.1.1000-SNAPSHOT-sources.jar
[INFO] 
[INFO] --- target-platform-configuration:1.6.0-SNAPSHOT:target-platform (default-target-platform) @ org.eclipse.e4.core.tests ---
[INFO] 
[INFO] --- tycho-packaging-plugin:1.6.0-SNAPSHOT:package-plugin (default-package-plugin) @ org.eclipse.e4.core.tests ---
[INFO] Building jar: /home/jenkins/agent/workspace/eclipse.platform.runtime-Gerrit/tests/org.eclipse.e4.core.tests/target/org.eclipse.e4.core.tests-1.1.1000-SNAPSHOT.jar
[INFO] 
[INFO] --- tycho-p2-plugin:1.6.0-SNAPSHOT:p2-metadata-default (default-p2-metadata-default) @ org.eclipse.e4.core.tests ---
[WARNING] MavenProject: org.eclipse.e4:org.eclipse.e4.core.tests:1.1.1000-SNAPSHOT @ /home/jenkins/agent/workspace/eclipse.platform.runtime-Gerrit/tests/org.eclipse.e4.core.tests/pom.xml: baseline and build artifacts have same version but different contents
   classifier-sources: not present in baseline

[INFO] MavenProject: org.eclipse.e4:org.eclipse.e4.core.tests:1.1.1000-SNAPSHOT @ /home/jenkins/agent/workspace/eclipse.platform.runtime-Gerrit/tests/org.eclipse.e4.core.tests/pom.xml
    The main artifact has been replaced with the baseline version.
    The following attached artifacts are not present in the baseline and have been removed: [sources]

[INFO] 
[INFO] --- tycho-surefire-plugin:1.6.0-SNAPSHOT:test (default-test) @ org.eclipse.e4.core.tests ---
[INFO] Expected eclipse log file: /home/jenkins/agent/workspace/eclipse.platform.runtime-Gerrit/tests/org.eclipse.e4.core.tests/target/work/data/.metadata/.log
[INFO] Command line:
	[/opt/tools/java/openjdk/jdk-11/11.0.4/bin/java, -Dosgi.noShutdown=false, -Dosgi.os=linux, -Dosgi.ws=gtk, -Dosgi.arch=x86_64, --add-modules=ALL-SYSTEM, -Dosgi.clean=true, -ea, -jar, /home/jenkins/agent/workspace/eclipse.platform.runtime-Gerrit/.repository/p2/osgi/bundle/org.eclipse.equinox.launcher/1.5.700.v20200107-1357/org.eclipse.equinox.launcher-1.5.700.v20200107-1357.jar, -data, /home/jenkins/agent/workspace/eclipse.platform.runtime-Gerrit/tests/org.eclipse.e4.core.tests/target/work/data, -install, /home/jenkins/agent/workspace/eclipse.platform.runtime-Gerrit/tests/org.eclipse.e4.core.tests/target/work, -configuration, /home/jenkins/agent/workspace/eclipse.platform.runtime-Gerrit/tests/org.eclipse.e4.core.tests/target/work/configuration, -application, org.eclipse.tycho.surefire.osgibooter.headlesstest, -testproperties, /home/jenkins/agent/workspace/eclipse.platform.runtime-Gerrit/tests/org.eclipse.e4.core.tests/target/surefire.properties]
Picked up JAVA_TOOL_OPTIONS: -XX:+IgnoreUnrecognizedVMOptions -XX:+UseContainerSupport -XX:+UnlockExperimentalVMOptions -XX:+UseCGroupMemoryLimitForHeap
Picked up _JAVA_OPTIONS: -XX:MaxRAMPercentage=64.0
Running org.eclipse.e4.core.tests.CoreTestSuite
Tests run: 195, Failures: 0, Errors: 124, Skipped: 0, Time elapsed: 0.925 s <<< FAILURE! - in org.eclipse.e4.core.tests.CoreTestSuite
testBug398728(org.eclipse.e4.core.internal.tests.di.extensions.ExtendedSupplierInjectionTests)  Time elapsed: 0.121 s  <<< ERROR!
java.lang.NullPointerException
	at org.eclipse.e4.core.internal.tests.di.extensions.ExtendedSupplierInjectionTests.setUp(ExtendedSupplierInjectionTests.java:89)

testBug430041(org.eclipse.e4.core.internal.tests.di.extensions.ExtendedSupplierInjectionTests)  Time elapsed: 0 s  <<< ERROR!
java.lang.NullPointerException
	at org.eclipse.e4.core.internal.tests.di.extensions.ExtendedSupplierInjectionTests.setUp(ExtendedSupplierInjectionTests.java:89)

testSupplierOrdering(org.eclipse.e4.core.internal.tests.di.extensions.ExtendedSupplierInjectionTests)  Time elapsed: 0 s  <<< ERROR!
java.lang.NullPointerException
	at org.eclipse.e4.core.internal.tests.di.extensions.ExtendedSupplierInjectionTests.setUp(ExtendedSupplierInjectionTests.java:89)

testPreferencesQualifier(org.eclipse.e4.core.internal.tests.di.extensions.InjectionPreferencesTest)  Time elapsed: 0.046 s  <<< ERROR!
java.lang.NullPointerException
	at org.eclipse.e4.core.internal.tests.di.extensions.InjectionPreferencesTest.testPreferencesQualifier(InjectionPreferencesTest.java:159)

testPreferencesConstructor(org.eclipse.e4.core.internal.tests.di.extensions.InjectionPreferencesTest)  Time elapsed: 0.015 s  <<< ERROR!
java.lang.NullPointerException
	at org.eclipse.e4.core.internal.tests.di.extensions.InjectionPreferencesTest.testPreferencesConstructor(InjectionPreferencesTest.java:285)

testBaseTypeConversion(org.eclipse.e4.core.internal.tests.di.extensions.InjectionPreferencesTest)  Time elapsed: 0.006 s  <<< ERROR!
java.lang.NullPointerException
	at org.eclipse.e4.core.internal.tests.di.extensions.InjectionPreferencesTest.testBaseTypeConversion(InjectionPreferencesTest.java:201)

testAutoConversion(org.eclipse.e4.core.internal.tests.di.extensions.InjectionPreferencesTest)  Time elapsed: 0 s  <<< ERROR!
java.lang.NullPointerException
	at org.eclipse.e4.core.internal.tests.di.extensions.InjectionPreferencesTest.testAutoConversion(InjectionPreferencesTest.java:242)

testPreferencesQualifier(org.eclipse.e4.core.internal.tests.di.extensions.InjectionMixedSuppliersTest)  Time elapsed: 0.001 s  <<< ERROR!
java.lang.NullPointerException
	at org.eclipse.e4.core.internal.tests.di.extensions.InjectionMixedSuppliersTest.testPreferencesQualifier(InjectionMixedSuppliersTest.java:52)

testEventInjection(org.eclipse.e4.core.internal.tests.di.extensions.InjectionEventTest)  Time elapsed: 0 s  <<< ERROR!
java.lang.NullPointerException
	at org.eclipse.e4.core.internal.tests.di.extensions.InjectionEventTest.setUp(InjectionEventTest.java:140)

testInjectWildCard(org.eclipse.e4.core.internal.tests.di.extensions.InjectionEventTest)  Time elapsed: 0 s  <<< ERROR!
java.lang.NullPointerException
	at org.eclipse.e4.core.internal.tests.di.extensions.InjectionEventTest.setUp(InjectionEventTest.java:140)

testInjectType(org.eclipse.e4.core.internal.tests.di.extensions.InjectionEventTest)  Time elapsed: 0 s  <<< ERROR!
java.lang.NullPointerException
	at org.eclipse.e4.core.internal.tests.di.extensions.InjectionEventTest.setUp(InjectionEventTest.java:140)

testEventInjectionUnsubscribe(org.eclipse.e4.core.internal.tests.di.extensions.InjectionEventTest)  Time elapsed: 0.001 s  <<< ERROR!
java.lang.NullPointerException
	at org.eclipse.e4.core.internal.tests.di.extensions.InjectionEventTest.setUp(InjectionEventTest.java:140)

testUnInject(org.eclipse.e4.core.internal.tests.di.extensions.InjectionOSGiTest)  Time elapsed: 0.001 s  <<< ERROR!
java.lang.NullPointerException
	at org.eclipse.e4.core.internal.tests.di.extensions.InjectionOSGiTest.setUp(InjectionOSGiTest.java:105)

testBundleInject(org.eclipse.e4.core.internal.tests.di.extensions.InjectionOSGiTest)  Time elapsed: 0 s  <<< ERROR!
java.lang.NullPointerException
	at org.eclipse.e4.core.internal.tests.di.extensions.InjectionOSGiTest.setUp(InjectionOSGiTest.java:105)

testInject(org.eclipse.e4.core.internal.tests.di.extensions.InjectionOSGiTest)  Time elapsed: 0 s  <<< ERROR!
java.lang.NullPointerException
	at org.eclipse.e4.core.internal.tests.di.extensions.InjectionOSGiTest.setUp(InjectionOSGiTest.java:105)

testInjectBCinExecute(org.eclipse.e4.core.internal.tests.di.extensions.InjectionOSGiHandlerTest)  Time elapsed: 0.008 s  <<< ERROR!
java.lang.NullPointerException
	at org.eclipse.e4.core.internal.tests.di.extensions.InjectionOSGiHandlerTest.testInjectBCinExecute(InjectionOSGiHandlerTest.java:54)

testDynamicAdd(org.eclipse.e4.core.internal.tests.di.extensions.ServiceSupplierTestCase)  Time elapsed: 0.002 s  <<< ERROR!
java.lang.NullPointerException
	at org.eclipse.e4.core.internal.tests.di.extensions.ServiceSupplierTestCase.testDynamicAdd(ServiceSupplierTestCase.java:120)

testDynamicAddRemove(org.eclipse.e4.core.internal.tests.di.extensions.ServiceSupplierTestCase)  Time elapsed: 0 s  <<< ERROR!
java.lang.NullPointerException
	at org.eclipse.e4.core.internal.tests.di.extensions.ServiceSupplierTestCase.testDynamicAddRemove(ServiceSupplierTestCase.java:161)

testCleanup(org.eclipse.e4.core.internal.tests.di.extensions.ServiceSupplierTestCase)  Time elapsed: 0.001 s  <<< ERROR!
java.lang.NullPointerException
	at org.eclipse.e4.core.internal.tests.di.extensions.ServiceSupplierTestCase.testCleanup(ServiceSupplierTestCase.java:198)

testOptionalReferences(org.eclipse.e4.core.internal.tests.di.extensions.ServiceSupplierTestCase)  Time elapsed: 0 s  <<< ERROR!
java.lang.NullPointerException
	at org.eclipse.e4.core.internal.tests.di.extensions.ServiceSupplierTestCase.testOptionalReferences(ServiceSupplierTestCase.java:216)

testInitialInject(org.eclipse.e4.core.internal.tests.di.extensions.ServiceSupplierTestCase)  Time elapsed: 0 s  <<< ERROR!
java.lang.NullPointerException
	at org.eclipse.e4.core.internal.tests.di.extensions.ServiceSupplierTestCase.testInitialInject(ServiceSupplierTestCase.java:86)

testStaticFilter(org.eclipse.e4.core.internal.tests.di.extensions.ServiceSupplierTestCase)  Time elapsed: 0 s  <<< ERROR!
java.lang.NullPointerException
	at org.eclipse.e4.core.internal.tests.di.extensions.ServiceSupplierTestCase.testStaticFilter(ServiceSupplierTestCase.java:102)

testCreateSectionFilter(org.eclipse.e4.core.internal.tests.about.AboutTest)  Time elapsed: 0.002 s
testAppendInstalledBundles(org.eclipse.e4.core.internal.tests.about.AboutTest)  Time elapsed: 0.179 s
testSystemEnvironmentVariables(org.eclipse.e4.core.internal.tests.about.AboutTest)  Time elapsed: 0.022 s
testSystemProperties(org.eclipse.e4.core.internal.tests.about.AboutTest)  Time elapsed: 0.05 s
testMaskPassword(org.eclipse.e4.core.internal.tests.about.AboutTest)  Time elapsed: 0.008 s
testAppendUserPreferences(org.eclipse.e4.core.internal.tests.about.AboutTest)  Time elapsed: 0.004 s
testAppendInstalledFeatures(org.eclipse.e4.core.internal.tests.about.AboutTest)  Time elapsed: 0.004 s
testMultilineValue(org.eclipse.e4.core.internal.tests.about.AboutTest)  Time elapsed: 0.003 s
testInstalledFeatures(org.eclipse.e4.core.internal.tests.about.InstalledFeaturesTest)  Time elapsed: 0.006 s
testSpecialMethodOnFailure(org.eclipse.e4.core.internal.tests.di.InjectionOrderTest)  Time elapsed: 0.002 s  <<< ERROR!
java.lang.NullPointerException
	at org.eclipse.e4.core.internal.tests.di.InjectionOrderTest.testSpecialMethodOnFailure(InjectionOrderTest.java:64)

testSuperclassMethods(org.eclipse.e4.core.internal.tests.di.InvokeTest)  Time elapsed: 0.001 s  <<< ERROR!
java.lang.NullPointerException
	at org.eclipse.e4.core.internal.tests.di.InvokeTest.testSuperclassMethods(InvokeTest.java:49)

testPrimitiveTypes(org.eclipse.e4.core.internal.tests.di.InjectBaseTypeTest)  Time elapsed: 0.001 s  <<< ERROR!
java.lang.NullPointerException
	at org.eclipse.e4.core.internal.tests.di.InjectBaseTypeTest.testPrimitiveTypes(InjectBaseTypeTest.java:85)

testCallMethodsWithMissingAnnotation(org.eclipse.e4.core.internal.tests.di.InvokeTestMissingAnnotation)  Time elapsed: 0.001 s
testCallMethodsWithMissingAnnotationNoExecution(org.eclipse.e4.core.internal.tests.di.InvokeTestMissingAnnotation)  Time elapsed: 0 s
testLeaks(org.eclipse.e4.core.internal.tests.di.InjectionResultLeakTest)  Time elapsed: 0.001 s  <<< ERROR!
java.lang.NullPointerException
	at org.eclipse.e4.core.internal.tests.di.InjectionResultLeakTest.testLeaks(InjectionResultLeakTest.java:60)

testNonCreatableInstancesAreUsedFromContext(org.eclipse.e4.core.internal.tests.di.AutoConstructWithCreatableTest)  Time elapsed: 0.001 s  <<< ERROR!
java.lang.NullPointerException
	at org.eclipse.e4.core.internal.tests.di.AutoConstructWithCreatableTest.testNonCreatableInstancesAreUsedFromContext(AutoConstructWithCreatableTest.java:102)

testCreatableIsCreated(org.eclipse.e4.core.internal.tests.di.AutoConstructWithCreatableTest)  Time elapsed: 0.001 s  <<< ERROR!
java.lang.NullPointerException
	at org.eclipse.e4.core.internal.tests.di.AutoConstructWithCreatableTest.testCreatableIsCreated(AutoConstructWithCreatableTest.java:73)

testNonCreatableInstanceAreNotCreated(org.eclipse.e4.core.internal.tests.di.AutoConstructWithCreatableTest)  Time elapsed: 0.001 s  <<< ERROR!
java.lang.Exception: Unexpected exception, expected<org.eclipse.e4.core.di.InjectionException> but was<java.lang.NullPointerException>
	at org.eclipse.e4.core.internal.tests.di.AutoConstructWithCreatableTest.testNonCreatableInstanceAreNotCreated(AutoConstructWithCreatableTest.java:94)

testDisposeClearsNotifyOnDisposalSet(org.eclipse.e4.core.internal.tests.contexts.EclipseContextTest)  Time elapsed: 0 s
testGetCFNotAValue(org.eclipse.e4.core.internal.tests.contexts.EclipseContextTest)  Time elapsed: 0.001 s
testNullInheritance(org.eclipse.e4.core.internal.tests.contexts.EclipseContextTest)  Time elapsed: 0 s
testRegisterRunAndTrackTwice(org.eclipse.e4.core.internal.tests.contexts.EclipseContextTest)  Time elapsed: 0.001 s
testGetLocal(org.eclipse.e4.core.internal.tests.contexts.EclipseContextTest)  Time elapsed: 0.001 s
testGetCFNotAValueToParent(org.eclipse.e4.core.internal.tests.contexts.EclipseContextTest)  Time elapsed: 0 s
testGet(org.eclipse.e4.core.internal.tests.contexts.EclipseContextTest)  Time elapsed: 0 s
testContextFunctionOrdering(org.eclipse.e4.core.internal.tests.contexts.EclipseContextTest)  Time elapsed: 0 s
testRemoveValueComputationOnDispose(org.eclipse.e4.core.internal.tests.contexts.EclipseContextTest)  Time elapsed: 0 s
testContainsKey(org.eclipse.e4.core.internal.tests.contexts.EclipseContextTest)  Time elapsed: 0.001 s
testDisposeRemovesParentReference(org.eclipse.e4.core.internal.tests.contexts.EclipseContextTest)  Time elapsed: 0 s
testRunAndTrackMultipleValues(org.eclipse.e4.core.internal.tests.contexts.EclipseContextTest)  Time elapsed: 0 s
testRunAndTrack(org.eclipse.e4.core.internal.tests.contexts.EclipseContextTest)  Time elapsed: 0.001 s
testContextFunctionInParent(org.eclipse.e4.core.internal.tests.contexts.EclipseContextTest)  Time elapsed: 0 s
testModify(org.eclipse.e4.core.internal.tests.contexts.EclipseContextTest)  Time elapsed: 0 s
testContextSetZeroArgs(org.eclipse.e4.core.internal.tests.contexts.inject.ContextInjectionTest)  Time elapsed: 0.001 s  <<< ERROR!
java.lang.NullPointerException
	at org.eclipse.e4.core.internal.tests.contexts.inject.ContextInjectionTest.testContextSetZeroArgs(ContextInjectionTest.java:103)

testInjectionAndInheritance(org.eclipse.e4.core.internal.tests.contexts.inject.ContextInjectionTest)  Time elapsed: 0.006 s  <<< ERROR!
java.lang.NullPointerException
	at org.eclipse.e4.core.internal.tests.contexts.inject.ContextInjectionTest.testInjectionAndInheritance(ContextInjectionTest.java:209)

testInjectionFromParent(org.eclipse.e4.core.internal.tests.contexts.inject.ContextInjectionTest)  Time elapsed: 0.003 s  <<< ERROR!
java.lang.NullPointerException
	at org.eclipse.e4.core.internal.tests.contexts.inject.ContextInjectionTest.testInjectionFromParent(ContextInjectionTest.java:175)

testBug374421(org.eclipse.e4.core.internal.tests.contexts.inject.ContextInjectionTest)  Time elapsed: 0 s  <<< ERROR!
java.lang.NullPointerException
	at org.eclipse.e4.core.internal.tests.contexts.inject.ContextInjectionTest.testBug374421(ContextInjectionTest.java:312)

testContextSetOneArg(org.eclipse.e4.core.internal.tests.contexts.inject.ContextInjectionTest)  Time elapsed: 0.001 s  <<< ERROR!
java.lang.NullPointerException
	at org.eclipse.e4.core.internal.tests.contexts.inject.ContextInjectionTest.testContextSetOneArg(ContextInjectionTest.java:64)

testInjection(org.eclipse.e4.core.internal.tests.contexts.inject.ContextInjectionTest)  Time elapsed: 0.001 s  <<< ERROR!
java.lang.NullPointerException
	at org.eclipse.e4.core.internal.tests.contexts.inject.ContextInjectionTest.testInjection(ContextInjectionTest.java:134)

testInjectionCloseOverride(org.eclipse.e4.core.internal.tests.contexts.inject.ContextInjectionTest)  Time elapsed: 0.001 s  <<< ERROR!
java.lang.NullPointerException
	at org.eclipse.e4.core.internal.tests.contexts.inject.ContextInjectionTest.testInjectionCloseOverride(ContextInjectionTest.java:294)

testContextDisposedNoArg(org.eclipse.e4.core.internal.tests.contexts.inject.ContextInjectionDisposeTest)  Time elapsed: 0.001 s  <<< ERROR!
java.lang.NullPointerException
	at org.eclipse.e4.core.internal.tests.contexts.inject.ContextInjectionDisposeTest.testContextDisposedNoArg(ContextInjectionDisposeTest.java:57)

testReleaseObject(org.eclipse.e4.core.internal.tests.contexts.inject.ContextInjectionDisposeTest)  Time elapsed: 0.001 s  <<< ERROR!
java.lang.NullPointerException
	at org.eclipse.e4.core.internal.tests.contexts.inject.ContextInjectionDisposeTest.testReleaseObject(ContextInjectionDisposeTest.java:124)

testDisposeContext(org.eclipse.e4.core.internal.tests.contexts.inject.ContextInjectionDisposeTest)  Time elapsed: 0.001 s  <<< ERROR!
java.lang.NullPointerException
	at org.eclipse.e4.core.internal.tests.contexts.inject.ContextInjectionDisposeTest.testDisposeContext(ContextInjectionDisposeTest.java:86)

testInvoke(org.eclipse.e4.core.internal.tests.contexts.inject.ContextInjectionFactoryTest)  Time elapsed: 0.002 s  <<< ERROR!
java.lang.NullPointerException
	at org.eclipse.e4.core.internal.tests.contexts.inject.ContextInjectionFactoryTest.testInvoke(ContextInjectionFactoryTest.java:77)

testInvokeWithParameters(org.eclipse.e4.core.internal.tests.contexts.inject.ContextInjectionFactoryTest)  Time elapsed: 0 s  <<< ERROR!
java.lang.NullPointerException
	at org.eclipse.e4.core.internal.tests.contexts.inject.ContextInjectionFactoryTest.testInvokeWithParameters(ContextInjectionFactoryTest.java:87)

testConstructorInjectionBasic(org.eclipse.e4.core.internal.tests.contexts.inject.ContextInjectionFactoryTest)  Time elapsed: 0.001 s  <<< ERROR!
java.lang.NullPointerException
	at org.eclipse.e4.core.internal.tests.contexts.inject.ContextInjectionFactoryTest.testConstructorInjectionBasic(ContextInjectionFactoryTest.java:103)

testReplaceFunctionWithStaticValue(org.eclipse.e4.core.internal.tests.contexts.ContextDynamicTest)  Time elapsed: 0.001 s
testAddRemove(org.eclipse.e4.core.internal.tests.contexts.ContextDynamicTest)  Time elapsed: 0.001 s  <<< ERROR!
java.lang.NullPointerException
	at org.eclipse.e4.core.internal.tests.contexts.ContextDynamicTest.testAddRemove(ContextDynamicTest.java:71)

testParentAddRemove(org.eclipse.e4.core.internal.tests.contexts.ContextDynamicTest)  Time elapsed: 0 s  <<< ERROR!
java.lang.NullPointerException
	at org.eclipse.e4.core.internal.tests.contexts.ContextDynamicTest.testParentAddRemove(ContextDynamicTest.java:135)

testContextFunctionNullBecomeParent(org.eclipse.e4.core.internal.tests.contexts.ReparentingTest)  Time elapsed: 0 s
testInjectSwitchParentSameGrandparent(org.eclipse.e4.core.internal.tests.contexts.ReparentingTest)  Time elapsed: 0.001 s  <<< ERROR!
java.lang.NullPointerException
	at org.eclipse.e4.core.internal.tests.contexts.ReparentingTest.testInjectSwitchParentSameGrandparent(ReparentingTest.java:234)

testContextFunctionInParentAdd(org.eclipse.e4.core.internal.tests.contexts.ReparentingTest)  Time elapsed: 0 s
testContextFunctionSwitchParent_2(org.eclipse.e4.core.internal.tests.contexts.ReparentingTest)  Time elapsed: 0.001 s  <<< ERROR!
java.lang.NullPointerException
	at org.eclipse.e4.core.internal.tests.contexts.ReparentingTest.testContextFunctionSwitchParent_2(ReparentingTest.java:366)

testContextFunctionParentBecomeNull(org.eclipse.e4.core.internal.tests.contexts.ReparentingTest)  Time elapsed: 0 s
testContextFunctionSwitchParent(org.eclipse.e4.core.internal.tests.contexts.ReparentingTest)  Time elapsed: 0 s
testUpdateSameParent(org.eclipse.e4.core.internal.tests.contexts.ReparentingTest)  Time elapsed: 0 s
testRunAndTrackParentBecomeNull(org.eclipse.e4.core.internal.tests.contexts.ReparentingTest)  Time elapsed: 0 s
testRunAndTrackSwitchParent(org.eclipse.e4.core.internal.tests.contexts.ReparentingTest)  Time elapsed: 0.001 s
testBug468048_contextFunction(org.eclipse.e4.core.internal.tests.contexts.ReparentingTest)  Time elapsed: 0.001 s
testBug468048_injection(org.eclipse.e4.core.internal.tests.contexts.ReparentingTest)  Time elapsed: 0.001 s  <<< ERROR!
java.lang.NullPointerException
	at org.eclipse.e4.core.internal.tests.contexts.ReparentingTest.testBug468048_injection(ReparentingTest.java:340)

testContextFunctionInParentRemove(org.eclipse.e4.core.internal.tests.contexts.ReparentingTest)  Time elapsed: 0 s
testUpdateSameParentCalculated(org.eclipse.e4.core.internal.tests.contexts.ReparentingTest)  Time elapsed: 0.001 s  <<< ERROR!
java.lang.NullPointerException
	at org.eclipse.e4.core.internal.tests.contexts.ReparentingTest.testUpdateSameParentCalculated(ReparentingTest.java:286)

testInjectSwitchParent(org.eclipse.e4.core.internal.tests.contexts.ReparentingTest)  Time elapsed: 0 s  <<< ERROR!
java.lang.NullPointerException
	at org.eclipse.e4.core.internal.tests.contexts.ReparentingTest.testInjectSwitchParent(ReparentingTest.java:208)

testRunAndTrackNullBecomesParent(org.eclipse.e4.core.internal.tests.contexts.ReparentingTest)  Time elapsed: 0.001 s
testActiveChain(org.eclipse.e4.core.internal.tests.contexts.RunAndTrackTest)  Time elapsed: 0.002 s
testSetContextVarToEqualObject(org.eclipse.e4.core.internal.tests.contexts.RunAndTrackTest)  Time elapsed: 0.002 s
testRunAndTrackSimple(org.eclipse.e4.core.internal.tests.contexts.RunAndTrackTest)  Time elapsed: 0.001 s
testSetContextVarToOtherObject(org.eclipse.e4.core.internal.tests.contexts.RunAndTrackTest)  Time elapsed: 0 s
testRunAndTrackComplex(org.eclipse.e4.core.internal.tests.contexts.RunAndTrackTest)  Time elapsed: 0.003 s
testSetHiddenValueToRootObject(org.eclipse.e4.core.internal.tests.contexts.RunAndTrackTest)  Time elapsed: 0.001 s
testSetHiddenValueToChildObject(org.eclipse.e4.core.internal.tests.contexts.RunAndTrackTest)  Time elapsed: 0.001 s
testSetHiddenValueToObjectEqualToChild(org.eclipse.e4.core.internal.tests.contexts.RunAndTrackTest)  Time elapsed: 0 s
testSetHiddenValueToEqualRootObject(org.eclipse.e4.core.internal.tests.contexts.RunAndTrackTest)  Time elapsed: 0 s
testSetHiddenValueToDifferentObject(org.eclipse.e4.core.internal.tests.contexts.RunAndTrackTest)  Time elapsed: 0.001 s
testSetHiddenValueToNull(org.eclipse.e4.core.internal.tests.contexts.RunAndTrackTest)  Time elapsed: 0 s
testRemoveContextVar(org.eclipse.e4.core.internal.tests.contexts.RunAndTrackTest)  Time elapsed: 0.001 s
testSetContextVarToSameObject(org.eclipse.e4.core.internal.tests.contexts.RunAndTrackTest)  Time elapsed: 0.001 s
testRemoveHiddenVariable(org.eclipse.e4.core.internal.tests.contexts.RunAndTrackTest)  Time elapsed: 0 s
testActiveChange(org.eclipse.e4.core.internal.tests.contexts.RunAndTrackTest)  Time elapsed: 0.001 s
testParentContextDisposal(org.eclipse.e4.core.internal.tests.contexts.inject.ParentContextDisposalTest)  Time elapsed: 0.001 s  <<< ERROR!
java.lang.NullPointerException
	at org.eclipse.e4.core.internal.tests.contexts.inject.ParentContextDisposalTest.testParentContextDisposal(ParentContextDisposalTest.java:55)

testU(org.eclipse.e4.core.internal.tests.contexts.inject.ComplexDisposalTest)  Time elapsed: 0.001 s  <<< ERROR!
java.lang.NullPointerException
	at org.eclipse.e4.core.internal.tests.contexts.inject.ComplexDisposalTest.testU(ComplexDisposalTest.java:65)

testV(org.eclipse.e4.core.internal.tests.contexts.inject.ComplexDisposalTest)  Time elapsed: 0 s  <<< ERROR!
java.lang.NullPointerException
	at org.eclipse.e4.core.internal.tests.contexts.inject.ComplexDisposalTest.testV(ComplexDisposalTest.java:80)

testW(org.eclipse.e4.core.internal.tests.contexts.inject.ComplexDisposalTest)  Time elapsed: 0.003 s  <<< ERROR!
java.lang.NullPointerException
	at org.eclipse.e4.core.internal.tests.contexts.inject.ComplexDisposalTest.testW(ComplexDisposalTest.java:99)

testMake(org.eclipse.e4.core.internal.tests.di.DisposeClassLinkTest)  Time elapsed: 0 s  <<< ERROR!
java.lang.NullPointerException
	at org.eclipse.e4.core.internal.tests.di.DisposeClassLinkTest.testMake(DisposeClassLinkTest.java:90)

testInjectedWithContext(org.eclipse.e4.core.internal.tests.di.DisposeClassLinkTest)  Time elapsed: 0.001 s  <<< ERROR!
java.lang.NullPointerException
	at org.eclipse.e4.core.internal.tests.di.DisposeClassLinkTest.testInjectedWithContext(DisposeClassLinkTest.java:140)

testDisposeParentFirst(org.eclipse.e4.core.internal.tests.di.DisposeClassLinkTest)  Time elapsed: 0.001 s  <<< ERROR!
java.lang.NullPointerException
	at org.eclipse.e4.core.internal.tests.di.DisposeClassLinkTest.testDisposeParentFirst(DisposeClassLinkTest.java:130)

testDisposeParent(org.eclipse.e4.core.internal.tests.di.DisposeClassLinkTest)  Time elapsed: 0.001 s  <<< ERROR!
java.lang.NullPointerException
	at org.eclipse.e4.core.internal.tests.di.DisposeClassLinkTest.testDisposeParent(DisposeClassLinkTest.java:101)

testBug430041(org.eclipse.e4.core.internal.tests.di.DisposeClassLinkTest)  Time elapsed: 0 s  <<< ERROR!
java.lang.NullPointerException
	at org.eclipse.e4.core.internal.tests.di.DisposeClassLinkTest.testBug430041(DisposeClassLinkTest.java:156)

testInject(org.eclipse.e4.core.internal.tests.di.DisposeClassLinkTest)  Time elapsed: 0.001 s  <<< ERROR!
java.lang.NullPointerException
	at org.eclipse.e4.core.internal.tests.di.DisposeClassLinkTest.testInject(DisposeClassLinkTest.java:118)

testStaticMake(org.eclipse.e4.core.internal.tests.contexts.inject.InjectStaticContextTest)  Time elapsed: 0.001 s  <<< ERROR!
java.lang.NullPointerException
	at org.eclipse.e4.core.internal.tests.contexts.inject.InjectStaticContextTest.testStaticMake(InjectStaticContextTest.java:113)

testStaticInject(org.eclipse.e4.core.internal.tests.contexts.inject.InjectStaticContextTest)  Time elapsed: 0.001 s  <<< ERROR!
java.lang.NullPointerException
	at org.eclipse.e4.core.internal.tests.contexts.inject.InjectStaticContextTest.testStaticInject(InjectStaticContextTest.java:196)

testStaticInvoke(org.eclipse.e4.core.internal.tests.contexts.inject.InjectStaticContextTest)  Time elapsed: 0.001 s  <<< ERROR!
java.lang.NullPointerException
	at org.eclipse.e4.core.internal.tests.contexts.inject.InjectStaticContextTest.testStaticInvoke(InjectStaticContextTest.java:268)

testContextActivation(org.eclipse.e4.core.internal.tests.contexts.ActivationTest)  Time elapsed: 0.001 s
testGetActiveRATNumberOfCalls(org.eclipse.e4.core.internal.tests.contexts.ActivationTest)  Time elapsed: 0 s
testGetActive(org.eclipse.e4.core.internal.tests.contexts.ActivationTest)  Time elapsed: 0 s
testGetActiveRATNumberOfCalls2(org.eclipse.e4.core.internal.tests.contexts.ActivationTest)  Time elapsed: 0 s
testGetActiveRAT(org.eclipse.e4.core.internal.tests.contexts.ActivationTest)  Time elapsed: 0.001 s
testGetActiveBug384425(org.eclipse.e4.core.internal.tests.contexts.ActivationTest)  Time elapsed: 0 s
testInheritedSpecialMethods(org.eclipse.e4.core.internal.tests.contexts.inject.AnnotationsInjectionTest)  Time elapsed: 0 s  <<< ERROR!
java.lang.NullPointerException
	at org.eclipse.e4.core.internal.tests.contexts.inject.AnnotationsInjectionTest.testInheritedSpecialMethods(AnnotationsInjectionTest.java:275)

testPostConstruct(org.eclipse.e4.core.internal.tests.contexts.inject.AnnotationsInjectionTest)  Time elapsed: 0.002 s  <<< ERROR!
java.lang.NullPointerException
	at org.eclipse.e4.core.internal.tests.contexts.inject.AnnotationsInjectionTest.testPostConstruct(AnnotationsInjectionTest.java:103)

testContextSetOneArg(org.eclipse.e4.core.internal.tests.contexts.inject.AnnotationsInjectionTest)  Time elapsed: 0.001 s  <<< ERROR!
java.lang.NullPointerException
	at org.eclipse.e4.core.internal.tests.contexts.inject.AnnotationsInjectionTest.testContextSetOneArg(AnnotationsInjectionTest.java:67)

testOptionalInjection(org.eclipse.e4.core.internal.tests.contexts.inject.AnnotationsInjectionTest)  Time elapsed: 0.001 s  <<< ERROR!
java.lang.NullPointerException
	at org.eclipse.e4.core.internal.tests.contexts.inject.AnnotationsInjectionTest.testOptionalInjection(AnnotationsInjectionTest.java:210)

testInjection(org.eclipse.e4.core.internal.tests.contexts.inject.AnnotationsInjectionTest)  Time elapsed: 0.001 s  <<< ERROR!
java.lang.NullPointerException
	at org.eclipse.e4.core.internal.tests.contexts.inject.AnnotationsInjectionTest.testInjection(AnnotationsInjectionTest.java:134)

testInvoke(org.eclipse.e4.core.internal.tests.contexts.inject.AnnotationsInjectionTest)  Time elapsed: 0.001 s  <<< ERROR!
java.lang.NullPointerException
	at org.eclipse.e4.core.internal.tests.contexts.inject.AnnotationsInjectionTest.testInvoke(AnnotationsInjectionTest.java:324)

testOptionalInvoke(org.eclipse.e4.core.internal.tests.contexts.inject.AnnotationsInjectionTest)  Time elapsed: 0 s  <<< ERROR!
java.lang.NullPointerException
	at org.eclipse.e4.core.internal.tests.contexts.inject.AnnotationsInjectionTest.testOptionalInvoke(AnnotationsInjectionTest.java:253)

testFieldMethodOrder(org.eclipse.e4.core.internal.tests.contexts.inject.AnnotationsInjectionTest)  Time elapsed: 0.002 s  <<< ERROR!
java.lang.NullPointerException
	at org.eclipse.e4.core.internal.tests.contexts.inject.AnnotationsInjectionTest.testFieldMethodOrder(AnnotationsInjectionTest.java:182)

testPreDestroy(org.eclipse.e4.core.internal.tests.contexts.inject.AnnotationsInjectionTest)  Time elapsed: 0.001 s  <<< ERROR!
java.lang.NullPointerException
	at org.eclipse.e4.core.internal.tests.contexts.inject.AnnotationsInjectionTest.testPreDestroy(AnnotationsInjectionTest.java:357)

testConstructorInjection(org.eclipse.e4.core.internal.tests.contexts.inject.TestConstructorInjection)  Time elapsed: 0.001 s  <<< ERROR!
java.lang.NullPointerException
	at org.eclipse.e4.core.internal.tests.contexts.inject.TestConstructorInjection.testConstructorInjection(TestConstructorInjection.java:110)

testServiceRemovalOnContextDispose(org.eclipse.e4.core.internal.tests.contexts.inject.ServiceContextTest)  Time elapsed: 0.003 s
testServiceInjection(org.eclipse.e4.core.internal.tests.contexts.inject.ServiceContextTest)  Time elapsed: 0.003 s
testServiceContextAsParent(org.eclipse.e4.core.internal.tests.contexts.inject.ServiceContextTest)  Time elapsed: 0 s
testRecursiveServiceRemoval(org.eclipse.e4.core.internal.tests.contexts.inject.ServiceContextTest)  Time elapsed: 0.005 s
testDeclarativeService(org.eclipse.e4.core.internal.tests.contexts.inject.ServiceContextTest)  Time elapsed: 0.001 s
testServiceExample(org.eclipse.e4.core.internal.tests.contexts.inject.ServiceContextTest)  Time elapsed: 0.042 s
testServiceAddition(org.eclipse.e4.core.internal.tests.contexts.inject.ServiceContextTest)  Time elapsed: 0.001 s
testOptionalReferences(org.eclipse.e4.core.internal.tests.contexts.inject.ServiceContextTest)  Time elapsed: 0.001 s  <<< ERROR!
java.lang.NullPointerException
	at org.eclipse.e4.core.internal.tests.contexts.inject.ServiceContextTest.testOptionalReferences(ServiceContextTest.java:299)

testServiceRanking(org.eclipse.e4.core.internal.tests.contexts.inject.ServiceContextTest)  Time elapsed: 0 s  <<< ERROR!
java.lang.NullPointerException
	at org.eclipse.e4.core.internal.tests.contexts.inject.ServiceContextTest.testServiceRanking(ServiceContextTest.java:348)

testConstructorWithProvider(org.eclipse.e4.core.internal.tests.contexts.inject.ProviderInjectionTest)  Time elapsed: 0.003 s  <<< ERROR!
java.lang.NullPointerException
	at org.eclipse.e4.core.internal.tests.contexts.inject.ProviderInjectionTest.testConstructorWithProvider(ProviderInjectionTest.java:92)

testInvokeWithProvider(org.eclipse.e4.core.internal.tests.contexts.inject.ProviderInjectionTest)  Time elapsed: 0.001 s  <<< ERROR!
java.lang.NullPointerException
	at org.eclipse.e4.core.internal.tests.contexts.inject.ProviderInjectionTest.testInvokeWithProvider(ProviderInjectionTest.java:78)

testNestedUpdatesConstructor(org.eclipse.e4.core.internal.tests.contexts.inject.InjectionUpdateTest)  Time elapsed: 0.002 s  <<< ERROR!
java.lang.NullPointerException
	at org.eclipse.e4.core.internal.tests.contexts.inject.InjectionUpdateTest.testNestedUpdatesConstructor(InjectionUpdateTest.java:181)

testPropagation(org.eclipse.e4.core.internal.tests.contexts.inject.InjectionUpdateTest)  Time elapsed: 0.001 s  <<< ERROR!
java.lang.NullPointerException
	at org.eclipse.e4.core.internal.tests.contexts.inject.InjectionUpdateTest.testPropagation(InjectionUpdateTest.java:103)

testNestedUpdatesPostConstruct(org.eclipse.e4.core.internal.tests.contexts.inject.InjectionUpdateTest)  Time elapsed: 0.001 s  <<< ERROR!
java.lang.NullPointerException
	at org.eclipse.e4.core.internal.tests.contexts.inject.InjectionUpdateTest.testNestedUpdatesPostConstruct(InjectionUpdateTest.java:144)

testContextDisposeCausesCompleteUninjection_Optional_False(org.eclipse.e4.core.internal.tests.contexts.inject.DisposingReferencedContextTest)  Time elapsed: 0.001 s  <<< ERROR!
java.lang.NullPointerException
	at org.eclipse.e4.core.internal.tests.contexts.inject.DisposingReferencedContextTest.testContextDisposeCausesCompleteUninjection_Optional(DisposingReferencedContextTest.java:103)
	at org.eclipse.e4.core.internal.tests.contexts.inject.DisposingReferencedContextTest.testContextDisposeCausesCompleteUninjection_Optional_False(DisposingReferencedContextTest.java:72)

testContextDisposeCausesCompleteUninjection_Mandatory_False(org.eclipse.e4.core.internal.tests.contexts.inject.DisposingReferencedContextTest)  Time elapsed: 0.001 s  <<< ERROR!
java.lang.NullPointerException
	at org.eclipse.e4.core.internal.tests.contexts.inject.DisposingReferencedContextTest.testContextDisposeCausesCompleteUninjection_Mandatory(DisposingReferencedContextTest.java:85)
	at org.eclipse.e4.core.internal.tests.contexts.inject.DisposingReferencedContextTest.testContextDisposeCausesCompleteUninjection_Mandatory_False(DisposingReferencedContextTest.java:62)

testContextDisposeCausesCompleteUninjection_Optional_True(org.eclipse.e4.core.internal.tests.contexts.inject.DisposingReferencedContextTest)  Time elapsed: 0 s  <<< ERROR!
java.lang.NullPointerException
	at org.eclipse.e4.core.internal.tests.contexts.inject.DisposingReferencedContextTest.testContextDisposeCausesCompleteUninjection_Optional(DisposingReferencedContextTest.java:103)
	at org.eclipse.e4.core.internal.tests.contexts.inject.DisposingReferencedContextTest.testContextDisposeCausesCompleteUninjection_Optional_True(DisposingReferencedContextTest.java:67)

testContextDisposeCausesCompleteUninjection_Mandatory_True(org.eclipse.e4.core.internal.tests.contexts.inject.DisposingReferencedContextTest)  Time elapsed: 0.001 s  <<< ERROR!
java.lang.NullPointerException
	at org.eclipse.e4.core.internal.tests.contexts.inject.DisposingReferencedContextTest.testContextDisposeCausesCompleteUninjection_Mandatory(DisposingReferencedContextTest.java:85)
	at org.eclipse.e4.core.internal.tests.contexts.inject.DisposingReferencedContextTest.testContextDisposeCausesCompleteUninjection_Mandatory_True(DisposingReferencedContextTest.java:57)

testSpecialMethodOnFailure(org.eclipse.e4.core.internal.tests.di.InjectionOrderTest)  Time elapsed: 0 s  <<< ERROR!
java.lang.NullPointerException
	at org.eclipse.e4.core.internal.tests.di.InjectionOrderTest.testSpecialMethodOnFailure(InjectionOrderTest.java:64)

testNoGrouping(org.eclipse.e4.core.internal.tests.contexts.inject.GroupedUpdatesTest)  Time elapsed: 0.001 s  <<< ERROR!
java.lang.NullPointerException
	at org.eclipse.e4.core.internal.tests.contexts.inject.GroupedUpdatesTest.testNoGrouping(GroupedUpdatesTest.java:81)

testGrouping(org.eclipse.e4.core.internal.tests.contexts.inject.GroupedUpdatesTest)  Time elapsed: 0.002 s  <<< ERROR!
java.lang.NullPointerException
	at org.eclipse.e4.core.internal.tests.contexts.inject.GroupedUpdatesTest.testGrouping(GroupedUpdatesTest.java:103)

testExtraDependencies(org.eclipse.e4.core.internal.tests.contexts.inject.ExtraDependenciesTest)  Time elapsed: 0.001 s  <<< ERROR!
java.lang.NullPointerException
	at org.eclipse.e4.core.internal.tests.contexts.inject.ExtraDependenciesTest.testExtraDependencies(ExtraDependenciesTest.java:77)

testBug315109(org.eclipse.e4.core.internal.tests.contexts.inject.ContextFunctionDynamicsTest)  Time elapsed: 0.001 s  <<< ERROR!
java.lang.NullPointerException
	at org.eclipse.e4.core.internal.tests.contexts.inject.ContextFunctionDynamicsTest.testBug315109(ContextFunctionDynamicsTest.java:170)

testOverrideICF(org.eclipse.e4.core.internal.tests.contexts.inject.ContextFunctionDynamicsTest)  Time elapsed: 0 s  <<< ERROR!
java.lang.NullPointerException
	at org.eclipse.e4.core.internal.tests.contexts.inject.ContextFunctionDynamicsTest.testOverrideICF(ContextFunctionDynamicsTest.java:91)

testLongChain(org.eclipse.e4.core.internal.tests.contexts.inject.ContextFunctionDynamicsTest)  Time elapsed: 0.001 s  <<< ERROR!
java.lang.NullPointerException
	at org.eclipse.e4.core.internal.tests.contexts.inject.ContextFunctionDynamicsTest.testLongChain(ContextFunctionDynamicsTest.java:120)

testChangeICF(org.eclipse.e4.core.internal.tests.contexts.inject.ContextFunctionDynamicsTest)  Time elapsed: 0.001 s  <<< ERROR!
java.lang.NullPointerException
	at org.eclipse.e4.core.internal.tests.contexts.inject.ContextFunctionDynamicsTest.testChangeICF(ContextFunctionDynamicsTest.java:60)

testArrayInjection(org.eclipse.e4.core.internal.tests.di.InjectArraysTest)  Time elapsed: 0 s  <<< ERROR!
java.lang.NullPointerException
	at org.eclipse.e4.core.internal.tests.di.InjectArraysTest.testArrayInjection(InjectArraysTest.java:64)

testInvokationFail(org.eclipse.e4.core.internal.tests.di.InjectBridgeTest)  Time elapsed: 0.001 s  <<< ERROR!
java.lang.Exception: Unexpected exception, expected<org.eclipse.e4.core.di.InjectionException> but was<java.lang.NullPointerException>
	at org.eclipse.e4.core.internal.tests.di.InjectBridgeTest.testInvokationFail(InjectBridgeTest.java:77)

testInjection(org.eclipse.e4.core.internal.tests.di.InjectBridgeTest)  Time elapsed: 0 s  <<< ERROR!
java.lang.NullPointerException
	at org.eclipse.e4.core.internal.tests.di.InjectBridgeTest.testInjection(InjectBridgeTest.java:54)

testInvokation(org.eclipse.e4.core.internal.tests.di.InjectBridgeTest)  Time elapsed: 0.001 s  <<< ERROR!
java.lang.NullPointerException
	at org.eclipse.e4.core.internal.tests.di.InjectBridgeTest.testInvokation(InjectBridgeTest.java:70)

testInjectionFail(org.eclipse.e4.core.internal.tests.di.InjectBridgeTest)  Time elapsed: 0 s  <<< ERROR!
java.lang.Exception: Unexpected exception, expected<org.eclipse.e4.core.di.InjectionException> but was<java.lang.NullPointerException>
	at org.eclipse.e4.core.internal.tests.di.InjectBridgeTest.testInjectionFail(InjectBridgeTest.java:62)

testStaticInvoke(org.eclipse.e4.core.internal.tests.contexts.inject.InvokeInRATTest)  Time elapsed: 0.001 s  <<< ERROR!
java.lang.NullPointerException
	at org.eclipse.e4.core.internal.tests.contexts.inject.InvokeInRATTest.testStaticInvoke(InvokeInRATTest.java:66)

testX(org.eclipse.e4.core.internal.tests.contexts.inject.Bug317183Test)  Time elapsed: 0 s
testY(org.eclipse.e4.core.internal.tests.contexts.inject.Bug317183Test)  Time elapsed: 0.001 s
testBug(org.eclipse.e4.core.internal.tests.contexts.DependenciesLeakTest)  Time elapsed: 0 s
testInvalidateDirectly(org.eclipse.e4.core.internal.tests.contexts.DependenciesLeakTest)  Time elapsed: 0.001 s
testContextActivation(org.eclipse.e4.core.internal.tests.contexts.inject.ActivationInjectionTest)  Time elapsed: 0.001 s  <<< ERROR!
java.lang.NullPointerException
	at org.eclipse.e4.core.internal.tests.contexts.inject.ActivationInjectionTest.testContextActivation(ActivationInjectionTest.java:70)

testActivationInjection(org.eclipse.e4.core.internal.tests.contexts.inject.ActivationInjectionTest)  Time elapsed: 0 s  <<< ERROR!
java.lang.NullPointerException
	at org.eclipse.e4.core.internal.tests.contexts.inject.ActivationInjectionTest.testActivationInjection(ActivationInjectionTest.java:126)

testInjection(org.eclipse.e4.core.internal.tests.contexts.inject.ActivationInjectionTest)  Time elapsed: 0.001 s  <<< ERROR!
java.lang.NullPointerException
	at org.eclipse.e4.core.internal.tests.contexts.inject.ActivationInjectionTest.testInjection(ActivationInjectionTest.java:181)

testGenericInjection(org.eclipse.e4.core.internal.tests.contexts.inject.GenericsInjectionTest)  Time elapsed: 0.002 s  <<< ERROR!
java.lang.NullPointerException
	at org.eclipse.e4.core.internal.tests.contexts.inject.GenericsInjectionTest.testGenericInjection(GenericsInjectionTest.java:95)

testClassGenericInjection(org.eclipse.e4.core.internal.tests.contexts.inject.GenericsInjectionTest)  Time elapsed: 0.002 s
testNamedInjection(org.eclipse.e4.core.internal.tests.contexts.inject.GenericsInjectionTest)  Time elapsed: 0 s  <<< ERROR!
java.lang.NullPointerException
	at org.eclipse.e4.core.internal.tests.contexts.inject.GenericsInjectionTest.testNamedInjection(GenericsInjectionTest.java:75)

testInterfaceGenericInjection(org.eclipse.e4.core.internal.tests.contexts.inject.GenericsInjectionTest)  Time elapsed: 0 s
testNested(org.eclipse.e4.core.internal.tests.di.RecursiveObjectCreationTest)  Time elapsed: 0.001 s  <<< ERROR!
java.lang.NullPointerException
	at org.eclipse.e4.core.internal.tests.di.RecursiveObjectCreationTest.testNested(RecursiveObjectCreationTest.java:89)

testSelfInject(org.eclipse.e4.core.internal.tests.di.RecursiveObjectCreationTest)  Time elapsed: 0 s  <<< ERROR!
java.lang.NullPointerException
	at org.eclipse.e4.core.internal.tests.di.RecursiveObjectCreationTest.testSelfInject(RecursiveObjectCreationTest.java:49)

testBundleMessagesUseDefaultLocaleForInvalidLocale(org.eclipse.e4.core.internal.tests.nls.NLSTest)  Time elapsed: 0.001 s  <<< ERROR!
java.lang.NullPointerException
	at org.eclipse.e4.core.internal.tests.nls.NLSTest.testBundleMessagesUseDefaultLocaleForInvalidLocale(NLSTest.java:533)

testSimpleMessagesUseDefaultLocaleForInvalidLocale(org.eclipse.e4.core.internal.tests.nls.NLSTest)  Time elapsed: 0 s  <<< ERROR!
java.lang.NullPointerException
	at org.eclipse.e4.core.internal.tests.nls.NLSTest.testSimpleMessagesUseDefaultLocaleForInvalidLocale(NLSTest.java:211)

testSimpleMessagesSkipDefaultLocaleForEquinoxRoot(org.eclipse.e4.core.internal.tests.nls.NLSTest)  Time elapsed: 0.001 s  <<< ERROR!
java.lang.NullPointerException
	at org.eclipse.e4.core.internal.tests.nls.NLSTest.testSimpleMessagesSkipDefaultLocaleForEquinoxRoot(NLSTest.java:171)

testBundleMessagesDifferentLocale(org.eclipse.e4.core.internal.tests.nls.NLSTest)  Time elapsed: 0 s  <<< ERROR!
java.lang.NullPointerException
	at org.eclipse.e4.core.internal.tests.nls.NLSTest.testBundleMessagesDifferentLocale(NLSTest.java:447)

testSimpleMessages(org.eclipse.e4.core.internal.tests.nls.NLSTest)  Time elapsed: 0 s  <<< ERROR!
java.lang.NullPointerException
	at org.eclipse.e4.core.internal.tests.nls.NLSTest.testSimpleMessages(NLSTest.java:89)

testClassBasedResourceBundle(org.eclipse.e4.core.internal.tests.nls.NLSTest)  Time elapsed: 0.001 s  <<< ERROR!
java.lang.NullPointerException
	at org.eclipse.e4.core.internal.tests.nls.NLSTest.testClassBasedResourceBundle(NLSTest.java:572)

testResourcesBundleUseDefaultLocaleForInvalidLocale(org.eclipse.e4.core.internal.tests.nls.NLSTest)  Time elapsed: 0 s  <<< ERROR!
java.lang.NullPointerException
	at org.eclipse.e4.core.internal.tests.nls.NLSTest.testResourcesBundleUseDefaultLocaleForInvalidLocale(NLSTest.java:863)

testResourcesBundle(org.eclipse.e4.core.internal.tests.nls.NLSTest)  Time elapsed: 0 s  <<< ERROR!
java.lang.NullPointerException
	at org.eclipse.e4.core.internal.tests.nls.NLSTest.testResourcesBundle(NLSTest.java:737)

testMessages(org.eclipse.e4.core.internal.tests.nls.NLSTest)  Time elapsed: 0.001 s  <<< ERROR!
java.lang.NullPointerException
	at org.eclipse.e4.core.internal.tests.nls.NLSTest.testMessages(NLSTest.java:250)

testSimpleMessagesDifferentLocale(org.eclipse.e4.core.internal.tests.nls.NLSTest)  Time elapsed: 0 s  <<< ERROR!
java.lang.NullPointerException
	at org.eclipse.e4.core.internal.tests.nls.NLSTest.testSimpleMessagesDifferentLocale(NLSTest.java:125)

testClassBasedResourceBundleSkipDefaultLocaleForEquinoxRoot(org.eclipse.e4.core.internal.tests.nls.NLSTest)  Time elapsed: 0 s  <<< ERROR!
java.lang.NullPointerException
	at org.eclipse.e4.core.internal.tests.nls.NLSTest.testClassBasedResourceBundleSkipDefaultLocaleForEquinoxRoot(NLSTest.java:656)

testResourcesBundleSkipDefaultLocaleForEquinoxRoot(org.eclipse.e4.core.internal.tests.nls.NLSTest)  Time elapsed: 0.001 s  <<< ERROR!
java.lang.NullPointerException
	at org.eclipse.e4.core.internal.tests.nls.NLSTest.testResourcesBundleSkipDefaultLocaleForEquinoxRoot(NLSTest.java:821)

testBundleMessages(org.eclipse.e4.core.internal.tests.nls.NLSTest)  Time elapsed: 0 s  <<< ERROR!
java.lang.NullPointerException
	at org.eclipse.e4.core.internal.tests.nls.NLSTest.testBundleMessages(NLSTest.java:411)

testMessagesSkipDefaultLocaleForEquinoxRoot(org.eclipse.e4.core.internal.tests.nls.NLSTest)  Time elapsed: 0 s  <<< ERROR!
java.lang.NullPointerException
	at org.eclipse.e4.core.internal.tests.nls.NLSTest.testMessagesSkipDefaultLocaleForEquinoxRoot(NLSTest.java:332)

testBundleMessagesSkipDefaultLocaleForEquinoxRoot(org.eclipse.e4.core.internal.tests.nls.NLSTest)  Time elapsed: 0 s  <<< ERROR!
java.lang.NullPointerException
	at org.eclipse.e4.core.internal.tests.nls.NLSTest.testBundleMessagesSkipDefaultLocaleForEquinoxRoot(NLSTest.java:493)

testClassBasedResourceBundleUseDefaultLocaleForInvalidLocale(org.eclipse.e4.core.internal.tests.nls.NLSTest)  Time elapsed: 0.001 s  <<< ERROR!
java.lang.NullPointerException
	at org.eclipse.e4.core.internal.tests.nls.NLSTest.testClassBasedResourceBundleUseDefaultLocaleForInvalidLocale(NLSTest.java:698)

testMessagesDifferentLocale(org.eclipse.e4.core.internal.tests.nls.NLSTest)  Time elapsed: 0 s  <<< ERROR!
java.lang.NullPointerException
	at org.eclipse.e4.core.internal.tests.nls.NLSTest.testMessagesDifferentLocale(NLSTest.java:286)

testClassBasedResourceBundleDifferentLocale(org.eclipse.e4.core.internal.tests.nls.NLSTest)  Time elapsed: 0 s  <<< ERROR!
java.lang.NullPointerException
	at org.eclipse.e4.core.internal.tests.nls.NLSTest.testClassBasedResourceBundleDifferentLocale(NLSTest.java:610)

testMessagesUseDefaultLocaleForInvalidLocale(org.eclipse.e4.core.internal.tests.nls.NLSTest)  Time elapsed: 0 s  <<< ERROR!
java.lang.NullPointerException
	at org.eclipse.e4.core.internal.tests.nls.NLSTest.testMessagesUseDefaultLocaleForInvalidLocale(NLSTest.java:372)

testResourcesBundleDifferentLocale(org.eclipse.e4.core.internal.tests.nls.NLSTest)  Time elapsed: 0 s  <<< ERROR!
java.lang.NullPointerException
	at org.eclipse.e4.core.internal.tests.nls.NLSTest.testResourcesBundleDifferentLocale(NLSTest.java:775)


Results:

Errors: 
  ContextDynamicTest.testAddRemove:71 » NullPointer
  ContextDynamicTest.testParentAddRemove:135 » NullPointer
  ReparentingTest.testBug468048_injection:340 » NullPointer
  ReparentingTest.testContextFunctionSwitchParent_2:366 » NullPointer
  ReparentingTest.testInjectSwitchParent:208 » NullPointer
  ReparentingTest.testInjectSwitchParentSameGrandparent:234 » NullPointer
  ReparentingTest.testUpdateSameParentCalculated:286 » NullPointer
  ActivationInjectionTest.testActivationInjection:126 » NullPointer
  ActivationInjectionTest.testContextActivation:70 » NullPointer
  ActivationInjectionTest.testInjection:181 » NullPointer
  AnnotationsInjectionTest.testContextSetOneArg:67 » NullPointer
  AnnotationsInjectionTest.testFieldMethodOrder:182 » NullPointer
  AnnotationsInjectionTest.testInheritedSpecialMethods:275 » NullPointer
  AnnotationsInjectionTest.testInjection:134 » NullPointer
  AnnotationsInjectionTest.testInvoke:324 » NullPointer
  AnnotationsInjectionTest.testOptionalInjection:210 » NullPointer
  AnnotationsInjectionTest.testOptionalInvoke:253 » NullPointer
  AnnotationsInjectionTest.testPostConstruct:103 » NullPointer
  AnnotationsInjectionTest.testPreDestroy:357 » NullPointer
  ComplexDisposalTest.testU:65 » NullPointer
  ComplexDisposalTest.testV:80 » NullPointer
  ComplexDisposalTest.testW:99 » NullPointer
  ContextFunctionDynamicsTest.testBug315109:170 » NullPointer
  ContextFunctionDynamicsTest.testChangeICF:60 » NullPointer
  ContextFunctionDynamicsTest.testLongChain:120 » NullPointer
  ContextFunctionDynamicsTest.testOverrideICF:91 » NullPointer
  ContextInjectionDisposeTest.testContextDisposedNoArg:57 » NullPointer
  ContextInjectionDisposeTest.testDisposeContext:86 » NullPointer
  ContextInjectionDisposeTest.testReleaseObject:124 » NullPointer
  ContextInjectionFactoryTest.testConstructorInjectionBasic:103 » NullPointer
  ContextInjectionFactoryTest.testInvoke:77 » NullPointer
  ContextInjectionFactoryTest.testInvokeWithParameters:87 » NullPointer
  ContextInjectionTest.testBug374421:312 » NullPointer
  ContextInjectionTest.testContextSetOneArg:64 » NullPointer
  ContextInjectionTest.testContextSetZeroArgs:103 » NullPointer
  ContextInjectionTest.testInjection:134 » NullPointer
  ContextInjectionTest.testInjectionAndInheritance:209 » NullPointer
  ContextInjectionTest.testInjectionCloseOverride:294 » NullPointer
  ContextInjectionTest.testInjectionFromParent:175 » NullPointer
  DisposingReferencedContextTest.testContextDisposeCausesCompleteUninjection_Mandatory_False:62->testContextDisposeCausesCompleteUninjection_Mandatory:85 » NullPointer
  DisposingReferencedContextTest.testContextDisposeCausesCompleteUninjection_Mandatory_True:57->testContextDisposeCausesCompleteUninjection_Mandatory:85 » NullPointer
  DisposingReferencedContextTest.testContextDisposeCausesCompleteUninjection_Optional_False:72->testContextDisposeCausesCompleteUninjection_Optional:103 » NullPointer
  DisposingReferencedContextTest.testContextDisposeCausesCompleteUninjection_Optional_True:67->testContextDisposeCausesCompleteUninjection_Optional:103 » NullPointer
  ExtraDependenciesTest.testExtraDependencies:77 » NullPointer
  GenericsInjectionTest.testGenericInjection:95 » NullPointer
  GenericsInjectionTest.testNamedInjection:75 » NullPointer
  GroupedUpdatesTest.testGrouping:103 » NullPointer
  GroupedUpdatesTest.testNoGrouping:81 » NullPointer
  InjectStaticContextTest.testStaticInject:196 » NullPointer
  InjectStaticContextTest.testStaticInvoke:268 » NullPointer
  InjectStaticContextTest.testStaticMake:113 » NullPointer
  InjectionUpdateTest.testNestedUpdatesConstructor:181 » NullPointer
  InjectionUpdateTest.testNestedUpdatesPostConstruct:144 » NullPointer
  InjectionUpdateTest.testPropagation:103 » NullPointer
  InvokeInRATTest.testStaticInvoke:66 » NullPointer
  ParentContextDisposalTest.testParentContextDisposal:55 » NullPointer
  ProviderInjectionTest.testConstructorWithProvider:92 » NullPointer
  ProviderInjectionTest.testInvokeWithProvider:78 » NullPointer
  ServiceContextTest.testOptionalReferences:299 » NullPointer
  ServiceContextTest.testServiceRanking:348 » NullPointer
  TestConstructorInjection.testConstructorInjection:110 » NullPointer
  AutoConstructWithCreatableTest.testCreatableIsCreated:73 » NullPointer
  AutoConstructWithCreatableTest.testNonCreatableInstanceAreNotCreated »  Unexpe...
  AutoConstructWithCreatableTest.testNonCreatableInstancesAreUsedFromContext:102 » NullPointer
  DisposeClassLinkTest.testBug430041:156 » NullPointer
  DisposeClassLinkTest.testDisposeParent:101 » NullPointer
  DisposeClassLinkTest.testDisposeParentFirst:130 » NullPointer
  DisposeClassLinkTest.testInject:118 » NullPointer
  DisposeClassLinkTest.testInjectedWithContext:140 » NullPointer
  DisposeClassLinkTest.testMake:90 » NullPointer
  InjectArraysTest.testArrayInjection:64 » NullPointer
  InjectBaseTypeTest.testPrimitiveTypes:85 » NullPointer
  InjectBridgeTest.testInjection:54 » NullPointer
  InjectBridgeTest.testInjectionFail »  Unexpected exception, expected<org.eclip...
  InjectBridgeTest.testInvokation:70 » NullPointer
  InjectBridgeTest.testInvokationFail »  Unexpected exception, expected<org.ecli...
org.eclipse.e4.core.internal.tests.di.InjectionOrderTest.testSpecialMethodOnFailure(org.eclipse.e4.core.internal.tests.di.InjectionOrderTest)
  Run 1: InjectionOrderTest.testSpecialMethodOnFailure:64 » NullPointer
  Run 2: InjectionOrderTest.testSpecialMethodOnFailure:64 » NullPointer

  InjectionResultLeakTest.testLeaks:60 » NullPointer
  InvokeTest.testSuperclassMethods:49 » NullPointer
  RecursiveObjectCreationTest.testNested:89 » NullPointer
  RecursiveObjectCreationTest.testSelfInject:49 » NullPointer
  ExtendedSupplierInjectionTests.setUp:89 » NullPointer
  ExtendedSupplierInjectionTests.setUp:89 » NullPointer
  ExtendedSupplierInjectionTests.setUp:89 » NullPointer
  InjectionEventTest.setUp:140 » NullPointer
  InjectionEventTest.setUp:140 » NullPointer
  InjectionEventTest.setUp:140 » NullPointer
  InjectionEventTest.setUp:140 » NullPointer
  InjectionMixedSuppliersTest.testPreferencesQualifier:52 » NullPointer
  InjectionOSGiHandlerTest.testInjectBCinExecute:54 » NullPointer
  InjectionOSGiTest.setUp:105 » NullPointer
  InjectionOSGiTest.setUp:105 » NullPointer
  InjectionOSGiTest.setUp:105 » NullPointer
  InjectionPreferencesTest.testAutoConversion:242 » NullPointer
  InjectionPreferencesTest.testBaseTypeConversion:201 » NullPointer
  InjectionPreferencesTest.testPreferencesConstructor:285 » NullPointer
  InjectionPreferencesTest.testPreferencesQualifier:159 » NullPointer
  ServiceSupplierTestCase.testCleanup:198 » NullPointer
  ServiceSupplierTestCase.testDynamicAdd:120 » NullPointer
  ServiceSupplierTestCase.testDynamicAddRemove:161 » NullPointer
  ServiceSupplierTestCase.testInitialInject:86 » NullPointer
  ServiceSupplierTestCase.testOptionalReferences:216 » NullPointer
  ServiceSupplierTestCase.testStaticFilter:102 » NullPointer
  NLSTest.testBundleMessages:411 » NullPointer
  NLSTest.testBundleMessagesDifferentLocale:447 » NullPointer
  NLSTest.testBundleMessagesSkipDefaultLocaleForEquinoxRoot:493 » NullPointer
  NLSTest.testBundleMessagesUseDefaultLocaleForInvalidLocale:533 » NullPointer
  NLSTest.testClassBasedResourceBundle:572 » NullPointer
  NLSTest.testClassBasedResourceBundleDifferentLocale:610 » NullPointer
  NLSTest.testClassBasedResourceBundleSkipDefaultLocaleForEquinoxRoot:656 » NullPointer
  NLSTest.testClassBasedResourceBundleUseDefaultLocaleForInvalidLocale:698 » NullPointer
  NLSTest.testMessages:250 » NullPointer
  NLSTest.testMessagesDifferentLocale:286 » NullPointer
  NLSTest.testMessagesSkipDefaultLocaleForEquinoxRoot:332 » NullPointer
  NLSTest.testMessagesUseDefaultLocaleForInvalidLocale:372 » NullPointer
  NLSTest.testResourcesBundle:737 » NullPointer
  NLSTest.testResourcesBundleDifferentLocale:775 » NullPointer
  NLSTest.testResourcesBundleSkipDefaultLocaleForEquinoxRoot:821 » NullPointer
  NLSTest.testResourcesBundleUseDefaultLocaleForInvalidLocale:863 » NullPointer
  NLSTest.testSimpleMessages:89 » NullPointer
  NLSTest.testSimpleMessagesDifferentLocale:125 » NullPointer
  NLSTest.testSimpleMessagesSkipDefaultLocaleForEquinoxRoot:171 » NullPointer
  NLSTest.testSimpleMessagesUseDefaultLocaleForInvalidLocale:211 » NullPointer

Tests run: 194, Failures: 0, Errors: 123, Skipped: 0

[INFO] 
[INFO] --------< org.eclipse.core:org.eclipse.core.contenttype.tests >---------
[INFO] Building org.eclipse.core.contenttype.tests 1.0.200-SNAPSHOT     [18/18]
[INFO] ------------------------[ eclipse-test-plugin ]-------------------------
[INFO] 
[INFO] --- maven-clean-plugin:3.1.0:clean (default-clean) @ org.eclipse.core.contenttype.tests ---
[INFO] 
[INFO] --- tycho-packaging-plugin:1.6.0-SNAPSHOT:build-qualifier (default-build-qualifier) @ org.eclipse.core.contenttype.tests ---
[INFO] The project's OSGi version is 1.0.200.v20190925-0538
[INFO] 
[INFO] --- tycho-packaging-plugin:1.6.0-SNAPSHOT:validate-id (default-validate-id) @ org.eclipse.core.contenttype.tests ---
[INFO] 
[INFO] --- tycho-packaging-plugin:1.6.0-SNAPSHOT:validate-version (default-validate-version) @ org.eclipse.core.contenttype.tests ---
[INFO] 
[INFO] --- maven-resources-plugin:3.1.0:copy-resources (saveproperties) @ org.eclipse.core.contenttype.tests ---
[INFO] Using 'UTF-8' encoding to copy filtered resources.
[INFO] skip non existing resourceDirectory /home/jenkins/agent/workspace/eclipse.platform.runtime-Gerrit/tests/org.eclipse.core.contenttype.tests/saveproperties
[INFO] 
[INFO] --- maven-enforcer-plugin:3.0.0-M3:enforce (enforce-maven) @ org.eclipse.core.contenttype.tests ---
[INFO] 
[INFO] --- eclipse-cbi-plugin:1.1.8-SNAPSHOT:generate-api-build-xml (default) @ org.eclipse.core.contenttype.tests ---
[INFO] 
[INFO] --- maven-resources-plugin:3.1.0:resources (default-resources) @ org.eclipse.core.contenttype.tests ---
[INFO] Using 'UTF-8' encoding to copy filtered resources.
[INFO] skip non existing resourceDirectory /home/jenkins/agent/workspace/eclipse.platform.runtime-Gerrit/tests/org.eclipse.core.contenttype.tests/src/main/resources
[INFO] 
[INFO] --- maven-resources-plugin:3.1.0:resources (filter-resources) @ org.eclipse.core.contenttype.tests ---
[INFO] Using 'UTF-8' encoding to copy filtered resources.
[INFO] skip non existing resourceDirectory /home/jenkins/agent/workspace/eclipse.platform.runtime-Gerrit/tests/org.eclipse.core.contenttype.tests/src/main/resources
[INFO] 
[INFO] --- tycho-compiler-plugin:1.6.0-SNAPSHOT:compile (default-compile) @ org.eclipse.core.contenttype.tests ---
[INFO] Compiling 2 source files to /home/jenkins/agent/workspace/eclipse.platform.runtime-Gerrit/tests/org.eclipse.core.contenttype.tests/target/classes
[INFO] 
[INFO] --- tycho-eclipserun-plugin:1.6.0-SNAPSHOT:eclipse-run (default) @ org.eclipse.core.contenttype.tests ---
[INFO] 
[INFO] --- maven-resources-plugin:3.1.0:testResources (default-testResources) @ org.eclipse.core.contenttype.tests ---
[INFO] Using 'UTF-8' encoding to copy filtered resources.
[INFO] skip non existing resourceDirectory /home/jenkins/agent/workspace/eclipse.platform.runtime-Gerrit/tests/org.eclipse.core.contenttype.tests/src/test/resources
[INFO] 
[INFO] --- tycho-source-plugin:1.6.0-SNAPSHOT:plugin-source (plugin-source) @ org.eclipse.core.contenttype.tests ---
[INFO] Building jar: /home/jenkins/agent/workspace/eclipse.platform.runtime-Gerrit/tests/org.eclipse.core.contenttype.tests/target/org.eclipse.core.contenttype.tests-1.0.200-SNAPSHOT-sources.jar
[INFO] 
[INFO] --- target-platform-configuration:1.6.0-SNAPSHOT:target-platform (default-target-platform) @ org.eclipse.core.contenttype.tests ---
[INFO] 
[INFO] --- tycho-packaging-plugin:1.6.0-SNAPSHOT:package-plugin (default-package-plugin) @ org.eclipse.core.contenttype.tests ---
[INFO] Building jar: /home/jenkins/agent/workspace/eclipse.platform.runtime-Gerrit/tests/org.eclipse.core.contenttype.tests/target/org.eclipse.core.contenttype.tests-1.0.200-SNAPSHOT.jar
[INFO] 
[INFO] --- tycho-p2-plugin:1.6.0-SNAPSHOT:p2-metadata-default (default-p2-metadata-default) @ org.eclipse.core.contenttype.tests ---
[INFO] No baseline version MavenProject: org.eclipse.core:org.eclipse.core.contenttype.tests:1.0.200-SNAPSHOT @ /home/jenkins/agent/workspace/eclipse.platform.runtime-Gerrit/tests/org.eclipse.core.contenttype.tests/pom.xml
[INFO] 
[INFO] --- tycho-surefire-plugin:1.6.0-SNAPSHOT:test (default-test) @ org.eclipse.core.contenttype.tests ---
[INFO] Expected eclipse log file: /home/jenkins/agent/workspace/eclipse.platform.runtime-Gerrit/tests/org.eclipse.core.contenttype.tests/target/work/data/.metadata/.log
[INFO] Command line:
	[/opt/tools/java/openjdk/jdk-11/11.0.4/bin/java, -Dosgi.noShutdown=false, -Dosgi.os=linux, -Dosgi.ws=gtk, -Dosgi.arch=x86_64, --add-modules=ALL-SYSTEM, -Dosgi.clean=true, -ea, -jar, /home/jenkins/agent/workspace/eclipse.platform.runtime-Gerrit/.repository/p2/osgi/bundle/org.eclipse.equinox.launcher/1.5.700.v20200107-1357/org.eclipse.equinox.launcher-1.5.700.v20200107-1357.jar, -data, /home/jenkins/agent/workspace/eclipse.platform.runtime-Gerrit/tests/org.eclipse.core.contenttype.tests/target/work/data, -install, /home/jenkins/agent/workspace/eclipse.platform.runtime-Gerrit/tests/org.eclipse.core.contenttype.tests/target/work, -configuration, /home/jenkins/agent/workspace/eclipse.platform.runtime-Gerrit/tests/org.eclipse.core.contenttype.tests/target/work/configuration, -application, org.eclipse.tycho.surefire.osgibooter.headlesstest, -testproperties, /home/jenkins/agent/workspace/eclipse.platform.runtime-Gerrit/tests/org.eclipse.core.contenttype.tests/target/surefire.properties]
Picked up JAVA_TOOL_OPTIONS: -XX:+IgnoreUnrecognizedVMOptions -XX:+UseContainerSupport -XX:+UnlockExperimentalVMOptions -XX:+UseCGroupMemoryLimitForHeap
Picked up _JAVA_OPTIONS: -XX:MaxRAMPercentage=64.0
Running org.eclipse.core.internal.contenttype.tests.AllTests
Tests run: 3, Failures: 0, Errors: 0, Skipped: 0, Time elapsed: 0.183 s - in org.eclipse.core.internal.contenttype.tests.AllTests
testCannotDeleteSystemContentType(org.eclipse.core.internal.contenttype.tests.UserContentTypeTest)  Time elapsed: 0.054 s
testPersistContentTypeAndAssociation(org.eclipse.core.internal.contenttype.tests.UserContentTypeTest)  Time elapsed: 0.037 s
testAddUserDefinedContentTypes(org.eclipse.core.internal.contenttype.tests.UserContentTypeTest)  Time elapsed: 0.002 s

Results:

Tests run: 3, Failures: 0, Errors: 0, Skipped: 0

[INFO] All tests passed!
[INFO] 
[INFO] --- tycho-p2-extras-plugin:1.6.0-SNAPSHOT:compare-version-with-baselines (compare-attached-artifacts-with-release) @ org.eclipse.core.contenttype.tests ---
[INFO] 
[INFO] --- maven-antrun-plugin:1.8:run (check-skip-api-analysis) @ org.eclipse.core.contenttype.tests ---
[INFO] Skipping Antrun execution
[INFO] 
[INFO] --- tycho-dependency-tools-plugin:1.6.0-SNAPSHOT:list-dependencies (list-dependencies) @ org.eclipse.core.contenttype.tests ---
[INFO] Skipped
[INFO] 
[INFO] --- tycho-eclipserun-plugin:1.6.0-SNAPSHOT:eclipse-run (api-analysis) @ org.eclipse.core.contenttype.tests ---
[INFO] ------------------------------------------------------------------------
[INFO] Reactor Summary:
[INFO] 
[INFO] eclipse.platform.runtime 4.15.0-SNAPSHOT ........... SUCCESS [ 40.947 s]
[INFO] org.eclipse.core.contenttype 3.7.600-SNAPSHOT ...... SUCCESS [ 51.781 s]
[INFO] org.eclipse.core.jobs 3.10.700-SNAPSHOT ............ SUCCESS [ 23.979 s]
[INFO] org.eclipse.core.runtime 3.17.100-SNAPSHOT ......... SUCCESS [ 29.151 s]
[INFO] org.eclipse.core.expressions 3.6.700-SNAPSHOT ...... SUCCESS [ 26.061 s]
[INFO] org.eclipse.e4.core.di.annotations 1.6.600-SNAPSHOT  SUCCESS [ 21.960 s]
[INFO] org.eclipse.e4.core.di 1.7.500-SNAPSHOT ............ SUCCESS [ 21.610 s]
[INFO] org.eclipse.e4.core.contexts 1.8.400-SNAPSHOT ...... SUCCESS [ 25.520 s]
[INFO] org.eclipse.e4.core.di.extensions 0.15.500-SNAPSHOT  SUCCESS [ 16.671 s]
[INFO] org.eclipse.e4.core.di.extensions.supplier 0.15.500-SNAPSHOT SUCCESS [ 25.749 s]
[INFO] org.eclipse.e4.core.services 2.2.200-SNAPSHOT ...... SUCCESS [ 34.790 s]
[INFO] org.eclipse.core.runtime.feature 1.2.800-SNAPSHOT .. SUCCESS [  0.620 s]
[INFO] eclipse.platform.runtime.tests 4.15.0-SNAPSHOT ..... SUCCESS [  0.093 s]
[INFO] org.eclipse.core.expressions.tests 3.5.600-SNAPSHOT  FAILURE [  8.474 s]
[INFO] org.eclipse.core.tests.harness 3.11.700-SNAPSHOT ... SUCCESS [ 18.921 s]
[INFO] org.eclipse.core.tests.runtime 3.11.1000-SNAPSHOT .. SUCCESS [06:15 min]
[INFO] org.eclipse.e4.core.tests 1.1.1000-SNAPSHOT ........ FAILURE [  9.703 s]
[INFO] org.eclipse.core.contenttype.tests 1.0.200-SNAPSHOT  SUCCESS [  7.075 s]
[INFO] ------------------------------------------------------------------------
[INFO] BUILD FAILURE
[INFO] ------------------------------------------------------------------------
[INFO] Total time:  14:21 min
[INFO] Finished at: 2020-01-17T18:13:27Z
[INFO] ------------------------------------------------------------------------
[ERROR] Failed to execute goal org.eclipse.tycho:tycho-surefire-plugin:1.6.0-SNAPSHOT:test (default-test) on project org.eclipse.core.expressions.tests: An unexpected error occurred while launching the test runtime (return code 13). See log /home/jenkins/agent/workspace/eclipse.platform.runtime-Gerrit/tests/org.eclipse.core.expressions.tests/target/work/data/.metadata/.log for details. -> [Help 1]
[ERROR] Failed to execute goal org.eclipse.tycho:tycho-surefire-plugin:1.6.0-SNAPSHOT:test (default-test) on project org.eclipse.e4.core.tests: There are test failures.
[ERROR] 
[ERROR] Please refer to /home/jenkins/agent/workspace/eclipse.platform.runtime-Gerrit/tests/org.eclipse.e4.core.tests/target/surefire-reports for the individual test results.
[ERROR] -> [Help 1]
[ERROR] 
[ERROR] To see the full stack trace of the errors, re-run Maven with the -e switch.
[ERROR] Re-run Maven using the -X switch to enable full debug logging.
[ERROR] 
[ERROR] For more information about the errors and possible solutions, please read the following articles:
[ERROR] [Help 1] http://cwiki.apache.org/confluence/display/MAVEN/MojoFailureException
[ERROR] 
[ERROR] After correcting the problems, you can resume the build with the command
[ERROR]   mvn <goals> -rf :org.eclipse.core.expressions.tests
Build step 'Invoke top-level Maven targets' marked build as failure
Terminating xvnc.
[WARNINGS] Skipping publisher since build result is FAILURE
Recording test results
Finished: FAILURE