FailedConsole Output

Skipping 995 KB.. Full Log
.9 MB
Progress (1): 0/2.9 MB
Progress (1): 0.1/2.9 MB
Progress (1): 0.1/2.9 MB
Progress (1): 0.1/2.9 MB
Progress (1): 0.1/2.9 MB
Progress (1): 0.1/2.9 MB
Progress (1): 0.1/2.9 MB
Progress (1): 0.1/2.9 MB
Progress (1): 0.1/2.9 MB
Progress (1): 0.1/2.9 MB
Progress (1): 0.1/2.9 MB
Progress (1): 0.1/2.9 MB
Progress (1): 0.1/2.9 MB
Progress (1): 0.1/2.9 MB
Progress (1): 0.1/2.9 MB
Progress (1): 0.1/2.9 MB
Progress (1): 0.1/2.9 MB
Progress (1): 0.1/2.9 MB
Progress (1): 0.1/2.9 MB
Progress (1): 0.1/2.9 MB
Progress (1): 0.1/2.9 MB
Progress (1): 0.1/2.9 MB
Progress (1): 0.1/2.9 MB
Progress (1): 0.1/2.9 MB
Progress (1): 0.1/2.9 MB
Progress (1): 0.1/2.9 MB
Progress (1): 0.2/2.9 MB
Progress (1): 0.2/2.9 MB
Progress (1): 0.2/2.9 MB
Progress (1): 0.2/2.9 MB
Progress (1): 0.2/2.9 MB
Progress (1): 0.2/2.9 MB
Progress (1): 0.2/2.9 MB
Progress (1): 0.2/2.9 MB
Progress (1): 0.2/2.9 MB
Progress (1): 0.2/2.9 MB
Progress (1): 0.2/2.9 MB
Progress (1): 0.2/2.9 MB
Progress (1): 0.2/2.9 MB
Progress (1): 0.2/2.9 MB
Progress (1): 0.2/2.9 MB
Progress (1): 0.2/2.9 MB
Progress (1): 0.2/2.9 MB
Progress (1): 0.2/2.9 MB
Progress (1): 0.2/2.9 MB
Progress (1): 0.2/2.9 MB
Progress (1): 0.2/2.9 MB
Progress (1): 0.2/2.9 MB
Progress (1): 0.2/2.9 MB
Progress (1): 0.2/2.9 MB
Progress (1): 0.2/2.9 MB
Progress (1): 0.3/2.9 MB
Progress (1): 0.3/2.9 MB
Progress (1): 0.3/2.9 MB
Progress (1): 0.3/2.9 MB
Progress (1): 0.3/2.9 MB
Progress (1): 0.3/2.9 MB
Progress (1): 0.3/2.9 MB
Progress (1): 0.3/2.9 MB
Progress (1): 0.3/2.9 MB
Progress (1): 0.3/2.9 MB
Progress (1): 0.3/2.9 MB
Progress (1): 0.3/2.9 MB
Progress (1): 0.3/2.9 MB
Progress (1): 0.3/2.9 MB
Progress (1): 0.3/2.9 MB
Progress (1): 0.3/2.9 MB
Progress (1): 0.3/2.9 MB
Progress (1): 0.3/2.9 MB
Progress (1): 0.3/2.9 MB
Progress (1): 0.3/2.9 MB
Progress (1): 0.3/2.9 MB
Progress (1): 0.3/2.9 MB
Progress (1): 0.3/2.9 MB
Progress (1): 0.3/2.9 MB
Progress (1): 0.3/2.9 MB
Progress (1): 0.4/2.9 MB
Progress (1): 0.4/2.9 MB
Progress (1): 0.4/2.9 MB
Progress (1): 0.4/2.9 MB
Progress (1): 0.4/2.9 MB
Progress (1): 0.4/2.9 MB
Progress (1): 0.4/2.9 MB
Progress (1): 0.4/2.9 MB
Progress (1): 0.4/2.9 MB
Progress (1): 0.4/2.9 MB
Progress (1): 0.4/2.9 MB
Progress (1): 0.4/2.9 MB
Progress (1): 0.4/2.9 MB
Progress (1): 0.4/2.9 MB
Progress (1): 0.4/2.9 MB
Progress (1): 0.4/2.9 MB
Progress (1): 0.4/2.9 MB
Progress (1): 0.4/2.9 MB
Progress (1): 0.4/2.9 MB
Progress (1): 0.4/2.9 MB
Progress (1): 0.4/2.9 MB
Progress (1): 0.4/2.9 MB
Progress (1): 0.4/2.9 MB
Progress (1): 0.4/2.9 MB
Progress (1): 0.4/2.9 MB
Progress (1): 0.5/2.9 MB
Progress (1): 0.5/2.9 MB
Progress (1): 0.5/2.9 MB
Progress (1): 0.5/2.9 MB
Progress (1): 0.5/2.9 MB
Progress (1): 0.5/2.9 MB
Progress (1): 0.5/2.9 MB
Progress (1): 0.5/2.9 MB
Progress (1): 0.5/2.9 MB
Progress (1): 0.5/2.9 MB
Progress (1): 0.5/2.9 MB
Progress (1): 0.5/2.9 MB
Progress (1): 0.5/2.9 MB
Progress (1): 0.5/2.9 MB
Progress (1): 0.5/2.9 MB
Progress (1): 0.5/2.9 MB
Progress (1): 0.5/2.9 MB
Progress (1): 0.5/2.9 MB
Progress (1): 0.5/2.9 MB
Progress (1): 0.5/2.9 MB
Progress (1): 0.5/2.9 MB
Progress (1): 0.5/2.9 MB
Progress (1): 0.5/2.9 MB
Progress (1): 0.5/2.9 MB
Progress (1): 0.5/2.9 MB
Progress (1): 0.6/2.9 MB
Progress (1): 0.6/2.9 MB
Progress (1): 0.6/2.9 MB
Progress (1): 0.6/2.9 MB
Progress (1): 0.6/2.9 MB
Progress (1): 0.6/2.9 MB
Progress (1): 0.6/2.9 MB
Progress (1): 0.6/2.9 MB
Progress (1): 0.6/2.9 MB
Progress (1): 0.6/2.9 MB
Progress (1): 0.6/2.9 MB
Progress (1): 0.6/2.9 MB
Progress (1): 0.6/2.9 MB
Progress (1): 0.6/2.9 MB
Progress (1): 0.6/2.9 MB
Progress (1): 0.6/2.9 MB
Progress (1): 0.6/2.9 MB
Progress (1): 0.6/2.9 MB
Progress (1): 0.6/2.9 MB
Progress (1): 0.6/2.9 MB
Progress (1): 0.6/2.9 MB
Progress (1): 0.6/2.9 MB
Progress (1): 0.6/2.9 MB
Progress (1): 0.6/2.9 MB
Progress (1): 0.6/2.9 MB
Progress (1): 0.7/2.9 MB
Progress (1): 0.7/2.9 MB
Progress (1): 0.7/2.9 MB
Progress (1): 0.7/2.9 MB
Progress (1): 0.7/2.9 MB
Progress (1): 0.7/2.9 MB
Progress (1): 0.7/2.9 MB
Progress (1): 0.7/2.9 MB
Progress (1): 0.7/2.9 MB
Progress (1): 0.7/2.9 MB
Progress (1): 0.7/2.9 MB
Progress (1): 0.7/2.9 MB
Progress (1): 0.7/2.9 MB
Progress (1): 0.7/2.9 MB
Progress (1): 0.7/2.9 MB
Progress (1): 0.7/2.9 MB
Progress (1): 0.7/2.9 MB
Progress (1): 0.7/2.9 MB
Progress (1): 0.7/2.9 MB
Progress (1): 0.7/2.9 MB
Progress (1): 0.7/2.9 MB
Progress (1): 0.7/2.9 MB
Progress (1): 0.7/2.9 MB
Progress (1): 0.7/2.9 MB
Progress (1): 0.7/2.9 MB
Progress (1): 0.8/2.9 MB
Progress (1): 0.8/2.9 MB
Progress (1): 0.8/2.9 MB
Progress (1): 0.8/2.9 MB
Progress (1): 0.8/2.9 MB
Progress (1): 0.8/2.9 MB
Progress (1): 0.8/2.9 MB
Progress (1): 0.8/2.9 MB
Progress (1): 0.8/2.9 MB
Progress (1): 0.8/2.9 MB
Progress (1): 0.8/2.9 MB
Progress (1): 0.8/2.9 MB
Progress (1): 0.8/2.9 MB
Progress (1): 0.8/2.9 MB
Progress (1): 0.8/2.9 MB
Progress (1): 0.8/2.9 MB
Progress (1): 0.8/2.9 MB
Progress (1): 0.8/2.9 MB
Progress (1): 0.8/2.9 MB
Progress (1): 0.8/2.9 MB
Progress (1): 0.8/2.9 MB
Progress (1): 0.8/2.9 MB
Progress (1): 0.8/2.9 MB
Progress (1): 0.8/2.9 MB
Progress (1): 0.8/2.9 MB
Progress (1): 0.9/2.9 MB
Progress (1): 0.9/2.9 MB
Progress (1): 0.9/2.9 MB
Progress (1): 0.9/2.9 MB
Progress (1): 0.9/2.9 MB
Progress (1): 0.9/2.9 MB
Progress (1): 0.9/2.9 MB
Progress (1): 0.9/2.9 MB
Progress (1): 0.9/2.9 MB
Progress (1): 0.9/2.9 MB
Progress (1): 0.9/2.9 MB
Progress (1): 0.9/2.9 MB
Progress (1): 0.9/2.9 MB
Progress (1): 0.9/2.9 MB
Progress (1): 0.9/2.9 MB
Progress (1): 0.9/2.9 MB
Progress (1): 0.9/2.9 MB
Progress (1): 0.9/2.9 MB
Progress (1): 0.9/2.9 MB
Progress (1): 0.9/2.9 MB
Progress (1): 0.9/2.9 MB
Progress (1): 0.9/2.9 MB
Progress (1): 0.9/2.9 MB
Progress (1): 0.9/2.9 MB
Progress (1): 0.9/2.9 MB
Progress (1): 1.0/2.9 MB
Progress (1): 1.0/2.9 MB
Progress (1): 1.0/2.9 MB
Progress (1): 1.0/2.9 MB
Progress (1): 1.0/2.9 MB
Progress (1): 1.0/2.9 MB
Progress (1): 1.0/2.9 MB
Progress (1): 1.0/2.9 MB
Progress (1): 1.0/2.9 MB
Progress (1): 1.0/2.9 MB
Progress (1): 1.0/2.9 MB
Progress (1): 1.0/2.9 MB
Progress (1): 1.0/2.9 MB
Progress (1): 1.0/2.9 MB
Progress (1): 1.0/2.9 MB
Progress (1): 1.0/2.9 MB
Progress (1): 1.0/2.9 MB
Progress (1): 1.0/2.9 MB
Progress (1): 1.0/2.9 MB
Progress (1): 1.0/2.9 MB
Progress (1): 1.0/2.9 MB
Progress (1): 1.0/2.9 MB
Progress (1): 1.0/2.9 MB
Progress (1): 1.0/2.9 MB
Progress (1): 1.0/2.9 MB
Progress (1): 1.1/2.9 MB
Progress (1): 1.1/2.9 MB
Progress (1): 1.1/2.9 MB
Progress (1): 1.1/2.9 MB
Progress (1): 1.1/2.9 MB
Progress (1): 1.1/2.9 MB
Progress (1): 1.1/2.9 MB
Progress (1): 1.1/2.9 MB
Progress (1): 1.1/2.9 MB
Progress (1): 1.1/2.9 MB
Progress (1): 1.1/2.9 MB
Progress (1): 1.1/2.9 MB
Progress (1): 1.1/2.9 MB
Progress (1): 1.1/2.9 MB
Progress (1): 1.1/2.9 MB
Progress (1): 1.1/2.9 MB
Progress (1): 1.1/2.9 MB
Progress (1): 1.1/2.9 MB
Progress (1): 1.1/2.9 MB
Progress (1): 1.1/2.9 MB
Progress (1): 1.1/2.9 MB
Progress (1): 1.1/2.9 MB
Progress (1): 1.1/2.9 MB
Progress (1): 1.1/2.9 MB
Progress (1): 1.1/2.9 MB
Progress (1): 1.2/2.9 MB
Progress (1): 1.2/2.9 MB
Progress (1): 1.2/2.9 MB
Progress (1): 1.2/2.9 MB
Progress (1): 1.2/2.9 MB
Progress (1): 1.2/2.9 MB
Progress (1): 1.2/2.9 MB
Progress (1): 1.2/2.9 MB
Progress (1): 1.2/2.9 MB
Progress (1): 1.2/2.9 MB
Progress (1): 1.2/2.9 MB
Progress (1): 1.2/2.9 MB
Progress (1): 1.2/2.9 MB
Progress (1): 1.2/2.9 MB
Progress (1): 1.2/2.9 MB
Progress (1): 1.2/2.9 MB
Progress (1): 1.2/2.9 MB
Progress (1): 1.2/2.9 MB
Progress (1): 1.2/2.9 MB
Progress (1): 1.2/2.9 MB
Progress (1): 1.2/2.9 MB
Progress (1): 1.2/2.9 MB
Progress (1): 1.2/2.9 MB
Progress (1): 1.2/2.9 MB
Progress (1): 1.2/2.9 MB
Progress (1): 1.3/2.9 MB
Progress (1): 1.3/2.9 MB
Progress (1): 1.3/2.9 MB
Progress (1): 1.3/2.9 MB
Progress (1): 1.3/2.9 MB
Progress (1): 1.3/2.9 MB
Progress (1): 1.3/2.9 MB
Progress (1): 1.3/2.9 MB
Progress (1): 1.3/2.9 MB
Progress (1): 1.3/2.9 MB
Progress (1): 1.3/2.9 MB
Progress (1): 1.3/2.9 MB
Progress (1): 1.3/2.9 MB
Progress (1): 1.3/2.9 MB
Progress (1): 1.3/2.9 MB
Progress (1): 1.3/2.9 MB
Progress (1): 1.3/2.9 MB
Progress (1): 1.3/2.9 MB
Progress (1): 1.3/2.9 MB
Progress (1): 1.3/2.9 MB
Progress (1): 1.3/2.9 MB
Progress (1): 1.3/2.9 MB
Progress (1): 1.3/2.9 MB
Progress (1): 1.3/2.9 MB
Progress (1): 1.3/2.9 MB
Progress (1): 1.4/2.9 MB
Progress (1): 1.4/2.9 MB
Progress (1): 1.4/2.9 MB
Progress (1): 1.4/2.9 MB
Progress (1): 1.4/2.9 MB
Progress (1): 1.4/2.9 MB
Progress (1): 1.4/2.9 MB
Progress (1): 1.4/2.9 MB
Progress (1): 1.4/2.9 MB
Progress (1): 1.4/2.9 MB
Progress (1): 1.4/2.9 MB
Progress (1): 1.4/2.9 MB
Progress (1): 1.4/2.9 MB
Progress (1): 1.4/2.9 MB
Progress (1): 1.4/2.9 MB
Progress (1): 1.4/2.9 MB
Progress (1): 1.4/2.9 MB
Progress (1): 1.4/2.9 MB
Progress (1): 1.4/2.9 MB
Progress (1): 1.4/2.9 MB
Progress (1): 1.4/2.9 MB
Progress (1): 1.4/2.9 MB
Progress (1): 1.4/2.9 MB
Progress (1): 1.4/2.9 MB
Progress (1): 1.4/2.9 MB
Progress (1): 1.5/2.9 MB
Progress (1): 1.5/2.9 MB
Progress (1): 1.5/2.9 MB
Progress (1): 1.5/2.9 MB
Progress (1): 1.5/2.9 MB
Progress (1): 1.5/2.9 MB
Progress (1): 1.5/2.9 MB
Progress (1): 1.5/2.9 MB
Progress (1): 1.5/2.9 MB
Progress (1): 1.5/2.9 MB
Progress (1): 1.5/2.9 MB
Progress (1): 1.5/2.9 MB
Progress (1): 1.5/2.9 MB
Progress (1): 1.5/2.9 MB
Progress (1): 1.5/2.9 MB
Progress (1): 1.5/2.9 MB
Progress (1): 1.5/2.9 MB
Progress (1): 1.5/2.9 MB
Progress (1): 1.5/2.9 MB
Progress (1): 1.5/2.9 MB
Progress (1): 1.5/2.9 MB
Progress (1): 1.5/2.9 MB
Progress (1): 1.5/2.9 MB
Progress (1): 1.5/2.9 MB
Progress (1): 1.5/2.9 MB
Progress (1): 1.6/2.9 MB
Progress (1): 1.6/2.9 MB
Progress (1): 1.6/2.9 MB
Progress (1): 1.6/2.9 MB
Progress (1): 1.6/2.9 MB
Progress (1): 1.6/2.9 MB
Progress (1): 1.6/2.9 MB
Progress (1): 1.6/2.9 MB
Progress (1): 1.6/2.9 MB
Progress (1): 1.6/2.9 MB
Progress (1): 1.6/2.9 MB
Progress (1): 1.6/2.9 MB
Progress (1): 1.6/2.9 MB
Progress (1): 1.6/2.9 MB
Progress (1): 1.6/2.9 MB
Progress (1): 1.6/2.9 MB
Progress (1): 1.6/2.9 MB
Progress (1): 1.6/2.9 MB
Progress (1): 1.6/2.9 MB
Progress (1): 1.6/2.9 MB
Progress (1): 1.6/2.9 MB
Progress (1): 1.6/2.9 MB
Progress (1): 1.6/2.9 MB
Progress (1): 1.6/2.9 MB
Progress (1): 1.6/2.9 MB
Progress (1): 1.7/2.9 MB
Progress (1): 1.7/2.9 MB
Progress (1): 1.7/2.9 MB
Progress (1): 1.7/2.9 MB
Progress (1): 1.7/2.9 MB
Progress (1): 1.7/2.9 MB
Progress (1): 1.7/2.9 MB
Progress (1): 1.7/2.9 MB
Progress (1): 1.7/2.9 MB
Progress (1): 1.7/2.9 MB
Progress (1): 1.7/2.9 MB
Progress (1): 1.7/2.9 MB
Progress (1): 1.7/2.9 MB
Progress (1): 1.7/2.9 MB
Progress (1): 1.7/2.9 MB
Progress (1): 1.7/2.9 MB
Progress (1): 1.7/2.9 MB
Progress (1): 1.7/2.9 MB
Progress (1): 1.7/2.9 MB
Progress (1): 1.7/2.9 MB
Progress (1): 1.7/2.9 MB
Progress (1): 1.7/2.9 MB
Progress (1): 1.7/2.9 MB
Progress (1): 1.7/2.9 MB
Progress (1): 1.7/2.9 MB
Progress (1): 1.8/2.9 MB
Progress (1): 1.8/2.9 MB
Progress (1): 1.8/2.9 MB
Progress (1): 1.8/2.9 MB
Progress (1): 1.8/2.9 MB
Progress (1): 1.8/2.9 MB
Progress (1): 1.8/2.9 MB
Progress (1): 1.8/2.9 MB
Progress (1): 1.8/2.9 MB
Progress (1): 1.8/2.9 MB
Progress (1): 1.8/2.9 MB
Progress (1): 1.8/2.9 MB
Progress (1): 1.8/2.9 MB
Progress (1): 1.8/2.9 MB
Progress (1): 1.8/2.9 MB
Progress (1): 1.8/2.9 MB
Progress (1): 1.8/2.9 MB
Progress (1): 1.8/2.9 MB
Progress (1): 1.8/2.9 MB
Progress (1): 1.8/2.9 MB
Progress (1): 1.8/2.9 MB
Progress (1): 1.8/2.9 MB
Progress (1): 1.8/2.9 MB
Progress (1): 1.8/2.9 MB
Progress (1): 1.8/2.9 MB
Progress (1): 1.9/2.9 MB
Progress (1): 1.9/2.9 MB
Progress (1): 1.9/2.9 MB
Progress (1): 1.9/2.9 MB
Progress (1): 1.9/2.9 MB
Progress (1): 1.9/2.9 MB
Progress (1): 1.9/2.9 MB
Progress (1): 1.9/2.9 MB
Progress (1): 1.9/2.9 MB
Progress (1): 1.9/2.9 MB
Progress (1): 1.9/2.9 MB
Progress (1): 1.9/2.9 MB
Progress (1): 1.9/2.9 MB
Progress (1): 1.9/2.9 MB
Progress (1): 1.9/2.9 MB
Progress (1): 1.9/2.9 MB
Progress (1): 1.9/2.9 MB
Progress (1): 1.9/2.9 MB
Progress (1): 1.9/2.9 MB
Progress (1): 1.9/2.9 MB
Progress (1): 1.9/2.9 MB
Progress (1): 1.9/2.9 MB
Progress (1): 1.9/2.9 MB
Progress (1): 1.9/2.9 MB
Progress (1): 1.9/2.9 MB
Progress (1): 2.0/2.9 MB
Progress (1): 2.0/2.9 MB
Progress (1): 2.0/2.9 MB
Progress (1): 2.0/2.9 MB
Progress (1): 2.0/2.9 MB
Progress (1): 2.0/2.9 MB
Progress (1): 2.0/2.9 MB
Progress (1): 2.0/2.9 MB
Progress (1): 2.0/2.9 MB
Progress (1): 2.0/2.9 MB
Progress (1): 2.0/2.9 MB
Progress (1): 2.0/2.9 MB
Progress (1): 2.0/2.9 MB
Progress (1): 2.0/2.9 MB
Progress (1): 2.0/2.9 MB
Progress (1): 2.0/2.9 MB
Progress (1): 2.0/2.9 MB
Progress (1): 2.0/2.9 MB
Progress (1): 2.0/2.9 MB
Progress (1): 2.0/2.9 MB
Progress (1): 2.0/2.9 MB
Progress (1): 2.0/2.9 MB
Progress (1): 2.0/2.9 MB
Progress (1): 2.0/2.9 MB
Progress (1): 2.0/2.9 MB
Progress (1): 2.1/2.9 MB
Progress (1): 2.1/2.9 MB
Progress (1): 2.1/2.9 MB
Progress (1): 2.1/2.9 MB
Progress (1): 2.1/2.9 MB
Progress (1): 2.1/2.9 MB
Progress (1): 2.1/2.9 MB
Progress (1): 2.1/2.9 MB
Progress (1): 2.1/2.9 MB
Progress (1): 2.1/2.9 MB
Progress (1): 2.1/2.9 MB
Progress (1): 2.1/2.9 MB
Progress (1): 2.1/2.9 MB
Progress (1): 2.1/2.9 MB
Progress (1): 2.1/2.9 MB
Progress (1): 2.1/2.9 MB
Progress (1): 2.1/2.9 MB
Progress (1): 2.1/2.9 MB
Progress (1): 2.1/2.9 MB
Progress (1): 2.1/2.9 MB
Progress (1): 2.1/2.9 MB
Progress (1): 2.1/2.9 MB
Progress (1): 2.1/2.9 MB
Progress (1): 2.1/2.9 MB
Progress (1): 2.1/2.9 MB
Progress (1): 2.2/2.9 MB
Progress (1): 2.2/2.9 MB
Progress (1): 2.2/2.9 MB
Progress (1): 2.2/2.9 MB
Progress (1): 2.2/2.9 MB
Progress (1): 2.2/2.9 MB
Progress (1): 2.2/2.9 MB
Progress (1): 2.2/2.9 MB
Progress (1): 2.2/2.9 MB
Progress (1): 2.2/2.9 MB
Progress (1): 2.2/2.9 MB
Progress (1): 2.2/2.9 MB
Progress (1): 2.2/2.9 MB
Progress (1): 2.2/2.9 MB
Progress (1): 2.2/2.9 MB
Progress (1): 2.2/2.9 MB
Progress (1): 2.2/2.9 MB
Progress (1): 2.2/2.9 MB
Progress (1): 2.2/2.9 MB
Progress (1): 2.2/2.9 MB
Progress (1): 2.2/2.9 MB
Progress (1): 2.2/2.9 MB
Progress (1): 2.2/2.9 MB
Progress (1): 2.2/2.9 MB
Progress (1): 2.2/2.9 MB
Progress (1): 2.3/2.9 MB
Progress (1): 2.3/2.9 MB
Progress (1): 2.3/2.9 MB
Progress (1): 2.3/2.9 MB
Progress (1): 2.3/2.9 MB
Progress (1): 2.3/2.9 MB
Progress (1): 2.3/2.9 MB
Progress (1): 2.3/2.9 MB
Progress (1): 2.3/2.9 MB
Progress (1): 2.3/2.9 MB
Progress (1): 2.3/2.9 MB
Progress (1): 2.3/2.9 MB
Progress (1): 2.3/2.9 MB
Progress (1): 2.3/2.9 MB
Progress (1): 2.3/2.9 MB
Progress (1): 2.3/2.9 MB
Progress (1): 2.3/2.9 MB
Progress (1): 2.3/2.9 MB
Progress (1): 2.3/2.9 MB
Progress (1): 2.3/2.9 MB
Progress (1): 2.3/2.9 MB
Progress (1): 2.3/2.9 MB
Progress (1): 2.3/2.9 MB
Progress (1): 2.3/2.9 MB
Progress (1): 2.3/2.9 MB
Progress (1): 2.4/2.9 MB
Progress (1): 2.4/2.9 MB
Progress (1): 2.4/2.9 MB
Progress (1): 2.4/2.9 MB
Progress (1): 2.4/2.9 MB
Progress (1): 2.4/2.9 MB
Progress (1): 2.4/2.9 MB
Progress (1): 2.4/2.9 MB
Progress (1): 2.4/2.9 MB
Progress (1): 2.4/2.9 MB
Progress (1): 2.4/2.9 MB
Progress (1): 2.4/2.9 MB
Progress (1): 2.4/2.9 MB
Progress (1): 2.4/2.9 MB
Progress (1): 2.4/2.9 MB
Progress (1): 2.4/2.9 MB
Progress (1): 2.4/2.9 MB
Progress (1): 2.4/2.9 MB
Progress (1): 2.4/2.9 MB
Progress (1): 2.4/2.9 MB
Progress (1): 2.4/2.9 MB
Progress (1): 2.4/2.9 MB
Progress (1): 2.4/2.9 MB
Progress (1): 2.4/2.9 MB
Progress (1): 2.4/2.9 MB
Progress (1): 2.5/2.9 MB
Progress (1): 2.5/2.9 MB
Progress (1): 2.5/2.9 MB
Progress (1): 2.5/2.9 MB
Progress (1): 2.5/2.9 MB
Progress (1): 2.5/2.9 MB
Progress (1): 2.5/2.9 MB
Progress (1): 2.5/2.9 MB
Progress (1): 2.5/2.9 MB
Progress (1): 2.5/2.9 MB
Progress (1): 2.5/2.9 MB
Progress (1): 2.5/2.9 MB
Progress (1): 2.5/2.9 MB
Progress (1): 2.5/2.9 MB
Progress (1): 2.5/2.9 MB
Progress (1): 2.5/2.9 MB
Progress (1): 2.5/2.9 MB
Progress (1): 2.5/2.9 MB
Progress (1): 2.5/2.9 MB
Progress (1): 2.5/2.9 MB
Progress (1): 2.5/2.9 MB
Progress (1): 2.5/2.9 MB
Progress (1): 2.5/2.9 MB
Progress (1): 2.5/2.9 MB
Progress (1): 2.5/2.9 MB
Progress (1): 2.6/2.9 MB
Progress (1): 2.6/2.9 MB
Progress (1): 2.6/2.9 MB
Progress (1): 2.6/2.9 MB
Progress (1): 2.6/2.9 MB
Progress (1): 2.6/2.9 MB
Progress (1): 2.6/2.9 MB
Progress (1): 2.6/2.9 MB
Progress (1): 2.6/2.9 MB
Progress (1): 2.6/2.9 MB
Progress (1): 2.6/2.9 MB
Progress (1): 2.6/2.9 MB
Progress (1): 2.6/2.9 MB
Progress (1): 2.6/2.9 MB
Progress (1): 2.6/2.9 MB
Progress (1): 2.6/2.9 MB
Progress (1): 2.6/2.9 MB
Progress (1): 2.6/2.9 MB
Progress (1): 2.6/2.9 MB
Progress (1): 2.6/2.9 MB
Progress (1): 2.6/2.9 MB
Progress (1): 2.6/2.9 MB
Progress (1): 2.6/2.9 MB
Progress (1): 2.6/2.9 MB
Progress (1): 2.6/2.9 MB
Progress (1): 2.7/2.9 MB
Progress (1): 2.7/2.9 MB
Progress (1): 2.7/2.9 MB
Progress (1): 2.7/2.9 MB
Progress (1): 2.7/2.9 MB
Progress (1): 2.7/2.9 MB
Progress (1): 2.7/2.9 MB
Progress (1): 2.7/2.9 MB
Progress (1): 2.7/2.9 MB
Progress (1): 2.7/2.9 MB
Progress (1): 2.7/2.9 MB
Progress (1): 2.7/2.9 MB
Progress (1): 2.7/2.9 MB
Progress (1): 2.7/2.9 MB
Progress (1): 2.7/2.9 MB
Progress (1): 2.7/2.9 MB
Progress (1): 2.7/2.9 MB
Progress (1): 2.7/2.9 MB
Progress (1): 2.7/2.9 MB
Progress (1): 2.7/2.9 MB
Progress (1): 2.7/2.9 MB
Progress (1): 2.7/2.9 MB
Progress (1): 2.7/2.9 MB
Progress (1): 2.7/2.9 MB
Progress (1): 2.7/2.9 MB
Progress (1): 2.8/2.9 MB
Progress (1): 2.8/2.9 MB
Progress (1): 2.8/2.9 MB
Progress (1): 2.8/2.9 MB
Progress (1): 2.8/2.9 MB
Progress (1): 2.8/2.9 MB
Progress (1): 2.8/2.9 MB
Progress (1): 2.8/2.9 MB
Progress (1): 2.8/2.9 MB
Progress (1): 2.8/2.9 MB
Progress (1): 2.8/2.9 MB
Progress (1): 2.8/2.9 MB
Progress (1): 2.8/2.9 MB
Progress (1): 2.8/2.9 MB
Progress (1): 2.8/2.9 MB
Progress (1): 2.8/2.9 MB
Progress (1): 2.8/2.9 MB
Progress (1): 2.8/2.9 MB
Progress (1): 2.8/2.9 MB
Progress (1): 2.8/2.9 MB
Progress (1): 2.8/2.9 MB
Progress (1): 2.8/2.9 MB
Progress (1): 2.8/2.9 MB
Progress (1): 2.8/2.9 MB
Progress (1): 2.8/2.9 MB
Progress (1): 2.9/2.9 MB
Progress (1): 2.9/2.9 MB
Progress (1): 2.9/2.9 MB
Progress (1): 2.9/2.9 MB
Progress (1): 2.9/2.9 MB
Progress (1): 2.9/2.9 MB
Progress (1): 2.9/2.9 MB
Progress (1): 2.9/2.9 MB
Progress (1): 2.9/2.9 MB
Progress (1): 2.9/2.9 MB
Progress (1): 2.9/2.9 MB
Progress (1): 2.9/2.9 MB
Progress (1): 2.9 MB    
                    
Downloaded from cbi-jdt: https://repo.eclipse.org/content/repositories/eclipse-staging/org/eclipse/jdt/ecj/3.20.0.v20191029-2311/ecj-3.20.0.v20191029-2311.jar (2.9 MB at 10 MB/s)
Downloading from cbi-snapshots: https://repo.eclipse.org/content/repositories/cbi-snapshots/org/codehaus/plexus/plexus-compiler-manager/2.8.5/plexus-compiler-manager-2.8.5.jar
Downloading from cbi-snapshots: https://repo.eclipse.org/content/repositories/cbi-snapshots/org/eclipse/tycho/tycho-compiler-jdt/1.5.1/tycho-compiler-jdt-1.5.1.jar
Downloading from cbi-snapshots: https://repo.eclipse.org/content/repositories/cbi-snapshots/org/codehaus/plexus/plexus-compiler-api/2.8.5/plexus-compiler-api-2.8.5.jar
Downloading from cbi-snapshots: https://repo.eclipse.org/content/repositories/cbi-snapshots/org/eclipse/tycho/tycho-lib-detector/1.5.1/tycho-lib-detector-1.5.1.jar
Downloading from eclipse: https://repo.eclipse.org/content/repositories/cbi/org/codehaus/plexus/plexus-compiler-manager/2.8.5/plexus-compiler-manager-2.8.5.jar
Downloading from eclipse: https://repo.eclipse.org/content/repositories/cbi/org/codehaus/plexus/plexus-compiler-api/2.8.5/plexus-compiler-api-2.8.5.jar
Downloading from eclipse: https://repo.eclipse.org/content/repositories/cbi/org/eclipse/tycho/tycho-lib-detector/1.5.1/tycho-lib-detector-1.5.1.jar
Downloading from eclipse: https://repo.eclipse.org/content/repositories/cbi/org/eclipse/tycho/tycho-compiler-jdt/1.5.1/tycho-compiler-jdt-1.5.1.jar
Downloading from eclipse.maven.central.mirror: https://repo.eclipse.org/content/repositories/maven_central/org/codehaus/plexus/plexus-compiler-manager/2.8.5/plexus-compiler-manager-2.8.5.jar
Downloading from eclipse.maven.central.mirror: https://repo.eclipse.org/content/repositories/maven_central/org/eclipse/tycho/tycho-lib-detector/1.5.1/tycho-lib-detector-1.5.1.jar
Downloading from eclipse.maven.central.mirror: https://repo.eclipse.org/content/repositories/maven_central/org/eclipse/tycho/tycho-compiler-jdt/1.5.1/tycho-compiler-jdt-1.5.1.jar
Downloading from eclipse.maven.central.mirror: https://repo.eclipse.org/content/repositories/maven_central/org/codehaus/plexus/plexus-compiler-api/2.8.5/plexus-compiler-api-2.8.5.jar
Progress (1): 4.1/4.7 kB
Progress (1): 4.7 kB    
Progress (2): 4.7 kB | 4.1/17 kB
Progress (2): 4.7 kB | 7.7/17 kB
Progress (2): 4.7 kB | 12/17 kB 
Progress (2): 4.7 kB | 16/17 kB
Progress (2): 4.7 kB | 17 kB   
                            
Downloaded from eclipse.maven.central.mirror: https://repo.eclipse.org/content/repositories/maven_central/org/codehaus/plexus/plexus-compiler-manager/2.8.5/plexus-compiler-manager-2.8.5.jar (4.7 kB at 105 kB/s)
Downloaded from eclipse.maven.central.mirror: https://repo.eclipse.org/content/repositories/maven_central/org/eclipse/tycho/tycho-compiler-jdt/1.5.1/tycho-compiler-jdt-1.5.1.jar (17 kB at 354 kB/s)
Progress (1): 3.5 kB
Progress (2): 3.5 kB | 4.1/27 kB
Progress (2): 3.5 kB | 7.7/27 kB
Progress (2): 3.5 kB | 12/27 kB 
Progress (2): 3.5 kB | 16/27 kB
Progress (2): 3.5 kB | 20/27 kB
Progress (2): 3.5 kB | 24/27 kB
Progress (2): 3.5 kB | 27 kB   
                            
Downloaded from eclipse.maven.central.mirror: https://repo.eclipse.org/content/repositories/maven_central/org/eclipse/tycho/tycho-lib-detector/1.5.1/tycho-lib-detector-1.5.1.jar (3.5 kB at 3.3 kB/s)
Downloaded from eclipse.maven.central.mirror: https://repo.eclipse.org/content/repositories/maven_central/org/codehaus/plexus/plexus-compiler-api/2.8.5/plexus-compiler-api-2.8.5.jar (27 kB at 26 kB/s)
[INFO] Compiling 36 source files to /home/jenkins/agent/workspace/eclipse.platform.runtime-Gerrit/bundles/org.eclipse.core.contenttype/target/classes
[INFO] 
[INFO] --- tycho-eclipserun-plugin:1.5.1:eclipse-run (default) @ org.eclipse.core.contenttype ---
[INFO] Fetching javax.annotation_1.2.0.v201602091430.jar.pack.gz from https://download.eclipse.org/eclipse/updates/4.14-I-builds/I20191102-1800/plugins/ (21.32kB)
[INFO] Fetching javax.annotation_1.2.0.v201602091430.jar.pack.gz from https://download.eclipse.org/eclipse/updates/4.14-I-builds/I20191102-1800/plugins/ (21.32kB)
[INFO] Fetching org.apache.ant_1.10.7.v20190926-0324.jar.pack.gz from https://download.eclipse.org/eclipse/updates/4.14-I-builds/I20191102-1800/plugins/ (2.83MB)
[INFO] Fetching org.apache.ant_1.10.7.v20190926-0324.jar.pack.gz from https://download.eclipse.org/eclipse/updates/4.14-I-builds/I20191102-1800/plugins/ (2.83MB)
[INFO] Fetching org.eclipse.ant.core_3.5.600.v20190914-1928.jar.pack.gz from https://download.eclipse.org/eclipse/updates/4.14-I-builds/I20191102-1800/plugins/ (71.79kB)
[INFO] Fetching org.eclipse.ant.core_3.5.600.v20190914-1928.jar.pack.gz from https://download.eclipse.org/eclipse/updates/4.14-I-builds/I20191102-1800/plugins/ (71.79kB)
[INFO] Fetching org.eclipse.core.runtime_3.16.100.v20191030-1620.jar.pack.gz from https://download.eclipse.org/eclipse/updates/4.14-I-builds/I20191102-1800/plugins/ (33.57kB)
[INFO] Fetching org.eclipse.core.runtime_3.16.100.v20191030-1620.jar.pack.gz from https://download.eclipse.org/eclipse/updates/4.14-I-builds/I20191102-1800/plugins/ (33.57kB)
[INFO] Fetching org.eclipse.core.contenttype_3.7.500.v20190916-2125.jar.pack.gz from https://download.eclipse.org/eclipse/updates/4.14-I-builds/I20191102-1800/plugins/ (41.62kB)
[INFO] Fetching org.eclipse.core.contenttype_3.7.500.v20190916-2125.jar.pack.gz from https://download.eclipse.org/eclipse/updates/4.14-I-builds/I20191102-1800/plugins/ (41.62kB)
[INFO] Fetching org.eclipse.core.expressions_3.6.600.v20191005-1353.jar.pack.gz from https://download.eclipse.org/eclipse/updates/4.14-I-builds/I20191102-1800/plugins/ (33.81kB)
[INFO] Fetching org.eclipse.core.expressions_3.6.600.v20191005-1353.jar.pack.gz from https://download.eclipse.org/eclipse/updates/4.14-I-builds/I20191102-1800/plugins/ (33.81kB)
[INFO] Fetching org.eclipse.core.jobs_3.10.600.v20191026-0839.jar.pack.gz from https://download.eclipse.org/eclipse/updates/4.14-I-builds/I20191102-1800/plugins/ (46.1kB)
[INFO] Fetching org.eclipse.core.jobs_3.10.600.v20191026-0839.jar.pack.gz from https://download.eclipse.org/eclipse/updates/4.14-I-builds/I20191102-1800/plugins/ (46.1kB)
[INFO] Fetching org.eclipse.debug.core_3.14.100.v20191014-1313.jar.pack.gz from https://download.eclipse.org/eclipse/updates/4.14-I-builds/I20191102-1800/plugins/ (125.75kB)
[INFO] Fetching org.eclipse.debug.core_3.14.100.v20191014-1313.jar.pack.gz from https://download.eclipse.org/eclipse/updates/4.14-I-builds/I20191102-1800/plugins/ (125.75kB)
[INFO] Fetching org.eclipse.e4.core.contexts_1.8.300.v20191017-1404.jar.pack.gz from https://download.eclipse.org/eclipse/updates/4.14-I-builds/I20191102-1800/plugins/ (22.69kB)
[INFO] Fetching org.eclipse.e4.core.contexts_1.8.300.v20191017-1404.jar.pack.gz from https://download.eclipse.org/eclipse/updates/4.14-I-builds/I20191102-1800/plugins/ (22.69kB)
[INFO] Fetching org.eclipse.e4.core.di_1.7.500.v20190916-2125.jar.pack.gz from https://download.eclipse.org/eclipse/updates/4.14-I-builds/I20191102-1800/plugins/ (25.92kB)
[INFO] Fetching org.eclipse.e4.core.di_1.7.500.v20190916-2125.jar.pack.gz from https://download.eclipse.org/eclipse/updates/4.14-I-builds/I20191102-1800/plugins/ (25.92kB)
[INFO] Fetching org.eclipse.e4.core.di.annotations_1.6.500.v20190925-0538.jar.pack.gz from https://download.eclipse.org/eclipse/updates/4.14-I-builds/I20191102-1800/plugins/ (7.68kB)
[INFO] Fetching org.eclipse.e4.core.di.annotations_1.6.500.v20190925-0538.jar.pack.gz from https://download.eclipse.org/eclipse/updates/4.14-I-builds/I20191102-1800/plugins/ (7.68kB)
[INFO] Fetching org.eclipse.e4.core.services_2.2.100.v20190925-0538.jar.pack.gz from https://download.eclipse.org/eclipse/updates/4.14-I-builds/I20191102-1800/plugins/ (28.41kB)
[INFO] Fetching org.eclipse.e4.core.services_2.2.100.v20190925-0538.jar.pack.gz from https://download.eclipse.org/eclipse/updates/4.14-I-builds/I20191102-1800/plugins/ (28.41kB)
[INFO] Fetching org.eclipse.equinox.frameworkadmin_2.1.400.v20191002-0702.jar.pack.gz from https://download.eclipse.org/eclipse/updates/4.14-I-builds/I20191102-1800/plugins/ (19.47kB)
[INFO] Fetching org.eclipse.equinox.frameworkadmin_2.1.400.v20191002-0702.jar.pack.gz from https://download.eclipse.org/eclipse/updates/4.14-I-builds/I20191102-1800/plugins/ (19.47kB)
[INFO] Fetching org.eclipse.equinox.frameworkadmin.equinox_1.1.200.v20191015-1207.jar.pack.gz from https://download.eclipse.org/eclipse/updates/4.14-I-builds/I20191102-1800/plugins/ (34.36kB)
[INFO] Fetching org.eclipse.equinox.frameworkadmin.equinox_1.1.200.v20191015-1207.jar.pack.gz from https://download.eclipse.org/eclipse/updates/4.14-I-builds/I20191102-1800/plugins/ (34.36kB)
[INFO] Fetching org.eclipse.equinox.p2.artifact.repository_1.3.300.v20191015-1504.jar.pack.gz from https://download.eclipse.org/eclipse/updates/4.14-I-builds/I20191102-1800/plugins/ (58.09kB)
[INFO] Fetching org.eclipse.equinox.p2.artifact.repository_1.3.300.v20191015-1504.jar.pack.gz from https://download.eclipse.org/eclipse/updates/4.14-I-builds/I20191102-1800/plugins/ (58.09kB)
[INFO] Fetching org.eclipse.equinox.p2.jarprocessor_1.1.500.v20191014-1732.jar.pack.gz from https://download.eclipse.org/eclipse/updates/4.14-I-builds/I20191102-1800/plugins/ (38.91kB)
[INFO] Fetching org.eclipse.equinox.p2.jarprocessor_1.1.500.v20191014-1732.jar.pack.gz from https://download.eclipse.org/eclipse/updates/4.14-I-builds/I20191102-1800/plugins/ (38.91kB)
[INFO] Fetching org.eclipse.equinox.p2.director_2.4.500.v20191014-1220.jar.pack.gz from https://download.eclipse.org/eclipse/updates/4.14-I-builds/I20191102-1800/plugins/ (48.14kB)
[INFO] Fetching org.eclipse.equinox.p2.director_2.4.500.v20191014-1220.jar.pack.gz from https://download.eclipse.org/eclipse/updates/4.14-I-builds/I20191102-1800/plugins/ (48.14kB)
[INFO] Fetching org.sat4j.core_2.3.5.v201308161310.jar.pack.gz from https://download.eclipse.org/eclipse/updates/4.14-I-builds/I20191102-1800/plugins/ (103.26kB)
[INFO] Fetching org.sat4j.core_2.3.5.v201308161310.jar.pack.gz from https://download.eclipse.org/eclipse/updates/4.14-I-builds/I20191102-1800/plugins/ (103.26kB)
[INFO] Fetching org.sat4j.pb_2.3.5.v201404071733.jar.pack.gz from https://download.eclipse.org/eclipse/updates/4.14-I-builds/I20191102-1800/plugins/ (72.9kB)
[INFO] Fetching org.sat4j.pb_2.3.5.v201404071733.jar.pack.gz from https://download.eclipse.org/eclipse/updates/4.14-I-builds/I20191102-1800/plugins/ (72.9kB)
[INFO] Fetching org.eclipse.equinox.p2.director.app_1.1.400.v20191015-1945.jar.pack.gz from https://download.eclipse.org/eclipse/updates/4.14-I-builds/I20191102-1800/plugins/ (37.91kB)
[INFO] Fetching org.eclipse.equinox.p2.director.app_1.1.400.v20191015-1945.jar.pack.gz from https://download.eclipse.org/eclipse/updates/4.14-I-builds/I20191102-1800/plugins/ (37.91kB)
[INFO] Fetching org.eclipse.equinox.p2.garbagecollector_1.1.300.v20191015-1207.jar.pack.gz from https://download.eclipse.org/eclipse/updates/4.14-I-builds/I20191102-1800/plugins/ (14.06kB)
[INFO] Fetching org.eclipse.equinox.p2.garbagecollector_1.1.300.v20191015-1207.jar.pack.gz from https://download.eclipse.org/eclipse/updates/4.14-I-builds/I20191102-1800/plugins/ (14.06kB)
[INFO] Fetching org.eclipse.equinox.p2.publisher_1.5.300.v20191016-0507.jar.pack.gz from https://download.eclipse.org/eclipse/updates/4.14-I-builds/I20191102-1800/plugins/ (43.28kB)
[INFO] Fetching org.eclipse.equinox.p2.publisher_1.5.300.v20191016-0507.jar.pack.gz from https://download.eclipse.org/eclipse/updates/4.14-I-builds/I20191102-1800/plugins/ (43.28kB)
[INFO] Fetching org.eclipse.equinox.p2.publisher.eclipse_1.3.400.v20191018-2256.jar.pack.gz from https://download.eclipse.org/eclipse/updates/4.14-I-builds/I20191102-1800/plugins/ (105.59kB)
[INFO] Fetching org.eclipse.equinox.p2.publisher.eclipse_1.3.400.v20191018-2256.jar.pack.gz from https://download.eclipse.org/eclipse/updates/4.14-I-builds/I20191102-1800/plugins/ (105.59kB)
[INFO] Fetching org.eclipse.equinox.simpleconfigurator.manipulator_2.1.400.v20191015-1836.jar.pack.gz from https://download.eclipse.org/eclipse/updates/4.14-I-builds/I20191102-1800/plugins/ (16.72kB)
[INFO] Fetching org.eclipse.equinox.simpleconfigurator.manipulator_2.1.400.v20191015-1836.jar.pack.gz from https://download.eclipse.org/eclipse/updates/4.14-I-builds/I20191102-1800/plugins/ (16.72kB)
[INFO] Fetching org.eclipse.equinox.p2.repository.tools_2.2.400.v20191016-0510.jar.pack.gz from https://download.eclipse.org/eclipse/updates/4.14-I-builds/I20191102-1800/plugins/ (121.9kB)
[INFO] Fetching org.eclipse.equinox.p2.repository.tools_2.2.400.v20191016-0510.jar.pack.gz from https://download.eclipse.org/eclipse/updates/4.14-I-builds/I20191102-1800/plugins/ (121.9kB)
[INFO] Fetching org.eclipse.equinox.p2.touchpoint.eclipse_2.2.500.v20191014-1333.jar.pack.gz from https://download.eclipse.org/eclipse/updates/4.14-I-builds/I20191102-1800/plugins/ (46.25kB)
[INFO] Fetching org.eclipse.equinox.p2.touchpoint.eclipse_2.2.500.v20191014-1333.jar.pack.gz from https://download.eclipse.org/eclipse/updates/4.14-I-builds/I20191102-1800/plugins/ (46.25kB)
[INFO] Fetching org.eclipse.jdt.core_3.20.0.v20191103-2100.jar from https://download.eclipse.org/eclipse/updates/4.14-I-builds/I20191103-1800/plugins/ (6.7MB)
[INFO] Fetching org.eclipse.jdt.core_3.20.0.v20191103-2100.jar from https://download.eclipse.org/eclipse/updates/4.14-I-builds/I20191103-1800/plugins/ (6.7MB)
[INFO] Fetching org.eclipse.jdt.debug_3.14.0.v20191105-0758.jar.pack.gz from https://download.eclipse.org/eclipse/updates/4.14-I-builds/I20191105-1800/plugins/ (937.08kB)
[INFO] Fetching org.eclipse.jdt.debug_3.14.0.v20191105-0758.jar.pack.gz from https://download.eclipse.org/eclipse/updates/4.14-I-builds/I20191105-1800/plugins/ (937.08kB)
[INFO] Fetching org.eclipse.jdt.launching_3.16.0.v20191028-2158.jar.pack.gz from https://download.eclipse.org/eclipse/updates/4.14-I-builds/I20191102-1800/plugins/ (273.96kB)
[INFO] Fetching org.eclipse.jdt.launching_3.16.0.v20191028-2158.jar.pack.gz from https://download.eclipse.org/eclipse/updates/4.14-I-builds/I20191102-1800/plugins/ (273.96kB)
[INFO] Fetching org.eclipse.pde.core_3.13.200.v20191105-0712.jar from https://download.eclipse.org/eclipse/updates/4.14-I-builds/I20191105-1800/plugins/ (1.29MB)
[INFO] Fetching org.eclipse.pde.core_3.13.200.v20191105-0712.jar from https://download.eclipse.org/eclipse/updates/4.14-I-builds/I20191105-1800/plugins/ (1.29MB)
[INFO] Fetching org.objectweb.asm_7.2.0.v20191010-1910.jar.pack.gz from https://download.eclipse.org/eclipse/updates/4.14-I-builds/I20191102-1800/plugins/ (58.83kB)
[INFO] Fetching org.objectweb.asm_7.2.0.v20191010-1910.jar.pack.gz from https://download.eclipse.org/eclipse/updates/4.14-I-builds/I20191102-1800/plugins/ (58.83kB)
[INFO] Fetching org.objectweb.asm.tree_7.2.0.v20191010-1910.jar.pack.gz from https://download.eclipse.org/eclipse/updates/4.14-I-builds/I20191102-1800/plugins/ (25.81kB)
[INFO] Fetching org.objectweb.asm.tree_7.2.0.v20191010-1910.jar.pack.gz from https://download.eclipse.org/eclipse/updates/4.14-I-builds/I20191102-1800/plugins/ (25.81kB)
[INFO] Fetching org.eclipse.pde.api.tools_1.1.1000.v20191104-0636.jar from https://download.eclipse.org/eclipse/updates/4.14-I-builds/I20191104-1800/plugins/ (922.25kB)
[INFO] Fetching org.eclipse.pde.api.tools_1.1.1000.v20191104-0636.jar from https://download.eclipse.org/eclipse/updates/4.14-I-builds/I20191104-1800/plugins/ (922.25kB)
[INFO] Fetching org.eclipse.pde.build_3.10.600.v20191011-0535.jar from https://download.eclipse.org/eclipse/updates/4.14-I-builds/I20191102-1800/plugins/ (478.7kB)
[INFO] Fetching org.eclipse.pde.build_3.10.600.v20191011-0535.jar from https://download.eclipse.org/eclipse/updates/4.14-I-builds/I20191102-1800/plugins/ (478.7kB)
[INFO] Fetching org.eclipse.update.configurator_3.4.400.v20190913-2047.jar.pack.gz from https://download.eclipse.org/eclipse/updates/4.14-I-builds/I20191102-1800/plugins/ (43.17kB)
[INFO] Fetching org.eclipse.update.configurator_3.4.400.v20190913-2047.jar.pack.gz from https://download.eclipse.org/eclipse/updates/4.14-I-builds/I20191102-1800/plugins/ (43.17kB)
[INFO] Toolchain in tycho-eclipserun-plugin: JDK[/opt/tools/java/oracle/jdk-8/latest/jre]
[INFO] Expected eclipse log file: /home/jenkins/agent/workspace/eclipse.platform.runtime-Gerrit/bundles/org.eclipse.core.contenttype/target/eclipserun-work/data/.metadata/.log
[INFO] Command line:
	[/opt/tools/java/oracle/jdk-8/latest/jre/bin/java, -jar, /home/jenkins/agent/workspace/eclipse.platform.runtime-Gerrit/.repository/p2/osgi/bundle/org.eclipse.equinox.launcher/1.5.600.v20191014-2022/org.eclipse.equinox.launcher-1.5.600.v20191014-2022.jar, -install, /home/jenkins/agent/workspace/eclipse.platform.runtime-Gerrit/bundles/org.eclipse.core.contenttype/target/eclipserun-work, -configuration, /home/jenkins/agent/workspace/eclipse.platform.runtime-Gerrit/bundles/org.eclipse.core.contenttype/target/eclipserun-work/configuration, -data, target/apibuild-workspace, -application, org.eclipse.ant.core.antRunner, -buildfile, target/.apibuild.xml]
Picked up JAVA_TOOL_OPTIONS: -XX:+IgnoreUnrecognizedVMOptions -XX:+UseContainerSupport -XX:+UnlockExperimentalVMOptions -XX:+UseCGroupMemoryLimitForHeap
Picked up _JAVA_OPTIONS: -XX:MaxRAMPercentage=64.0
Buildfile: target/.apibuild.xml

apigen:
BUILD SUCCESSFUL

BUILD SUCCESSFUL
Total time: 1 second
[INFO] 
[INFO] --- maven-resources-plugin:3.1.0:testResources (default-testResources) @ org.eclipse.core.contenttype ---
[INFO] Using 'UTF-8' encoding to copy filtered resources.
[INFO] skip non existing resourceDirectory /home/jenkins/agent/workspace/eclipse.platform.runtime-Gerrit/bundles/org.eclipse.core.contenttype/src/test/resources
[INFO] 
[INFO] --- tycho-source-plugin:1.5.1:plugin-source (plugin-source) @ org.eclipse.core.contenttype ---
[INFO] Building jar: /home/jenkins/agent/workspace/eclipse.platform.runtime-Gerrit/bundles/org.eclipse.core.contenttype/target/org.eclipse.core.contenttype-3.7.500-SNAPSHOT-sources.jar
[INFO] 
[INFO] --- target-platform-configuration:1.5.1:target-platform (default-target-platform) @ org.eclipse.core.contenttype ---
[INFO] 
[INFO] --- tycho-packaging-plugin:1.5.1:package-plugin (default-package-plugin) @ org.eclipse.core.contenttype ---
[INFO] Building jar: /home/jenkins/agent/workspace/eclipse.platform.runtime-Gerrit/bundles/org.eclipse.core.contenttype/target/org.eclipse.core.contenttype-3.7.500-SNAPSHOT.jar
[INFO] 
[INFO] --- tycho-p2-plugin:1.5.1:p2-metadata-default (default-p2-metadata-default) @ org.eclipse.core.contenttype ---
[INFO] MavenProject: org.eclipse.core:org.eclipse.core.contenttype:3.7.500-SNAPSHOT @ /home/jenkins/agent/workspace/eclipse.platform.runtime-Gerrit/bundles/org.eclipse.core.contenttype/pom.xml
    The main artifact has been replaced with the baseline version.
    The following attached artifacts have been replaced with the baseline version: [sources]

[INFO] 
[INFO] --- tycho-p2-extras-plugin:1.5.1:compare-version-with-baselines (compare-attached-artifacts-with-release) @ org.eclipse.core.contenttype ---
[INFO] Fetching p2.index from https://download.eclipse.org/eclipse/updates/4.13/
[INFO] Adding repository https://download.eclipse.org/eclipse/updates/4.13
[INFO] Fetching compositeContent.jar from https://download.eclipse.org/eclipse/updates/4.13/ (447B)
[INFO] Fetching compositeContent.jar from https://download.eclipse.org/eclipse/updates/4.13/ (447B)
[INFO] Fetching content.jar from https://download.eclipse.org/eclipse/updates/4.13/categories/ (1.46kB)
[INFO] Fetching content.jar from https://download.eclipse.org/eclipse/updates/4.13/categories/ (1.46kB)
[INFO] Fetching p2.index from https://download.eclipse.org/eclipse/updates/4.13/R-4.13-201909161045/
[INFO] Fetching p2.index from https://download.eclipse.org/eclipse/updates/4.13/R-4.13-201909161045/
[INFO] Fetching content.xml.xz from https://download.eclipse.org/eclipse/updates/4.13/R-4.13-201909161045/
[INFO] Fetching content.xml.xz from https://download.eclipse.org/eclipse/updates/4.13/R-4.13-201909161045/
[INFO] Fetching R-4.13-201909161045&countryCode=us&timeZone=0&format=xml from http://www.eclipse.org/downloads/download.php?format=xml&file=/eclipse/updates/4.13/
[INFO] Fetching org.eclipse.core.contenttype_3.7.400.v20190624-1144.jar.pack.gz from https://download.eclipse.org/eclipse/updates/4.13/R-4.13-201909161045/plugins/ (41.63kB)
[INFO] Fetching org.eclipse.core.contenttype_3.7.400.v20190624-1144.jar.pack.gz from https://download.eclipse.org/eclipse/updates/4.13/R-4.13-201909161045/plugins/ (41.63kB)
[INFO] Fetching org.eclipse.core.contenttype.source_3.7.400.v20190624-1144.jar from https://download.eclipse.org/eclipse/updates/4.13/R-4.13-201909161045/plugins/ (83.28kB)
[INFO] Fetching org.eclipse.core.contenttype.source_3.7.400.v20190624-1144.jar from https://download.eclipse.org/eclipse/updates/4.13/R-4.13-201909161045/plugins/ (83.28kB)
[INFO] 
[INFO] --- maven-antrun-plugin:1.8:run (check-skip-api-analysis) @ org.eclipse.core.contenttype ---
[INFO] Executing tasks

main:
[INFO] Executed tasks
[INFO] 
[INFO] --- tycho-dependency-tools-plugin:1.5.1:list-dependencies (list-dependencies) @ org.eclipse.core.contenttype ---
[INFO] 
[INFO] --- tycho-eclipserun-plugin:1.5.1:eclipse-run (api-analysis) @ org.eclipse.core.contenttype ---
[INFO] Fetching org.eclipse.ecf_3.9.4.v20191020-1846.jar.pack.gz from https://download.eclipse.org/eclipse/updates/4.14-I-builds/I20191102-1800/plugins/ (48.09kB)
[INFO] Fetching org.eclipse.ecf_3.9.4.v20191020-1846.jar.pack.gz from https://download.eclipse.org/eclipse/updates/4.14-I-builds/I20191102-1800/plugins/ (48.09kB)
[INFO] Fetching org.eclipse.ecf.identity_3.9.300.v20191020-1846.jar.pack.gz from https://download.eclipse.org/eclipse/updates/4.14-I-builds/I20191102-1800/plugins/ (27.11kB)
[INFO] Fetching org.eclipse.ecf.identity_3.9.300.v20191020-1846.jar.pack.gz from https://download.eclipse.org/eclipse/updates/4.14-I-builds/I20191102-1800/plugins/ (27.11kB)
[INFO] Fetching org.eclipse.equinox.concurrent_1.1.400.v20190621-0852.jar.pack.gz from https://download.eclipse.org/eclipse/updates/4.14-I-builds/I20191102-1800/plugins/ (12.23kB)
[INFO] Fetching org.eclipse.equinox.concurrent_1.1.400.v20190621-0852.jar.pack.gz from https://download.eclipse.org/eclipse/updates/4.14-I-builds/I20191102-1800/plugins/ (12.23kB)
[INFO] Fetching org.eclipse.ecf.filetransfer_5.0.300.v20191020-1846.jar.pack.gz from https://download.eclipse.org/eclipse/updates/4.14-I-builds/I20191102-1800/plugins/ (20.33kB)
[INFO] Fetching org.eclipse.ecf.filetransfer_5.0.300.v20191020-1846.jar.pack.gz from https://download.eclipse.org/eclipse/updates/4.14-I-builds/I20191102-1800/plugins/ (20.33kB)
[INFO] Fetching org.eclipse.ecf.provider.filetransfer_3.2.500.v20191017-1905.jar.pack.gz from https://download.eclipse.org/eclipse/updates/4.14-I-builds/I20191102-1800/plugins/ (45.04kB)
[INFO] Fetching org.eclipse.ecf.provider.filetransfer_3.2.500.v20191017-1905.jar.pack.gz from https://download.eclipse.org/eclipse/updates/4.14-I-builds/I20191102-1800/plugins/ (45.04kB)
[INFO] Fetching org.eclipse.ecf.provider.filetransfer.ssl_1.0.101.v20191012-1926.jar.pack.gz from https://download.eclipse.org/eclipse/updates/4.14-I-builds/I20191102-1800/plugins/ (7.38kB)
[INFO] Fetching org.eclipse.ecf.provider.filetransfer.ssl_1.0.101.v20191012-1926.jar.pack.gz from https://download.eclipse.org/eclipse/updates/4.14-I-builds/I20191102-1800/plugins/ (7.38kB)
[INFO] Fetching org.eclipse.equinox.p2.touchpoint.natives_1.3.400.v20191017-1917.jar.pack.gz from https://download.eclipse.org/eclipse/updates/4.14-I-builds/I20191102-1800/plugins/ (35.24kB)
[INFO] Fetching org.eclipse.equinox.p2.touchpoint.natives_1.3.400.v20191017-1917.jar.pack.gz from https://download.eclipse.org/eclipse/updates/4.14-I-builds/I20191102-1800/plugins/ (35.24kB)
[INFO] Fetching org.eclipse.equinox.p2.transport.ecf_1.2.300.v20191001-0955.jar.pack.gz from https://download.eclipse.org/eclipse/updates/4.14-I-builds/I20191102-1800/plugins/ (22.34kB)
[INFO] Fetching org.eclipse.equinox.p2.transport.ecf_1.2.300.v20191001-0955.jar.pack.gz from https://download.eclipse.org/eclipse/updates/4.14-I-builds/I20191102-1800/plugins/ (22.34kB)
[INFO] Toolchain in tycho-eclipserun-plugin: JDK[/opt/tools/java/oracle/jdk-8/latest/jre]
[INFO] Expected eclipse log file: /home/jenkins/agent/workspace/eclipse.platform.runtime-Gerrit/bundles/org.eclipse.core.contenttype/target/eclipserun-work/data/.metadata/.log
[INFO] Command line:
	[/opt/tools/java/oracle/jdk-8/latest/jre/bin/java, -Xmx2048M, -jar, /home/jenkins/agent/workspace/eclipse.platform.runtime-Gerrit/.repository/p2/osgi/bundle/org.eclipse.equinox.launcher/1.5.600.v20191014-2022/org.eclipse.equinox.launcher-1.5.600.v20191014-2022.jar, -install, /home/jenkins/agent/workspace/eclipse.platform.runtime-Gerrit/bundles/org.eclipse.core.contenttype/target/eclipserun-work, -configuration, /home/jenkins/agent/workspace/eclipse.platform.runtime-Gerrit/bundles/org.eclipse.core.contenttype/target/eclipserun-work/configuration, -data, /home/jenkins/agent/workspace/eclipse.platform.runtime-Gerrit/bundles/org.eclipse.core.contenttype/../target/org.eclipse.core.contenttype-apiAnalyzer-workspace, -application, org.eclipse.pde.api.tools.apiAnalyzer, -project, /home/jenkins/agent/workspace/eclipse.platform.runtime-Gerrit/bundles/org.eclipse.core.contenttype, -baseline, /home/jenkins/agent/workspace/eclipse.platform.runtime-Gerrit/bundles/org.eclipse.core.contenttype/target/org.eclipse.core.contenttype-apiBaseline.target, -dependencyList, /home/jenkins/agent/workspace/eclipse.platform.runtime-Gerrit/bundles/org.eclipse.core.contenttype/target/dependencies-list.txt, -failOnError]
Picked up JAVA_TOOL_OPTIONS: -XX:+IgnoreUnrecognizedVMOptions -XX:+UseContainerSupport -XX:+UnlockExperimentalVMOptions -XX:+UseCGroupMemoryLimitForHeap
Picked up _JAVA_OPTIONS: -XX:MaxRAMPercentage=64.0
0 API ERRORS
0 API warnings
[INFO] 
[INFO] ---------------< org.eclipse.core:org.eclipse.core.jobs >---------------
[INFO] Building org.eclipse.core.jobs 3.10.600-SNAPSHOT                  [3/18]
[INFO] ---------------------------[ eclipse-plugin ]---------------------------
[INFO] 
[INFO] --- maven-clean-plugin:3.1.0:clean (default-clean) @ org.eclipse.core.jobs ---
[INFO] 
[INFO] --- tycho-packaging-plugin:1.5.1:build-qualifier (default-build-qualifier) @ org.eclipse.core.jobs ---
[INFO] The project's OSGi version is 3.10.600.v20191026-0839
[INFO] 
[INFO] --- tycho-packaging-plugin:1.5.1:validate-id (default-validate-id) @ org.eclipse.core.jobs ---
[INFO] 
[INFO] --- tycho-packaging-plugin:1.5.1:validate-version (default-validate-version) @ org.eclipse.core.jobs ---
[INFO] 
[INFO] --- maven-resources-plugin:3.1.0:copy-resources (saveproperties) @ org.eclipse.core.jobs ---
[INFO] Using 'UTF-8' encoding to copy filtered resources.
[INFO] skip non existing resourceDirectory /home/jenkins/agent/workspace/eclipse.platform.runtime-Gerrit/bundles/org.eclipse.core.jobs/saveproperties
[INFO] 
[INFO] --- maven-enforcer-plugin:3.0.0-M2:enforce (enforce-maven) @ org.eclipse.core.jobs ---
[INFO] 
[INFO] --- eclipse-cbi-plugin:1.1.8-SNAPSHOT:generate-api-build-xml (default) @ org.eclipse.core.jobs ---
Generating target/.apibuild.xml
[INFO] 
[INFO] --- maven-resources-plugin:3.1.0:resources (default-resources) @ org.eclipse.core.jobs ---
[INFO] Using 'UTF-8' encoding to copy filtered resources.
[INFO] skip non existing resourceDirectory /home/jenkins/agent/workspace/eclipse.platform.runtime-Gerrit/bundles/org.eclipse.core.jobs/src/main/resources
[INFO] 
[INFO] --- maven-resources-plugin:3.1.0:resources (filter-resources) @ org.eclipse.core.jobs ---
[INFO] Using 'UTF-8' encoding to copy filtered resources.
[INFO] skip non existing resourceDirectory /home/jenkins/agent/workspace/eclipse.platform.runtime-Gerrit/bundles/org.eclipse.core.jobs/src/main/resources
[INFO] 
[INFO] --- tycho-compiler-plugin:1.5.1:compile (default-compile) @ org.eclipse.core.jobs ---
[INFO] Compiling 36 source files to /home/jenkins/agent/workspace/eclipse.platform.runtime-Gerrit/bundles/org.eclipse.core.jobs/target/classes
[INFO] 
[INFO] --- tycho-eclipserun-plugin:1.5.1:eclipse-run (default) @ org.eclipse.core.jobs ---
[INFO] Toolchain in tycho-eclipserun-plugin: JDK[/opt/tools/java/oracle/jdk-8/latest/jre]
[INFO] Expected eclipse log file: /home/jenkins/agent/workspace/eclipse.platform.runtime-Gerrit/bundles/org.eclipse.core.jobs/target/eclipserun-work/data/.metadata/.log
[INFO] Command line:
	[/opt/tools/java/oracle/jdk-8/latest/jre/bin/java, -jar, /home/jenkins/agent/workspace/eclipse.platform.runtime-Gerrit/.repository/p2/osgi/bundle/org.eclipse.equinox.launcher/1.5.600.v20191014-2022/org.eclipse.equinox.launcher-1.5.600.v20191014-2022.jar, -install, /home/jenkins/agent/workspace/eclipse.platform.runtime-Gerrit/bundles/org.eclipse.core.jobs/target/eclipserun-work, -configuration, /home/jenkins/agent/workspace/eclipse.platform.runtime-Gerrit/bundles/org.eclipse.core.jobs/target/eclipserun-work/configuration, -data, target/apibuild-workspace, -application, org.eclipse.ant.core.antRunner, -buildfile, target/.apibuild.xml]
Picked up JAVA_TOOL_OPTIONS: -XX:+IgnoreUnrecognizedVMOptions -XX:+UseContainerSupport -XX:+UnlockExperimentalVMOptions -XX:+UseCGroupMemoryLimitForHeap
Picked up _JAVA_OPTIONS: -XX:MaxRAMPercentage=64.0
Buildfile: target/.apibuild.xml

apigen:
BUILD SUCCESSFUL

BUILD SUCCESSFUL
Total time: 1 second
[INFO] 
[INFO] --- maven-resources-plugin:3.1.0:testResources (default-testResources) @ org.eclipse.core.jobs ---
[INFO] Using 'UTF-8' encoding to copy filtered resources.
[INFO] skip non existing resourceDirectory /home/jenkins/agent/workspace/eclipse.platform.runtime-Gerrit/bundles/org.eclipse.core.jobs/src/test/resources
[INFO] 
[INFO] --- tycho-source-plugin:1.5.1:plugin-source (plugin-source) @ org.eclipse.core.jobs ---
[INFO] Building jar: /home/jenkins/agent/workspace/eclipse.platform.runtime-Gerrit/bundles/org.eclipse.core.jobs/target/org.eclipse.core.jobs-3.10.600-SNAPSHOT-sources.jar
[INFO] 
[INFO] --- target-platform-configuration:1.5.1:target-platform (default-target-platform) @ org.eclipse.core.jobs ---
[INFO] 
[INFO] --- tycho-packaging-plugin:1.5.1:package-plugin (default-package-plugin) @ org.eclipse.core.jobs ---
[INFO] Building jar: /home/jenkins/agent/workspace/eclipse.platform.runtime-Gerrit/bundles/org.eclipse.core.jobs/target/org.eclipse.core.jobs-3.10.600-SNAPSHOT.jar
[INFO] 
[INFO] --- tycho-p2-plugin:1.5.1:p2-metadata-default (default-p2-metadata-default) @ org.eclipse.core.jobs ---
[INFO] MavenProject: org.eclipse.core:org.eclipse.core.jobs:3.10.600-SNAPSHOT @ /home/jenkins/agent/workspace/eclipse.platform.runtime-Gerrit/bundles/org.eclipse.core.jobs/pom.xml
    The main artifact has been replaced with the baseline version.
    The following attached artifacts have been replaced with the baseline version: [sources]

[INFO] 
[INFO] --- tycho-p2-extras-plugin:1.5.1:compare-version-with-baselines (compare-attached-artifacts-with-release) @ org.eclipse.core.jobs ---
[INFO] Fetching org.eclipse.core.jobs_3.10.500.v20190620-1426.jar.pack.gz from https://download.eclipse.org/eclipse/updates/4.13/R-4.13-201909161045/plugins/ (45.98kB)
[INFO] Fetching org.eclipse.core.jobs_3.10.500.v20190620-1426.jar.pack.gz from https://download.eclipse.org/eclipse/updates/4.13/R-4.13-201909161045/plugins/ (45.98kB)
[INFO] Fetching org.eclipse.core.jobs.source_3.10.500.v20190620-1426.jar from https://download.eclipse.org/eclipse/updates/4.13/R-4.13-201909161045/plugins/ (107.51kB)
[INFO] Fetching org.eclipse.core.jobs.source_3.10.500.v20190620-1426.jar from https://download.eclipse.org/eclipse/updates/4.13/R-4.13-201909161045/plugins/ (107.51kB)
[INFO] 
[INFO] --- maven-antrun-plugin:1.8:run (check-skip-api-analysis) @ org.eclipse.core.jobs ---
[INFO] Executing tasks

main:
[INFO] Executed tasks
[INFO] 
[INFO] --- tycho-dependency-tools-plugin:1.5.1:list-dependencies (list-dependencies) @ org.eclipse.core.jobs ---
[INFO] 
[INFO] --- tycho-eclipserun-plugin:1.5.1:eclipse-run (api-analysis) @ org.eclipse.core.jobs ---
[INFO] Toolchain in tycho-eclipserun-plugin: JDK[/opt/tools/java/oracle/jdk-8/latest/jre]
[INFO] Expected eclipse log file: /home/jenkins/agent/workspace/eclipse.platform.runtime-Gerrit/bundles/org.eclipse.core.jobs/target/eclipserun-work/data/.metadata/.log
[INFO] Command line:
	[/opt/tools/java/oracle/jdk-8/latest/jre/bin/java, -Xmx2048M, -jar, /home/jenkins/agent/workspace/eclipse.platform.runtime-Gerrit/.repository/p2/osgi/bundle/org.eclipse.equinox.launcher/1.5.600.v20191014-2022/org.eclipse.equinox.launcher-1.5.600.v20191014-2022.jar, -install, /home/jenkins/agent/workspace/eclipse.platform.runtime-Gerrit/bundles/org.eclipse.core.jobs/target/eclipserun-work, -configuration, /home/jenkins/agent/workspace/eclipse.platform.runtime-Gerrit/bundles/org.eclipse.core.jobs/target/eclipserun-work/configuration, -data, /home/jenkins/agent/workspace/eclipse.platform.runtime-Gerrit/bundles/org.eclipse.core.jobs/../target/org.eclipse.core.jobs-apiAnalyzer-workspace, -application, org.eclipse.pde.api.tools.apiAnalyzer, -project, /home/jenkins/agent/workspace/eclipse.platform.runtime-Gerrit/bundles/org.eclipse.core.jobs, -baseline, /home/jenkins/agent/workspace/eclipse.platform.runtime-Gerrit/bundles/org.eclipse.core.jobs/target/org.eclipse.core.jobs-apiBaseline.target, -dependencyList, /home/jenkins/agent/workspace/eclipse.platform.runtime-Gerrit/bundles/org.eclipse.core.jobs/target/dependencies-list.txt, -failOnError]
Picked up JAVA_TOOL_OPTIONS: -XX:+IgnoreUnrecognizedVMOptions -XX:+UseContainerSupport -XX:+UnlockExperimentalVMOptions -XX:+UseCGroupMemoryLimitForHeap
Picked up _JAVA_OPTIONS: -XX:MaxRAMPercentage=64.0
0 API ERRORS
1 API warnings
* Marker [on: /org.eclipse.core.jobs/src/org/eclipse/core/runtime/jobs/Job.java, id: 2, type: org.eclipse.pde.api.tools.api_usage, attributes: [apiMarkerID: 3, charEnd: 2365, charStart: 2362, lineNumber: 50, message: Job extends non-API type InternalJob, messagearguments: InternalJob#Job, org.eclipse.jdt.internal.core.JavaModelManager.handleId: =org.eclipse.core.jobs/src<org.eclipse.core.runtime.jobs{Job.java[Job, problemTypeName: org.eclipse.core.runtime.jobs.Job, problemid: 576720909, severity: 1, sourceId: API Tools], created: 11/6/19 12:48 PM]
[INFO] 
[INFO] -------------< org.eclipse.core:org.eclipse.core.runtime >--------------
[INFO] Building org.eclipse.core.runtime 3.16.100-SNAPSHOT               [4/18]
[INFO] ---------------------------[ eclipse-plugin ]---------------------------
[INFO] 
[INFO] --- maven-clean-plugin:3.1.0:clean (default-clean) @ org.eclipse.core.runtime ---
[INFO] 
[INFO] --- tycho-packaging-plugin:1.5.1:build-qualifier (default-build-qualifier) @ org.eclipse.core.runtime ---
[INFO] The project's OSGi version is 3.16.100.v20191106-1243
[INFO] 
[INFO] --- tycho-packaging-plugin:1.5.1:validate-id (default-validate-id) @ org.eclipse.core.runtime ---
[INFO] 
[INFO] --- tycho-packaging-plugin:1.5.1:validate-version (default-validate-version) @ org.eclipse.core.runtime ---
[INFO] 
[INFO] --- maven-resources-plugin:3.1.0:copy-resources (saveproperties) @ org.eclipse.core.runtime ---
[INFO] Using 'UTF-8' encoding to copy filtered resources.
[INFO] skip non existing resourceDirectory /home/jenkins/agent/workspace/eclipse.platform.runtime-Gerrit/bundles/org.eclipse.core.runtime/saveproperties
[INFO] 
[INFO] --- maven-enforcer-plugin:3.0.0-M2:enforce (enforce-maven) @ org.eclipse.core.runtime ---
[INFO] 
[INFO] --- eclipse-cbi-plugin:1.1.8-SNAPSHOT:generate-api-build-xml (default) @ org.eclipse.core.runtime ---
Generating target/.apibuild.xml
[INFO] 
[INFO] --- maven-resources-plugin:3.1.0:resources (default-resources) @ org.eclipse.core.runtime ---
[INFO] Using 'UTF-8' encoding to copy filtered resources.
[INFO] skip non existing resourceDirectory /home/jenkins/agent/workspace/eclipse.platform.runtime-Gerrit/bundles/org.eclipse.core.runtime/src/main/resources
[INFO] 
[INFO] --- maven-resources-plugin:3.1.0:resources (filter-resources) @ org.eclipse.core.runtime ---
[INFO] Using 'UTF-8' encoding to copy filtered resources.
[INFO] skip non existing resourceDirectory /home/jenkins/agent/workspace/eclipse.platform.runtime-Gerrit/bundles/org.eclipse.core.runtime/src/main/resources
[INFO] 
[INFO] --- tycho-compiler-plugin:1.5.1:compile (default-compile) @ org.eclipse.core.runtime ---
[INFO] Compiling 21 source files to /home/jenkins/agent/workspace/eclipse.platform.runtime-Gerrit/bundles/org.eclipse.core.runtime/target/classes
[INFO] 
[INFO] --- tycho-eclipserun-plugin:1.5.1:eclipse-run (default) @ org.eclipse.core.runtime ---
[INFO] Toolchain in tycho-eclipserun-plugin: JDK[/opt/tools/java/oracle/jdk-8/latest/jre]
[INFO] Expected eclipse log file: /home/jenkins/agent/workspace/eclipse.platform.runtime-Gerrit/bundles/org.eclipse.core.runtime/target/eclipserun-work/data/.metadata/.log
[INFO] Command line:
	[/opt/tools/java/oracle/jdk-8/latest/jre/bin/java, -jar, /home/jenkins/agent/workspace/eclipse.platform.runtime-Gerrit/.repository/p2/osgi/bundle/org.eclipse.equinox.launcher/1.5.600.v20191014-2022/org.eclipse.equinox.launcher-1.5.600.v20191014-2022.jar, -install, /home/jenkins/agent/workspace/eclipse.platform.runtime-Gerrit/bundles/org.eclipse.core.runtime/target/eclipserun-work, -configuration, /home/jenkins/agent/workspace/eclipse.platform.runtime-Gerrit/bundles/org.eclipse.core.runtime/target/eclipserun-work/configuration, -data, target/apibuild-workspace, -application, org.eclipse.ant.core.antRunner, -buildfile, target/.apibuild.xml]
Picked up JAVA_TOOL_OPTIONS: -XX:+IgnoreUnrecognizedVMOptions -XX:+UseContainerSupport -XX:+UnlockExperimentalVMOptions -XX:+UseCGroupMemoryLimitForHeap
Picked up _JAVA_OPTIONS: -XX:MaxRAMPercentage=64.0
Buildfile: target/.apibuild.xml

apigen:
BUILD SUCCESSFUL

BUILD SUCCESSFUL
Total time: 1 second
[INFO] 
[INFO] --- maven-resources-plugin:3.1.0:testResources (default-testResources) @ org.eclipse.core.runtime ---
[INFO] Using 'UTF-8' encoding to copy filtered resources.
[INFO] skip non existing resourceDirectory /home/jenkins/agent/workspace/eclipse.platform.runtime-Gerrit/bundles/org.eclipse.core.runtime/src/test/resources
[INFO] 
[INFO] --- tycho-source-plugin:1.5.1:plugin-source (plugin-source) @ org.eclipse.core.runtime ---
[INFO] Building jar: /home/jenkins/agent/workspace/eclipse.platform.runtime-Gerrit/bundles/org.eclipse.core.runtime/target/org.eclipse.core.runtime-3.16.100-SNAPSHOT-sources.jar
[INFO] 
[INFO] --- target-platform-configuration:1.5.1:target-platform (default-target-platform) @ org.eclipse.core.runtime ---
[INFO] 
[INFO] --- tycho-packaging-plugin:1.5.1:package-plugin (default-package-plugin) @ org.eclipse.core.runtime ---
[INFO] Building jar: /home/jenkins/agent/workspace/eclipse.platform.runtime-Gerrit/bundles/org.eclipse.core.runtime/target/org.eclipse.core.runtime-3.16.100-SNAPSHOT.jar
[INFO] 
[INFO] --- tycho-p2-plugin:1.5.1:p2-metadata-default (default-p2-metadata-default) @ org.eclipse.core.runtime ---
[INFO] No baseline version MavenProject: org.eclipse.core:org.eclipse.core.runtime:3.16.100-SNAPSHOT @ /home/jenkins/agent/workspace/eclipse.platform.runtime-Gerrit/bundles/org.eclipse.core.runtime/pom.xml
[INFO] 
[INFO] --- tycho-p2-extras-plugin:1.5.1:compare-version-with-baselines (compare-attached-artifacts-with-release) @ org.eclipse.core.runtime ---
[INFO] Fetching org.eclipse.core.runtime_3.16.0.v20190823-1314.jar.pack.gz from https://download.eclipse.org/eclipse/updates/4.13/R-4.13-201909161045/plugins/ (33.72kB)
[INFO] Fetching org.eclipse.core.runtime_3.16.0.v20190823-1314.jar.pack.gz from https://download.eclipse.org/eclipse/updates/4.13/R-4.13-201909161045/plugins/ (33.72kB)
[INFO] Fetching org.eclipse.core.runtime.source_3.16.0.v20190823-1314.jar from https://download.eclipse.org/eclipse/updates/4.13/R-4.13-201909161045/plugins/ (84.16kB)
[INFO] Fetching org.eclipse.core.runtime.source_3.16.0.v20190823-1314.jar from https://download.eclipse.org/eclipse/updates/4.13/R-4.13-201909161045/plugins/ (84.16kB)
[INFO] 
[INFO] --- maven-antrun-plugin:1.8:run (check-skip-api-analysis) @ org.eclipse.core.runtime ---
[INFO] Executing tasks

main:
[INFO] Executed tasks
[INFO] 
[INFO] --- tycho-dependency-tools-plugin:1.5.1:list-dependencies (list-dependencies) @ org.eclipse.core.runtime ---
[INFO] 
[INFO] --- tycho-eclipserun-plugin:1.5.1:eclipse-run (api-analysis) @ org.eclipse.core.runtime ---
[INFO] Toolchain in tycho-eclipserun-plugin: JDK[/opt/tools/java/oracle/jdk-8/latest/jre]
[INFO] Expected eclipse log file: /home/jenkins/agent/workspace/eclipse.platform.runtime-Gerrit/bundles/org.eclipse.core.runtime/target/eclipserun-work/data/.metadata/.log
[INFO] Command line:
	[/opt/tools/java/oracle/jdk-8/latest/jre/bin/java, -Xmx2048M, -jar, /home/jenkins/agent/workspace/eclipse.platform.runtime-Gerrit/.repository/p2/osgi/bundle/org.eclipse.equinox.launcher/1.5.600.v20191014-2022/org.eclipse.equinox.launcher-1.5.600.v20191014-2022.jar, -install, /home/jenkins/agent/workspace/eclipse.platform.runtime-Gerrit/bundles/org.eclipse.core.runtime/target/eclipserun-work, -configuration, /home/jenkins/agent/workspace/eclipse.platform.runtime-Gerrit/bundles/org.eclipse.core.runtime/target/eclipserun-work/configuration, -data, /home/jenkins/agent/workspace/eclipse.platform.runtime-Gerrit/bundles/org.eclipse.core.runtime/../target/org.eclipse.core.runtime-apiAnalyzer-workspace, -application, org.eclipse.pde.api.tools.apiAnalyzer, -project, /home/jenkins/agent/workspace/eclipse.platform.runtime-Gerrit/bundles/org.eclipse.core.runtime, -baseline, /home/jenkins/agent/workspace/eclipse.platform.runtime-Gerrit/bundles/org.eclipse.core.runtime/target/org.eclipse.core.runtime-apiBaseline.target, -dependencyList, /home/jenkins/agent/workspace/eclipse.platform.runtime-Gerrit/bundles/org.eclipse.core.runtime/target/dependencies-list.txt, -failOnError]
Picked up JAVA_TOOL_OPTIONS: -XX:+IgnoreUnrecognizedVMOptions -XX:+UseContainerSupport -XX:+UnlockExperimentalVMOptions -XX:+UseCGroupMemoryLimitForHeap
Picked up _JAVA_OPTIONS: -XX:MaxRAMPercentage=64.0
1 API ERRORS
* Marker [on: /org.eclipse.core.runtime/META-INF/MANIFEST.MF, id: 31, type: org.eclipse.pde.api.tools.version_numbering, attributes: [apiMarkerID: 4, charEnd: 107, charStart: 89, description: - Message not found for id: 0
- Message not found for id: 0
- Message not found for id: 0
- Message not found for id: 0
- Message not found for id: 0
- Message not found for id: 0
, lineNumber: 4, message: The minor version should be incremented in version 3.16.100, since new APIs have been added since version 3.16.0, messagearguments: 3.16.100#3.16.0, problemid: 924844039, severity: 2, sourceId: API Tools, version: 3.17.0.qualifier], created: 11/6/19 12:49 PM]
0 API warnings
[INFO] 
[INFO] ------------------------------------------------------------------------
[INFO] Skipping org.eclipse.core.expressions
[INFO] This project has been banned from the build due to previous failures.
[INFO] ------------------------------------------------------------------------
[INFO] 
[INFO] ---------< org.eclipse.e4:org.eclipse.e4.core.di.annotations >----------
[INFO] Building org.eclipse.e4.core.di.annotations 1.6.500-SNAPSHOT      [5/18]
[INFO] ---------------------------[ eclipse-plugin ]---------------------------
[INFO] 
[INFO] --- maven-clean-plugin:3.1.0:clean (default-clean) @ org.eclipse.e4.core.di.annotations ---
[INFO] 
[INFO] --- tycho-packaging-plugin:1.5.1:build-qualifier (default-build-qualifier) @ org.eclipse.e4.core.di.annotations ---
[INFO] The project's OSGi version is 1.6.500.v20190925-0538
[INFO] 
[INFO] --- tycho-packaging-plugin:1.5.1:validate-id (default-validate-id) @ org.eclipse.e4.core.di.annotations ---
[INFO] 
[INFO] --- tycho-packaging-plugin:1.5.1:validate-version (default-validate-version) @ org.eclipse.e4.core.di.annotations ---
[INFO] 
[INFO] --- maven-resources-plugin:3.1.0:copy-resources (saveproperties) @ org.eclipse.e4.core.di.annotations ---
[INFO] Using 'UTF-8' encoding to copy filtered resources.
[INFO] skip non existing resourceDirectory /home/jenkins/agent/workspace/eclipse.platform.runtime-Gerrit/bundles/org.eclipse.e4.core.di.annotations/saveproperties
[INFO] 
[INFO] --- maven-enforcer-plugin:3.0.0-M2:enforce (enforce-maven) @ org.eclipse.e4.core.di.annotations ---
[INFO] 
[INFO] --- eclipse-cbi-plugin:1.1.8-SNAPSHOT:generate-api-build-xml (default) @ org.eclipse.e4.core.di.annotations ---
Generating target/.apibuild.xml
[INFO] 
[INFO] --- maven-resources-plugin:3.1.0:resources (default-resources) @ org.eclipse.e4.core.di.annotations ---
[INFO] Using 'UTF-8' encoding to copy filtered resources.
[INFO] skip non existing resourceDirectory /home/jenkins/agent/workspace/eclipse.platform.runtime-Gerrit/bundles/org.eclipse.e4.core.di.annotations/src/main/resources
[INFO] 
[INFO] --- maven-resources-plugin:3.1.0:resources (filter-resources) @ org.eclipse.e4.core.di.annotations ---
[INFO] Using 'UTF-8' encoding to copy filtered resources.
[INFO] skip non existing resourceDirectory /home/jenkins/agent/workspace/eclipse.platform.runtime-Gerrit/bundles/org.eclipse.e4.core.di.annotations/src/main/resources
[INFO] 
[INFO] --- tycho-compiler-plugin:1.5.1:compile (default-compile) @ org.eclipse.e4.core.di.annotations ---
[INFO] Compiling 6 source files to /home/jenkins/agent/workspace/eclipse.platform.runtime-Gerrit/bundles/org.eclipse.e4.core.di.annotations/target/classes
[INFO] 
[INFO] --- tycho-eclipserun-plugin:1.5.1:eclipse-run (default) @ org.eclipse.e4.core.di.annotations ---
[INFO] Toolchain in tycho-eclipserun-plugin: JDK[/opt/tools/java/oracle/jdk-8/latest/jre]
[INFO] Expected eclipse log file: /home/jenkins/agent/workspace/eclipse.platform.runtime-Gerrit/bundles/org.eclipse.e4.core.di.annotations/target/eclipserun-work/data/.metadata/.log
[INFO] Command line:
	[/opt/tools/java/oracle/jdk-8/latest/jre/bin/java, -jar, /home/jenkins/agent/workspace/eclipse.platform.runtime-Gerrit/.repository/p2/osgi/bundle/org.eclipse.equinox.launcher/1.5.600.v20191014-2022/org.eclipse.equinox.launcher-1.5.600.v20191014-2022.jar, -install, /home/jenkins/agent/workspace/eclipse.platform.runtime-Gerrit/bundles/org.eclipse.e4.core.di.annotations/target/eclipserun-work, -configuration, /home/jenkins/agent/workspace/eclipse.platform.runtime-Gerrit/bundles/org.eclipse.e4.core.di.annotations/target/eclipserun-work/configuration, -data, target/apibuild-workspace, -application, org.eclipse.ant.core.antRunner, -buildfile, target/.apibuild.xml]
Picked up JAVA_TOOL_OPTIONS: -XX:+IgnoreUnrecognizedVMOptions -XX:+UseContainerSupport -XX:+UnlockExperimentalVMOptions -XX:+UseCGroupMemoryLimitForHeap
Picked up _JAVA_OPTIONS: -XX:MaxRAMPercentage=64.0
Buildfile: target/.apibuild.xml

apigen:
BUILD SUCCESSFUL

BUILD SUCCESSFUL
Total time: 1 second
[INFO] 
[INFO] --- maven-resources-plugin:3.1.0:testResources (default-testResources) @ org.eclipse.e4.core.di.annotations ---
[INFO] Using 'UTF-8' encoding to copy filtered resources.
[INFO] skip non existing resourceDirectory /home/jenkins/agent/workspace/eclipse.platform.runtime-Gerrit/bundles/org.eclipse.e4.core.di.annotations/src/test/resources
[INFO] 
[INFO] --- tycho-source-plugin:1.5.1:plugin-source (plugin-source) @ org.eclipse.e4.core.di.annotations ---
[INFO] Building jar: /home/jenkins/agent/workspace/eclipse.platform.runtime-Gerrit/bundles/org.eclipse.e4.core.di.annotations/target/org.eclipse.e4.core.di.annotations-1.6.500-SNAPSHOT-sources.jar
[INFO] 
[INFO] --- target-platform-configuration:1.5.1:target-platform (default-target-platform) @ org.eclipse.e4.core.di.annotations ---
[INFO] 
[INFO] --- tycho-packaging-plugin:1.5.1:package-plugin (default-package-plugin) @ org.eclipse.e4.core.di.annotations ---
[INFO] Building jar: /home/jenkins/agent/workspace/eclipse.platform.runtime-Gerrit/bundles/org.eclipse.e4.core.di.annotations/target/org.eclipse.e4.core.di.annotations-1.6.500-SNAPSHOT.jar
[INFO] 
[INFO] --- tycho-p2-plugin:1.5.1:p2-metadata-default (default-p2-metadata-default) @ org.eclipse.e4.core.di.annotations ---
[INFO] MavenProject: org.eclipse.e4:org.eclipse.e4.core.di.annotations:1.6.500-SNAPSHOT @ /home/jenkins/agent/workspace/eclipse.platform.runtime-Gerrit/bundles/org.eclipse.e4.core.di.annotations/pom.xml
    The main artifact has been replaced with the baseline version.
    The following attached artifacts have been replaced with the baseline version: [sources]

[INFO] 
[INFO] --- tycho-p2-extras-plugin:1.5.1:compare-version-with-baselines (compare-attached-artifacts-with-release) @ org.eclipse.e4.core.di.annotations ---
[INFO] Fetching org.eclipse.e4.core.di.annotations_1.6.400.v20190518-1217.jar from https://download.eclipse.org/eclipse/updates/4.13/R-4.13-201909161045/plugins/ (11.98kB)
[INFO] Fetching org.eclipse.e4.core.di.annotations_1.6.400.v20190518-1217.jar from https://download.eclipse.org/eclipse/updates/4.13/R-4.13-201909161045/plugins/ (11.98kB)
[INFO] Fetching org.eclipse.e4.core.di.annotations.source_1.6.400.v20190518-1217.jar from https://download.eclipse.org/eclipse/updates/4.13/R-4.13-201909161045/plugins/ (14.43kB)
[INFO] Fetching org.eclipse.e4.core.di.annotations.source_1.6.400.v20190518-1217.jar from https://download.eclipse.org/eclipse/updates/4.13/R-4.13-201909161045/plugins/ (14.43kB)
[INFO] 
[INFO] --- maven-antrun-plugin:1.8:run (check-skip-api-analysis) @ org.eclipse.e4.core.di.annotations ---
[INFO] Executing tasks

main:
[INFO] Executed tasks
[INFO] 
[INFO] --- tycho-dependency-tools-plugin:1.5.1:list-dependencies (list-dependencies) @ org.eclipse.e4.core.di.annotations ---
[INFO] 
[INFO] --- tycho-eclipserun-plugin:1.5.1:eclipse-run (api-analysis) @ org.eclipse.e4.core.di.annotations ---
[INFO] Toolchain in tycho-eclipserun-plugin: JDK[/opt/tools/java/oracle/jdk-8/latest/jre]
[INFO] Expected eclipse log file: /home/jenkins/agent/workspace/eclipse.platform.runtime-Gerrit/bundles/org.eclipse.e4.core.di.annotations/target/eclipserun-work/data/.metadata/.log
[INFO] Command line:
	[/opt/tools/java/oracle/jdk-8/latest/jre/bin/java, -Xmx2048M, -jar, /home/jenkins/agent/workspace/eclipse.platform.runtime-Gerrit/.repository/p2/osgi/bundle/org.eclipse.equinox.launcher/1.5.600.v20191014-2022/org.eclipse.equinox.launcher-1.5.600.v20191014-2022.jar, -install, /home/jenkins/agent/workspace/eclipse.platform.runtime-Gerrit/bundles/org.eclipse.e4.core.di.annotations/target/eclipserun-work, -configuration, /home/jenkins/agent/workspace/eclipse.platform.runtime-Gerrit/bundles/org.eclipse.e4.core.di.annotations/target/eclipserun-work/configuration, -data, /home/jenkins/agent/workspace/eclipse.platform.runtime-Gerrit/bundles/org.eclipse.e4.core.di.annotations/../target/org.eclipse.e4.core.di.annotations-apiAnalyzer-workspace, -application, org.eclipse.pde.api.tools.apiAnalyzer, -project, /home/jenkins/agent/workspace/eclipse.platform.runtime-Gerrit/bundles/org.eclipse.e4.core.di.annotations, -baseline, /home/jenkins/agent/workspace/eclipse.platform.runtime-Gerrit/bundles/org.eclipse.e4.core.di.annotations/target/org.eclipse.e4.core.di.annotations-apiBaseline.target, -dependencyList, /home/jenkins/agent/workspace/eclipse.platform.runtime-Gerrit/bundles/org.eclipse.e4.core.di.annotations/target/dependencies-list.txt, -failOnError]
Picked up JAVA_TOOL_OPTIONS: -XX:+IgnoreUnrecognizedVMOptions -XX:+UseContainerSupport -XX:+UnlockExperimentalVMOptions -XX:+UseCGroupMemoryLimitForHeap
Picked up _JAVA_OPTIONS: -XX:MaxRAMPercentage=64.0
0 API ERRORS
0 API warnings
[INFO] 
[INFO] ---------------< org.eclipse.e4:org.eclipse.e4.core.di >----------------
[INFO] Building org.eclipse.e4.core.di 1.7.500-SNAPSHOT                  [6/18]
[INFO] ---------------------------[ eclipse-plugin ]---------------------------
[INFO] 
[INFO] --- maven-clean-plugin:3.1.0:clean (default-clean) @ org.eclipse.e4.core.di ---
[INFO] 
[INFO] --- tycho-packaging-plugin:1.5.1:build-qualifier (default-build-qualifier) @ org.eclipse.e4.core.di ---
[INFO] The project's OSGi version is 1.7.500.v20190916-2125
[INFO] 
[INFO] --- tycho-packaging-plugin:1.5.1:validate-id (default-validate-id) @ org.eclipse.e4.core.di ---
[INFO] 
[INFO] --- tycho-packaging-plugin:1.5.1:validate-version (default-validate-version) @ org.eclipse.e4.core.di ---
[INFO] 
[INFO] --- maven-resources-plugin:3.1.0:copy-resources (saveproperties) @ org.eclipse.e4.core.di ---
[INFO] Using 'UTF-8' encoding to copy filtered resources.
[INFO] skip non existing resourceDirectory /home/jenkins/agent/workspace/eclipse.platform.runtime-Gerrit/bundles/org.eclipse.e4.core.di/saveproperties
[INFO] 
[INFO] --- maven-enforcer-plugin:3.0.0-M2:enforce (enforce-maven) @ org.eclipse.e4.core.di ---
[INFO] 
[INFO] --- eclipse-cbi-plugin:1.1.8-SNAPSHOT:generate-api-build-xml (default) @ org.eclipse.e4.core.di ---
Generating target/.apibuild.xml
[INFO] 
[INFO] --- maven-resources-plugin:3.1.0:resources (default-resources) @ org.eclipse.e4.core.di ---
[INFO] Using 'UTF-8' encoding to copy filtered resources.
[INFO] skip non existing resourceDirectory /home/jenkins/agent/workspace/eclipse.platform.runtime-Gerrit/bundles/org.eclipse.e4.core.di/src/main/resources
[INFO] 
[INFO] --- maven-resources-plugin:3.1.0:resources (filter-resources) @ org.eclipse.e4.core.di ---
[INFO] Using 'UTF-8' encoding to copy filtered resources.
[INFO] skip non existing resourceDirectory /home/jenkins/agent/workspace/eclipse.platform.runtime-Gerrit/bundles/org.eclipse.e4.core.di/src/main/resources
[INFO] 
[INFO] --- tycho-compiler-plugin:1.5.1:compile (default-compile) @ org.eclipse.e4.core.di ---
[INFO] Compiling 21 source files to /home/jenkins/agent/workspace/eclipse.platform.runtime-Gerrit/bundles/org.eclipse.e4.core.di/target/classes
[INFO] 
[INFO] --- tycho-eclipserun-plugin:1.5.1:eclipse-run (default) @ org.eclipse.e4.core.di ---
[INFO] Toolchain in tycho-eclipserun-plugin: JDK[/opt/tools/java/oracle/jdk-8/latest/jre]
[INFO] Expected eclipse log file: /home/jenkins/agent/workspace/eclipse.platform.runtime-Gerrit/bundles/org.eclipse.e4.core.di/target/eclipserun-work/data/.metadata/.log
[INFO] Command line:
	[/opt/tools/java/oracle/jdk-8/latest/jre/bin/java, -jar, /home/jenkins/agent/workspace/eclipse.platform.runtime-Gerrit/.repository/p2/osgi/bundle/org.eclipse.equinox.launcher/1.5.600.v20191014-2022/org.eclipse.equinox.launcher-1.5.600.v20191014-2022.jar, -install, /home/jenkins/agent/workspace/eclipse.platform.runtime-Gerrit/bundles/org.eclipse.e4.core.di/target/eclipserun-work, -configuration, /home/jenkins/agent/workspace/eclipse.platform.runtime-Gerrit/bundles/org.eclipse.e4.core.di/target/eclipserun-work/configuration, -data, target/apibuild-workspace, -application, org.eclipse.ant.core.antRunner, -buildfile, target/.apibuild.xml]
Picked up JAVA_TOOL_OPTIONS: -XX:+IgnoreUnrecognizedVMOptions -XX:+UseContainerSupport -XX:+UnlockExperimentalVMOptions -XX:+UseCGroupMemoryLimitForHeap
Picked up _JAVA_OPTIONS: -XX:MaxRAMPercentage=64.0
Buildfile: target/.apibuild.xml

apigen:
BUILD SUCCESSFUL

BUILD SUCCESSFUL
Total time: 1 second
[INFO] 
[INFO] --- maven-resources-plugin:3.1.0:testResources (default-testResources) @ org.eclipse.e4.core.di ---
[INFO] Using 'UTF-8' encoding to copy filtered resources.
[INFO] skip non existing resourceDirectory /home/jenkins/agent/workspace/eclipse.platform.runtime-Gerrit/bundles/org.eclipse.e4.core.di/src/test/resources
[INFO] 
[INFO] --- tycho-source-plugin:1.5.1:plugin-source (plugin-source) @ org.eclipse.e4.core.di ---
[INFO] Building jar: /home/jenkins/agent/workspace/eclipse.platform.runtime-Gerrit/bundles/org.eclipse.e4.core.di/target/org.eclipse.e4.core.di-1.7.500-SNAPSHOT-sources.jar
[INFO] 
[INFO] --- target-platform-configuration:1.5.1:target-platform (default-target-platform) @ org.eclipse.e4.core.di ---
[INFO] 
[INFO] --- tycho-packaging-plugin:1.5.1:package-plugin (default-package-plugin) @ org.eclipse.e4.core.di ---
[INFO] Building jar: /home/jenkins/agent/workspace/eclipse.platform.runtime-Gerrit/bundles/org.eclipse.e4.core.di/target/org.eclipse.e4.core.di-1.7.500-SNAPSHOT.jar
[INFO] 
[INFO] --- tycho-p2-plugin:1.5.1:p2-metadata-default (default-p2-metadata-default) @ org.eclipse.e4.core.di ---
[INFO] MavenProject: org.eclipse.e4:org.eclipse.e4.core.di:1.7.500-SNAPSHOT @ /home/jenkins/agent/workspace/eclipse.platform.runtime-Gerrit/bundles/org.eclipse.e4.core.di/pom.xml
    The main artifact has been replaced with the baseline version.
    The following attached artifacts have been replaced with the baseline version: [sources]

[INFO] 
[INFO] --- tycho-p2-extras-plugin:1.5.1:compare-version-with-baselines (compare-attached-artifacts-with-release) @ org.eclipse.e4.core.di ---
[INFO] Fetching org.eclipse.e4.core.di_1.7.400.v20190903-1311.jar.pack.gz from https://download.eclipse.org/eclipse/updates/4.13/R-4.13-201909161045/plugins/ (25.9kB)
[INFO] Fetching org.eclipse.e4.core.di_1.7.400.v20190903-1311.jar.pack.gz from https://download.eclipse.org/eclipse/updates/4.13/R-4.13-201909161045/plugins/ (25.9kB)
[INFO] Fetching org.eclipse.e4.core.di.source_1.7.400.v20190903-1311.jar from https://download.eclipse.org/eclipse/updates/4.13/R-4.13-201909161045/plugins/ (44.49kB)
[INFO] Fetching org.eclipse.e4.core.di.source_1.7.400.v20190903-1311.jar from https://download.eclipse.org/eclipse/updates/4.13/R-4.13-201909161045/plugins/ (44.49kB)
[INFO] 
[INFO] --- maven-antrun-plugin:1.8:run (check-skip-api-analysis) @ org.eclipse.e4.core.di ---
[INFO] Executing tasks

main:
[INFO] Executed tasks
[INFO] 
[INFO] --- tycho-dependency-tools-plugin:1.5.1:list-dependencies (list-dependencies) @ org.eclipse.e4.core.di ---
[INFO] 
[INFO] --- tycho-eclipserun-plugin:1.5.1:eclipse-run (api-analysis) @ org.eclipse.e4.core.di ---
[INFO] Toolchain in tycho-eclipserun-plugin: JDK[/opt/tools/java/oracle/jdk-8/latest/jre]
[INFO] Expected eclipse log file: /home/jenkins/agent/workspace/eclipse.platform.runtime-Gerrit/bundles/org.eclipse.e4.core.di/target/eclipserun-work/data/.metadata/.log
[INFO] Command line:
	[/opt/tools/java/oracle/jdk-8/latest/jre/bin/java, -Xmx2048M, -jar, /home/jenkins/agent/workspace/eclipse.platform.runtime-Gerrit/.repository/p2/osgi/bundle/org.eclipse.equinox.launcher/1.5.600.v20191014-2022/org.eclipse.equinox.launcher-1.5.600.v20191014-2022.jar, -install, /home/jenkins/agent/workspace/eclipse.platform.runtime-Gerrit/bundles/org.eclipse.e4.core.di/target/eclipserun-work, -configuration, /home/jenkins/agent/workspace/eclipse.platform.runtime-Gerrit/bundles/org.eclipse.e4.core.di/target/eclipserun-work/configuration, -data, /home/jenkins/agent/workspace/eclipse.platform.runtime-Gerrit/bundles/org.eclipse.e4.core.di/../target/org.eclipse.e4.core.di-apiAnalyzer-workspace, -application, org.eclipse.pde.api.tools.apiAnalyzer, -project, /home/jenkins/agent/workspace/eclipse.platform.runtime-Gerrit/bundles/org.eclipse.e4.core.di, -baseline, /home/jenkins/agent/workspace/eclipse.platform.runtime-Gerrit/bundles/org.eclipse.e4.core.di/target/org.eclipse.e4.core.di-apiBaseline.target, -dependencyList, /home/jenkins/agent/workspace/eclipse.platform.runtime-Gerrit/bundles/org.eclipse.e4.core.di/target/dependencies-list.txt, -failOnError]
Picked up JAVA_TOOL_OPTIONS: -XX:+IgnoreUnrecognizedVMOptions -XX:+UseContainerSupport -XX:+UnlockExperimentalVMOptions -XX:+UseCGroupMemoryLimitForHeap
Picked up _JAVA_OPTIONS: -XX:MaxRAMPercentage=64.0
0 API ERRORS
0 API warnings
[INFO] 
[INFO] ------------< org.eclipse.e4:org.eclipse.e4.core.contexts >-------------
[INFO] Building org.eclipse.e4.core.contexts 1.8.300-SNAPSHOT            [7/18]
[INFO] ---------------------------[ eclipse-plugin ]---------------------------
[INFO] 
[INFO] --- maven-clean-plugin:3.1.0:clean (default-clean) @ org.eclipse.e4.core.contexts ---
[INFO] 
[INFO] --- tycho-packaging-plugin:1.5.1:build-qualifier (default-build-qualifier) @ org.eclipse.e4.core.contexts ---
[INFO] The project's OSGi version is 1.8.300.v20191017-1404
[INFO] 
[INFO] --- tycho-packaging-plugin:1.5.1:validate-id (default-validate-id) @ org.eclipse.e4.core.contexts ---
[INFO] 
[INFO] --- tycho-packaging-plugin:1.5.1:validate-version (default-validate-version) @ org.eclipse.e4.core.contexts ---
[INFO] 
[INFO] --- maven-resources-plugin:3.1.0:copy-resources (saveproperties) @ org.eclipse.e4.core.contexts ---
[INFO] Using 'UTF-8' encoding to copy filtered resources.
[INFO] skip non existing resourceDirectory /home/jenkins/agent/workspace/eclipse.platform.runtime-Gerrit/bundles/org.eclipse.e4.core.contexts/saveproperties
[INFO] 
[INFO] --- maven-enforcer-plugin:3.0.0-M2:enforce (enforce-maven) @ org.eclipse.e4.core.contexts ---
[INFO] 
[INFO] --- eclipse-cbi-plugin:1.1.8-SNAPSHOT:generate-api-build-xml (default) @ org.eclipse.e4.core.contexts ---
Generating target/.apibuild.xml
[INFO] 
[INFO] --- maven-resources-plugin:3.1.0:resources (default-resources) @ org.eclipse.e4.core.contexts ---
[INFO] Using 'UTF-8' encoding to copy filtered resources.
[INFO] skip non existing resourceDirectory /home/jenkins/agent/workspace/eclipse.platform.runtime-Gerrit/bundles/org.eclipse.e4.core.contexts/src/main/resources
[INFO] 
[INFO] --- maven-resources-plugin:3.1.0:resources (filter-resources) @ org.eclipse.e4.core.contexts ---
[INFO] Using 'UTF-8' encoding to copy filtered resources.
[INFO] skip non existing resourceDirectory /home/jenkins/agent/workspace/eclipse.platform.runtime-Gerrit/bundles/org.eclipse.e4.core.contexts/src/main/resources
[INFO] 
[INFO] --- tycho-compiler-plugin:1.5.1:compile (default-compile) @ org.eclipse.e4.core.contexts ---
[INFO] Compiling 19 source files to /home/jenkins/agent/workspace/eclipse.platform.runtime-Gerrit/bundles/org.eclipse.e4.core.contexts/target/classes
[INFO] 
[INFO] --- tycho-eclipserun-plugin:1.5.1:eclipse-run (default) @ org.eclipse.e4.core.contexts ---
[INFO] Toolchain in tycho-eclipserun-plugin: JDK[/opt/tools/java/oracle/jdk-8/latest/jre]
[INFO] Expected eclipse log file: /home/jenkins/agent/workspace/eclipse.platform.runtime-Gerrit/bundles/org.eclipse.e4.core.contexts/target/eclipserun-work/data/.metadata/.log
[INFO] Command line:
	[/opt/tools/java/oracle/jdk-8/latest/jre/bin/java, -jar, /home/jenkins/agent/workspace/eclipse.platform.runtime-Gerrit/.repository/p2/osgi/bundle/org.eclipse.equinox.launcher/1.5.600.v20191014-2022/org.eclipse.equinox.launcher-1.5.600.v20191014-2022.jar, -install, /home/jenkins/agent/workspace/eclipse.platform.runtime-Gerrit/bundles/org.eclipse.e4.core.contexts/target/eclipserun-work, -configuration, /home/jenkins/agent/workspace/eclipse.platform.runtime-Gerrit/bundles/org.eclipse.e4.core.contexts/target/eclipserun-work/configuration, -data, target/apibuild-workspace, -application, org.eclipse.ant.core.antRunner, -buildfile, target/.apibuild.xml]
Picked up JAVA_TOOL_OPTIONS: -XX:+IgnoreUnrecognizedVMOptions -XX:+UseContainerSupport -XX:+UnlockExperimentalVMOptions -XX:+UseCGroupMemoryLimitForHeap
Picked up _JAVA_OPTIONS: -XX:MaxRAMPercentage=64.0
Buildfile: target/.apibuild.xml

apigen:
BUILD SUCCESSFUL

BUILD SUCCESSFUL
Total time: 1 second
[INFO] 
[INFO] --- maven-resources-plugin:3.1.0:testResources (default-testResources) @ org.eclipse.e4.core.contexts ---
[INFO] Using 'UTF-8' encoding to copy filtered resources.
[INFO] skip non existing resourceDirectory /home/jenkins/agent/workspace/eclipse.platform.runtime-Gerrit/bundles/org.eclipse.e4.core.contexts/src/test/resources
[INFO] 
[INFO] --- tycho-source-plugin:1.5.1:plugin-source (plugin-source) @ org.eclipse.e4.core.contexts ---
[INFO] Building jar: /home/jenkins/agent/workspace/eclipse.platform.runtime-Gerrit/bundles/org.eclipse.e4.core.contexts/target/org.eclipse.e4.core.contexts-1.8.300-SNAPSHOT-sources.jar
[INFO] 
[INFO] --- target-platform-configuration:1.5.1:target-platform (default-target-platform) @ org.eclipse.e4.core.contexts ---
[INFO] 
[INFO] --- tycho-packaging-plugin:1.5.1:package-plugin (default-package-plugin) @ org.eclipse.e4.core.contexts ---
[INFO] Building jar: /home/jenkins/agent/workspace/eclipse.platform.runtime-Gerrit/bundles/org.eclipse.e4.core.contexts/target/org.eclipse.e4.core.contexts-1.8.300-SNAPSHOT.jar
[INFO] 
[INFO] --- tycho-p2-plugin:1.5.1:p2-metadata-default (default-p2-metadata-default) @ org.eclipse.e4.core.contexts ---
[INFO] MavenProject: org.eclipse.e4:org.eclipse.e4.core.contexts:1.8.300-SNAPSHOT @ /home/jenkins/agent/workspace/eclipse.platform.runtime-Gerrit/bundles/org.eclipse.e4.core.contexts/pom.xml
    The main artifact has been replaced with the baseline version.
    The following attached artifacts have been replaced with the baseline version: [sources]

[INFO] 
[INFO] --- tycho-p2-extras-plugin:1.5.1:compare-version-with-baselines (compare-attached-artifacts-with-release) @ org.eclipse.e4.core.contexts ---
[INFO] Fetching org.eclipse.e4.core.contexts_1.8.200.v20190620-0649.jar.pack.gz from https://download.eclipse.org/eclipse/updates/4.13/R-4.13-201909161045/plugins/ (22.6kB)
[INFO] Fetching org.eclipse.e4.core.contexts_1.8.200.v20190620-0649.jar.pack.gz from https://download.eclipse.org/eclipse/updates/4.13/R-4.13-201909161045/plugins/ (22.6kB)
[INFO] Fetching org.eclipse.e4.core.contexts.source_1.8.200.v20190620-0649.jar from https://download.eclipse.org/eclipse/updates/4.13/R-4.13-201909161045/plugins/ (42.05kB)
[INFO] Fetching org.eclipse.e4.core.contexts.source_1.8.200.v20190620-0649.jar from https://download.eclipse.org/eclipse/updates/4.13/R-4.13-201909161045/plugins/ (42.05kB)
[INFO] 
[INFO] --- maven-antrun-plugin:1.8:run (check-skip-api-analysis) @ org.eclipse.e4.core.contexts ---
[INFO] Executing tasks

main:
[INFO] Executed tasks
[INFO] 
[INFO] --- tycho-dependency-tools-plugin:1.5.1:list-dependencies (list-dependencies) @ org.eclipse.e4.core.contexts ---
[INFO] 
[INFO] --- tycho-eclipserun-plugin:1.5.1:eclipse-run (api-analysis) @ org.eclipse.e4.core.contexts ---
[INFO] Toolchain in tycho-eclipserun-plugin: JDK[/opt/tools/java/oracle/jdk-8/latest/jre]
[INFO] Expected eclipse log file: /home/jenkins/agent/workspace/eclipse.platform.runtime-Gerrit/bundles/org.eclipse.e4.core.contexts/target/eclipserun-work/data/.metadata/.log
[INFO] Command line:
	[/opt/tools/java/oracle/jdk-8/latest/jre/bin/java, -Xmx2048M, -jar, /home/jenkins/agent/workspace/eclipse.platform.runtime-Gerrit/.repository/p2/osgi/bundle/org.eclipse.equinox.launcher/1.5.600.v20191014-2022/org.eclipse.equinox.launcher-1.5.600.v20191014-2022.jar, -install, /home/jenkins/agent/workspace/eclipse.platform.runtime-Gerrit/bundles/org.eclipse.e4.core.contexts/target/eclipserun-work, -configuration, /home/jenkins/agent/workspace/eclipse.platform.runtime-Gerrit/bundles/org.eclipse.e4.core.contexts/target/eclipserun-work/configuration, -data, /home/jenkins/agent/workspace/eclipse.platform.runtime-Gerrit/bundles/org.eclipse.e4.core.contexts/../target/org.eclipse.e4.core.contexts-apiAnalyzer-workspace, -application, org.eclipse.pde.api.tools.apiAnalyzer, -project, /home/jenkins/agent/workspace/eclipse.platform.runtime-Gerrit/bundles/org.eclipse.e4.core.contexts, -baseline, /home/jenkins/agent/workspace/eclipse.platform.runtime-Gerrit/bundles/org.eclipse.e4.core.contexts/target/org.eclipse.e4.core.contexts-apiBaseline.target, -dependencyList, /home/jenkins/agent/workspace/eclipse.platform.runtime-Gerrit/bundles/org.eclipse.e4.core.contexts/target/dependencies-list.txt, -failOnError]
Picked up JAVA_TOOL_OPTIONS: -XX:+IgnoreUnrecognizedVMOptions -XX:+UseContainerSupport -XX:+UnlockExperimentalVMOptions -XX:+UseCGroupMemoryLimitForHeap
Picked up _JAVA_OPTIONS: -XX:MaxRAMPercentage=64.0
0 API ERRORS
1 API warnings
* Marker [on: /org.eclipse.e4.core.contexts/src/org/eclipse/e4/core/contexts/ContextFunction.java, id: 0, type: org.eclipse.pde.api.tools.api_usage, attributes: [apiMarkerID: 3, charEnd: 968, charStart: 953, lineNumber: 26, message: ContextFunction implements non-API interface IContextFunction, messagearguments: IContextFunction#ContextFunction, org.eclipse.jdt.internal.core.JavaModelManager.handleId: =org.eclipse.e4.core.contexts/src<org.eclipse.e4.core.contexts{ContextFunction.java[ContextFunction, problemTypeName: org.eclipse.e4.core.contexts.ContextFunction, problemid: 576725006, severity: 1, sourceId: API Tools], created: 11/6/19 12:50 PM]
[INFO] 
[INFO] ----------< org.eclipse.e4:org.eclipse.e4.core.di.extensions >----------
[INFO] Building org.eclipse.e4.core.di.extensions 0.15.300-SNAPSHOT      [8/18]
[INFO] ---------------------------[ eclipse-plugin ]---------------------------
[INFO] 
[INFO] --- maven-clean-plugin:3.1.0:clean (default-clean) @ org.eclipse.e4.core.di.extensions ---
[INFO] 
[INFO] --- tycho-packaging-plugin:1.5.1:build-qualifier (default-build-qualifier) @ org.eclipse.e4.core.di.extensions ---
[INFO] The project's OSGi version is 0.15.300.v20190213-1308
[INFO] 
[INFO] --- tycho-packaging-plugin:1.5.1:validate-id (default-validate-id) @ org.eclipse.e4.core.di.extensions ---
[INFO] 
[INFO] --- tycho-packaging-plugin:1.5.1:validate-version (default-validate-version) @ org.eclipse.e4.core.di.extensions ---
[INFO] 
[INFO] --- maven-resources-plugin:3.1.0:copy-resources (saveproperties) @ org.eclipse.e4.core.di.extensions ---
[INFO] Using 'UTF-8' encoding to copy filtered resources.
[INFO] skip non existing resourceDirectory /home/jenkins/agent/workspace/eclipse.platform.runtime-Gerrit/bundles/org.eclipse.e4.core.di.extensions/saveproperties
[INFO] 
[INFO] --- maven-enforcer-plugin:3.0.0-M2:enforce (enforce-maven) @ org.eclipse.e4.core.di.extensions ---
[INFO] 
[INFO] --- eclipse-cbi-plugin:1.1.8-SNAPSHOT:generate-api-build-xml (default) @ org.eclipse.e4.core.di.extensions ---
Generating target/.apibuild.xml
[INFO] 
[INFO] --- maven-resources-plugin:3.1.0:resources (default-resources) @ org.eclipse.e4.core.di.extensions ---
[INFO] Using 'UTF-8' encoding to copy filtered resources.
[INFO] skip non existing resourceDirectory /home/jenkins/agent/workspace/eclipse.platform.runtime-Gerrit/bundles/org.eclipse.e4.core.di.extensions/src/main/resources
[INFO] 
[INFO] --- maven-resources-plugin:3.1.0:resources (filter-resources) @ org.eclipse.e4.core.di.extensions ---
[INFO] Using 'UTF-8' encoding to copy filtered resources.
[INFO] skip non existing resourceDirectory /home/jenkins/agent/workspace/eclipse.platform.runtime-Gerrit/bundles/org.eclipse.e4.core.di.extensions/src/main/resources
[INFO] 
[INFO] --- tycho-compiler-plugin:1.5.1:compile (default-compile) @ org.eclipse.e4.core.di.extensions ---
[INFO] Compiling 4 source files to /home/jenkins/agent/workspace/eclipse.platform.runtime-Gerrit/bundles/org.eclipse.e4.core.di.extensions/target/classes
[INFO] 
[INFO] --- tycho-eclipserun-plugin:1.5.1:eclipse-run (default) @ org.eclipse.e4.core.di.extensions ---
[INFO] Toolchain in tycho-eclipserun-plugin: JDK[/opt/tools/java/oracle/jdk-8/latest/jre]
[INFO] Expected eclipse log file: /home/jenkins/agent/workspace/eclipse.platform.runtime-Gerrit/bundles/org.eclipse.e4.core.di.extensions/target/eclipserun-work/data/.metadata/.log
[INFO] Command line:
	[/opt/tools/java/oracle/jdk-8/latest/jre/bin/java, -jar, /home/jenkins/agent/workspace/eclipse.platform.runtime-Gerrit/.repository/p2/osgi/bundle/org.eclipse.equinox.launcher/1.5.600.v20191014-2022/org.eclipse.equinox.launcher-1.5.600.v20191014-2022.jar, -install, /home/jenkins/agent/workspace/eclipse.platform.runtime-Gerrit/bundles/org.eclipse.e4.core.di.extensions/target/eclipserun-work, -configuration, /home/jenkins/agent/workspace/eclipse.platform.runtime-Gerrit/bundles/org.eclipse.e4.core.di.extensions/target/eclipserun-work/configuration, -data, target/apibuild-workspace, -application, org.eclipse.ant.core.antRunner, -buildfile, target/.apibuild.xml]
Picked up JAVA_TOOL_OPTIONS: -XX:+IgnoreUnrecognizedVMOptions -XX:+UseContainerSupport -XX:+UnlockExperimentalVMOptions -XX:+UseCGroupMemoryLimitForHeap
Picked up _JAVA_OPTIONS: -XX:MaxRAMPercentage=64.0
Buildfile: target/.apibuild.xml

apigen:
BUILD SUCCESSFUL

BUILD SUCCESSFUL
Total time: 1 second
[INFO] 
[INFO] --- maven-resources-plugin:3.1.0:testResources (default-testResources) @ org.eclipse.e4.core.di.extensions ---
[INFO] Using 'UTF-8' encoding to copy filtered resources.
[INFO] skip non existing resourceDirectory /home/jenkins/agent/workspace/eclipse.platform.runtime-Gerrit/bundles/org.eclipse.e4.core.di.extensions/src/test/resources
[INFO] 
[INFO] --- tycho-source-plugin:1.5.1:plugin-source (plugin-source) @ org.eclipse.e4.core.di.extensions ---
[INFO] Building jar: /home/jenkins/agent/workspace/eclipse.platform.runtime-Gerrit/bundles/org.eclipse.e4.core.di.extensions/target/org.eclipse.e4.core.di.extensions-0.15.300-SNAPSHOT-sources.jar
[INFO] 
[INFO] --- target-platform-configuration:1.5.1:target-platform (default-target-platform) @ org.eclipse.e4.core.di.extensions ---
[INFO] 
[INFO] --- tycho-packaging-plugin:1.5.1:package-plugin (default-package-plugin) @ org.eclipse.e4.core.di.extensions ---
[INFO] Building jar: /home/jenkins/agent/workspace/eclipse.platform.runtime-Gerrit/bundles/org.eclipse.e4.core.di.extensions/target/org.eclipse.e4.core.di.extensions-0.15.300-SNAPSHOT.jar
[INFO] 
[INFO] --- tycho-p2-plugin:1.5.1:p2-metadata-default (default-p2-metadata-default) @ org.eclipse.e4.core.di.extensions ---
[INFO] MavenProject: org.eclipse.e4:org.eclipse.e4.core.di.extensions:0.15.300-SNAPSHOT @ /home/jenkins/agent/workspace/eclipse.platform.runtime-Gerrit/bundles/org.eclipse.e4.core.di.extensions/pom.xml
    The main artifact has been replaced with the baseline version.
    The following attached artifacts have been replaced with the baseline version: [sources]

[INFO] 
[INFO] --- tycho-p2-extras-plugin:1.5.1:compare-version-with-baselines (compare-attached-artifacts-with-release) @ org.eclipse.e4.core.di.extensions ---
[INFO] Fetching org.eclipse.e4.core.di.extensions_0.15.300.v20190213-1308.jar from https://download.eclipse.org/eclipse/updates/4.13/R-4.13-201909161045/plugins/ (11.15kB)
[INFO] Fetching org.eclipse.e4.core.di.extensions_0.15.300.v20190213-1308.jar from https://download.eclipse.org/eclipse/updates/4.13/R-4.13-201909161045/plugins/ (11.15kB)
[INFO] Fetching org.eclipse.e4.core.di.extensions.source_0.15.300.v20190213-1308.jar from https://download.eclipse.org/eclipse/updates/4.13/R-4.13-201909161045/plugins/ (12.58kB)
[INFO] Fetching org.eclipse.e4.core.di.extensions.source_0.15.300.v20190213-1308.jar from https://download.eclipse.org/eclipse/updates/4.13/R-4.13-201909161045/plugins/ (12.58kB)
[INFO] 
[INFO] --- maven-antrun-plugin:1.8:run (check-skip-api-analysis) @ org.eclipse.e4.core.di.extensions ---
[INFO] Executing tasks

main:
[INFO] Executed tasks
[INFO] 
[INFO] --- tycho-dependency-tools-plugin:1.5.1:list-dependencies (list-dependencies) @ org.eclipse.e4.core.di.extensions ---
[INFO] 
[INFO] --- tycho-eclipserun-plugin:1.5.1:eclipse-run (api-analysis) @ org.eclipse.e4.core.di.extensions ---
[INFO] Toolchain in tycho-eclipserun-plugin: JDK[/opt/tools/java/oracle/jdk-8/latest/jre]
[INFO] Expected eclipse log file: /home/jenkins/agent/workspace/eclipse.platform.runtime-Gerrit/bundles/org.eclipse.e4.core.di.extensions/target/eclipserun-work/data/.metadata/.log
[INFO] Command line:
	[/opt/tools/java/oracle/jdk-8/latest/jre/bin/java, -Xmx2048M, -jar, /home/jenkins/agent/workspace/eclipse.platform.runtime-Gerrit/.repository/p2/osgi/bundle/org.eclipse.equinox.launcher/1.5.600.v20191014-2022/org.eclipse.equinox.launcher-1.5.600.v20191014-2022.jar, -install, /home/jenkins/agent/workspace/eclipse.platform.runtime-Gerrit/bundles/org.eclipse.e4.core.di.extensions/target/eclipserun-work, -configuration, /home/jenkins/agent/workspace/eclipse.platform.runtime-Gerrit/bundles/org.eclipse.e4.core.di.extensions/target/eclipserun-work/configuration, -data, /home/jenkins/agent/workspace/eclipse.platform.runtime-Gerrit/bundles/org.eclipse.e4.core.di.extensions/../target/org.eclipse.e4.core.di.extensions-apiAnalyzer-workspace, -application, org.eclipse.pde.api.tools.apiAnalyzer, -project, /home/jenkins/agent/workspace/eclipse.platform.runtime-Gerrit/bundles/org.eclipse.e4.core.di.extensions, -baseline, /home/jenkins/agent/workspace/eclipse.platform.runtime-Gerrit/bundles/org.eclipse.e4.core.di.extensions/target/org.eclipse.e4.core.di.extensions-apiBaseline.target, -dependencyList, /home/jenkins/agent/workspace/eclipse.platform.runtime-Gerrit/bundles/org.eclipse.e4.core.di.extensions/target/dependencies-list.txt, -failOnError]
Picked up JAVA_TOOL_OPTIONS: -XX:+IgnoreUnrecognizedVMOptions -XX:+UseContainerSupport -XX:+UnlockExperimentalVMOptions -XX:+UseCGroupMemoryLimitForHeap
Picked up _JAVA_OPTIONS: -XX:MaxRAMPercentage=64.0
0 API ERRORS
0 API warnings
[INFO] 
[INFO] -----< org.eclipse.e4:org.eclipse.e4.core.di.extensions.supplier >------
[INFO] Building org.eclipse.e4.core.di.extensions.supplier 0.15.400-SNAPSHOT [9/18]
[INFO] ---------------------------[ eclipse-plugin ]---------------------------
[INFO] 
[INFO] --- maven-clean-plugin:3.1.0:clean (default-clean) @ org.eclipse.e4.core.di.extensions.supplier ---
[INFO] 
[INFO] --- tycho-packaging-plugin:1.5.1:build-qualifier (default-build-qualifier) @ org.eclipse.e4.core.di.extensions.supplier ---
[INFO] The project's OSGi version is 0.15.400.v20190709-0707
[INFO] 
[INFO] --- tycho-packaging-plugin:1.5.1:validate-id (default-validate-id) @ org.eclipse.e4.core.di.extensions.supplier ---
[INFO] 
[INFO] --- tycho-packaging-plugin:1.5.1:validate-version (default-validate-version) @ org.eclipse.e4.core.di.extensions.supplier ---
[INFO] 
[INFO] --- maven-resources-plugin:3.1.0:copy-resources (saveproperties) @ org.eclipse.e4.core.di.extensions.supplier ---
[INFO] Using 'UTF-8' encoding to copy filtered resources.
[INFO] skip non existing resourceDirectory /home/jenkins/agent/workspace/eclipse.platform.runtime-Gerrit/bundles/org.eclipse.e4.core.di.extensions.supplier/saveproperties
[INFO] 
[INFO] --- maven-enforcer-plugin:3.0.0-M2:enforce (enforce-maven) @ org.eclipse.e4.core.di.extensions.supplier ---
[INFO] 
[INFO] --- eclipse-cbi-plugin:1.1.8-SNAPSHOT:generate-api-build-xml (default) @ org.eclipse.e4.core.di.extensions.supplier ---
Generating target/.apibuild.xml
[INFO] 
[INFO] --- maven-resources-plugin:3.1.0:resources (default-resources) @ org.eclipse.e4.core.di.extensions.supplier ---
[INFO] Using 'UTF-8' encoding to copy filtered resources.
[INFO] skip non existing resourceDirectory /home/jenkins/agent/workspace/eclipse.platform.runtime-Gerrit/bundles/org.eclipse.e4.core.di.extensions.supplier/src/main/resources
[INFO] 
[INFO] --- maven-resources-plugin:3.1.0:resources (filter-resources) @ org.eclipse.e4.core.di.extensions.supplier ---
[INFO] Using 'UTF-8' encoding to copy filtered resources.
[INFO] skip non existing resourceDirectory /home/jenkins/agent/workspace/eclipse.platform.runtime-Gerrit/bundles/org.eclipse.e4.core.di.extensions.supplier/src/main/resources
[INFO] 
[INFO] --- tycho-compiler-plugin:1.5.1:compile (default-compile) @ org.eclipse.e4.core.di.extensions.supplier ---
[INFO] Compiling 5 source files to /home/jenkins/agent/workspace/eclipse.platform.runtime-Gerrit/bundles/org.eclipse.e4.core.di.extensions.supplier/target/classes
[INFO] 
[INFO] --- tycho-eclipserun-plugin:1.5.1:eclipse-run (default) @ org.eclipse.e4.core.di.extensions.supplier ---
[INFO] Toolchain in tycho-eclipserun-plugin: JDK[/opt/tools/java/oracle/jdk-8/latest/jre]
[INFO] Expected eclipse log file: /home/jenkins/agent/workspace/eclipse.platform.runtime-Gerrit/bundles/org.eclipse.e4.core.di.extensions.supplier/target/eclipserun-work/data/.metadata/.log
[INFO] Command line:
	[/opt/tools/java/oracle/jdk-8/latest/jre/bin/java, -jar, /home/jenkins/agent/workspace/eclipse.platform.runtime-Gerrit/.repository/p2/osgi/bundle/org.eclipse.equinox.launcher/1.5.600.v20191014-2022/org.eclipse.equinox.launcher-1.5.600.v20191014-2022.jar, -install, /home/jenkins/agent/workspace/eclipse.platform.runtime-Gerrit/bundles/org.eclipse.e4.core.di.extensions.supplier/target/eclipserun-work, -configuration, /home/jenkins/agent/workspace/eclipse.platform.runtime-Gerrit/bundles/org.eclipse.e4.core.di.extensions.supplier/target/eclipserun-work/configuration, -data, target/apibuild-workspace, -application, org.eclipse.ant.core.antRunner, -buildfile, target/.apibuild.xml]
Picked up JAVA_TOOL_OPTIONS: -XX:+IgnoreUnrecognizedVMOptions -XX:+UseContainerSupport -XX:+UnlockExperimentalVMOptions -XX:+UseCGroupMemoryLimitForHeap
Picked up _JAVA_OPTIONS: -XX:MaxRAMPercentage=64.0
Buildfile: target/.apibuild.xml

apigen:
BUILD SUCCESSFUL

BUILD SUCCESSFUL
Total time: 1 second
[INFO] 
[INFO] --- maven-resources-plugin:3.1.0:testResources (default-testResources) @ org.eclipse.e4.core.di.extensions.supplier ---
[INFO] Using 'UTF-8' encoding to copy filtered resources.
[INFO] skip non existing resourceDirectory /home/jenkins/agent/workspace/eclipse.platform.runtime-Gerrit/bundles/org.eclipse.e4.core.di.extensions.supplier/src/test/resources
[INFO] 
[INFO] --- tycho-source-plugin:1.5.1:plugin-source (plugin-source) @ org.eclipse.e4.core.di.extensions.supplier ---
[INFO] Building jar: /home/jenkins/agent/workspace/eclipse.platform.runtime-Gerrit/bundles/org.eclipse.e4.core.di.extensions.supplier/target/org.eclipse.e4.core.di.extensions.supplier-0.15.400-SNAPSHOT-sources.jar
[INFO] 
[INFO] --- target-platform-configuration:1.5.1:target-platform (default-target-platform) @ org.eclipse.e4.core.di.extensions.supplier ---
[INFO] 
[INFO] --- tycho-packaging-plugin:1.5.1:package-plugin (default-package-plugin) @ org.eclipse.e4.core.di.extensions.supplier ---
[INFO] Building jar: /home/jenkins/agent/workspace/eclipse.platform.runtime-Gerrit/bundles/org.eclipse.e4.core.di.extensions.supplier/target/org.eclipse.e4.core.di.extensions.supplier-0.15.400-SNAPSHOT.jar
[INFO] 
[INFO] --- tycho-p2-plugin:1.5.1:p2-metadata-default (default-p2-metadata-default) @ org.eclipse.e4.core.di.extensions.supplier ---
[INFO] MavenProject: org.eclipse.e4:org.eclipse.e4.core.di.extensions.supplier:0.15.400-SNAPSHOT @ /home/jenkins/agent/workspace/eclipse.platform.runtime-Gerrit/bundles/org.eclipse.e4.core.di.extensions.supplier/pom.xml
    The main artifact has been replaced with the baseline version.
    The following attached artifacts have been replaced with the baseline version: [sources]

[INFO] 
[INFO] --- tycho-p2-extras-plugin:1.5.1:compare-version-with-baselines (compare-attached-artifacts-with-release) @ org.eclipse.e4.core.di.extensions.supplier ---
[INFO] Fetching org.eclipse.e4.core.di.extensions.supplier_0.15.400.v20190709-0707.jar.pack.gz from https://download.eclipse.org/eclipse/updates/4.13/R-4.13-201909161045/plugins/ (16.67kB)
[INFO] Fetching org.eclipse.e4.core.di.extensions.supplier_0.15.400.v20190709-0707.jar.pack.gz from https://download.eclipse.org/eclipse/updates/4.13/R-4.13-201909161045/plugins/ (16.67kB)
[INFO] Fetching org.eclipse.e4.core.di.extensions.supplier.source_0.15.400.v20190709-0707.jar from https://download.eclipse.org/eclipse/updates/4.13/R-4.13-201909161045/plugins/ (19.83kB)
[INFO] Fetching org.eclipse.e4.core.di.extensions.supplier.source_0.15.400.v20190709-0707.jar from https://download.eclipse.org/eclipse/updates/4.13/R-4.13-201909161045/plugins/ (19.83kB)
[INFO] 
[INFO] --- maven-antrun-plugin:1.8:run (check-skip-api-analysis) @ org.eclipse.e4.core.di.extensions.supplier ---
[INFO] Executing tasks

main:
[INFO] Executed tasks
[INFO] 
[INFO] --- tycho-dependency-tools-plugin:1.5.1:list-dependencies (list-dependencies) @ org.eclipse.e4.core.di.extensions.supplier ---
[INFO] 
[INFO] --- tycho-eclipserun-plugin:1.5.1:eclipse-run (api-analysis) @ org.eclipse.e4.core.di.extensions.supplier ---
[INFO] Toolchain in tycho-eclipserun-plugin: JDK[/opt/tools/java/oracle/jdk-8/latest/jre]
[INFO] Expected eclipse log file: /home/jenkins/agent/workspace/eclipse.platform.runtime-Gerrit/bundles/org.eclipse.e4.core.di.extensions.supplier/target/eclipserun-work/data/.metadata/.log
[INFO] Command line:
	[/opt/tools/java/oracle/jdk-8/latest/jre/bin/java, -Xmx2048M, -jar, /home/jenkins/agent/workspace/eclipse.platform.runtime-Gerrit/.repository/p2/osgi/bundle/org.eclipse.equinox.launcher/1.5.600.v20191014-2022/org.eclipse.equinox.launcher-1.5.600.v20191014-2022.jar, -install, /home/jenkins/agent/workspace/eclipse.platform.runtime-Gerrit/bundles/org.eclipse.e4.core.di.extensions.supplier/target/eclipserun-work, -configuration, /home/jenkins/agent/workspace/eclipse.platform.runtime-Gerrit/bundles/org.eclipse.e4.core.di.extensions.supplier/target/eclipserun-work/configuration, -data, /home/jenkins/agent/workspace/eclipse.platform.runtime-Gerrit/bundles/org.eclipse.e4.core.di.extensions.supplier/../target/org.eclipse.e4.core.di.extensions.supplier-apiAnalyzer-workspace, -application, org.eclipse.pde.api.tools.apiAnalyzer, -project, /home/jenkins/agent/workspace/eclipse.platform.runtime-Gerrit/bundles/org.eclipse.e4.core.di.extensions.supplier, -baseline, /home/jenkins/agent/workspace/eclipse.platform.runtime-Gerrit/bundles/org.eclipse.e4.core.di.extensions.supplier/target/org.eclipse.e4.core.di.extensions.supplier-apiBaseline.target, -dependencyList, /home/jenkins/agent/workspace/eclipse.platform.runtime-Gerrit/bundles/org.eclipse.e4.core.di.extensions.supplier/target/dependencies-list.txt, -failOnError]
Picked up JAVA_TOOL_OPTIONS: -XX:+IgnoreUnrecognizedVMOptions -XX:+UseContainerSupport -XX:+UnlockExperimentalVMOptions -XX:+UseCGroupMemoryLimitForHeap
Picked up _JAVA_OPTIONS: -XX:MaxRAMPercentage=64.0
0 API ERRORS
0 API warnings
[INFO] 
[INFO] ------------< org.eclipse.e4:org.eclipse.e4.core.services >-------------
[INFO] Building org.eclipse.e4.core.services 2.2.100-SNAPSHOT           [10/18]
[INFO] ---------------------------[ eclipse-plugin ]---------------------------
[INFO] 
[INFO] --- maven-clean-plugin:3.1.0:clean (default-clean) @ org.eclipse.e4.core.services ---
[INFO] 
[INFO] --- tycho-packaging-plugin:1.5.1:build-qualifier (default-build-qualifier) @ org.eclipse.e4.core.services ---
[INFO] The project's OSGi version is 2.2.100.v20190925-0538
[INFO] 
[INFO] --- tycho-packaging-plugin:1.5.1:validate-id (default-validate-id) @ org.eclipse.e4.core.services ---
[INFO] 
[INFO] --- tycho-packaging-plugin:1.5.1:validate-version (default-validate-version) @ org.eclipse.e4.core.services ---
[INFO] 
[INFO] --- maven-resources-plugin:3.1.0:copy-resources (saveproperties) @ org.eclipse.e4.core.services ---
[INFO] Using 'UTF-8' encoding to copy filtered resources.
[INFO] skip non existing resourceDirectory /home/jenkins/agent/workspace/eclipse.platform.runtime-Gerrit/bundles/org.eclipse.e4.core.services/saveproperties
[INFO] 
[INFO] --- maven-enforcer-plugin:3.0.0-M2:enforce (enforce-maven) @ org.eclipse.e4.core.services ---
[INFO] 
[INFO] --- eclipse-cbi-plugin:1.1.8-SNAPSHOT:generate-api-build-xml (default) @ org.eclipse.e4.core.services ---
Generating target/.apibuild.xml
[INFO] 
[INFO] --- maven-resources-plugin:3.1.0:resources (default-resources) @ org.eclipse.e4.core.services ---
[INFO] Using 'UTF-8' encoding to copy filtered resources.
[INFO] skip non existing resourceDirectory /home/jenkins/agent/workspace/eclipse.platform.runtime-Gerrit/bundles/org.eclipse.e4.core.services/src/main/resources
[INFO] 
[INFO] --- maven-resources-plugin:3.1.0:resources (filter-resources) @ org.eclipse.e4.core.services ---
[INFO] Using 'UTF-8' encoding to copy filtered resources.
[INFO] skip non existing resourceDirectory /home/jenkins/agent/workspace/eclipse.platform.runtime-Gerrit/bundles/org.eclipse.e4.core.services/src/main/resources
[INFO] 
[INFO] --- tycho-compiler-plugin:1.5.1:compile (default-compile) @ org.eclipse.e4.core.services ---
[INFO] Compiling 34 source files to /home/jenkins/agent/workspace/eclipse.platform.runtime-Gerrit/bundles/org.eclipse.e4.core.services/target/classes
[INFO] 
[INFO] --- tycho-eclipserun-plugin:1.5.1:eclipse-run (default) @ org.eclipse.e4.core.services ---
[INFO] Toolchain in tycho-eclipserun-plugin: JDK[/opt/tools/java/oracle/jdk-8/latest/jre]
[INFO] Expected eclipse log file: /home/jenkins/agent/workspace/eclipse.platform.runtime-Gerrit/bundles/org.eclipse.e4.core.services/target/eclipserun-work/data/.metadata/.log
[INFO] Command line:
	[/opt/tools/java/oracle/jdk-8/latest/jre/bin/java, -jar, /home/jenkins/agent/workspace/eclipse.platform.runtime-Gerrit/.repository/p2/osgi/bundle/org.eclipse.equinox.launcher/1.5.600.v20191014-2022/org.eclipse.equinox.launcher-1.5.600.v20191014-2022.jar, -install, /home/jenkins/agent/workspace/eclipse.platform.runtime-Gerrit/bundles/org.eclipse.e4.core.services/target/eclipserun-work, -configuration, /home/jenkins/agent/workspace/eclipse.platform.runtime-Gerrit/bundles/org.eclipse.e4.core.services/target/eclipserun-work/configuration, -data, target/apibuild-workspace, -application, org.eclipse.ant.core.antRunner, -buildfile, target/.apibuild.xml]
Picked up JAVA_TOOL_OPTIONS: -XX:+IgnoreUnrecognizedVMOptions -XX:+UseContainerSupport -XX:+UnlockExperimentalVMOptions -XX:+UseCGroupMemoryLimitForHeap
Picked up _JAVA_OPTIONS: -XX:MaxRAMPercentage=64.0
Buildfile: target/.apibuild.xml

apigen:
BUILD SUCCESSFUL

BUILD SUCCESSFUL
Total time: 1 second
[INFO] 
[INFO] --- maven-resources-plugin:3.1.0:testResources (default-testResources) @ org.eclipse.e4.core.services ---
[INFO] Using 'UTF-8' encoding to copy filtered resources.
[INFO] skip non existing resourceDirectory /home/jenkins/agent/workspace/eclipse.platform.runtime-Gerrit/bundles/org.eclipse.e4.core.services/src/test/resources
[INFO] 
[INFO] --- tycho-source-plugin:1.5.1:plugin-source (plugin-source) @ org.eclipse.e4.core.services ---
[INFO] Building jar: /home/jenkins/agent/workspace/eclipse.platform.runtime-Gerrit/bundles/org.eclipse.e4.core.services/target/org.eclipse.e4.core.services-2.2.100-SNAPSHOT-sources.jar
[INFO] 
[INFO] --- target-platform-configuration:1.5.1:target-platform (default-target-platform) @ org.eclipse.e4.core.services ---
[INFO] 
[INFO] --- tycho-packaging-plugin:1.5.1:package-plugin (default-package-plugin) @ org.eclipse.e4.core.services ---
[INFO] Building jar: /home/jenkins/agent/workspace/eclipse.platform.runtime-Gerrit/bundles/org.eclipse.e4.core.services/target/org.eclipse.e4.core.services-2.2.100-SNAPSHOT.jar
[INFO] 
[INFO] --- tycho-p2-plugin:1.5.1:p2-metadata-default (default-p2-metadata-default) @ org.eclipse.e4.core.services ---
[INFO] MavenProject: org.eclipse.e4:org.eclipse.e4.core.services:2.2.100-SNAPSHOT @ /home/jenkins/agent/workspace/eclipse.platform.runtime-Gerrit/bundles/org.eclipse.e4.core.services/pom.xml
    The main artifact has been replaced with the baseline version.
    The following attached artifacts have been replaced with the baseline version: [sources]

[INFO] 
[INFO] --- tycho-p2-extras-plugin:1.5.1:compare-version-with-baselines (compare-attached-artifacts-with-release) @ org.eclipse.e4.core.services ---
[INFO] Fetching org.eclipse.e4.core.services_2.2.0.v20190630-2019.jar.pack.gz from https://download.eclipse.org/eclipse/updates/4.13/R-4.13-201909161045/plugins/ (28.41kB)
[INFO] Fetching org.eclipse.e4.core.services_2.2.0.v20190630-2019.jar.pack.gz from https://download.eclipse.org/eclipse/updates/4.13/R-4.13-201909161045/plugins/ (28.41kB)
[INFO] Fetching org.eclipse.e4.core.services.source_2.2.0.v20190630-2019.jar from https://download.eclipse.org/eclipse/updates/4.13/R-4.13-201909161045/plugins/ (60.47kB)
[INFO] Fetching org.eclipse.e4.core.services.source_2.2.0.v20190630-2019.jar from https://download.eclipse.org/eclipse/updates/4.13/R-4.13-201909161045/plugins/ (60.47kB)
[INFO] 
[INFO] --- maven-antrun-plugin:1.8:run (check-skip-api-analysis) @ org.eclipse.e4.core.services ---
[INFO] Executing tasks

main:
[INFO] Executed tasks
[INFO] 
[INFO] --- tycho-dependency-tools-plugin:1.5.1:list-dependencies (list-dependencies) @ org.eclipse.e4.core.services ---
[INFO] 
[INFO] --- tycho-eclipserun-plugin:1.5.1:eclipse-run (api-analysis) @ org.eclipse.e4.core.services ---
[INFO] Toolchain in tycho-eclipserun-plugin: JDK[/opt/tools/java/oracle/jdk-8/latest/jre]
[INFO] Expected eclipse log file: /home/jenkins/agent/workspace/eclipse.platform.runtime-Gerrit/bundles/org.eclipse.e4.core.services/target/eclipserun-work/data/.metadata/.log
[INFO] Command line:
	[/opt/tools/java/oracle/jdk-8/latest/jre/bin/java, -Xmx2048M, -jar, /home/jenkins/agent/workspace/eclipse.platform.runtime-Gerrit/.repository/p2/osgi/bundle/org.eclipse.equinox.launcher/1.5.600.v20191014-2022/org.eclipse.equinox.launcher-1.5.600.v20191014-2022.jar, -install, /home/jenkins/agent/workspace/eclipse.platform.runtime-Gerrit/bundles/org.eclipse.e4.core.services/target/eclipserun-work, -configuration, /home/jenkins/agent/workspace/eclipse.platform.runtime-Gerrit/bundles/org.eclipse.e4.core.services/target/eclipserun-work/configuration, -data, /home/jenkins/agent/workspace/eclipse.platform.runtime-Gerrit/bundles/org.eclipse.e4.core.services/../target/org.eclipse.e4.core.services-apiAnalyzer-workspace, -application, org.eclipse.pde.api.tools.apiAnalyzer, -project, /home/jenkins/agent/workspace/eclipse.platform.runtime-Gerrit/bundles/org.eclipse.e4.core.services, -baseline, /home/jenkins/agent/workspace/eclipse.platform.runtime-Gerrit/bundles/org.eclipse.e4.core.services/target/org.eclipse.e4.core.services-apiBaseline.target, -dependencyList, /home/jenkins/agent/workspace/eclipse.platform.runtime-Gerrit/bundles/org.eclipse.e4.core.services/target/dependencies-list.txt, -failOnError]
Picked up JAVA_TOOL_OPTIONS: -XX:+IgnoreUnrecognizedVMOptions -XX:+UseContainerSupport -XX:+UnlockExperimentalVMOptions -XX:+UseCGroupMemoryLimitForHeap
Picked up _JAVA_OPTIONS: -XX:MaxRAMPercentage=64.0
0 API ERRORS
0 API warnings
[INFO] 
[INFO] ------------------------------------------------------------------------
[INFO] Skipping org.eclipse.core.runtime.feature
[INFO] This project has been banned from the build due to previous failures.
[INFO] ------------------------------------------------------------------------
[INFO] 
[INFO] ------< eclipse.platform.runtime:eclipse.platform.runtime.tests >-------
[INFO] Building eclipse.platform.runtime.tests 4.14.0-SNAPSHOT          [11/18]
[INFO] --------------------------------[ pom ]---------------------------------
[INFO] 
[INFO] --- maven-clean-plugin:3.1.0:clean (default-clean) @ eclipse.platform.runtime.tests ---
[INFO] 
[INFO] --- maven-resources-plugin:3.1.0:copy-resources (saveproperties) @ eclipse.platform.runtime.tests ---
[INFO] Using 'UTF-8' encoding to copy filtered resources.
[INFO] skip non existing resourceDirectory /home/jenkins/agent/workspace/eclipse.platform.runtime-Gerrit/tests/saveproperties
[INFO] 
[INFO] --- maven-enforcer-plugin:3.0.0-M2:enforce (enforce-maven) @ eclipse.platform.runtime.tests ---
[INFO] 
[INFO] --- eclipse-cbi-plugin:1.1.8-SNAPSHOT:generate-api-build-xml (default) @ eclipse.platform.runtime.tests ---
[INFO] 
[INFO] --- maven-resources-plugin:3.1.0:resources (filter-resources) @ eclipse.platform.runtime.tests ---
[INFO] Using 'UTF-8' encoding to copy filtered resources.
[INFO] skip non existing resourceDirectory /home/jenkins/agent/workspace/eclipse.platform.runtime-Gerrit/tests/src/main/resources
[INFO] 
[INFO] --- tycho-eclipserun-plugin:1.5.1:eclipse-run (default) @ eclipse.platform.runtime.tests ---
[INFO] 
[INFO] --- tycho-source-plugin:1.5.1:plugin-source (plugin-source) @ eclipse.platform.runtime.tests ---
[INFO] 
[INFO] --- tycho-p2-extras-plugin:1.5.1:compare-version-with-baselines (compare-attached-artifacts-with-release) @ eclipse.platform.runtime.tests ---
[INFO] 
[INFO] --- maven-antrun-plugin:1.8:run (check-skip-api-analysis) @ eclipse.platform.runtime.tests ---
[INFO] Executing tasks

main:
[INFO] Executed tasks
[INFO] 
[INFO] --- tycho-dependency-tools-plugin:1.5.1:list-dependencies (list-dependencies) @ eclipse.platform.runtime.tests ---
[INFO] Skipped
[INFO] 
[INFO] --- tycho-eclipserun-plugin:1.5.1:eclipse-run (api-analysis) @ eclipse.platform.runtime.tests ---
[INFO] 
[INFO] ------------------------------------------------------------------------
[INFO] Skipping org.eclipse.core.expressions.tests
[INFO] This project has been banned from the build due to previous failures.
[INFO] ------------------------------------------------------------------------
[INFO] 
[INFO] ------------------------------------------------------------------------
[INFO] Skipping org.eclipse.core.tests.harness
[INFO] This project has been banned from the build due to previous failures.
[INFO] ------------------------------------------------------------------------
[INFO] 
[INFO] ------------------------------------------------------------------------
[INFO] Skipping org.eclipse.core.tests.runtime
[INFO] This project has been banned from the build due to previous failures.
[INFO] ------------------------------------------------------------------------
[INFO] 
[INFO] ------------------------------------------------------------------------
[INFO] Skipping org.eclipse.e4.core.tests
[INFO] This project has been banned from the build due to previous failures.
[INFO] ------------------------------------------------------------------------
[INFO] 
[INFO] ------------------------------------------------------------------------
[INFO] Skipping org.eclipse.core.contenttype.tests
[INFO] This project has been banned from the build due to previous failures.
[INFO] ------------------------------------------------------------------------
[INFO] ------------------------------------------------------------------------
[INFO] Reactor Summary:
[INFO] 
[INFO] eclipse.platform.runtime 4.14.0-SNAPSHOT ........... SUCCESS [ 49.548 s]
[INFO] org.eclipse.core.contenttype 3.7.500-SNAPSHOT ...... SUCCESS [01:03 min]
[INFO] org.eclipse.core.jobs 3.10.600-SNAPSHOT ............ SUCCESS [ 27.145 s]
[INFO] org.eclipse.core.runtime 3.16.100-SNAPSHOT ......... FAILURE [ 32.501 s]
[INFO] org.eclipse.core.expressions 3.6.600-SNAPSHOT ...... SKIPPED
[INFO] org.eclipse.e4.core.di.annotations 1.6.500-SNAPSHOT  SUCCESS [ 20.383 s]
[INFO] org.eclipse.e4.core.di 1.7.500-SNAPSHOT ............ SUCCESS [ 28.080 s]
[INFO] org.eclipse.e4.core.contexts 1.8.300-SNAPSHOT ...... SUCCESS [ 27.564 s]
[INFO] org.eclipse.e4.core.di.extensions 0.15.300-SNAPSHOT  SUCCESS [ 25.148 s]
[INFO] org.eclipse.e4.core.di.extensions.supplier 0.15.400-SNAPSHOT SUCCESS [ 26.061 s]
[INFO] org.eclipse.e4.core.services 2.2.100-SNAPSHOT ...... SUCCESS [ 29.329 s]
[INFO] org.eclipse.core.runtime.feature 1.2.700-SNAPSHOT .. SKIPPED
[INFO] eclipse.platform.runtime.tests 4.14.0-SNAPSHOT ..... SUCCESS [  0.058 s]
[INFO] org.eclipse.core.expressions.tests 3.5.600-SNAPSHOT  SKIPPED
[INFO] org.eclipse.core.tests.harness 3.11.600-SNAPSHOT ... SKIPPED
[INFO] org.eclipse.core.tests.runtime 3.11.900-SNAPSHOT ... SKIPPED
[INFO] org.eclipse.e4.core.tests 1.1.900-SNAPSHOT ......... SKIPPED
[INFO] org.eclipse.core.contenttype.tests 1.0.200-SNAPSHOT  SKIPPED
[INFO] ------------------------------------------------------------------------
[INFO] BUILD FAILURE
[INFO] ------------------------------------------------------------------------
[INFO] Total time:  07:57 min
[INFO] Finished at: 2019-11-06T12:51:53Z
[INFO] ------------------------------------------------------------------------
[ERROR] Failed to execute goal org.eclipse.tycho.extras:tycho-eclipserun-plugin:1.5.1:eclipse-run (api-analysis) on project org.eclipse.core.runtime: Error while executing platform: Error while executing platform (return code: 4) -> [Help 1]
[ERROR] 
[ERROR] To see the full stack trace of the errors, re-run Maven with the -e switch.
[ERROR] Re-run Maven using the -X switch to enable full debug logging.
[ERROR] 
[ERROR] For more information about the errors and possible solutions, please read the following articles:
[ERROR] [Help 1] http://cwiki.apache.org/confluence/display/MAVEN/MojoExecutionException
[ERROR] 
[ERROR] After correcting the problems, you can resume the build with the command
[ERROR]   mvn <goals> -rf :org.eclipse.core.runtime
Build step 'Invoke top-level Maven targets' marked build as failure
Terminating xvnc.
[WARNINGS] Skipping publisher since build result is FAILURE
Recording test results
ERROR: Step ‘Publish JUnit test result report’ failed: No test report files were found. Configuration error?
Finished: FAILURE