FailedConsole Output

Skipping 1,056 KB.. Full Log
UAAAAYB+LCAAAAAAAAP9b85aBtbiIQSmjNKU4P0+vJLE4u1gvPjexLDVPzxdEGvvmZ+X75ZekLlOVfvTjc8FPJgaGiiIGKaiG5Py84vycVD1nCA1SyAABjCCFBQCV27OjYAAAAA==[INFO] --- maven-antrun-plugin:1.8:run (check-skip-api-analysis) @ org.eclipse.debug.core ---
04:35:24 [INFO] Executing tasks
04:35:24 
04:35:24 main:
04:35:24 [INFO] Executed tasks
04:35:24 [INFO] 
04:35:24 [INFO] --- tycho-dependency-tools-plugin:1.5.1:list-dependencies (list-dependencies) @ org.eclipse.debug.core ---
04:35:24 [INFO] 
04:35:24 [INFO] --- tycho-eclipserun-plugin:1.5.1:eclipse-run (api-analysis) @ org.eclipse.debug.core ---
04:35:24 [INFO] Toolchain in tycho-eclipserun-plugin: JDK[/opt/tools/java/oracle/jdk-8/latest/jre]
04:35:24 [INFO] Expected eclipse log file: /home/jenkins/agent/workspace/eclipse.platform.debug-Gerrit/org.eclipse.debug.core/target/eclipserun-work/data/.metadata/.log
04:35:24 [INFO] Command line:
04:35:24 	[/opt/tools/java/oracle/jdk-8/latest/jre/bin/java, -Xmx2048M, -jar, /home/jenkins/agent/workspace/eclipse.platform.debug-Gerrit/.repository/p2/osgi/bundle/org.eclipse.equinox.launcher/1.5.600.v20191014-2022/org.eclipse.equinox.launcher-1.5.600.v20191014-2022.jar, -install, /home/jenkins/agent/workspace/eclipse.platform.debug-Gerrit/org.eclipse.debug.core/target/eclipserun-work, -configuration, /home/jenkins/agent/workspace/eclipse.platform.debug-Gerrit/org.eclipse.debug.core/target/eclipserun-work/configuration, -data, /home/jenkins/agent/workspace/eclipse.platform.debug-Gerrit/org.eclipse.debug.core/../target/org.eclipse.debug.core-apiAnalyzer-workspace, -application, org.eclipse.pde.api.tools.apiAnalyzer, -project, /home/jenkins/agent/workspace/eclipse.platform.debug-Gerrit/org.eclipse.debug.core, -baseline, /home/jenkins/agent/workspace/eclipse.platform.debug-Gerrit/org.eclipse.debug.core/target/org.eclipse.debug.core-apiBaseline.target, -dependencyList, /home/jenkins/agent/workspace/eclipse.platform.debug-Gerrit/org.eclipse.debug.core/target/dependencies-list.txt, -failOnError]
04:35:24 Picked up JAVA_TOOL_OPTIONS: -XX:+IgnoreUnrecognizedVMOptions -XX:+UseContainerSupport -XX:+UnlockExperimentalVMOptions -XX:+UseCGroupMemoryLimitForHeap
04:35:24 Picked up _JAVA_OPTIONS: -XX:MaxRAMPercentage=64.0
04:36:02 0 API ERRORS
04:36:02 1 API warnings
04:36:02 * Marker [on: /org.eclipse.debug.core, id: 8, type: org.eclipse.pde.api.tools.api_usage, attributes: [apiMarkerID: 3, charEnd: -1, charStart: -1, lineNumber: 0, message: Execution environment references were not checked for 'org.eclipse.debug.core' because no environment descriptions are installed. , messagearguments: org.eclipse.debug.core, problemid: 665845798, severity: 1, sourceId: API Tools], created: 12/4/19 9:36 AM]
04:36:06 [INFO] 
04:36:06 [INFO] ----------< org.eclipse.core:org.eclipse.core.externaltools >-----------
04:36:06 [INFO] Building org.eclipse.core.externaltools 1.1.500-SNAPSHOT          [4/12]
04:36:06 [INFO] ---------------------------[ eclipse-plugin ]---------------------------
04:36:06 [INFO] 
04:36:06 [INFO] --- maven-clean-plugin:3.1.0:clean (default-clean) @ org.eclipse.core.externaltools ---
04:36:06 [INFO] 
04:36:06 [INFO] --- tycho-packaging-plugin:1.5.1:build-qualifier (default-build-qualifier) @ org.eclipse.core.externaltools ---
04:36:06 [INFO] The project's OSGi version is 1.1.500.v20191014-1300
04:36:06 [INFO] 
04:36:06 [INFO] --- tycho-packaging-plugin:1.5.1:validate-id (default-validate-id) @ org.eclipse.core.externaltools ---
04:36:06 [INFO] 
04:36:06 [INFO] --- tycho-packaging-plugin:1.5.1:validate-version (default-validate-version) @ org.eclipse.core.externaltools ---
04:36:06 [INFO] 
04:36:06 [INFO] --- maven-resources-plugin:3.1.0:copy-resources (saveproperties) @ org.eclipse.core.externaltools ---
04:36:06 [INFO] Using 'UTF-8' encoding to copy filtered resources.
04:36:06 [INFO] skip non existing resourceDirectory /home/jenkins/agent/workspace/eclipse.platform.debug-Gerrit/org.eclipse.core.externaltools/saveproperties
04:36:06 [INFO] 
04:36:06 [INFO] --- maven-enforcer-plugin:3.0.0-M2:enforce (enforce-maven) @ org.eclipse.core.externaltools ---
04:36:06 [INFO] 
04:36:06 [INFO] --- eclipse-cbi-plugin:1.1.8-SNAPSHOT:generate-api-build-xml (default) @ org.eclipse.core.externaltools ---
04:36:06 Generating target/.apibuild.xml
04:36:06 [INFO] 
04:36:06 [INFO] --- maven-resources-plugin:3.1.0:resources (default-resources) @ org.eclipse.core.externaltools ---
04:36:06 [INFO] Using 'UTF-8' encoding to copy filtered resources.
04:36:06 [INFO] skip non existing resourceDirectory /home/jenkins/agent/workspace/eclipse.platform.debug-Gerrit/org.eclipse.core.externaltools/src/main/resources
04:36:06 [INFO] 
04:36:06 [INFO] --- maven-resources-plugin:3.1.0:resources (filter-resources) @ org.eclipse.core.externaltools ---
04:36:06 [INFO] Using 'UTF-8' encoding to copy filtered resources.
04:36:06 [INFO] skip non existing resourceDirectory /home/jenkins/agent/workspace/eclipse.platform.debug-Gerrit/org.eclipse.core.externaltools/src/main/resources
04:36:06 [INFO] 
04:36:06 [INFO] --- tycho-compiler-plugin:1.5.1:compile (default-compile) @ org.eclipse.core.externaltools ---
04:36:06 [INFO] Compiling 11 source files to /home/jenkins/agent/workspace/eclipse.platform.debug-Gerrit/org.eclipse.core.externaltools/target/classes
04:36:07 [INFO] 
04:36:07 [INFO] --- tycho-eclipserun-plugin:1.5.1:eclipse-run (default) @ org.eclipse.core.externaltools ---
04:36:07 [INFO] Toolchain in tycho-eclipserun-plugin: JDK[/opt/tools/java/oracle/jdk-8/latest/jre]
04:36:07 [INFO] Expected eclipse log file: /home/jenkins/agent/workspace/eclipse.platform.debug-Gerrit/org.eclipse.core.externaltools/target/eclipserun-work/data/.metadata/.log
04:36:07 [INFO] Command line:
04:36:07 	[/opt/tools/java/oracle/jdk-8/latest/jre/bin/java, -jar, /home/jenkins/agent/workspace/eclipse.platform.debug-Gerrit/.repository/p2/osgi/bundle/org.eclipse.equinox.launcher/1.5.600.v20191014-2022/org.eclipse.equinox.launcher-1.5.600.v20191014-2022.jar, -install, /home/jenkins/agent/workspace/eclipse.platform.debug-Gerrit/org.eclipse.core.externaltools/target/eclipserun-work, -configuration, /home/jenkins/agent/workspace/eclipse.platform.debug-Gerrit/org.eclipse.core.externaltools/target/eclipserun-work/configuration, -data, target/apibuild-workspace, -application, org.eclipse.ant.core.antRunner, -buildfile, target/.apibuild.xml]
04:36:07 Picked up JAVA_TOOL_OPTIONS: -XX:+IgnoreUnrecognizedVMOptions -XX:+UseContainerSupport -XX:+UnlockExperimentalVMOptions -XX:+UseCGroupMemoryLimitForHeap
04:36:07 Picked up _JAVA_OPTIONS: -XX:MaxRAMPercentage=64.0
04:36:09 Buildfile: target/.apibuild.xml
04:36:09 
04:36:09 apigen:
04:36:13 BUILD SUCCESSFUL
04:36:13 
04:36:13 BUILD SUCCESSFUL
04:36:13 Total time: 3 seconds
04:36:18 [INFO] 
04:36:18 [INFO] --- maven-resources-plugin:3.1.0:testResources (default-testResources) @ org.eclipse.core.externaltools ---
04:36:18 [INFO] Using 'UTF-8' encoding to copy filtered resources.
04:36:18 [INFO] skip non existing resourceDirectory /home/jenkins/agent/workspace/eclipse.platform.debug-Gerrit/org.eclipse.core.externaltools/src/test/resources
04:36:18 [INFO] 
04:36:18 [INFO] --- tycho-source-plugin:1.5.1:plugin-source (plugin-source) @ org.eclipse.core.externaltools ---
04:36:18 [INFO] Building jar: /home/jenkins/agent/workspace/eclipse.platform.debug-Gerrit/org.eclipse.core.externaltools/target/org.eclipse.core.externaltools-1.1.500-SNAPSHOT-sources.jar
04:36:18 [INFO] 
04:36:18 [INFO] --- target-platform-configuration:1.5.1:target-platform (default-target-platform) @ org.eclipse.core.externaltools ---
04:36:18 [INFO] 
04:36:18 [INFO] --- tycho-packaging-plugin:1.5.1:package-plugin (default-package-plugin) @ org.eclipse.core.externaltools ---
04:36:18 [INFO] Building jar: /home/jenkins/agent/workspace/eclipse.platform.debug-Gerrit/org.eclipse.core.externaltools/target/org.eclipse.core.externaltools-1.1.500-SNAPSHOT.jar
04:36:18 [INFO] 
04:36:18 [INFO] --- tycho-p2-plugin:1.5.1:p2-metadata-default (default-p2-metadata-default) @ org.eclipse.core.externaltools ---
04:36:18 [INFO] 
04:36:18 [INFO] --- tycho-pack200a-plugin:1.5.1:normalize (pack200-normalize) @ org.eclipse.core.externaltools ---
04:36:18 [INFO] Pack200 normalizing jar /home/jenkins/agent/workspace/eclipse.platform.debug-Gerrit/org.eclipse.core.externaltools/target/org.eclipse.core.externaltools-1.1.500-SNAPSHOT.jar
04:36:18 [INFO] 
04:36:18 [INFO] --- tycho-pack200b-plugin:1.5.1:pack (pack200-pack) @ org.eclipse.core.externaltools ---
04:36:18 [INFO] Pack200 packing jar /home/jenkins/agent/workspace/eclipse.platform.debug-Gerrit/org.eclipse.core.externaltools/target/org.eclipse.core.externaltools-1.1.500-SNAPSHOT.jar
04:36:18 [INFO] 
04:36:18 [INFO] --- tycho-p2-plugin:1.5.1:p2-metadata (p2-metadata) @ org.eclipse.core.externaltools ---
04:36:18 [INFO] MavenProject: org.eclipse.core:org.eclipse.core.externaltools:1.1.500-SNAPSHOT @ /home/jenkins/agent/workspace/eclipse.platform.debug-Gerrit/org.eclipse.core.externaltools/pom.xml
04:36:18     The main artifact has been replaced with the baseline version.
04:36:18     The following attached artifacts have been replaced with the baseline version: [pack200, sources]
04:36:18 
04:36:18 [INFO] 
04:36:18 [INFO] --- tycho-p2-extras-plugin:1.5.1:compare-version-with-baselines (compare-attached-artifacts-with-release) @ org.eclipse.core.externaltools ---
04:36:18 [INFO] Fetching org.eclipse.core.externaltools_1.1.400.v20190705-1530.jar.pack.gz from https://download.eclipse.org/eclipse/updates/4.13/R-4.13-201909161045/plugins/ (20.7kB)
04:36:18 [INFO] Fetching org.eclipse.core.externaltools_1.1.400.v20190705-1530.jar.pack.gz from https://download.eclipse.org/eclipse/updates/4.13/R-4.13-201909161045/plugins/ (20.7kB)
04:36:19 [INFO] Fetching org.eclipse.core.externaltools.source_1.1.400.v20190705-1530.jar from https://download.eclipse.org/eclipse/updates/4.13/R-4.13-201909161045/plugins/ (35.92kB)
04:36:19 [INFO] Fetching org.eclipse.core.externaltools.source_1.1.400.v20190705-1530.jar from https://download.eclipse.org/eclipse/updates/4.13/R-4.13-201909161045/plugins/ (35.92kB)
04:36:19 [INFO] 
04:36:19 [INFO] --- maven-antrun-plugin:1.8:run (check-skip-api-analysis) @ org.eclipse.core.externaltools ---
04:36:19 [INFO] Executing tasks
04:36:19 
04:36:19 main:
04:36:19 [INFO] Executed tasks
04:36:19 [INFO] 
04:36:19 [INFO] --- tycho-dependency-tools-plugin:1.5.1:list-dependencies (list-dependencies) @ org.eclipse.core.externaltools ---
04:36:19 [INFO] 
04:36:19 [INFO] --- tycho-eclipserun-plugin:1.5.1:eclipse-run (api-analysis) @ org.eclipse.core.externaltools ---
04:36:19 [INFO] Toolchain in tycho-eclipserun-plugin: JDK[/opt/tools/java/oracle/jdk-8/latest/jre]
04:36:19 [INFO] Expected eclipse log file: /home/jenkins/agent/workspace/eclipse.platform.debug-Gerrit/org.eclipse.core.externaltools/target/eclipserun-work/data/.metadata/.log
04:36:19 [INFO] Command line:
04:36:19 	[/opt/tools/java/oracle/jdk-8/latest/jre/bin/java, -Xmx2048M, -jar, /home/jenkins/agent/workspace/eclipse.platform.debug-Gerrit/.repository/p2/osgi/bundle/org.eclipse.equinox.launcher/1.5.600.v20191014-2022/org.eclipse.equinox.launcher-1.5.600.v20191014-2022.jar, -install, /home/jenkins/agent/workspace/eclipse.platform.debug-Gerrit/org.eclipse.core.externaltools/target/eclipserun-work, -configuration, /home/jenkins/agent/workspace/eclipse.platform.debug-Gerrit/org.eclipse.core.externaltools/target/eclipserun-work/configuration, -data, /home/jenkins/agent/workspace/eclipse.platform.debug-Gerrit/org.eclipse.core.externaltools/../target/org.eclipse.core.externaltools-apiAnalyzer-workspace, -application, org.eclipse.pde.api.tools.apiAnalyzer, -project, /home/jenkins/agent/workspace/eclipse.platform.debug-Gerrit/org.eclipse.core.externaltools, -baseline, /home/jenkins/agent/workspace/eclipse.platform.debug-Gerrit/org.eclipse.core.externaltools/target/org.eclipse.core.externaltools-apiBaseline.target, -dependencyList, /home/jenkins/agent/workspace/eclipse.platform.debug-Gerrit/org.eclipse.core.externaltools/target/dependencies-list.txt, -failOnError]
04:36:19 Picked up JAVA_TOOL_OPTIONS: -XX:+IgnoreUnrecognizedVMOptions -XX:+UseContainerSupport -XX:+UnlockExperimentalVMOptions -XX:+UseCGroupMemoryLimitForHeap
04:36:19 Picked up _JAVA_OPTIONS: -XX:MaxRAMPercentage=64.0
04:36:49 0 API ERRORS
04:36:49 1 API warnings
04:36:49 * Marker [on: /org.eclipse.core.externaltools, id: 0, type: org.eclipse.pde.api.tools.api_usage, attributes: [apiMarkerID: 3, charEnd: -1, charStart: -1, lineNumber: 0, message: Execution environment references were not checked for 'org.eclipse.core.externaltools' because no environment descriptions are installed. , messagearguments: org.eclipse.core.externaltools, problemid: 665845798, severity: 1, sourceId: API Tools], created: 12/4/19 9:36 AM]
04:36:51 [INFO] 
04:36:51 [INFO] ---------< org.eclipse.debug:org.eclipse.debug.examples.core >----------
04:36:51 [INFO] Building org.eclipse.debug.examples.core 1.4.600-SNAPSHOT         [5/12]
04:36:51 [INFO] ---------------------------[ eclipse-plugin ]---------------------------
04:36:51 [INFO] 
04:36:51 [INFO] --- maven-clean-plugin:3.1.0:clean (default-clean) @ org.eclipse.debug.examples.core ---
04:36:51 [INFO] 
04:36:51 [INFO] --- tycho-packaging-plugin:1.5.1:build-qualifier (default-build-qualifier) @ org.eclipse.debug.examples.core ---
04:36:51 [INFO] The project's OSGi version is 1.4.600.v20190924-0615
04:36:51 [INFO] 
04:36:51 [INFO] --- tycho-packaging-plugin:1.5.1:validate-id (default-validate-id) @ org.eclipse.debug.examples.core ---
04:36:51 [INFO] 
04:36:51 [INFO] --- tycho-packaging-plugin:1.5.1:validate-version (default-validate-version) @ org.eclipse.debug.examples.core ---
04:36:51 [INFO] 
04:36:51 [INFO] --- maven-resources-plugin:3.1.0:copy-resources (saveproperties) @ org.eclipse.debug.examples.core ---
04:36:51 [INFO] Using 'UTF-8' encoding to copy filtered resources.
04:36:51 [INFO] skip non existing resourceDirectory /home/jenkins/agent/workspace/eclipse.platform.debug-Gerrit/org.eclipse.debug.examples.core/saveproperties
04:36:51 [INFO] 
04:36:51 [INFO] --- maven-enforcer-plugin:3.0.0-M2:enforce (enforce-maven) @ org.eclipse.debug.examples.core ---
04:36:51 [INFO] 
04:36:51 [INFO] --- eclipse-cbi-plugin:1.1.8-SNAPSHOT:generate-api-build-xml (default) @ org.eclipse.debug.examples.core ---
04:36:51 Generating target/.apibuild.xml
04:36:51 [INFO] 
04:36:51 [INFO] --- maven-resources-plugin:3.1.0:resources (default-resources) @ org.eclipse.debug.examples.core ---
04:36:51 [INFO] Using 'UTF-8' encoding to copy filtered resources.
04:36:51 [INFO] skip non existing resourceDirectory /home/jenkins/agent/workspace/eclipse.platform.debug-Gerrit/org.eclipse.debug.examples.core/src/main/resources
04:36:51 [INFO] 
04:36:51 [INFO] --- maven-resources-plugin:3.1.0:resources (filter-resources) @ org.eclipse.debug.examples.core ---
04:36:51 [INFO] Using 'UTF-8' encoding to copy filtered resources.
04:36:51 [INFO] skip non existing resourceDirectory /home/jenkins/agent/workspace/eclipse.platform.debug-Gerrit/org.eclipse.debug.examples.core/src/main/resources
04:36:51 [INFO] 
04:36:51 [INFO] --- tycho-compiler-plugin:1.5.1:compile (default-compile) @ org.eclipse.debug.examples.core ---
04:36:51 [INFO] Compiling 80 source files to /home/jenkins/agent/workspace/eclipse.platform.debug-Gerrit/org.eclipse.debug.examples.core/target/classes
04:36:51 [INFO] 
04:36:51 [INFO] --- tycho-eclipserun-plugin:1.5.1:eclipse-run (default) @ org.eclipse.debug.examples.core ---
04:36:52 [INFO] Toolchain in tycho-eclipserun-plugin: JDK[/opt/tools/java/oracle/jdk-8/latest/jre]
04:36:52 [INFO] Expected eclipse log file: /home/jenkins/agent/workspace/eclipse.platform.debug-Gerrit/org.eclipse.debug.examples.core/target/eclipserun-work/data/.metadata/.log
04:36:52 [INFO] Command line:
04:36:52 	[/opt/tools/java/oracle/jdk-8/latest/jre/bin/java, -jar, /home/jenkins/agent/workspace/eclipse.platform.debug-Gerrit/.repository/p2/osgi/bundle/org.eclipse.equinox.launcher/1.5.600.v20191014-2022/org.eclipse.equinox.launcher-1.5.600.v20191014-2022.jar, -install, /home/jenkins/agent/workspace/eclipse.platform.debug-Gerrit/org.eclipse.debug.examples.core/target/eclipserun-work, -configuration, /home/jenkins/agent/workspace/eclipse.platform.debug-Gerrit/org.eclipse.debug.examples.core/target/eclipserun-work/configuration, -data, target/apibuild-workspace, -application, org.eclipse.ant.core.antRunner, -buildfile, target/.apibuild.xml]
04:36:52 Picked up JAVA_TOOL_OPTIONS: -XX:+IgnoreUnrecognizedVMOptions -XX:+UseContainerSupport -XX:+UnlockExperimentalVMOptions -XX:+UseCGroupMemoryLimitForHeap
04:36:52 Picked up _JAVA_OPTIONS: -XX:MaxRAMPercentage=64.0
04:36:55 Buildfile: target/.apibuild.xml
04:36:55 
04:36:55 apigen:
04:36:56 BUILD SUCCESSFUL
04:36:56 
04:36:56 BUILD SUCCESSFUL
04:36:56 Total time: 0 seconds
04:36:57 [INFO] 
04:36:57 [INFO] --- maven-resources-plugin:3.1.0:testResources (default-testResources) @ org.eclipse.debug.examples.core ---
04:36:57 [INFO] Using 'UTF-8' encoding to copy filtered resources.
04:36:57 [INFO] skip non existing resourceDirectory /home/jenkins/agent/workspace/eclipse.platform.debug-Gerrit/org.eclipse.debug.examples.core/src/test/resources
04:36:57 [INFO] 
04:36:57 [INFO] --- tycho-source-plugin:1.5.1:plugin-source (plugin-source) @ org.eclipse.debug.examples.core ---
04:36:57 [INFO] Building jar: /home/jenkins/agent/workspace/eclipse.platform.debug-Gerrit/org.eclipse.debug.examples.core/target/org.eclipse.debug.examples.core-1.4.600-SNAPSHOT-sources.jar
04:36:57 [INFO] 
04:36:57 [INFO] --- target-platform-configuration:1.5.1:target-platform (default-target-platform) @ org.eclipse.debug.examples.core ---
04:36:57 [INFO] 
04:36:57 [INFO] --- tycho-packaging-plugin:1.5.1:package-plugin (default-package-plugin) @ org.eclipse.debug.examples.core ---
04:36:57 [INFO] Building jar: /home/jenkins/agent/workspace/eclipse.platform.debug-Gerrit/org.eclipse.debug.examples.core/target/org.eclipse.debug.examples.core-1.4.600-SNAPSHOT.jar
04:36:57 [INFO] 
04:36:57 [INFO] --- tycho-p2-plugin:1.5.1:p2-metadata-default (default-p2-metadata-default) @ org.eclipse.debug.examples.core ---
04:36:57 [INFO] 
04:36:57 [INFO] --- tycho-pack200a-plugin:1.5.1:normalize (pack200-normalize) @ org.eclipse.debug.examples.core ---
04:36:57 [INFO] Pack200 normalizing jar /home/jenkins/agent/workspace/eclipse.platform.debug-Gerrit/org.eclipse.debug.examples.core/target/org.eclipse.debug.examples.core-1.4.600-SNAPSHOT.jar
04:36:57 [INFO] 
04:36:57 [INFO] --- tycho-pack200b-plugin:1.5.1:pack (pack200-pack) @ org.eclipse.debug.examples.core ---
04:36:57 [INFO] Pack200 packing jar /home/jenkins/agent/workspace/eclipse.platform.debug-Gerrit/org.eclipse.debug.examples.core/target/org.eclipse.debug.examples.core-1.4.600-SNAPSHOT.jar
04:36:57 [INFO] 
04:36:57 [INFO] --- tycho-p2-plugin:1.5.1:p2-metadata (p2-metadata) @ org.eclipse.debug.examples.core ---
04:36:58 [INFO] MavenProject: org.eclipse.debug:org.eclipse.debug.examples.core:1.4.600-SNAPSHOT @ /home/jenkins/agent/workspace/eclipse.platform.debug-Gerrit/org.eclipse.debug.examples.core/pom.xml
04:36:58     The main artifact has been replaced with the baseline version.
04:36:58     The following attached artifacts have been replaced with the baseline version: [pack200, sources]
04:36:58 
04:36:58 [INFO] 
04:36:58 [INFO] --- tycho-p2-extras-plugin:1.5.1:compare-version-with-baselines (compare-attached-artifacts-with-release) @ org.eclipse.debug.examples.core ---
04:36:58 [INFO] Fetching org.eclipse.debug.examples.core_1.4.500.v20190620-1423.jar.pack.gz from https://download.eclipse.org/eclipse/updates/4.13/R-4.13-201909161045/plugins/ (55.48kB)
04:36:58 [INFO] Fetching org.eclipse.debug.examples.core_1.4.500.v20190620-1423.jar.pack.gz from https://download.eclipse.org/eclipse/updates/4.13/R-4.13-201909161045/plugins/ (55.48kB)
04:36:58 [INFO] Fetching org.eclipse.debug.examples.core.source_1.4.500.v20190620-1423.jar from https://download.eclipse.org/eclipse/updates/4.13/R-4.13-201909161045/plugins/ (109.49kB)
04:36:58 [INFO] Fetching org.eclipse.debug.examples.core.source_1.4.500.v20190620-1423.jar from https://download.eclipse.org/eclipse/updates/4.13/R-4.13-201909161045/plugins/ (109.49kB)
04:36:58 [INFO] 
04:36:58 [INFO] --- maven-antrun-plugin:1.8:run (check-skip-api-analysis) @ org.eclipse.debug.examples.core ---
04:36:58 [INFO] Executing tasks
04:36:58 
04:36:58 main:
04:36:58 [INFO] Executed tasks
04:36:58 [INFO] 
04:36:58 [INFO] --- tycho-dependency-tools-plugin:1.5.1:list-dependencies (list-dependencies) @ org.eclipse.debug.examples.core ---
04:36:58 [INFO] 
04:36:58 [INFO] --- tycho-eclipserun-plugin:1.5.1:eclipse-run (api-analysis) @ org.eclipse.debug.examples.core ---
04:36:58 [INFO] Toolchain in tycho-eclipserun-plugin: JDK[/opt/tools/java/oracle/jdk-8/latest/jre]
04:36:58 [INFO] Expected eclipse log file: /home/jenkins/agent/workspace/eclipse.platform.debug-Gerrit/org.eclipse.debug.examples.core/target/eclipserun-work/data/.metadata/.log
04:36:58 [INFO] Command line:
04:36:58 	[/opt/tools/java/oracle/jdk-8/latest/jre/bin/java, -Xmx2048M, -jar, /home/jenkins/agent/workspace/eclipse.platform.debug-Gerrit/.repository/p2/osgi/bundle/org.eclipse.equinox.launcher/1.5.600.v20191014-2022/org.eclipse.equinox.launcher-1.5.600.v20191014-2022.jar, -install, /home/jenkins/agent/workspace/eclipse.platform.debug-Gerrit/org.eclipse.debug.examples.core/target/eclipserun-work, -configuration, /home/jenkins/agent/workspace/eclipse.platform.debug-Gerrit/org.eclipse.debug.examples.core/target/eclipserun-work/configuration, -data, /home/jenkins/agent/workspace/eclipse.platform.debug-Gerrit/org.eclipse.debug.examples.core/../target/org.eclipse.debug.examples.core-apiAnalyzer-workspace, -application, org.eclipse.pde.api.tools.apiAnalyzer, -project, /home/jenkins/agent/workspace/eclipse.platform.debug-Gerrit/org.eclipse.debug.examples.core, -baseline, /home/jenkins/agent/workspace/eclipse.platform.debug-Gerrit/org.eclipse.debug.examples.core/target/org.eclipse.debug.examples.core-apiBaseline.target, -dependencyList, /home/jenkins/agent/workspace/eclipse.platform.debug-Gerrit/org.eclipse.debug.examples.core/target/dependencies-list.txt, -failOnError]
04:36:58 Picked up JAVA_TOOL_OPTIONS: -XX:+IgnoreUnrecognizedVMOptions -XX:+UseContainerSupport -XX:+UnlockExperimentalVMOptions -XX:+UseCGroupMemoryLimitForHeap
04:36:58 Picked up _JAVA_OPTIONS: -XX:MaxRAMPercentage=64.0
04:37:31 0 API ERRORS
04:37:31 1 API warnings
04:37:31 * Marker [on: /org.eclipse.debug.examples.core, id: 18, type: org.eclipse.pde.api.tools.api_usage, attributes: [apiMarkerID: 3, charEnd: -1, charStart: -1, lineNumber: 0, message: Execution environment references were not checked for 'org.eclipse.debug.examples.core' because no environment descriptions are installed. , messagearguments: org.eclipse.debug.examples.core, problemid: 665845798, severity: 1, sourceId: API Tools], created: 12/4/19 9:37 AM]
04:37:33 [INFO] 
04:37:33 [INFO] ---------------< org.eclipse.ui:org.eclipse.ui.console >----------------
04:37:33 [INFO] Building org.eclipse.ui.console 3.9.0-SNAPSHOT                    [6/12]
04:37:33 [INFO] ---------------------------[ eclipse-plugin ]---------------------------
04:37:33 [INFO] 
04:37:33 [INFO] --- maven-clean-plugin:3.1.0:clean (default-clean) @ org.eclipse.ui.console ---
04:37:33 [INFO] 
04:37:33 [INFO] --- tycho-packaging-plugin:1.5.1:build-qualifier (default-build-qualifier) @ org.eclipse.ui.console ---
04:37:33 [INFO] The project's OSGi version is 3.9.0.v20191204-0931
04:37:33 [INFO] 
04:37:33 [INFO] --- tycho-packaging-plugin:1.5.1:validate-id (default-validate-id) @ org.eclipse.ui.console ---
04:37:33 [INFO] 
04:37:33 [INFO] --- tycho-packaging-plugin:1.5.1:validate-version (default-validate-version) @ org.eclipse.ui.console ---
04:37:33 [INFO] 
04:37:33 [INFO] --- maven-resources-plugin:3.1.0:copy-resources (saveproperties) @ org.eclipse.ui.console ---
04:37:33 [INFO] Using 'UTF-8' encoding to copy filtered resources.
04:37:33 [INFO] skip non existing resourceDirectory /home/jenkins/agent/workspace/eclipse.platform.debug-Gerrit/org.eclipse.ui.console/saveproperties
04:37:33 [INFO] 
04:37:33 [INFO] --- maven-enforcer-plugin:3.0.0-M2:enforce (enforce-maven) @ org.eclipse.ui.console ---
04:37:33 [INFO] 
04:37:33 [INFO] --- eclipse-cbi-plugin:1.1.8-SNAPSHOT:generate-api-build-xml (default) @ org.eclipse.ui.console ---
04:37:33 Generating target/.apibuild.xml
04:37:33 [INFO] 
04:37:33 [INFO] --- maven-resources-plugin:3.1.0:resources (default-resources) @ org.eclipse.ui.console ---
04:37:33 [INFO] Using 'UTF-8' encoding to copy filtered resources.
04:37:33 [INFO] skip non existing resourceDirectory /home/jenkins/agent/workspace/eclipse.platform.debug-Gerrit/org.eclipse.ui.console/src/main/resources
04:37:33 [INFO] 
04:37:33 [INFO] --- maven-resources-plugin:3.1.0:resources (filter-resources) @ org.eclipse.ui.console ---
04:37:33 [INFO] Using 'UTF-8' encoding to copy filtered resources.
04:37:33 [INFO] skip non existing resourceDirectory /home/jenkins/agent/workspace/eclipse.platform.debug-Gerrit/org.eclipse.ui.console/src/main/resources
04:37:33 [INFO] 
04:37:33 [INFO] --- tycho-compiler-plugin:1.5.1:compile (default-compile) @ org.eclipse.ui.console ---
04:37:33 [INFO] Compiling 61 source files to /home/jenkins/agent/workspace/eclipse.platform.debug-Gerrit/org.eclipse.ui.console/target/classes
04:37:34 [INFO] 
04:37:34 [INFO] --- tycho-eclipserun-plugin:1.5.1:eclipse-run (default) @ org.eclipse.ui.console ---
04:37:34 [INFO] Toolchain in tycho-eclipserun-plugin: JDK[/opt/tools/java/oracle/jdk-8/latest/jre]
04:37:34 [INFO] Expected eclipse log file: /home/jenkins/agent/workspace/eclipse.platform.debug-Gerrit/org.eclipse.ui.console/target/eclipserun-work/data/.metadata/.log
04:37:34 [INFO] Command line:
04:37:34 	[/opt/tools/java/oracle/jdk-8/latest/jre/bin/java, -jar, /home/jenkins/agent/workspace/eclipse.platform.debug-Gerrit/.repository/p2/osgi/bundle/org.eclipse.equinox.launcher/1.5.600.v20191014-2022/org.eclipse.equinox.launcher-1.5.600.v20191014-2022.jar, -install, /home/jenkins/agent/workspace/eclipse.platform.debug-Gerrit/org.eclipse.ui.console/target/eclipserun-work, -configuration, /home/jenkins/agent/workspace/eclipse.platform.debug-Gerrit/org.eclipse.ui.console/target/eclipserun-work/configuration, -data, target/apibuild-workspace, -application, org.eclipse.ant.core.antRunner, -buildfile, target/.apibuild.xml]
04:37:34 Picked up JAVA_TOOL_OPTIONS: -XX:+IgnoreUnrecognizedVMOptions -XX:+UseContainerSupport -XX:+UnlockExperimentalVMOptions -XX:+UseCGroupMemoryLimitForHeap
04:37:34 Picked up _JAVA_OPTIONS: -XX:MaxRAMPercentage=64.0
04:37:37 Buildfile: target/.apibuild.xml
04:37:37 
04:37:37 apigen:
04:37:39 BUILD SUCCESSFUL
04:37:39 
04:37:39 BUILD SUCCESSFUL
04:37:39 Total time: 1 second
04:37:42 [INFO] 
04:37:42 [INFO] --- maven-resources-plugin:3.1.0:testResources (default-testResources) @ org.eclipse.ui.console ---
04:37:42 [INFO] Using 'UTF-8' encoding to copy filtered resources.
04:37:42 [INFO] skip non existing resourceDirectory /home/jenkins/agent/workspace/eclipse.platform.debug-Gerrit/org.eclipse.ui.console/src/test/resources
04:37:42 [INFO] 
04:37:42 [INFO] --- tycho-source-plugin:1.5.1:plugin-source (plugin-source) @ org.eclipse.ui.console ---
04:37:42 [INFO] Building jar: /home/jenkins/agent/workspace/eclipse.platform.debug-Gerrit/org.eclipse.ui.console/target/org.eclipse.ui.console-3.9.0-SNAPSHOT-sources.jar
04:37:42 [INFO] 
04:37:42 [INFO] --- target-platform-configuration:1.5.1:target-platform (default-target-platform) @ org.eclipse.ui.console ---
04:37:42 [INFO] 
04:37:42 [INFO] --- tycho-packaging-plugin:1.5.1:package-plugin (default-package-plugin) @ org.eclipse.ui.console ---
04:37:42 [INFO] Building jar: /home/jenkins/agent/workspace/eclipse.platform.debug-Gerrit/org.eclipse.ui.console/target/org.eclipse.ui.console-3.9.0-SNAPSHOT.jar
04:37:42 [INFO] 
04:37:42 [INFO] --- tycho-p2-plugin:1.5.1:p2-metadata-default (default-p2-metadata-default) @ org.eclipse.ui.console ---
04:37:42 [INFO] 
04:37:42 [INFO] --- tycho-pack200a-plugin:1.5.1:normalize (pack200-normalize) @ org.eclipse.ui.console ---
04:37:42 [INFO] Pack200 normalizing jar /home/jenkins/agent/workspace/eclipse.platform.debug-Gerrit/org.eclipse.ui.console/target/org.eclipse.ui.console-3.9.0-SNAPSHOT.jar
04:37:42 [INFO] 
04:37:42 [INFO] --- tycho-pack200b-plugin:1.5.1:pack (pack200-pack) @ org.eclipse.ui.console ---
04:37:42 [INFO] Pack200 packing jar /home/jenkins/agent/workspace/eclipse.platform.debug-Gerrit/org.eclipse.ui.console/target/org.eclipse.ui.console-3.9.0-SNAPSHOT.jar
04:37:43 [INFO] 
04:37:43 [INFO] --- tycho-p2-plugin:1.5.1:p2-metadata (p2-metadata) @ org.eclipse.ui.console ---
04:37:43 [INFO] No baseline version MavenProject: org.eclipse.ui:org.eclipse.ui.console:3.9.0-SNAPSHOT @ /home/jenkins/agent/workspace/eclipse.platform.debug-Gerrit/org.eclipse.ui.console/pom.xml
04:37:43 [INFO] 
04:37:43 [INFO] --- tycho-p2-extras-plugin:1.5.1:compare-version-with-baselines (compare-attached-artifacts-with-release) @ org.eclipse.ui.console ---
04:37:43 [INFO] Fetching org.eclipse.ui.console_3.8.600.v20190815-2020.jar.pack.gz from https://download.eclipse.org/eclipse/updates/4.13/R-4.13-201909161045/plugins/ (83.96kB)
04:37:43 [INFO] Fetching org.eclipse.ui.console_3.8.600.v20190815-2020.jar.pack.gz from https://download.eclipse.org/eclipse/updates/4.13/R-4.13-201909161045/plugins/ (83.96kB)
04:37:43 [INFO] Fetching org.eclipse.ui.console.source_3.8.600.v20190815-2020.jar from https://download.eclipse.org/eclipse/updates/4.13/R-4.13-201909161045/plugins/ (127.57kB)
04:37:43 [INFO] Fetching org.eclipse.ui.console.source_3.8.600.v20190815-2020.jar from https://download.eclipse.org/eclipse/updates/4.13/R-4.13-201909161045/plugins/ (127.57kB)
04:37:43 [INFO] 
04:37:43 [INFO] --- maven-antrun-plugin:1.8:run (check-skip-api-analysis) @ org.eclipse.ui.console ---
04:37:43 [INFO] Executing tasks
04:37:43 
04:37:43 main:
04:37:43 [INFO] Executed tasks
04:37:43 [INFO] 
04:37:43 [INFO] --- tycho-dependency-tools-plugin:1.5.1:list-dependencies (list-dependencies) @ org.eclipse.ui.console ---
04:37:43 [INFO] 
04:37:43 [INFO] --- tycho-eclipserun-plugin:1.5.1:eclipse-run (api-analysis) @ org.eclipse.ui.console ---
04:37:43 [INFO] Toolchain in tycho-eclipserun-plugin: JDK[/opt/tools/java/oracle/jdk-8/latest/jre]
04:37:43 [INFO] Expected eclipse log file: /home/jenkins/agent/workspace/eclipse.platform.debug-Gerrit/org.eclipse.ui.console/target/eclipserun-work/data/.metadata/.log
04:37:43 [INFO] Command line:
04:37:43 	[/opt/tools/java/oracle/jdk-8/latest/jre/bin/java, -Xmx2048M, -jar, /home/jenkins/agent/workspace/eclipse.platform.debug-Gerrit/.repository/p2/osgi/bundle/org.eclipse.equinox.launcher/1.5.600.v20191014-2022/org.eclipse.equinox.launcher-1.5.600.v20191014-2022.jar, -install, /home/jenkins/agent/workspace/eclipse.platform.debug-Gerrit/org.eclipse.ui.console/target/eclipserun-work, -configuration, /home/jenkins/agent/workspace/eclipse.platform.debug-Gerrit/org.eclipse.ui.console/target/eclipserun-work/configuration, -data, /home/jenkins/agent/workspace/eclipse.platform.debug-Gerrit/org.eclipse.ui.console/../target/org.eclipse.ui.console-apiAnalyzer-workspace, -application, org.eclipse.pde.api.tools.apiAnalyzer, -project, /home/jenkins/agent/workspace/eclipse.platform.debug-Gerrit/org.eclipse.ui.console, -baseline, /home/jenkins/agent/workspace/eclipse.platform.debug-Gerrit/org.eclipse.ui.console/target/org.eclipse.ui.console-apiBaseline.target, -dependencyList, /home/jenkins/agent/workspace/eclipse.platform.debug-Gerrit/org.eclipse.ui.console/target/dependencies-list.txt, -failOnError]
04:37:43 Picked up JAVA_TOOL_OPTIONS: -XX:+IgnoreUnrecognizedVMOptions -XX:+UseContainerSupport -XX:+UnlockExperimentalVMOptions -XX:+UseCGroupMemoryLimitForHeap
04:37:43 Picked up _JAVA_OPTIONS: -XX:MaxRAMPercentage=64.0
04:38:21 0 API ERRORS
04:38:21 2 API warnings
04:38:21 * Marker [on: /org.eclipse.ui.console, id: 1, type: org.eclipse.pde.api.tools.api_usage, attributes: [apiMarkerID: 3, charEnd: -1, charStart: -1, lineNumber: 0, message: Execution environment references were not checked for 'org.eclipse.ui.console' because no environment descriptions are installed. , messagearguments: org.eclipse.ui.console, problemid: 665845798, severity: 1, sourceId: API Tools], created: 12/4/19 9:38 AM]
04:38:21 * Marker [on: /org.eclipse.ui.console/src/org/eclipse/ui/console/TextConsolePage.java, id: 2, type: org.eclipse.pde.api.tools.api_usage, attributes: [apiMarkerID: 3, charEnd: 3031, charStart: 3016, lineNumber: 75, message: TextConsolePage illegally implements IPage via IPageBookViewPage, messagearguments: IPageBookViewPage#TextConsolePage#IPage, org.eclipse.jdt.internal.core.JavaModelManager.handleId: =org.eclipse.ui.console/src<org.eclipse.ui.console{TextConsolePage.java[TextConsolePage, problemTypeName: org.eclipse.ui.console.TextConsolePage, problemid: 574668824, severity: 1, sourceId: API Tools], created: 12/4/19 9:38 AM]
04:38:24 [INFO] 
04:38:24 [INFO] ---------------< org.eclipse.debug:org.eclipse.debug.ui >---------------
04:38:24 [INFO] Building org.eclipse.debug.ui 3.14.300-SNAPSHOT                   [7/12]
04:38:24 [INFO] ---------------------------[ eclipse-plugin ]---------------------------
04:38:24 [INFO] 
04:38:24 [INFO] --- maven-clean-plugin:3.1.0:clean (default-clean) @ org.eclipse.debug.ui ---
04:38:24 [INFO] 
04:38:24 [INFO] --- tycho-packaging-plugin:1.5.1:build-qualifier (default-build-qualifier) @ org.eclipse.debug.ui ---
04:38:25 [INFO] The project's OSGi version is 3.14.300.v20191116-2105
04:38:25 [INFO] 
04:38:25 [INFO] --- tycho-packaging-plugin:1.5.1:validate-id (default-validate-id) @ org.eclipse.debug.ui ---
04:38:25 [INFO] 
04:38:25 [INFO] --- tycho-packaging-plugin:1.5.1:validate-version (default-validate-version) @ org.eclipse.debug.ui ---
04:38:25 [INFO] 
04:38:25 [INFO] --- maven-resources-plugin:3.1.0:copy-resources (saveproperties) @ org.eclipse.debug.ui ---
04:38:25 [INFO] Using 'UTF-8' encoding to copy filtered resources.
04:38:25 [INFO] skip non existing resourceDirectory /home/jenkins/agent/workspace/eclipse.platform.debug-Gerrit/org.eclipse.debug.ui/saveproperties
04:38:25 [INFO] 
04:38:25 [INFO] --- maven-enforcer-plugin:3.0.0-M2:enforce (enforce-maven) @ org.eclipse.debug.ui ---
04:38:25 [INFO] 
04:38:25 [INFO] --- eclipse-cbi-plugin:1.1.8-SNAPSHOT:generate-api-build-xml (default) @ org.eclipse.debug.ui ---
04:38:25 Generating target/.apibuild.xml
04:38:25 [INFO] 
04:38:25 [INFO] --- maven-resources-plugin:3.1.0:resources (default-resources) @ org.eclipse.debug.ui ---
04:38:25 [INFO] Using 'UTF-8' encoding to copy filtered resources.
04:38:25 [INFO] skip non existing resourceDirectory /home/jenkins/agent/workspace/eclipse.platform.debug-Gerrit/org.eclipse.debug.ui/src/main/resources
04:38:25 [INFO] 
04:38:25 [INFO] --- maven-resources-plugin:3.1.0:resources (filter-resources) @ org.eclipse.debug.ui ---
04:38:25 [INFO] Using 'UTF-8' encoding to copy filtered resources.
04:38:25 [INFO] skip non existing resourceDirectory /home/jenkins/agent/workspace/eclipse.platform.debug-Gerrit/org.eclipse.debug.ui/src/main/resources
04:38:25 [INFO] 
04:38:25 [INFO] --- tycho-compiler-plugin:1.5.1:compile (default-compile) @ org.eclipse.debug.ui ---
04:38:25 [INFO] Compiling 851 source files to /home/jenkins/agent/workspace/eclipse.platform.debug-Gerrit/org.eclipse.debug.ui/target/classes
04:38:31 [INFO] 
04:38:31 [INFO] --- tycho-eclipserun-plugin:1.5.1:eclipse-run (default) @ org.eclipse.debug.ui ---
04:38:32 [INFO] Toolchain in tycho-eclipserun-plugin: JDK[/opt/tools/java/oracle/jdk-8/latest/jre]
04:38:32 [INFO] Expected eclipse log file: /home/jenkins/agent/workspace/eclipse.platform.debug-Gerrit/org.eclipse.debug.ui/target/eclipserun-work/data/.metadata/.log
04:38:32 [INFO] Command line:
04:38:32 	[/opt/tools/java/oracle/jdk-8/latest/jre/bin/java, -jar, /home/jenkins/agent/workspace/eclipse.platform.debug-Gerrit/.repository/p2/osgi/bundle/org.eclipse.equinox.launcher/1.5.600.v20191014-2022/org.eclipse.equinox.launcher-1.5.600.v20191014-2022.jar, -install, /home/jenkins/agent/workspace/eclipse.platform.debug-Gerrit/org.eclipse.debug.ui/target/eclipserun-work, -configuration, /home/jenkins/agent/workspace/eclipse.platform.debug-Gerrit/org.eclipse.debug.ui/target/eclipserun-work/configuration, -data, target/apibuild-workspace, -application, org.eclipse.ant.core.antRunner, -buildfile, target/.apibuild.xml]
04:38:32 Picked up JAVA_TOOL_OPTIONS: -XX:+IgnoreUnrecognizedVMOptions -XX:+UseContainerSupport -XX:+UnlockExperimentalVMOptions -XX:+UseCGroupMemoryLimitForHeap
04:38:32 Picked up _JAVA_OPTIONS: -XX:MaxRAMPercentage=64.0
04:38:35 Buildfile: target/.apibuild.xml
04:38:35 
04:38:35 apigen:
04:38:39 BUILD SUCCESSFUL
04:38:39 
04:38:39 BUILD SUCCESSFUL
04:38:39 Total time: 4 seconds
04:38:44 [INFO] 
04:38:44 [INFO] --- maven-resources-plugin:3.1.0:testResources (default-testResources) @ org.eclipse.debug.ui ---
04:38:44 [INFO] Using 'UTF-8' encoding to copy filtered resources.
04:38:44 [INFO] skip non existing resourceDirectory /home/jenkins/agent/workspace/eclipse.platform.debug-Gerrit/org.eclipse.debug.ui/src/test/resources
04:38:44 [INFO] 
04:38:44 [INFO] --- tycho-source-plugin:1.5.1:plugin-source (plugin-source) @ org.eclipse.debug.ui ---
04:38:44 [INFO] Building jar: /home/jenkins/agent/workspace/eclipse.platform.debug-Gerrit/org.eclipse.debug.ui/target/org.eclipse.debug.ui-3.14.300-SNAPSHOT-sources.jar
04:38:44 [INFO] 
04:38:44 [INFO] --- target-platform-configuration:1.5.1:target-platform (default-target-platform) @ org.eclipse.debug.ui ---
04:38:44 [INFO] 
04:38:44 [INFO] --- tycho-packaging-plugin:1.5.1:package-plugin (default-package-plugin) @ org.eclipse.debug.ui ---
04:38:45 [INFO] Building jar: /home/jenkins/agent/workspace/eclipse.platform.debug-Gerrit/org.eclipse.debug.ui/target/org.eclipse.debug.ui-3.14.300-SNAPSHOT.jar
04:38:46 [INFO] 
04:38:46 [INFO] --- tycho-p2-plugin:1.5.1:p2-metadata-default (default-p2-metadata-default) @ org.eclipse.debug.ui ---
04:38:46 [INFO] 
04:38:46 [INFO] --- tycho-pack200a-plugin:1.5.1:normalize (pack200-normalize) @ org.eclipse.debug.ui ---
04:38:46 [INFO] Pack200 normalizing jar /home/jenkins/agent/workspace/eclipse.platform.debug-Gerrit/org.eclipse.debug.ui/target/org.eclipse.debug.ui-3.14.300-SNAPSHOT.jar
04:38:49 [INFO] 
04:38:49 [INFO] --- tycho-pack200b-plugin:1.5.1:pack (pack200-pack) @ org.eclipse.debug.ui ---
04:38:49 [INFO] Pack200 packing jar /home/jenkins/agent/workspace/eclipse.platform.debug-Gerrit/org.eclipse.debug.ui/target/org.eclipse.debug.ui-3.14.300-SNAPSHOT.jar
04:38:51 [INFO] 
04:38:51 [INFO] --- tycho-p2-plugin:1.5.1:p2-metadata (p2-metadata) @ org.eclipse.debug.ui ---
04:38:52 [INFO] MavenProject: org.eclipse.debug:org.eclipse.debug.ui:3.14.300-SNAPSHOT @ /home/jenkins/agent/workspace/eclipse.platform.debug-Gerrit/org.eclipse.debug.ui/pom.xml
04:38:52     The main artifact has been replaced with the baseline version.
04:38:52     The following attached artifacts have been replaced with the baseline version: [pack200, sources]
04:38:52 
04:38:52 [INFO] 
04:38:52 [INFO] --- tycho-p2-extras-plugin:1.5.1:compare-version-with-baselines (compare-attached-artifacts-with-release) @ org.eclipse.debug.ui ---
04:38:52 Dec 04, 2019 9:38:52 AM org.apache.http.impl.execchain.RetryExec execute
04:38:52 INFO: I/O exception (org.apache.http.NoHttpResponseException) caught when processing request to {s}->https://download.eclipse.org:443: The target server failed to respond
04:38:52 Dec 04, 2019 9:38:52 AM org.apache.http.impl.execchain.RetryExec execute
04:38:52 INFO: Retrying request to {s}->https://download.eclipse.org:443
04:38:52 [INFO] Fetching org.eclipse.debug.ui_3.14.200.v20190822-2125.jar.pack.gz from https://download.eclipse.org/eclipse/updates/4.13/R-4.13-201909161045/plugins/ (1MB)
04:38:52 [INFO] Fetching org.eclipse.debug.ui_3.14.200.v20190822-2125.jar.pack.gz from https://download.eclipse.org/eclipse/updates/4.13/R-4.13-201909161045/plugins/ (1MB)
04:38:54 Dec 04, 2019 9:38:54 AM org.apache.http.impl.execchain.RetryExec execute
04:38:54 INFO: I/O exception (org.apache.http.NoHttpResponseException) caught when processing request to {s}->https://download.eclipse.org:443: The target server failed to respond
04:38:54 Dec 04, 2019 9:38:54 AM org.apache.http.impl.execchain.RetryExec execute
04:38:54 INFO: Retrying request to {s}->https://download.eclipse.org:443
04:38:54 [INFO] Fetching org.eclipse.debug.ui.source_3.14.200.v20190822-2125.jar from https://download.eclipse.org/eclipse/updates/4.13/R-4.13-201909161045/plugins/ (1.67MB)
04:38:54 [INFO] Fetching org.eclipse.debug.ui.source_3.14.200.v20190822-2125.jar from https://download.eclipse.org/eclipse/updates/4.13/R-4.13-201909161045/plugins/ (1.67MB)
04:38:54 [INFO] 
04:38:54 [INFO] --- maven-antrun-plugin:1.8:run (check-skip-api-analysis) @ org.eclipse.debug.ui ---
04:38:54 [INFO] Executing tasks
04:38:54 
04:38:54 main:
04:38:54 [INFO] Executed tasks
04:38:54 [INFO] 
04:38:54 [INFO] --- tycho-dependency-tools-plugin:1.5.1:list-dependencies (list-dependencies) @ org.eclipse.debug.ui ---
04:38:54 [INFO] 
04:38:54 [INFO] --- tycho-eclipserun-plugin:1.5.1:eclipse-run (api-analysis) @ org.eclipse.debug.ui ---
04:38:55 [INFO] Toolchain in tycho-eclipserun-plugin: JDK[/opt/tools/java/oracle/jdk-8/latest/jre]
04:38:55 [INFO] Expected eclipse log file: /home/jenkins/agent/workspace/eclipse.platform.debug-Gerrit/org.eclipse.debug.ui/target/eclipserun-work/data/.metadata/.log
04:38:55 [INFO] Command line:
04:38:55 	[/opt/tools/java/oracle/jdk-8/latest/jre/bin/java, -Xmx2048M, -jar, /home/jenkins/agent/workspace/eclipse.platform.debug-Gerrit/.repository/p2/osgi/bundle/org.eclipse.equinox.launcher/1.5.600.v20191014-2022/org.eclipse.equinox.launcher-1.5.600.v20191014-2022.jar, -install, /home/jenkins/agent/workspace/eclipse.platform.debug-Gerrit/org.eclipse.debug.ui/target/eclipserun-work, -configuration, /home/jenkins/agent/workspace/eclipse.platform.debug-Gerrit/org.eclipse.debug.ui/target/eclipserun-work/configuration, -data, /home/jenkins/agent/workspace/eclipse.platform.debug-Gerrit/org.eclipse.debug.ui/../target/org.eclipse.debug.ui-apiAnalyzer-workspace, -application, org.eclipse.pde.api.tools.apiAnalyzer, -project, /home/jenkins/agent/workspace/eclipse.platform.debug-Gerrit/org.eclipse.debug.ui, -baseline, /home/jenkins/agent/workspace/eclipse.platform.debug-Gerrit/org.eclipse.debug.ui/target/org.eclipse.debug.ui-apiBaseline.target, -dependencyList, /home/jenkins/agent/workspace/eclipse.platform.debug-Gerrit/org.eclipse.debug.ui/target/dependencies-list.txt, -failOnError]
04:38:55 Picked up JAVA_TOOL_OPTIONS: -XX:+IgnoreUnrecognizedVMOptions -XX:+UseContainerSupport -XX:+UnlockExperimentalVMOptions -XX:+UseCGroupMemoryLimitForHeap
04:38:55 Picked up _JAVA_OPTIONS: -XX:MaxRAMPercentage=64.0
04:40:01 0 API ERRORS
04:40:01 1 API warnings
04:40:01 * Marker [on: /org.eclipse.debug.ui, id: 150, type: org.eclipse.pde.api.tools.api_usage, attributes: [apiMarkerID: 3, charEnd: -1, charStart: -1, lineNumber: 0, message: Execution environment references were not checked for 'org.eclipse.debug.ui' because no environment descriptions are installed. , messagearguments: org.eclipse.debug.ui, problemid: 665845798, severity: 1, sourceId: API Tools], created: 12/4/19 9:40 AM]
04:40:04 [INFO] 
04:40:04 [INFO] --------< org.eclipse.debug:org.eclipse.debug.examples.memory >---------
04:40:04 [INFO] Building org.eclipse.debug.examples.memory 1.102.200-SNAPSHOT     [8/12]
04:40:04 [INFO] ---------------------------[ eclipse-plugin ]---------------------------
04:40:04 [INFO] 
04:40:04 [INFO] --- maven-clean-plugin:3.1.0:clean (default-clean) @ org.eclipse.debug.examples.memory ---
04:40:04 [INFO] 
04:40:04 [INFO] --- tycho-packaging-plugin:1.5.1:build-qualifier (default-build-qualifier) @ org.eclipse.debug.examples.memory ---
04:40:04 [INFO] The project's OSGi version is 1.102.200.v20191025-1523
04:40:04 [INFO] 
04:40:04 [INFO] --- tycho-packaging-plugin:1.5.1:validate-id (default-validate-id) @ org.eclipse.debug.examples.memory ---
04:40:04 [INFO] 
04:40:04 [INFO] --- tycho-packaging-plugin:1.5.1:validate-version (default-validate-version) @ org.eclipse.debug.examples.memory ---
04:40:04 [INFO] 
04:40:04 [INFO] --- maven-resources-plugin:3.1.0:copy-resources (saveproperties) @ org.eclipse.debug.examples.memory ---
04:40:04 [INFO] Using 'UTF-8' encoding to copy filtered resources.
04:40:04 [INFO] skip non existing resourceDirectory /home/jenkins/agent/workspace/eclipse.platform.debug-Gerrit/org.eclipse.debug.examples.memory/saveproperties
04:40:04 [INFO] 
04:40:04 [INFO] --- maven-enforcer-plugin:3.0.0-M2:enforce (enforce-maven) @ org.eclipse.debug.examples.memory ---
04:40:04 [INFO] 
04:40:04 [INFO] --- eclipse-cbi-plugin:1.1.8-SNAPSHOT:generate-api-build-xml (default) @ org.eclipse.debug.examples.memory ---
04:40:04 Generating target/.apibuild.xml
04:40:04 [INFO] 
04:40:04 [INFO] --- maven-resources-plugin:3.1.0:resources (default-resources) @ org.eclipse.debug.examples.memory ---
04:40:04 [INFO] Using 'UTF-8' encoding to copy filtered resources.
04:40:04 [INFO] skip non existing resourceDirectory /home/jenkins/agent/workspace/eclipse.platform.debug-Gerrit/org.eclipse.debug.examples.memory/src/main/resources
04:40:04 [INFO] 
04:40:04 [INFO] --- maven-resources-plugin:3.1.0:resources (filter-resources) @ org.eclipse.debug.examples.memory ---
04:40:04 [INFO] Using 'UTF-8' encoding to copy filtered resources.
04:40:04 [INFO] skip non existing resourceDirectory /home/jenkins/agent/workspace/eclipse.platform.debug-Gerrit/org.eclipse.debug.examples.memory/src/main/resources
04:40:04 [INFO] 
04:40:04 [INFO] --- tycho-compiler-plugin:1.5.1:compile (default-compile) @ org.eclipse.debug.examples.memory ---
04:40:04 [INFO] Compiling 15 source files to /home/jenkins/agent/workspace/eclipse.platform.debug-Gerrit/org.eclipse.debug.examples.memory/target/classes
04:40:05 [INFO] 
04:40:05 [INFO] --- tycho-eclipserun-plugin:1.5.1:eclipse-run (default) @ org.eclipse.debug.examples.memory ---
04:40:05 [INFO] Toolchain in tycho-eclipserun-plugin: JDK[/opt/tools/java/oracle/jdk-8/latest/jre]
04:40:05 [INFO] Expected eclipse log file: /home/jenkins/agent/workspace/eclipse.platform.debug-Gerrit/org.eclipse.debug.examples.memory/target/eclipserun-work/data/.metadata/.log
04:40:05 [INFO] Command line:
04:40:05 	[/opt/tools/java/oracle/jdk-8/latest/jre/bin/java, -jar, /home/jenkins/agent/workspace/eclipse.platform.debug-Gerrit/.repository/p2/osgi/bundle/org.eclipse.equinox.launcher/1.5.600.v20191014-2022/org.eclipse.equinox.launcher-1.5.600.v20191014-2022.jar, -install, /home/jenkins/agent/workspace/eclipse.platform.debug-Gerrit/org.eclipse.debug.examples.memory/target/eclipserun-work, -configuration, /home/jenkins/agent/workspace/eclipse.platform.debug-Gerrit/org.eclipse.debug.examples.memory/target/eclipserun-work/configuration, -data, target/apibuild-workspace, -application, org.eclipse.ant.core.antRunner, -buildfile, target/.apibuild.xml]
04:40:05 Picked up JAVA_TOOL_OPTIONS: -XX:+IgnoreUnrecognizedVMOptions -XX:+UseContainerSupport -XX:+UnlockExperimentalVMOptions -XX:+UseCGroupMemoryLimitForHeap
04:40:05 Picked up _JAVA_OPTIONS: -XX:MaxRAMPercentage=64.0
04:40:08 Buildfile: target/.apibuild.xml
04:40:08 
04:40:08 apigen:
04:40:08 BUILD SUCCESSFUL
04:40:08 
04:40:08 BUILD SUCCESSFUL
04:40:08 Total time: 0 seconds
04:40:10 [INFO] 
04:40:10 [INFO] --- maven-resources-plugin:3.1.0:testResources (default-testResources) @ org.eclipse.debug.examples.memory ---
04:40:10 [INFO] Using 'UTF-8' encoding to copy filtered resources.
04:40:10 [INFO] skip non existing resourceDirectory /home/jenkins/agent/workspace/eclipse.platform.debug-Gerrit/org.eclipse.debug.examples.memory/src/test/resources
04:40:10 [INFO] 
04:40:10 [INFO] --- tycho-source-plugin:1.5.1:plugin-source (plugin-source) @ org.eclipse.debug.examples.memory ---
04:40:10 [INFO] Building jar: /home/jenkins/agent/workspace/eclipse.platform.debug-Gerrit/org.eclipse.debug.examples.memory/target/org.eclipse.debug.examples.memory-1.102.200-SNAPSHOT-sources.jar
04:40:10 [INFO] 
04:40:10 [INFO] --- target-platform-configuration:1.5.1:target-platform (default-target-platform) @ org.eclipse.debug.examples.memory ---
04:40:10 [INFO] 
04:40:10 [INFO] --- tycho-packaging-plugin:1.5.1:package-plugin (default-package-plugin) @ org.eclipse.debug.examples.memory ---
04:40:11 [INFO] Building jar: /home/jenkins/agent/workspace/eclipse.platform.debug-Gerrit/org.eclipse.debug.examples.memory/target/org.eclipse.debug.examples.memory-1.102.200-SNAPSHOT.jar
04:40:11 [INFO] 
04:40:11 [INFO] --- tycho-p2-plugin:1.5.1:p2-metadata-default (default-p2-metadata-default) @ org.eclipse.debug.examples.memory ---
04:40:11 [INFO] 
04:40:11 [INFO] --- tycho-pack200a-plugin:1.5.1:normalize (pack200-normalize) @ org.eclipse.debug.examples.memory ---
04:40:11 [INFO] Pack200 normalizing jar /home/jenkins/agent/workspace/eclipse.platform.debug-Gerrit/org.eclipse.debug.examples.memory/target/org.eclipse.debug.examples.memory-1.102.200-SNAPSHOT.jar
04:40:11 [INFO] 
04:40:11 [INFO] --- tycho-pack200b-plugin:1.5.1:pack (pack200-pack) @ org.eclipse.debug.examples.memory ---
04:40:11 [INFO] Pack200 packing jar /home/jenkins/agent/workspace/eclipse.platform.debug-Gerrit/org.eclipse.debug.examples.memory/target/org.eclipse.debug.examples.memory-1.102.200-SNAPSHOT.jar
04:40:11 [INFO] 
04:40:11 [INFO] --- tycho-p2-plugin:1.5.1:p2-metadata (p2-metadata) @ org.eclipse.debug.examples.memory ---
04:40:11 [INFO] No baseline version MavenProject: org.eclipse.debug:org.eclipse.debug.examples.memory:1.102.200-SNAPSHOT @ /home/jenkins/agent/workspace/eclipse.platform.debug-Gerrit/org.eclipse.debug.examples.memory/pom.xml
04:40:11 [INFO] 
04:40:11 [INFO] --- tycho-p2-extras-plugin:1.5.1:compare-version-with-baselines (compare-attached-artifacts-with-release) @ org.eclipse.debug.examples.memory ---
04:40:11 [INFO] 
04:40:11 [INFO] --- maven-antrun-plugin:1.8:run (check-skip-api-analysis) @ org.eclipse.debug.examples.memory ---
04:40:11 [INFO] Skipping Antrun execution
04:40:11 [INFO] 
04:40:11 [INFO] --- tycho-dependency-tools-plugin:1.5.1:list-dependencies (list-dependencies) @ org.eclipse.debug.examples.memory ---
04:40:11 [INFO] Skipped
04:40:11 [INFO] 
04:40:11 [INFO] --- tycho-eclipserun-plugin:1.5.1:eclipse-run (api-analysis) @ org.eclipse.debug.examples.memory ---
04:40:11 [INFO] 
04:40:11 [INFO] -------< org.eclipse.debug:org.eclipse.debug.examples.mixedmode >-------
04:40:11 [INFO] Building org.eclipse.debug.examples.mixedmode 1.2.0-SNAPSHOT      [9/12]
04:40:11 [INFO] ---------------------------[ eclipse-plugin ]---------------------------
04:40:11 [INFO] 
04:40:11 [INFO] --- maven-clean-plugin:3.1.0:clean (default-clean) @ org.eclipse.debug.examples.mixedmode ---
04:40:11 [INFO] 
04:40:11 [INFO] --- tycho-packaging-plugin:1.5.1:build-qualifier (default-build-qualifier) @ org.eclipse.debug.examples.mixedmode ---
04:40:11 [INFO] The project's OSGi version is 1.2.0.v20191014-1300
04:40:11 [INFO] 
04:40:11 [INFO] --- tycho-packaging-plugin:1.5.1:validate-id (default-validate-id) @ org.eclipse.debug.examples.mixedmode ---
04:40:11 [INFO] 
04:40:11 [INFO] --- tycho-packaging-plugin:1.5.1:validate-version (default-validate-version) @ org.eclipse.debug.examples.mixedmode ---
04:40:11 [INFO] 
04:40:11 [INFO] --- maven-resources-plugin:3.1.0:copy-resources (saveproperties) @ org.eclipse.debug.examples.mixedmode ---
04:40:11 [INFO] Using 'UTF-8' encoding to copy filtered resources.
04:40:11 [INFO] skip non existing resourceDirectory /home/jenkins/agent/workspace/eclipse.platform.debug-Gerrit/org.eclipse.debug.examples.mixedmode/saveproperties
04:40:11 [INFO] 
04:40:11 [INFO] --- maven-enforcer-plugin:3.0.0-M2:enforce (enforce-maven) @ org.eclipse.debug.examples.mixedmode ---
04:40:11 [INFO] 
04:40:11 [INFO] --- eclipse-cbi-plugin:1.1.8-SNAPSHOT:generate-api-build-xml (default) @ org.eclipse.debug.examples.mixedmode ---
04:40:11 Generating target/.apibuild.xml
04:40:11 [INFO] 
04:40:11 [INFO] --- maven-resources-plugin:3.1.0:resources (default-resources) @ org.eclipse.debug.examples.mixedmode ---
04:40:11 [INFO] Using 'UTF-8' encoding to copy filtered resources.
04:40:11 [INFO] skip non existing resourceDirectory /home/jenkins/agent/workspace/eclipse.platform.debug-Gerrit/org.eclipse.debug.examples.mixedmode/src/main/resources
04:40:11 [INFO] 
04:40:11 [INFO] --- maven-resources-plugin:3.1.0:resources (filter-resources) @ org.eclipse.debug.examples.mixedmode ---
04:40:11 [INFO] Using 'UTF-8' encoding to copy filtered resources.
04:40:11 [INFO] skip non existing resourceDirectory /home/jenkins/agent/workspace/eclipse.platform.debug-Gerrit/org.eclipse.debug.examples.mixedmode/src/main/resources
04:40:11 [INFO] 
04:40:11 [INFO] --- tycho-compiler-plugin:1.5.1:compile (default-compile) @ org.eclipse.debug.examples.mixedmode ---
04:40:11 [INFO] Compiling 6 source files to /home/jenkins/agent/workspace/eclipse.platform.debug-Gerrit/org.eclipse.debug.examples.mixedmode/target/classes
04:40:11 [INFO] 
04:40:11 [INFO] --- tycho-eclipserun-plugin:1.5.1:eclipse-run (default) @ org.eclipse.debug.examples.mixedmode ---
04:40:11 [INFO] Toolchain in tycho-eclipserun-plugin: JDK[/opt/tools/java/oracle/jdk-8/latest/jre]
04:40:11 [INFO] Expected eclipse log file: /home/jenkins/agent/workspace/eclipse.platform.debug-Gerrit/org.eclipse.debug.examples.mixedmode/target/eclipserun-work/data/.metadata/.log
04:40:11 [INFO] Command line:
04:40:11 	[/opt/tools/java/oracle/jdk-8/latest/jre/bin/java, -jar, /home/jenkins/agent/workspace/eclipse.platform.debug-Gerrit/.repository/p2/osgi/bundle/org.eclipse.equinox.launcher/1.5.600.v20191014-2022/org.eclipse.equinox.launcher-1.5.600.v20191014-2022.jar, -install, /home/jenkins/agent/workspace/eclipse.platform.debug-Gerrit/org.eclipse.debug.examples.mixedmode/target/eclipserun-work, -configuration, /home/jenkins/agent/workspace/eclipse.platform.debug-Gerrit/org.eclipse.debug.examples.mixedmode/target/eclipserun-work/configuration, -data, target/apibuild-workspace, -application, org.eclipse.ant.core.antRunner, -buildfile, target/.apibuild.xml]
04:40:11 Picked up JAVA_TOOL_OPTIONS: -XX:+IgnoreUnrecognizedVMOptions -XX:+UseContainerSupport -XX:+UnlockExperimentalVMOptions -XX:+UseCGroupMemoryLimitForHeap
04:40:11 Picked up _JAVA_OPTIONS: -XX:MaxRAMPercentage=64.0
04:40:16 Buildfile: target/.apibuild.xml
04:40:16 
04:40:16 apigen:
04:40:17 BUILD SUCCESSFUL
04:40:17 
04:40:17 BUILD SUCCESSFUL
04:40:17 Total time: 1 second
04:40:19 [INFO] 
04:40:19 [INFO] --- maven-resources-plugin:3.1.0:testResources (default-testResources) @ org.eclipse.debug.examples.mixedmode ---
04:40:19 [INFO] Using 'UTF-8' encoding to copy filtered resources.
04:40:19 [INFO] skip non existing resourceDirectory /home/jenkins/agent/workspace/eclipse.platform.debug-Gerrit/org.eclipse.debug.examples.mixedmode/src/test/resources
04:40:19 [INFO] 
04:40:19 [INFO] --- tycho-source-plugin:1.5.1:plugin-source (plugin-source) @ org.eclipse.debug.examples.mixedmode ---
04:40:19 [INFO] Building jar: /home/jenkins/agent/workspace/eclipse.platform.debug-Gerrit/org.eclipse.debug.examples.mixedmode/target/org.eclipse.debug.examples.mixedmode-1.2.0-SNAPSHOT-sources.jar
04:40:19 [INFO] 
04:40:19 [INFO] --- target-platform-configuration:1.5.1:target-platform (default-target-platform) @ org.eclipse.debug.examples.mixedmode ---
04:40:19 [INFO] 
04:40:19 [INFO] --- tycho-packaging-plugin:1.5.1:package-plugin (default-package-plugin) @ org.eclipse.debug.examples.mixedmode ---
04:40:19 [INFO] Building jar: /home/jenkins/agent/workspace/eclipse.platform.debug-Gerrit/org.eclipse.debug.examples.mixedmode/target/org.eclipse.debug.examples.mixedmode-1.2.0-SNAPSHOT.jar
04:40:19 [INFO] 
04:40:19 [INFO] --- tycho-p2-plugin:1.5.1:p2-metadata-default (default-p2-metadata-default) @ org.eclipse.debug.examples.mixedmode ---
04:40:19 [INFO] 
04:40:19 [INFO] --- tycho-pack200a-plugin:1.5.1:normalize (pack200-normalize) @ org.eclipse.debug.examples.mixedmode ---
04:40:19 [INFO] Pack200 normalizing jar /home/jenkins/agent/workspace/eclipse.platform.debug-Gerrit/org.eclipse.debug.examples.mixedmode/target/org.eclipse.debug.examples.mixedmode-1.2.0-SNAPSHOT.jar
04:40:19 [INFO] 
04:40:19 [INFO] --- tycho-pack200b-plugin:1.5.1:pack (pack200-pack) @ org.eclipse.debug.examples.mixedmode ---
04:40:19 [INFO] Pack200 packing jar /home/jenkins/agent/workspace/eclipse.platform.debug-Gerrit/org.eclipse.debug.examples.mixedmode/target/org.eclipse.debug.examples.mixedmode-1.2.0-SNAPSHOT.jar
04:40:19 [INFO] 
04:40:19 [INFO] --- tycho-p2-plugin:1.5.1:p2-metadata (p2-metadata) @ org.eclipse.debug.examples.mixedmode ---
04:40:19 [INFO] No baseline version MavenProject: org.eclipse.debug:org.eclipse.debug.examples.mixedmode:1.2.0-SNAPSHOT @ /home/jenkins/agent/workspace/eclipse.platform.debug-Gerrit/org.eclipse.debug.examples.mixedmode/pom.xml
04:40:19 [INFO] 
04:40:19 [INFO] --- tycho-p2-extras-plugin:1.5.1:compare-version-with-baselines (compare-attached-artifacts-with-release) @ org.eclipse.debug.examples.mixedmode ---
04:40:19 [INFO] 
04:40:19 [INFO] --- maven-antrun-plugin:1.8:run (check-skip-api-analysis) @ org.eclipse.debug.examples.mixedmode ---
04:40:19 [INFO] Skipping Antrun execution
04:40:19 [INFO] 
04:40:19 [INFO] --- tycho-dependency-tools-plugin:1.5.1:list-dependencies (list-dependencies) @ org.eclipse.debug.examples.mixedmode ---
04:40:19 [INFO] Skipped
04:40:19 [INFO] 
04:40:19 [INFO] --- tycho-eclipserun-plugin:1.5.1:eclipse-run (api-analysis) @ org.eclipse.debug.examples.mixedmode ---
04:40:19 [INFO] 
04:40:19 [INFO] ----------< org.eclipse.debug:org.eclipse.debug.examples.ui >-----------
04:40:19 [INFO] Building org.eclipse.debug.examples.ui 1.6.300-SNAPSHOT          [10/12]
04:40:19 [INFO] ---------------------------[ eclipse-plugin ]---------------------------
04:40:19 [INFO] 
04:40:19 [INFO] --- maven-clean-plugin:3.1.0:clean (default-clean) @ org.eclipse.debug.examples.ui ---
04:40:19 [INFO] 
04:40:19 [INFO] --- tycho-packaging-plugin:1.5.1:build-qualifier (default-build-qualifier) @ org.eclipse.debug.examples.ui ---
04:40:19 [INFO] The project's OSGi version is 1.6.300.v20191025-1523
04:40:19 [INFO] 
04:40:19 [INFO] --- tycho-packaging-plugin:1.5.1:validate-id (default-validate-id) @ org.eclipse.debug.examples.ui ---
04:40:19 [INFO] 
04:40:19 [INFO] --- tycho-packaging-plugin:1.5.1:validate-version (default-validate-version) @ org.eclipse.debug.examples.ui ---
04:40:19 [INFO] 
04:40:19 [INFO] --- maven-resources-plugin:3.1.0:copy-resources (saveproperties) @ org.eclipse.debug.examples.ui ---
04:40:19 [INFO] Using 'UTF-8' encoding to copy filtered resources.
04:40:19 [INFO] skip non existing resourceDirectory /home/jenkins/agent/workspace/eclipse.platform.debug-Gerrit/org.eclipse.debug.examples.ui/saveproperties
04:40:19 [INFO] 
04:40:19 [INFO] --- maven-enforcer-plugin:3.0.0-M2:enforce (enforce-maven) @ org.eclipse.debug.examples.ui ---
04:40:19 [INFO] 
04:40:19 [INFO] --- eclipse-cbi-plugin:1.1.8-SNAPSHOT:generate-api-build-xml (default) @ org.eclipse.debug.examples.ui ---
04:40:19 Generating target/.apibuild.xml
04:40:19 [INFO] 
04:40:19 [INFO] --- maven-resources-plugin:3.1.0:resources (default-resources) @ org.eclipse.debug.examples.ui ---
04:40:19 [INFO] Using 'UTF-8' encoding to copy filtered resources.
04:40:19 [INFO] skip non existing resourceDirectory /home/jenkins/agent/workspace/eclipse.platform.debug-Gerrit/org.eclipse.debug.examples.ui/src/main/resources
04:40:19 [INFO] 
04:40:19 [INFO] --- maven-resources-plugin:3.1.0:resources (filter-resources) @ org.eclipse.debug.examples.ui ---
04:40:19 [INFO] Using 'UTF-8' encoding to copy filtered resources.
04:40:19 [INFO] skip non existing resourceDirectory /home/jenkins/agent/workspace/eclipse.platform.debug-Gerrit/org.eclipse.debug.examples.ui/src/main/resources
04:40:19 [INFO] 
04:40:19 [INFO] --- tycho-compiler-plugin:1.5.1:compile (default-compile) @ org.eclipse.debug.examples.ui ---
04:40:19 [INFO] Compiling 62 source files to /home/jenkins/agent/workspace/eclipse.platform.debug-Gerrit/org.eclipse.debug.examples.ui/target/classes
04:40:20 [INFO] 
04:40:20 [INFO] --- tycho-eclipserun-plugin:1.5.1:eclipse-run (default) @ org.eclipse.debug.examples.ui ---
04:40:20 [INFO] Toolchain in tycho-eclipserun-plugin: JDK[/opt/tools/java/oracle/jdk-8/latest/jre]
04:40:20 [INFO] Expected eclipse log file: /home/jenkins/agent/workspace/eclipse.platform.debug-Gerrit/org.eclipse.debug.examples.ui/target/eclipserun-work/data/.metadata/.log
04:40:20 [INFO] Command line:
04:40:20 	[/opt/tools/java/oracle/jdk-8/latest/jre/bin/java, -jar, /home/jenkins/agent/workspace/eclipse.platform.debug-Gerrit/.repository/p2/osgi/bundle/org.eclipse.equinox.launcher/1.5.600.v20191014-2022/org.eclipse.equinox.launcher-1.5.600.v20191014-2022.jar, -install, /home/jenkins/agent/workspace/eclipse.platform.debug-Gerrit/org.eclipse.debug.examples.ui/target/eclipserun-work, -configuration, /home/jenkins/agent/workspace/eclipse.platform.debug-Gerrit/org.eclipse.debug.examples.ui/target/eclipserun-work/configuration, -data, target/apibuild-workspace, -application, org.eclipse.ant.core.antRunner, -buildfile, target/.apibuild.xml]
04:40:20 Picked up JAVA_TOOL_OPTIONS: -XX:+IgnoreUnrecognizedVMOptions -XX:+UseContainerSupport -XX:+UnlockExperimentalVMOptions -XX:+UseCGroupMemoryLimitForHeap
04:40:20 Picked up _JAVA_OPTIONS: -XX:MaxRAMPercentage=64.0
04:40:23 Buildfile: target/.apibuild.xml
04:40:23 
04:40:23 apigen:
04:40:24 BUILD SUCCESSFUL
04:40:24 
04:40:24 BUILD SUCCESSFUL
04:40:24 Total time: 1 second
04:40:26 [INFO] 
04:40:26 [INFO] --- maven-resources-plugin:3.1.0:testResources (default-testResources) @ org.eclipse.debug.examples.ui ---
04:40:26 [INFO] Using 'UTF-8' encoding to copy filtered resources.
04:40:26 [INFO] skip non existing resourceDirectory /home/jenkins/agent/workspace/eclipse.platform.debug-Gerrit/org.eclipse.debug.examples.ui/src/test/resources
04:40:26 [INFO] 
04:40:26 [INFO] --- tycho-source-plugin:1.5.1:plugin-source (plugin-source) @ org.eclipse.debug.examples.ui ---
04:40:26 [INFO] Building jar: /home/jenkins/agent/workspace/eclipse.platform.debug-Gerrit/org.eclipse.debug.examples.ui/target/org.eclipse.debug.examples.ui-1.6.300-SNAPSHOT-sources.jar
04:40:26 [INFO] 
04:40:26 [INFO] --- target-platform-configuration:1.5.1:target-platform (default-target-platform) @ org.eclipse.debug.examples.ui ---
04:40:26 [INFO] 
04:40:26 [INFO] --- tycho-packaging-plugin:1.5.1:package-plugin (default-package-plugin) @ org.eclipse.debug.examples.ui ---
04:40:26 [INFO] Building jar: /home/jenkins/agent/workspace/eclipse.platform.debug-Gerrit/org.eclipse.debug.examples.ui/target/org.eclipse.debug.examples.ui-1.6.300-SNAPSHOT.jar
04:40:26 [INFO] 
04:40:26 [INFO] --- tycho-p2-plugin:1.5.1:p2-metadata-default (default-p2-metadata-default) @ org.eclipse.debug.examples.ui ---
04:40:26 [INFO] 
04:40:26 [INFO] --- tycho-pack200a-plugin:1.5.1:normalize (pack200-normalize) @ org.eclipse.debug.examples.ui ---
04:40:26 [INFO] Pack200 normalizing jar /home/jenkins/agent/workspace/eclipse.platform.debug-Gerrit/org.eclipse.debug.examples.ui/target/org.eclipse.debug.examples.ui-1.6.300-SNAPSHOT.jar
04:40:26 [INFO] 
04:40:26 [INFO] --- tycho-pack200b-plugin:1.5.1:pack (pack200-pack) @ org.eclipse.debug.examples.ui ---
04:40:26 [INFO] Pack200 packing jar /home/jenkins/agent/workspace/eclipse.platform.debug-Gerrit/org.eclipse.debug.examples.ui/target/org.eclipse.debug.examples.ui-1.6.300-SNAPSHOT.jar
04:40:26 [INFO] 
04:40:26 [INFO] --- tycho-p2-plugin:1.5.1:p2-metadata (p2-metadata) @ org.eclipse.debug.examples.ui ---
04:40:27 [INFO] MavenProject: org.eclipse.debug:org.eclipse.debug.examples.ui:1.6.300-SNAPSHOT @ /home/jenkins/agent/workspace/eclipse.platform.debug-Gerrit/org.eclipse.debug.examples.ui/pom.xml
04:40:27     The main artifact has been replaced with the baseline version.
04:40:27     The following attached artifacts have been replaced with the baseline version: [pack200, sources]
04:40:27 
04:40:27 [INFO] 
04:40:27 [INFO] --- tycho-p2-extras-plugin:1.5.1:compare-version-with-baselines (compare-attached-artifacts-with-release) @ org.eclipse.debug.examples.ui ---
04:40:27 [INFO] Fetching org.eclipse.debug.examples.ui_1.6.200.v20190614-1239.jar.pack.gz from https://download.eclipse.org/eclipse/updates/4.13/R-4.13-201909161045/plugins/ (47.72kB)
04:40:27 [INFO] Fetching org.eclipse.debug.examples.ui_1.6.200.v20190614-1239.jar.pack.gz from https://download.eclipse.org/eclipse/updates/4.13/R-4.13-201909161045/plugins/ (47.72kB)
04:40:27 [INFO] Fetching org.eclipse.debug.examples.ui.source_1.6.200.v20190614-1239.jar from https://download.eclipse.org/eclipse/updates/4.13/R-4.13-201909161045/plugins/ (93.97kB)
04:40:27 [INFO] Fetching org.eclipse.debug.examples.ui.source_1.6.200.v20190614-1239.jar from https://download.eclipse.org/eclipse/updates/4.13/R-4.13-201909161045/plugins/ (93.97kB)
04:40:27 [INFO] 
04:40:27 [INFO] --- maven-antrun-plugin:1.8:run (check-skip-api-analysis) @ org.eclipse.debug.examples.ui ---
04:40:27 [INFO] Executing tasks
04:40:27 
04:40:27 main:
04:40:27 [INFO] Executed tasks
04:40:27 [INFO] 
04:40:27 [INFO] --- tycho-dependency-tools-plugin:1.5.1:list-dependencies (list-dependencies) @ org.eclipse.debug.examples.ui ---
04:40:27 [INFO] 
04:40:27 [INFO] --- tycho-eclipserun-plugin:1.5.1:eclipse-run (api-analysis) @ org.eclipse.debug.examples.ui ---
04:40:27 [INFO] Toolchain in tycho-eclipserun-plugin: JDK[/opt/tools/java/oracle/jdk-8/latest/jre]
04:40:27 [INFO] Expected eclipse log file: /home/jenkins/agent/workspace/eclipse.platform.debug-Gerrit/org.eclipse.debug.examples.ui/target/eclipserun-work/data/.metadata/.log
04:40:27 [INFO] Command line:
04:40:27 	[/opt/tools/java/oracle/jdk-8/latest/jre/bin/java, -Xmx2048M, -jar, /home/jenkins/agent/workspace/eclipse.platform.debug-Gerrit/.repository/p2/osgi/bundle/org.eclipse.equinox.launcher/1.5.600.v20191014-2022/org.eclipse.equinox.launcher-1.5.600.v20191014-2022.jar, -install, /home/jenkins/agent/workspace/eclipse.platform.debug-Gerrit/org.eclipse.debug.examples.ui/target/eclipserun-work, -configuration, /home/jenkins/agent/workspace/eclipse.platform.debug-Gerrit/org.eclipse.debug.examples.ui/target/eclipserun-work/configuration, -data, /home/jenkins/agent/workspace/eclipse.platform.debug-Gerrit/org.eclipse.debug.examples.ui/../target/org.eclipse.debug.examples.ui-apiAnalyzer-workspace, -application, org.eclipse.pde.api.tools.apiAnalyzer, -project, /home/jenkins/agent/workspace/eclipse.platform.debug-Gerrit/org.eclipse.debug.examples.ui, -baseline, /home/jenkins/agent/workspace/eclipse.platform.debug-Gerrit/org.eclipse.debug.examples.ui/target/org.eclipse.debug.examples.ui-apiBaseline.target, -dependencyList, /home/jenkins/agent/workspace/eclipse.platform.debug-Gerrit/org.eclipse.debug.examples.ui/target/dependencies-list.txt, -failOnError]
04:40:27 Picked up JAVA_TOOL_OPTIONS: -XX:+IgnoreUnrecognizedVMOptions -XX:+UseContainerSupport -XX:+UnlockExperimentalVMOptions -XX:+UseCGroupMemoryLimitForHeap
04:40:27 Picked up _JAVA_OPTIONS: -XX:MaxRAMPercentage=64.0
04:41:11 0 API ERRORS
04:41:11 1 API warnings
04:41:11 * Marker [on: /org.eclipse.debug.examples.ui, id: 11, type: org.eclipse.pde.api.tools.api_usage, attributes: [apiMarkerID: 3, charEnd: -1, charStart: -1, lineNumber: 0, message: Execution environment references were not checked for 'org.eclipse.debug.examples.ui' because no environment descriptions are installed. , messagearguments: org.eclipse.debug.examples.ui, problemid: 665845798, severity: 1, sourceId: API Tools], created: 12/4/19 9:41 AM]
04:41:16 [INFO] 
04:41:16 [INFO] ------------< org.eclipse.ui:org.eclipse.ui.externaltools >-------------
04:41:16 [INFO] Building org.eclipse.ui.externaltools 3.4.500-SNAPSHOT           [11/12]
04:41:16 [INFO] ---------------------------[ eclipse-plugin ]---------------------------
04:41:16 [INFO] 
04:41:16 [INFO] --- maven-clean-plugin:3.1.0:clean (default-clean) @ org.eclipse.ui.externaltools ---
04:41:16 [INFO] 
04:41:16 [INFO] --- tycho-packaging-plugin:1.5.1:build-qualifier (default-build-qualifier) @ org.eclipse.ui.externaltools ---
04:41:16 [INFO] The project's OSGi version is 3.4.500.v20191025-1523
04:41:16 [INFO] 
04:41:16 [INFO] --- tycho-packaging-plugin:1.5.1:validate-id (default-validate-id) @ org.eclipse.ui.externaltools ---
04:41:16 [INFO] 
04:41:16 [INFO] --- tycho-packaging-plugin:1.5.1:validate-version (default-validate-version) @ org.eclipse.ui.externaltools ---
04:41:16 [INFO] 
04:41:16 [INFO] --- maven-resources-plugin:3.1.0:copy-resources (saveproperties) @ org.eclipse.ui.externaltools ---
04:41:16 [INFO] Using 'UTF-8' encoding to copy filtered resources.
04:41:16 [INFO] skip non existing resourceDirectory /home/jenkins/agent/workspace/eclipse.platform.debug-Gerrit/org.eclipse.ui.externaltools/saveproperties
04:41:16 [INFO] 
04:41:16 [INFO] --- maven-enforcer-plugin:3.0.0-M2:enforce (enforce-maven) @ org.eclipse.ui.externaltools ---
04:41:16 [INFO] 
04:41:16 [INFO] --- eclipse-cbi-plugin:1.1.8-SNAPSHOT:generate-api-build-xml (default) @ org.eclipse.ui.externaltools ---
04:41:16 Generating target/.apibuild.xml
04:41:16 [INFO] 
04:41:16 [INFO] --- maven-resources-plugin:3.1.0:resources (default-resources) @ org.eclipse.ui.externaltools ---
04:41:16 [INFO] Using 'UTF-8' encoding to copy filtered resources.
04:41:16 [INFO] skip non existing resourceDirectory /home/jenkins/agent/workspace/eclipse.platform.debug-Gerrit/org.eclipse.ui.externaltools/src/main/resources
04:41:16 [INFO] 
04:41:16 [INFO] --- maven-resources-plugin:3.1.0:resources (filter-resources) @ org.eclipse.ui.externaltools ---
04:41:16 [INFO] Using 'UTF-8' encoding to copy filtered resources.
04:41:16 [INFO] skip non existing resourceDirectory /home/jenkins/agent/workspace/eclipse.platform.debug-Gerrit/org.eclipse.ui.externaltools/src/main/resources
04:41:16 [INFO] 
04:41:16 [INFO] --- tycho-compiler-plugin:1.5.1:compile (default-compile) @ org.eclipse.ui.externaltools ---
04:41:16 [INFO] Compiling 34 source files to /home/jenkins/agent/workspace/eclipse.platform.debug-Gerrit/org.eclipse.ui.externaltools/target/classes
04:41:16 [INFO] 
04:41:16 [INFO] --- tycho-eclipserun-plugin:1.5.1:eclipse-run (default) @ org.eclipse.ui.externaltools ---
04:41:16 [INFO] Toolchain in tycho-eclipserun-plugin: JDK[/opt/tools/java/oracle/jdk-8/latest/jre]
04:41:16 [INFO] Expected eclipse log file: /home/jenkins/agent/workspace/eclipse.platform.debug-Gerrit/org.eclipse.ui.externaltools/target/eclipserun-work/data/.metadata/.log
04:41:16 [INFO] Command line:
04:41:16 	[/opt/tools/java/oracle/jdk-8/latest/jre/bin/java, -jar, /home/jenkins/agent/workspace/eclipse.platform.debug-Gerrit/.repository/p2/osgi/bundle/org.eclipse.equinox.launcher/1.5.600.v20191014-2022/org.eclipse.equinox.launcher-1.5.600.v20191014-2022.jar, -install, /home/jenkins/agent/workspace/eclipse.platform.debug-Gerrit/org.eclipse.ui.externaltools/target/eclipserun-work, -configuration, /home/jenkins/agent/workspace/eclipse.platform.debug-Gerrit/org.eclipse.ui.externaltools/target/eclipserun-work/configuration, -data, target/apibuild-workspace, -application, org.eclipse.ant.core.antRunner, -buildfile, target/.apibuild.xml]
04:41:16 Picked up JAVA_TOOL_OPTIONS: -XX:+IgnoreUnrecognizedVMOptions -XX:+UseContainerSupport -XX:+UnlockExperimentalVMOptions -XX:+UseCGroupMemoryLimitForHeap
04:41:16 Picked up _JAVA_OPTIONS: -XX:MaxRAMPercentage=64.0
04:41:19 Buildfile: target/.apibuild.xml
04:41:19 
04:41:19 apigen:
04:41:20 BUILD SUCCESSFUL
04:41:20 
04:41:20 BUILD SUCCESSFUL
04:41:20 Total time: 1 second
04:41:22 [INFO] 
04:41:22 [INFO] --- maven-resources-plugin:3.1.0:testResources (default-testResources) @ org.eclipse.ui.externaltools ---
04:41:22 [INFO] Using 'UTF-8' encoding to copy filtered resources.
04:41:22 [INFO] skip non existing resourceDirectory /home/jenkins/agent/workspace/eclipse.platform.debug-Gerrit/org.eclipse.ui.externaltools/src/test/resources
04:41:22 [INFO] 
04:41:22 [INFO] --- tycho-source-plugin:1.5.1:plugin-source (plugin-source) @ org.eclipse.ui.externaltools ---
04:41:22 [INFO] Building jar: /home/jenkins/agent/workspace/eclipse.platform.debug-Gerrit/org.eclipse.ui.externaltools/target/org.eclipse.ui.externaltools-3.4.500-SNAPSHOT-sources.jar
04:41:22 [INFO] 
04:41:22 [INFO] --- target-platform-configuration:1.5.1:target-platform (default-target-platform) @ org.eclipse.ui.externaltools ---
04:41:22 [INFO] 
04:41:22 [INFO] --- tycho-packaging-plugin:1.5.1:package-plugin (default-package-plugin) @ org.eclipse.ui.externaltools ---
04:41:22 [INFO] Building jar: /home/jenkins/agent/workspace/eclipse.platform.debug-Gerrit/org.eclipse.ui.externaltools/target/org.eclipse.ui.externaltools-3.4.500-SNAPSHOT.jar
04:41:22 [INFO] 
04:41:22 [INFO] --- tycho-p2-plugin:1.5.1:p2-metadata-default (default-p2-metadata-default) @ org.eclipse.ui.externaltools ---
04:41:22 [INFO] 
04:41:22 [INFO] --- tycho-pack200a-plugin:1.5.1:normalize (pack200-normalize) @ org.eclipse.ui.externaltools ---
04:41:22 [INFO] Pack200 normalizing jar /home/jenkins/agent/workspace/eclipse.platform.debug-Gerrit/org.eclipse.ui.externaltools/target/org.eclipse.ui.externaltools-3.4.500-SNAPSHOT.jar
04:41:22 [INFO] 
04:41:22 [INFO] --- tycho-pack200b-plugin:1.5.1:pack (pack200-pack) @ org.eclipse.ui.externaltools ---
04:41:22 [INFO] Pack200 packing jar /home/jenkins/agent/workspace/eclipse.platform.debug-Gerrit/org.eclipse.ui.externaltools/target/org.eclipse.ui.externaltools-3.4.500-SNAPSHOT.jar
04:41:22 [INFO] 
04:41:22 [INFO] --- tycho-p2-plugin:1.5.1:p2-metadata (p2-metadata) @ org.eclipse.ui.externaltools ---
04:41:23 [INFO] MavenProject: org.eclipse.ui:org.eclipse.ui.externaltools:3.4.500-SNAPSHOT @ /home/jenkins/agent/workspace/eclipse.platform.debug-Gerrit/org.eclipse.ui.externaltools/pom.xml
04:41:23     The main artifact has been replaced with the baseline version.
04:41:23     The following attached artifacts have been replaced with the baseline version: [pack200, sources]
04:41:23 
04:41:23 [INFO] 
04:41:23 [INFO] --- tycho-p2-extras-plugin:1.5.1:compare-version-with-baselines (compare-attached-artifacts-with-release) @ org.eclipse.ui.externaltools ---
04:41:23 [INFO] Fetching org.eclipse.ui.externaltools_3.4.400.v20190705-1219.jar.pack.gz from https://download.eclipse.org/eclipse/updates/4.13/R-4.13-201909161045/plugins/ (66.07kB)
04:41:23 [INFO] Fetching org.eclipse.ui.externaltools_3.4.400.v20190705-1219.jar.pack.gz from https://download.eclipse.org/eclipse/updates/4.13/R-4.13-201909161045/plugins/ (66.07kB)
04:41:23 [INFO] Fetching org.eclipse.ui.externaltools.source_3.4.400.v20190705-1219.jar from https://download.eclipse.org/eclipse/updates/4.13/R-4.13-201909161045/plugins/ (82.46kB)
04:41:23 [INFO] Fetching org.eclipse.ui.externaltools.source_3.4.400.v20190705-1219.jar from https://download.eclipse.org/eclipse/updates/4.13/R-4.13-201909161045/plugins/ (82.46kB)
04:41:23 [INFO] 
04:41:24 [INFO] --- maven-antrun-plugin:1.8:run (check-skip-api-analysis) @ org.eclipse.ui.externaltools ---
04:41:24 [INFO] Executing tasks
04:41:24 
04:41:24 main:
04:41:24 [INFO] Executed tasks
04:41:24 [INFO] 
04:41:24 [INFO] --- tycho-dependency-tools-plugin:1.5.1:list-dependencies (list-dependencies) @ org.eclipse.ui.externaltools ---
04:41:24 [INFO] 
04:41:24 [INFO] --- tycho-eclipserun-plugin:1.5.1:eclipse-run (api-analysis) @ org.eclipse.ui.externaltools ---
04:41:24 [INFO] Toolchain in tycho-eclipserun-plugin: JDK[/opt/tools/java/oracle/jdk-8/latest/jre]
04:41:24 [INFO] Expected eclipse log file: /home/jenkins/agent/workspace/eclipse.platform.debug-Gerrit/org.eclipse.ui.externaltools/target/eclipserun-work/data/.metadata/.log
04:41:24 [INFO] Command line:
04:41:24 	[/opt/tools/java/oracle/jdk-8/latest/jre/bin/java, -Xmx2048M, -jar, /home/jenkins/agent/workspace/eclipse.platform.debug-Gerrit/.repository/p2/osgi/bundle/org.eclipse.equinox.launcher/1.5.600.v20191014-2022/org.eclipse.equinox.launcher-1.5.600.v20191014-2022.jar, -install, /home/jenkins/agent/workspace/eclipse.platform.debug-Gerrit/org.eclipse.ui.externaltools/target/eclipserun-work, -configuration, /home/jenkins/agent/workspace/eclipse.platform.debug-Gerrit/org.eclipse.ui.externaltools/target/eclipserun-work/configuration, -data, /home/jenkins/agent/workspace/eclipse.platform.debug-Gerrit/org.eclipse.ui.externaltools/../target/org.eclipse.ui.externaltools-apiAnalyzer-workspace, -application, org.eclipse.pde.api.tools.apiAnalyzer, -project, /home/jenkins/agent/workspace/eclipse.platform.debug-Gerrit/org.eclipse.ui.externaltools, -baseline, /home/jenkins/agent/workspace/eclipse.platform.debug-Gerrit/org.eclipse.ui.externaltools/target/org.eclipse.ui.externaltools-apiBaseline.target, -dependencyList, /home/jenkins/agent/workspace/eclipse.platform.debug-Gerrit/org.eclipse.ui.externaltools/target/dependencies-list.txt, -failOnError]
04:41:24 Picked up JAVA_TOOL_OPTIONS: -XX:+IgnoreUnrecognizedVMOptions -XX:+UseContainerSupport -XX:+UnlockExperimentalVMOptions -XX:+UseCGroupMemoryLimitForHeap
04:41:24 Picked up _JAVA_OPTIONS: -XX:MaxRAMPercentage=64.0
04:42:13 0 API ERRORS
04:42:13 1 API warnings
04:42:13 * Marker [on: /org.eclipse.ui.externaltools, id: 0, type: org.eclipse.pde.api.tools.api_usage, attributes: [apiMarkerID: 3, charEnd: -1, charStart: -1, lineNumber: 0, message: Execution environment references were not checked for 'org.eclipse.ui.externaltools' because no environment descriptions are installed. , messagearguments: org.eclipse.ui.externaltools, problemid: 665845798, severity: 1, sourceId: API Tools], created: 12/4/19 9:42 AM]
04:42:19 [INFO] 
04:42:19 [INFO] -------------< org.eclipse.debug:org.eclipse.debug.tests >--------------
04:42:19 [INFO] Building org.eclipse.debug.tests 3.11.500-SNAPSHOT               [12/12]
04:42:19 [INFO] ------------------------[ eclipse-test-plugin ]-------------------------
04:42:19 [INFO] 
04:42:19 [INFO] --- maven-clean-plugin:3.1.0:clean (default-clean) @ org.eclipse.debug.tests ---
04:42:19 [INFO] 
04:42:19 [INFO] --- tycho-packaging-plugin:1.5.1:build-qualifier (default-build-qualifier) @ org.eclipse.debug.tests ---
04:42:19 [INFO] The project's OSGi version is 3.11.500.v20191116-2105
04:42:19 [INFO] 
04:42:19 [INFO] --- tycho-packaging-plugin:1.5.1:validate-id (default-validate-id) @ org.eclipse.debug.tests ---
04:42:19 [INFO] 
04:42:19 [INFO] --- tycho-packaging-plugin:1.5.1:validate-version (default-validate-version) @ org.eclipse.debug.tests ---
04:42:19 [INFO] 
04:42:19 [INFO] --- maven-resources-plugin:3.1.0:copy-resources (saveproperties) @ org.eclipse.debug.tests ---
04:42:19 [INFO] Using 'UTF-8' encoding to copy filtered resources.
04:42:19 [INFO] skip non existing resourceDirectory /home/jenkins/agent/workspace/eclipse.platform.debug-Gerrit/org.eclipse.debug.tests/saveproperties
04:42:19 [INFO] 
04:42:19 [INFO] --- maven-enforcer-plugin:3.0.0-M2:enforce (enforce-maven) @ org.eclipse.debug.tests ---
04:42:19 [INFO] 
04:42:19 [INFO] --- eclipse-cbi-plugin:1.1.8-SNAPSHOT:generate-api-build-xml (default) @ org.eclipse.debug.tests ---
04:42:19 [INFO] 
04:42:19 [INFO] --- maven-resources-plugin:3.1.0:resources (default-resources) @ org.eclipse.debug.tests ---
04:42:19 [INFO] Using 'UTF-8' encoding to copy filtered resources.
04:42:19 [INFO] skip non existing resourceDirectory /home/jenkins/agent/workspace/eclipse.platform.debug-Gerrit/org.eclipse.debug.tests/src/main/resources
04:42:19 [INFO] 
04:42:19 [INFO] --- maven-resources-plugin:3.1.0:resources (filter-resources) @ org.eclipse.debug.tests ---
04:42:19 [INFO] Using 'UTF-8' encoding to copy filtered resources.
04:42:19 [INFO] skip non existing resourceDirectory /home/jenkins/agent/workspace/eclipse.platform.debug-Gerrit/org.eclipse.debug.tests/src/main/resources
04:42:19 [INFO] 
04:42:19 [INFO] --- tycho-compiler-plugin:1.5.1:compile (default-compile) @ org.eclipse.debug.tests ---
04:42:19 [INFO] Compiling 92 source files to /home/jenkins/agent/workspace/eclipse.platform.debug-Gerrit/org.eclipse.debug.tests/target/classes
04:42:20 [INFO] 
04:42:20 [INFO] --- tycho-eclipserun-plugin:1.5.1:eclipse-run (default) @ org.eclipse.debug.tests ---
04:42:20 [INFO] 
04:42:20 [INFO] --- maven-resources-plugin:3.1.0:testResources (default-testResources) @ org.eclipse.debug.tests ---
04:42:20 [INFO] Using 'UTF-8' encoding to copy filtered resources.
04:42:20 [INFO] skip non existing resourceDirectory /home/jenkins/agent/workspace/eclipse.platform.debug-Gerrit/org.eclipse.debug.tests/src/test/resources
04:42:20 [INFO] 
04:42:20 [INFO] --- tycho-source-plugin:1.5.1:plugin-source (plugin-source) @ org.eclipse.debug.tests ---
04:42:20 [INFO] Building jar: /home/jenkins/agent/workspace/eclipse.platform.debug-Gerrit/org.eclipse.debug.tests/target/org.eclipse.debug.tests-3.11.500-SNAPSHOT-sources.jar
04:42:20 [INFO] 
04:42:20 [INFO] --- target-platform-configuration:1.5.1:target-platform (default-target-platform) @ org.eclipse.debug.tests ---
04:42:20 [INFO] 
04:42:20 [INFO] --- tycho-packaging-plugin:1.5.1:package-plugin (default-package-plugin) @ org.eclipse.debug.tests ---
04:42:20 [INFO] Building jar: /home/jenkins/agent/workspace/eclipse.platform.debug-Gerrit/org.eclipse.debug.tests/target/org.eclipse.debug.tests-3.11.500-SNAPSHOT.jar
04:42:20 [INFO] 
04:42:20 [INFO] --- tycho-p2-plugin:1.5.1:p2-metadata-default (default-p2-metadata-default) @ org.eclipse.debug.tests ---
04:42:20 [INFO] 
04:42:20 [INFO] --- tycho-pack200a-plugin:1.5.1:normalize (pack200-normalize) @ org.eclipse.debug.tests ---
04:42:20 [INFO] Pack200 normalizing jar /home/jenkins/agent/workspace/eclipse.platform.debug-Gerrit/org.eclipse.debug.tests/target/org.eclipse.debug.tests-3.11.500-SNAPSHOT.jar
04:42:21 [INFO] 
04:42:21 [INFO] --- tycho-pack200b-plugin:1.5.1:pack (pack200-pack) @ org.eclipse.debug.tests ---
04:42:21 [INFO] Pack200 packing jar /home/jenkins/agent/workspace/eclipse.platform.debug-Gerrit/org.eclipse.debug.tests/target/org.eclipse.debug.tests-3.11.500-SNAPSHOT.jar
04:42:21 [INFO] 
04:42:21 [INFO] --- tycho-p2-plugin:1.5.1:p2-metadata (p2-metadata) @ org.eclipse.debug.tests ---
04:42:22 [WARNING] MavenProject: org.eclipse.debug:org.eclipse.debug.tests:3.11.500-SNAPSHOT @ /home/jenkins/agent/workspace/eclipse.platform.debug-Gerrit/org.eclipse.debug.tests/pom.xml: baseline and build artifacts have same version but different contents
04:42:22    classifier-sources: not present in baseline
04:42:22 
04:42:22 [INFO] MavenProject: org.eclipse.debug:org.eclipse.debug.tests:3.11.500-SNAPSHOT @ /home/jenkins/agent/workspace/eclipse.platform.debug-Gerrit/org.eclipse.debug.tests/pom.xml
04:42:22     The main artifact has been replaced with the baseline version.
04:42:22     The following attached artifacts have been replaced with the baseline version: [pack200]
04:42:22     The following attached artifacts are not present in the baseline and have been removed: [sources]
04:42:22 
04:42:22 [INFO] 
04:42:22 [INFO] --- tycho-surefire-plugin:1.5.1:test (default-test) @ org.eclipse.debug.tests ---
04:42:22 [INFO] Expected eclipse log file: /home/jenkins/agent/workspace/eclipse.platform.debug-Gerrit/org.eclipse.debug.tests/target/work/data/.metadata/.log
04:42:22 [INFO] Command line:
04:42:22 	[/opt/tools/java/oracle/jdk-8/1.8.0_202/jre/bin/java, -Dosgi.noShutdown=false, -Dosgi.os=linux, -Dosgi.ws=gtk, -Dosgi.arch=x86_64, -Dosgi.clean=true, -ea, -jar, /home/jenkins/agent/workspace/eclipse.platform.debug-Gerrit/.repository/p2/osgi/bundle/org.eclipse.equinox.launcher/1.5.600.v20191014-2022/org.eclipse.equinox.launcher-1.5.600.v20191014-2022.jar, -data, /home/jenkins/agent/workspace/eclipse.platform.debug-Gerrit/org.eclipse.debug.tests/target/work/data, -install, /home/jenkins/agent/workspace/eclipse.platform.debug-Gerrit/org.eclipse.debug.tests/target/work, -configuration, /home/jenkins/agent/workspace/eclipse.platform.debug-Gerrit/org.eclipse.debug.tests/target/work/configuration, -application, org.eclipse.tycho.surefire.osgibooter.uitest, -testproperties, /home/jenkins/agent/workspace/eclipse.platform.debug-Gerrit/org.eclipse.debug.tests/target/surefire.properties]
04:42:22 Picked up JAVA_TOOL_OPTIONS: -XX:+IgnoreUnrecognizedVMOptions -XX:+UseContainerSupport -XX:+UnlockExperimentalVMOptions -XX:+UseCGroupMemoryLimitForHeap
04:42:22 Picked up _JAVA_OPTIONS: -XX:MaxRAMPercentage=64.0
04:42:29 Running org.eclipse.debug.tests.AutomatedSuite
04:43:09 testDisconnectedAndWriteProcesses runs: 2000
04:43:11 testTerminatedAndWriteProcesses runs: 2000
04:43:13 testDisconnectedAndWriteTargets runs: 2000
04:43:15 testTerminatedAndWriteTargets runs: 2000
04:43:16 All tasks scheduled, processing UI events now...
04:43:16 Requesting to show: mock #5
04:43:16 Requesting to show: mock #3
04:43:16 Requesting to show: mock #10
04:43:16 Requesting to show: mock #12
04:43:16 Requesting to show: mock #11
04:43:16 Requesting to show: mock #13
04:43:16 Requesting to show: mock #8
04:43:16 Requesting to show: mock #4
04:43:16 Requesting to show: mock #17
04:43:16 Requesting to show: mock #16
04:43:16 Requesting to show: mock #2
04:43:16 Requesting to show: mock #20
04:43:16 Requesting to show: mock #7
04:43:16 Requesting to show: mock #9
04:43:16 Requesting to show: mock #19
04:43:16 Requesting to show: mock #15
04:43:16 Requesting to show: mock #18
04:43:16 Requesting to show: mock #14
04:43:16 Requesting to show: mock #1
04:43:16 Requesting to show: mock #6
04:43:16 Shown: mock #5, overall: 1
04:43:16 Shown: mock #3, overall: 2
04:43:16 Shown: mock #10, overall: 3
04:43:16 Shown: mock #12, overall: 4
04:43:16 Shown: mock #11, overall: 5
04:43:16 Shown: mock #13, overall: 6
04:43:16 Shown: mock #8, overall: 7
04:43:16 Shown: mock #4, overall: 8
04:43:16 Shown: mock #17, overall: 9
04:43:16 Shown: mock #16, overall: 10
04:43:16 Shown: mock #2, overall: 11
04:43:16 Shown: mock #20, overall: 12
04:43:16 Shown: mock #7, overall: 13
04:43:16 Shown: mock #9, overall: 14
04:43:16 Shown: mock #19, overall: 15
04:43:16 Shown: mock #15, overall: 16
04:43:16 Shown: mock #18, overall: 17
04:43:16 Shown: mock #14, overall: 18
04:43:16 Shown: mock #1, overall: 19
04:43:16 Shown: mock #6, overall: 20
04:43:17 Waiting on jobs now...
04:43:17 Done with jobs, processing UI events again...
04:43:20 Waiting on execution service to finish...
04:43:20 Done waiting on execution service to finish
04:44:20 Tests run: 290, Failures: 1, Errors: 0, Skipped: 0, Time elapsed: 110.83 s <<< FAILURE! - in org.eclipse.debug.tests.AutomatedSuite
04:44:20 testLookupStackframeForce(org.eclipse.debug.tests.sourcelookup.SourceLookupFacilityTests)  Time elapsed: 0.04 s
04:44:20 testLRU(org.eclipse.debug.tests.sourcelookup.SourceLookupFacilityTests)  Time elapsed: 0.014 s
04:44:20 testLookupStackframeWithDebugElement1(org.eclipse.debug.tests.sourcelookup.SourceLookupFacilityTests)  Time elapsed: 0.007 s
04:44:20 testLookupStackframeWithDebugElement2(org.eclipse.debug.tests.sourcelookup.SourceLookupFacilityTests)  Time elapsed: 0.008 s
04:44:20 testLookupStackframeWithDebugElement3(org.eclipse.debug.tests.sourcelookup.SourceLookupFacilityTests)  Time elapsed: 0.006 s
04:44:20 testLookupStackframeWithDebugElement4(org.eclipse.debug.tests.sourcelookup.SourceLookupFacilityTests)  Time elapsed: 0.006 s
04:44:20 testLookupStackframeWithDebugElement5(org.eclipse.debug.tests.sourcelookup.SourceLookupFacilityTests)  Time elapsed: 0.007 s
04:44:20 testLookupStringLocatorNoForce(org.eclipse.debug.tests.sourcelookup.SourceLookupFacilityTests)  Time elapsed: 0.006 s
04:44:20 testLookupStringForce(org.eclipse.debug.tests.sourcelookup.SourceLookupFacilityTests)  Time elapsed: 0.006 s
04:44:20 testLookupStackframeNoForce(org.eclipse.debug.tests.sourcelookup.SourceLookupFacilityTests)  Time elapsed: 0.009 s
04:44:20 testLookupStringNoLocatorNoForce(org.eclipse.debug.tests.sourcelookup.SourceLookupFacilityTests)  Time elapsed: 0.006 s
04:44:20 testLookupStringNoForce(org.eclipse.debug.tests.sourcelookup.SourceLookupFacilityTests)  Time elapsed: 0.006 s
04:44:20 testBreakpointOrdering0(org.eclipse.debug.tests.breakpoint.BreakpointOrderingTests)  Time elapsed: 0.049 s
04:44:20 testBreakpointOrdering1(org.eclipse.debug.tests.breakpoint.BreakpointOrderingTests)  Time elapsed: 0.017 s
04:44:20 testBreakpointOrdering2(org.eclipse.debug.tests.breakpoint.BreakpointOrderingTests)  Time elapsed: 0.011 s
04:44:20 testBreakpointOrdering3(org.eclipse.debug.tests.breakpoint.BreakpointOrderingTests)  Time elapsed: 0.008 s
04:44:20 testInsertAndRemove(org.eclipse.debug.tests.viewer.model.VirtualViewerDeltaTests)  Time elapsed: 0.1 s
04:44:20 testInsertAndSelect(org.eclipse.debug.tests.viewer.model.VirtualViewerDeltaTests)  Time elapsed: 0.046 s
04:44:20 testUpdateLabel(org.eclipse.debug.tests.viewer.model.VirtualViewerDeltaTests)  Time elapsed: 0.024 s
04:44:20 testExpandAndSelect_simple(org.eclipse.debug.tests.viewer.model.VirtualViewerDeltaTests)  Time elapsed: 0.021 s
04:44:20 testCompositeModelAddElement(org.eclipse.debug.tests.viewer.model.VirtualViewerDeltaTests)  Time elapsed: 0.029 s
04:44:20 testAddElement(org.eclipse.debug.tests.viewer.model.VirtualViewerDeltaTests)  Time elapsed: 0.031 s
04:44:20 testRefreshStruct2(org.eclipse.debug.tests.viewer.model.VirtualViewerDeltaTests)  Time elapsed: 0.035 s
04:44:20 testBug292322(org.eclipse.debug.tests.viewer.model.VirtualViewerDeltaTests)  Time elapsed: 0.022 s
04:44:20 testRefreshStruct(org.eclipse.debug.tests.viewer.model.VirtualViewerDeltaTests)  Time elapsed: 0.038 s
04:44:20 testRefreshCoalesceStruct(org.eclipse.debug.tests.viewer.model.VirtualViewerDeltaTests)  Time elapsed: 0.025 s
04:44:20 testInsert(org.eclipse.debug.tests.viewer.model.VirtualViewerDeltaTests)  Time elapsed: 0.019 s
04:44:20 testCompositeModelRefreshStruct(org.eclipse.debug.tests.viewer.model.VirtualViewerDeltaTests)  Time elapsed: 0.025 s
04:44:20 testRemove(org.eclipse.debug.tests.viewer.model.VirtualViewerDeltaTests)  Time elapsed: 0.031 s
04:44:20 testExpandAndSelect(org.eclipse.debug.tests.viewer.model.VirtualViewerDeltaTests)  Time elapsed: 0.021 s
04:44:20 testLabelUpdatesCompletedOutOfSequence1(org.eclipse.debug.tests.viewer.model.VirtualViewerContentTests)  Time elapsed: 0.324 s
04:44:20 testLabelUpdatesCompletedOutOfSequence2(org.eclipse.debug.tests.viewer.model.VirtualViewerContentTests)  Time elapsed: 0.324 s
04:44:20 testSimpleSingleLevel(org.eclipse.debug.tests.viewer.model.VirtualViewerContentTests)  Time elapsed: 0.017 s
04:44:20 testSimpleMultiLevel(org.eclipse.debug.tests.viewer.model.VirtualViewerContentTests)  Time elapsed: 0.025 s
04:44:20 test(org.eclipse.debug.tests.viewer.model.VirtualViewerLazyModeTests)  Time elapsed: 0.017 s
04:44:20 testSelectionPolicy(org.eclipse.debug.tests.viewer.model.VirtualViewerSelectionTests)  Time elapsed: 0.025 s
04:44:20 testSelectRemoveRefreshStruct(org.eclipse.debug.tests.viewer.model.VirtualViewerSelectionTests)  Time elapsed: 0.021 s
04:44:20 testSelectRemove(org.eclipse.debug.tests.viewer.model.VirtualViewerSelectionTests)  Time elapsed: 0.031 s
04:44:20 testSimpleSetSelection(org.eclipse.debug.tests.viewer.model.VirtualViewerSelectionTests)  Time elapsed: 0.02 s
04:44:20 testSaveAndRestore1(org.eclipse.debug.tests.viewer.model.VirtualViewerStateTests)  Time elapsed: 0.037 s
04:44:20 testSaveAndRestore2(org.eclipse.debug.tests.viewer.model.VirtualViewerStateTests)  Time elapsed: 0.035 s
04:44:20 testPreserveExpandedOnInsert(org.eclipse.debug.tests.viewer.model.VirtualViewerStateTests)  Time elapsed: 0.025 s
04:44:20 testPreserveExpandedOnRemove(org.eclipse.debug.tests.viewer.model.VirtualViewerStateTests)  Time elapsed: 0.024 s
04:44:20 testKeepCollapsedAfterRemovingAndReaddingChildrenInExpandedTree(org.eclipse.debug.tests.viewer.model.VirtualViewerStateTests)  Time elapsed: 0.039 s
04:44:20 testPreserveExpandedOnMultLevelContent(org.eclipse.debug.tests.viewer.model.VirtualViewerStateTests)  Time elapsed: 0.034 s
04:44:20 testPreserveLargeModelOnContent(org.eclipse.debug.tests.viewer.model.VirtualViewerStateTests)  Time elapsed: 0.516 s
04:44:20 testSaveAndRestorePartialStateLarge(org.eclipse.debug.tests.viewer.model.VirtualViewerStateTests)  Time elapsed: 0.976 s
04:44:20 testSaveRestoreOrder(org.eclipse.debug.tests.viewer.model.VirtualViewerStateTests)  Time elapsed: 0.028 s
04:44:20 testPreserveExpandDeltaAfterContent(org.eclipse.debug.tests.viewer.model.VirtualViewerStateTests)  Time elapsed: 0.018 s
04:44:20 testPreserveCollapseAndSelectDeltaAfterSaveAndRestore(org.eclipse.debug.tests.viewer.model.VirtualViewerStateTests)  Time elapsed: 0.025 s
04:44:20 testUpdateWithNullInput(org.eclipse.debug.tests.viewer.model.VirtualViewerStateTests)  Time elapsed: 0.023 s
04:44:20 testUpdateViewer(org.eclipse.debug.tests.viewer.model.VirtualViewerStateTests)  Time elapsed: 0.019 s
04:44:20 testSaveAndRestoreInputInstanceEquals(org.eclipse.debug.tests.viewer.model.VirtualViewerStateTests)  Time elapsed: 0.024 s
04:44:20 testSaveAndRestoreLarge(org.eclipse.debug.tests.viewer.model.VirtualViewerStateTests)  Time elapsed: 0.976 s
04:44:20 testSaveAndRestoreInputInstance(org.eclipse.debug.tests.viewer.model.VirtualViewerStateTests)  Time elapsed: 0.025 s
04:44:20 testPreserveCollapseDeltaAfterContent(org.eclipse.debug.tests.viewer.model.VirtualViewerStateTests)  Time elapsed: 0.019 s
04:44:20 testPreserveSelectionDeltaAfterContent(org.eclipse.debug.tests.viewer.model.VirtualViewerStateTests)  Time elapsed: 0.02 s
04:44:20 testPreserveExpandedOnSubTreeContent(org.eclipse.debug.tests.viewer.model.VirtualViewerStateTests)  Time elapsed: 0.021 s
04:44:20 testPreserveExpandedOnContentStress(org.eclipse.debug.tests.viewer.model.VirtualViewerStateTests)  Time elapsed: 0.064 s
04:44:20 testAddNewChildren(org.eclipse.debug.tests.viewer.model.VirtualViewerUpdateTests)  Time elapsed: 0.02 s
04:44:20 testRescheduleUpdates(org.eclipse.debug.tests.viewer.model.VirtualViewerUpdateTests)  Time elapsed: 0.03 s
04:44:20 testCanceledUpdates1(org.eclipse.debug.tests.viewer.model.VirtualViewerUpdateTests)  Time elapsed: 0.019 s
04:44:20 testCanceledUpdates2(org.eclipse.debug.tests.viewer.model.VirtualViewerUpdateTests)  Time elapsed: 0.019 s
04:44:20 testCanceledUpdates3(org.eclipse.debug.tests.viewer.model.VirtualViewerUpdateTests)  Time elapsed: 0.018 s
04:44:20 testCanceledUpdates4(org.eclipse.debug.tests.viewer.model.VirtualViewerUpdateTests)  Time elapsed: 0.019 s
04:44:20 testNotifyUpdatesTartedOnModelChanged(org.eclipse.debug.tests.viewer.model.VirtualViewerUpdateTests)  Time elapsed: 0.018 s
04:44:20 testInsertAtInvalidIndex(org.eclipse.debug.tests.viewer.model.VirtualViewerUpdateTests)  Time elapsed: 0.02 s
04:44:20 testRepeatedAddRemoveElement(org.eclipse.debug.tests.viewer.model.VirtualViewerUpdateTests)  Time elapsed: 0.021 s
04:44:20 testCanceledUpdatesOnSetNullInput(org.eclipse.debug.tests.viewer.model.VirtualViewerUpdateTests)  Time elapsed: 0.016 s
04:44:20 testCancelUpdatesOnRemoveElementWhileUpdatingSubTree(org.eclipse.debug.tests.viewer.model.VirtualViewerUpdateTests)  Time elapsed: 0.021 s
04:44:20 testRemoveElements(org.eclipse.debug.tests.viewer.model.VirtualViewerUpdateTests)  Time elapsed: 0.019 s
04:44:20 testContentPlusAddRemoveUpdateRaceConditionsElement(org.eclipse.debug.tests.viewer.model.VirtualViewerUpdateTests)  Time elapsed: 0.082 s
04:44:20 testCanceledUpdatesOnSetInput(org.eclipse.debug.tests.viewer.model.VirtualViewerUpdateTests)  Time elapsed: 0.017 s
04:44:20 testLargeSingleLevel(org.eclipse.debug.tests.viewer.model.VirtualViewerFilterTests)  Time elapsed: 0.063 s
04:44:20 testSimpleMultiLevelWithMixedFilters(org.eclipse.debug.tests.viewer.model.VirtualViewerFilterTests)  Time elapsed: 0.02 s
04:44:20 testSimpleSingleLevelWithTMVFilter(org.eclipse.debug.tests.viewer.model.VirtualViewerFilterTests)  Time elapsed: 0.015 s
04:44:20 testPreserveExpandedOnMultLevelContent(org.eclipse.debug.tests.viewer.model.VirtualViewerFilterTests)  Time elapsed: 0.023 s
04:44:20 testRefreshToUnfilterElementsWithMixedFilters(org.eclipse.debug.tests.viewer.model.VirtualViewerFilterTests)  Time elapsed: 0.323 s
04:44:20 testReplacedUnrealizedFilteredElement(org.eclipse.debug.tests.viewer.model.VirtualViewerFilterTests)  Time elapsed: 0.329 s
04:44:20 testSimpleSingleLevel(org.eclipse.debug.tests.viewer.model.VirtualViewerFilterTests)  Time elapsed: 0.017 s
04:44:20 testRefreshUnrealizedFilteredElementWithTMVFilter(org.eclipse.debug.tests.viewer.model.VirtualViewerFilterTests)  Time elapsed: 0.328 s
04:44:20 testRefreshToUnfilterElements(org.eclipse.debug.tests.viewer.model.VirtualViewerFilterTests)  Time elapsed: 0.325 s
04:44:20 testRefreshToUnfilterElementsWithTMVFilter(org.eclipse.debug.tests.viewer.model.VirtualViewerFilterTests)  Time elapsed: 0.322 s
04:44:20 testReplacedUnrealizedFilteredElementWithTMVFilter(org.eclipse.debug.tests.viewer.model.VirtualViewerFilterTests)  Time elapsed: 0.321 s
04:44:20 testSimpleMultiLevel(org.eclipse.debug.tests.viewer.model.VirtualViewerFilterTests)  Time elapsed: 0.017 s
04:44:20 testLargeSingleLevelWithTMVFilter(org.eclipse.debug.tests.viewer.model.VirtualViewerFilterTests)  Time elapsed: 0.035 s
04:44:20 testSimpleSingleLevelWithMixedFilters(org.eclipse.debug.tests.viewer.model.VirtualViewerFilterTests)  Time elapsed: 0.014 s
04:44:20 testSimpleMultiLevelWithTMVFilter(org.eclipse.debug.tests.viewer.model.VirtualViewerFilterTests)  Time elapsed: 0.013 s
04:44:20 testRefreshUnrealizedFilteredElement(org.eclipse.debug.tests.viewer.model.VirtualViewerFilterTests)  Time elapsed: 0.333 s
04:44:20 testViewToModelCount(org.eclipse.debug.tests.viewer.model.FilterTransformTests)  Time elapsed: 0.006 s
04:44:20 testViewToModelIndex(org.eclipse.debug.tests.viewer.model.FilterTransformTests)  Time elapsed: 0.006 s
04:44:20 testClearLastFromFilters(org.eclipse.debug.tests.viewer.model.FilterTransformTests)  Time elapsed: 0.006 s
04:44:20 testAddAlreadyFiltered(org.eclipse.debug.tests.viewer.model.FilterTransformTests)  Time elapsed: 0.006 s
04:44:20 testRemoveMiddleElementFromFilters(org.eclipse.debug.tests.viewer.model.FilterTransformTests)  Time elapsed: 0.006 s
04:44:20 testRemoveLastFromFilters(org.eclipse.debug.tests.viewer.model.FilterTransformTests)  Time elapsed: 0.006 s
04:44:20 testClearFirstElementFromFilters(org.eclipse.debug.tests.viewer.model.FilterTransformTests)  Time elapsed: 0.006 s
04:44:20 testRemoveFirstElementFromFilters(org.eclipse.debug.tests.viewer.model.FilterTransformTests)  Time elapsed: 0.006 s
04:44:20 testClearMiddleElementFromFilters(org.eclipse.debug.tests.viewer.model.FilterTransformTests)  Time elapsed: 0.006 s
04:44:20 testRegression200325(org.eclipse.debug.tests.viewer.model.FilterTransformTests)  Time elapsed: 0.006 s
04:44:20 testCoalesce(org.eclipse.debug.tests.viewer.model.ChildrenUpdateTests)  Time elapsed: 0.007 s
04:44:20 testSaveRestore(org.eclipse.debug.tests.viewer.model.PresentationContextTests)  Time elapsed: 0.008 s
04:44:20 testDynamicBinding(org.eclipse.debug.tests.view.memory.MemoryRenderingTests)  Time elapsed: 0.011 s
04:44:20 testNoDefaultBinding(org.eclipse.debug.tests.view.memory.MemoryRenderingTests)  Time elapsed: 0.006 s
04:44:20 testSingleBinding(org.eclipse.debug.tests.view.memory.MemoryRenderingTests)  Time elapsed: 0.006 s
04:44:20 testNoPrimaryBinding(org.eclipse.debug.tests.view.memory.MemoryRenderingTests)  Time elapsed: 0.006 s
04:44:20 testBindingChangeNotification(org.eclipse.debug.tests.view.memory.MemoryRenderingTests)  Time elapsed: 0.007 s
04:44:20 testDefaultBinding(org.eclipse.debug.tests.view.memory.MemoryRenderingTests)  Time elapsed: 0.006 s
04:44:20 testRenderingTypes(org.eclipse.debug.tests.view.memory.MemoryRenderingTests)  Time elapsed: 0.006 s
04:44:20 testRenderingTypeNames(org.eclipse.debug.tests.view.memory.MemoryRenderingTests)  Time elapsed: 0.006 s
04:44:20 testDefaultWithoutPrimaryBinding(org.eclipse.debug.tests.view.memory.MemoryRenderingTests)  Time elapsed: 0.006 s
04:44:20 testPrimaryBinding(org.eclipse.debug.tests.view.memory.MemoryRenderingTests)  Time elapsed: 0.006 s
04:44:20 testDoubleBinding(org.eclipse.debug.tests.view.memory.MemoryRenderingTests)  Time elapsed: 0.006 s
04:44:20 testCreateDeleteEFS(org.eclipse.debug.tests.launching.LaunchConfigurationTests)  Time elapsed: 0.189 s
04:44:20 testRenameSharedConfiguration(org.eclipse.debug.tests.launching.LaunchConfigurationTests)  Time elapsed: 0.044 s
04:44:20 testPrototypeChildren(org.eclipse.debug.tests.launching.LaunchConfigurationTests)  Time elapsed: 0.023 s
04:44:20 testSetAttributes(org.eclipse.debug.tests.launching.LaunchConfigurationTests)  Time elapsed: 0.012 s
04:44:20 testGetProjectMappedResource1(org.eclipse.debug.tests.launching.LaunchConfigurationTests)  Time elapsed: 0.007 s
04:44:20 testGetProjectMappedResource2(org.eclipse.debug.tests.launching.LaunchConfigurationTests)  Time elapsed: 0.007 s
04:44:20 testGetProjectMappedResource3(org.eclipse.debug.tests.launching.LaunchConfigurationTests)  Time elapsed: 0.008 s
04:44:20 testGetProjectMappedResource4(org.eclipse.debug.tests.launching.LaunchConfigurationTests)  Time elapsed: 0.125 s
04:44:20 testNullLaunchConfigurationInLaunch(org.eclipse.debug.tests.launching.LaunchConfigurationTests)  Time elapsed: 0.048 s
04:44:20 testCopyAttributes(org.eclipse.debug.tests.launching.LaunchConfigurationTests)  Time elapsed: 0.007 s
04:44:20 testSetNullAttributes(org.eclipse.debug.tests.launching.LaunchConfigurationTests)  Time elapsed: 0.011 s
04:44:20 testLocalCopy(org.eclipse.debug.tests.launching.LaunchConfigurationTests)  Time elapsed: 0.015 s
04:44:20 testLocalName(org.eclipse.debug.tests.launching.LaunchConfigurationTests)  Time elapsed: 0.009 s
04:44:20 testGetTypeImageFromURI(org.eclipse.debug.tests.launching.LaunchConfigurationTests)  Time elapsed: 0.036 s
04:44:20 testWorkingCopyGetLocation(org.eclipse.debug.tests.launching.LaunchConfigurationTests)  Time elapsed: 0.007 s
04:44:20 testPersistIndex(org.eclipse.debug.tests.launching.LaunchConfigurationTests)  Time elapsed: 0.045 s
04:44:20 testIllegalFileSepCharName(org.eclipse.debug.tests.launching.LaunchConfigurationTests)  Time elapsed: 0.006 s
04:44:20 testCreateLocalConfiguration(org.eclipse.debug.tests.launching.LaunchConfigurationTests)  Time elapsed: 0.01 s
04:44:20 testCopyPrototype(org.eclipse.debug.tests.launching.LaunchConfigurationTests)  Time elapsed: 0.006 s
04:44:20 testIsPrototype(org.eclipse.debug.tests.launching.LaunchConfigurationTests)  Time elapsed: 0.01 s
04:44:20 testNestedPrototypes(org.eclipse.debug.tests.launching.LaunchConfigurationTests)  Time elapsed: 0.009 s
04:44:20 testDoubleSave(org.eclipse.debug.tests.launching.LaunchConfigurationTests)  Time elapsed: 0.014 s
04:44:20 testDeleteLocalConfiguration(org.eclipse.debug.tests.launching.LaunchConfigurationTests)  Time elapsed: 0.01 s
04:44:20 testPrototypeRemoveBehavior(org.eclipse.debug.tests.launching.LaunchConfigurationTests)  Time elapsed: 0.01 s
04:44:20 testNestedWorkingCopyLocalConfiguration(org.eclipse.debug.tests.launching.LaunchConfigurationTests)  Time elapsed: 0.01 s
04:44:20 testLaunchTimeStamp(org.eclipse.debug.tests.launching.LaunchConfigurationTests)  Time elapsed: 0.022 s
04:44:20 testLegalFileSepCharName(org.eclipse.debug.tests.launching.LaunchConfigurationTests)  Time elapsed: 0.007 s
04:44:20 testGetTyeImage(org.eclipse.debug.tests.launching.LaunchConfigurationTests)  Time elapsed: 0.006 s
04:44:20 testIllegalCharName(org.eclipse.debug.tests.launching.LaunchConfigurationTests)  Time elapsed: 0.007 s
04:44:20 testDeleteSharedConfiguration(org.eclipse.debug.tests.launching.LaunchConfigurationTests)  Time elapsed: 0.02 s
04:44:20 testUnPrototype(org.eclipse.debug.tests.launching.LaunchConfigurationTests)  Time elapsed: 0.02 s
04:44:20 testMoveSharedToLocalConfiguration(org.eclipse.debug.tests.launching.LaunchConfigurationTests)  Time elapsed: 0.018 s
04:44:20 testDeleteProjectWithSharedConfig(org.eclipse.debug.tests.launching.LaunchConfigurationTests)  Time elapsed: 0.053 s
04:44:20 testCreateDeleteEFSLink(org.eclipse.debug.tests.launching.LaunchConfigurationTests)  Time elapsed: 0.026 s
04:44:20 testCreationFromPrototype(org.eclipse.debug.tests.launching.LaunchConfigurationTests)  Time elapsed: 0.012 s
04:44:20 testRenameLocalConfiguration(org.eclipse.debug.tests.launching.LaunchConfigurationTests)  Time elapsed: 0.014 s
04:44:20 testImport(org.eclipse.debug.tests.launching.LaunchConfigurationTests)  Time elapsed: 0.043 s
04:44:20 testCreateSharedConfiguration(org.eclipse.debug.tests.launching.LaunchConfigurationTests)  Time elapsed: 0.013 s
04:44:20 testMoveLocalToSharedConfiguration(org.eclipse.debug.tests.launching.LaunchConfigurationTests)  Time elapsed: 0.016 s
04:44:20 testRenameAndMoveShared(org.eclipse.debug.tests.launching.LaunchConfigurationTests)  Time elapsed: 0.019 s
04:44:20 testMapAttributePersistence(org.eclipse.debug.tests.launching.LaunchConfigurationTests)  Time elapsed: 0.044 s
04:44:20 testSharedCopy(org.eclipse.debug.tests.launching.LaunchConfigurationTests)  Time elapsed: 0.033 s
04:44:20 testSharedName(org.eclipse.debug.tests.launching.LaunchConfigurationTests)  Time elapsed: 0.014 s
04:44:20 testEFSProjectRename(org.eclipse.debug.tests.launching.LaunchConfigurationTests)  Time elapsed: 0.093 s
04:44:20 testSetAttributePersistence(org.eclipse.debug.tests.launching.LaunchConfigurationTests)  Time elapsed: 0.019 s
04:44:20 testGetAttributes(org.eclipse.debug.tests.launching.LaunchConfigurationTests)  Time elapsed: 0.047 s
04:44:20 testIllegalPrototype(org.eclipse.debug.tests.launching.LaunchConfigurationTests)  Time elapsed: 0.009 s
04:44:20 testWithEllipses(org.eclipse.debug.tests.launching.AcceleratorSubstitutionTests)  Time elapsed: 0.008 s
04:44:20 testWithoutEllipses(org.eclipse.debug.tests.launching.AcceleratorSubstitutionTests)  Time elapsed: 0.006 s
04:44:20 testWithoutDBCSAcclerator(org.eclipse.debug.tests.launching.AcceleratorSubstitutionTests)  Time elapsed: 0.006 s
04:44:20 testHistoryAddition(org.eclipse.debug.tests.launching.LaunchHistoryTests)  Time elapsed: 0.013 s
04:44:20 testLaunchHistorySize(org.eclipse.debug.tests.launching.LaunchHistoryTests)  Time elapsed: 0.021 s
04:44:20 testRenameConfigHistoryUpdate(org.eclipse.debug.tests.launching.LaunchHistoryTests)  Time elapsed: 0.017 s
04:44:20 testHistoryReodering(org.eclipse.debug.tests.launching.LaunchHistoryTests)  Time elapsed: 0.01 s
04:44:20 testHistoriesInSync(org.eclipse.debug.tests.launching.LaunchHistoryTests)  Time elapsed: 0.007 s
04:44:20 testDeleteLaunchConfigurationHistoryUpdate(org.eclipse.debug.tests.launching.LaunchHistoryTests)  Time elapsed: 0.009 s
04:44:20 testBecomeFavorite(org.eclipse.debug.tests.launching.LaunchFavoriteTests)  Time elapsed: 0.015 s
04:44:20 testRenameFavorite(org.eclipse.debug.tests.launching.LaunchFavoriteTests)  Time elapsed: 0.016 s
04:44:20 testDeleteConfiguration(org.eclipse.debug.tests.launching.LaunchFavoriteTests)  Time elapsed: 0.015 s
04:44:20 testRenameBecomeFavorite(org.eclipse.debug.tests.launching.LaunchFavoriteTests)  Time elapsed: 0.013 s
04:44:20 testRenameUnFavorite(org.eclipse.debug.tests.launching.LaunchFavoriteTests)  Time elapsed: 0.014 s
04:44:20 testUnFavorite(org.eclipse.debug.tests.launching.LaunchFavoriteTests)  Time elapsed: 0.013 s
04:44:20 testValidateConfigBadCharName(org.eclipse.debug.tests.launching.LaunchManagerTests)  Time elapsed: 0.006 s
04:44:20 testValidateConfigBadName(org.eclipse.debug.tests.launching.LaunchManagerTests)  Time elapsed: 0.006 s
04:44:20 testGenerateValidName(org.eclipse.debug.tests.launching.LaunchManagerTests)  Time elapsed: 0.007 s
04:44:20 testGenerateBadConfigName(org.eclipse.debug.tests.launching.LaunchManagerTests)  Time elapsed: 0.006 s
04:44:20 testGenereateConfigName(org.eclipse.debug.tests.launching.LaunchManagerTests)  Time elapsed: 0.007 s
04:44:20 testGenerateConfigNameReservedName(org.eclipse.debug.tests.launching.LaunchManagerTests)  Time elapsed: 0.006 s
04:44:20 testCancelledPreLaunchCheck(org.eclipse.debug.tests.launching.LaunchManagerTests)  Time elapsed: 0.015 s
04:44:20 testCancelledBuildForLaunch(org.eclipse.debug.tests.launching.LaunchManagerTests)  Time elapsed: 0.011 s
04:44:20 testGenereateConfigNameBadChar(org.eclipse.debug.tests.launching.LaunchManagerTests)  Time elapsed: 0.006 s
04:44:20 testGenerateConflictingName(org.eclipse.debug.tests.launching.LaunchManagerTests)  Time elapsed: 0.007 s
04:44:20 testGenerateBadCharConflict(org.eclipse.debug.tests.launching.LaunchManagerTests)  Time elapsed: 0.009 s
04:44:20 testGenerateNameExistingConfig(org.eclipse.debug.tests.launching.LaunchManagerTests)  Time elapsed: 0.01 s
04:44:20 testCancelledFinalLaunchCheck(org.eclipse.debug.tests.launching.LaunchManagerTests)  Time elapsed: 0.01 s
04:44:20 testValidateConfigGoodName(org.eclipse.debug.tests.launching.LaunchManagerTests)  Time elapsed: 0.006 s
04:44:20 testGenerateBadNameConflict(org.eclipse.debug.tests.launching.LaunchManagerTests)  Time elapsed: 0.006 s
04:44:20 testRemoveAcc(org.eclipse.debug.tests.launching.LaunchManagerTests)  Time elapsed: 0.006 s
04:44:20 testNPE_Bug484882(org.eclipse.debug.tests.launching.LaunchManagerTests)  Time elapsed: 23.565 s
04:44:20 testSelectedResource(org.eclipse.debug.tests.launching.RefreshTabTests)  Time elapsed: 0.259 s
04:44:20 testSpecificResource(org.eclipse.debug.tests.launching.RefreshTabTests)  Time elapsed: 0.007 s
04:44:20 testSelectionsFolder(org.eclipse.debug.tests.launching.RefreshTabTests)  Time elapsed: 0.011 s
04:44:20 testWorkingSet(org.eclipse.debug.tests.launching.RefreshTabTests)  Time elapsed: 0.009 s
04:44:20 testWorkspaceScope(org.eclipse.debug.tests.launching.RefreshTabTests)  Time elapsed: 0.121 s
04:44:20 testSelectionsProject(org.eclipse.debug.tests.launching.RefreshTabTests)  Time elapsed: 0.009 s
04:44:20 testEmptyResourceSet(org.eclipse.debug.tests.launching.RefreshTabTests)  Time elapsed: 0.008 s
04:44:20 testResourceMemento(org.eclipse.debug.tests.launching.RefreshTabTests)  Time elapsed: 0.007 s
04:44:20 testRefreshScopeComparator(org.eclipse.debug.tests.launching.RefreshTabTests)  Time elapsed: 0.007 s
04:44:20 testAllInOne(org.eclipse.debug.tests.launching.ArgumentParsingTests)  Time elapsed: 0.188 s
04:44:20 testDoubleQuoted1(org.eclipse.debug.tests.launching.ArgumentParsingTests)  Time elapsed: 0.182 s
04:44:20 testDoubleQuoted2(org.eclipse.debug.tests.launching.ArgumentParsingTests)  Time elapsed: 0.177 s
04:44:20 testDoubleQuoted3(org.eclipse.debug.tests.launching.ArgumentParsingTests)  Time elapsed: 0.178 s
04:44:20 testDoubleQuoted4(org.eclipse.debug.tests.launching.ArgumentParsingTests)  Time elapsed: 0.178 s
04:44:20 testDoubleQuoted5(org.eclipse.debug.tests.launching.ArgumentParsingTests)  Time elapsed: 0.176 s
04:44:20 testEmpty(org.eclipse.debug.tests.launching.ArgumentParsingTests)  Time elapsed: 0.179 s
04:44:20 test1arg(org.eclipse.debug.tests.launching.ArgumentParsingTests)  Time elapsed: 0.176 s
04:44:20 test2arg(org.eclipse.debug.tests.launching.ArgumentParsingTests)  Time elapsed: 0.174 s
04:44:20 testEscapeDoubleQuote1(org.eclipse.debug.tests.launching.ArgumentParsingTests)  Time elapsed: 0.177 s
04:44:20 testEscapeDoubleQuote2(org.eclipse.debug.tests.launching.ArgumentParsingTests)  Time elapsed: 0.18 s
04:44:20 testWindows1(org.eclipse.debug.tests.launching.ArgumentParsingTests)  Time elapsed: 0.178 s
04:44:20 testWindows2(org.eclipse.debug.tests.launching.ArgumentParsingTests)  Time elapsed: 0.175 s
04:44:20 testWindows3(org.eclipse.debug.tests.launching.ArgumentParsingTests)  Time elapsed: 0.177 s
04:44:20 testWindows4(org.eclipse.debug.tests.launching.ArgumentParsingTests)  Time elapsed: 0.175 s
04:44:20 testWindows5(org.eclipse.debug.tests.launching.ArgumentParsingTests)  Time elapsed: 0.182 s
04:44:20 testDoubleQuotedWithSpace1(org.eclipse.debug.tests.launching.ArgumentParsingTests)  Time elapsed: 0.176 s
04:44:20 testDoubleQuotedWithSpace2(org.eclipse.debug.tests.launching.ArgumentParsingTests)  Time elapsed: 0.178 s
04:44:20 testSingleQuoted1(org.eclipse.debug.tests.launching.ArgumentParsingTests)  Time elapsed: 0.173 s
04:44:20 testSingleQuoted2(org.eclipse.debug.tests.launching.ArgumentParsingTests)  Time elapsed: 0.175 s
04:44:20 test100arg(org.eclipse.debug.tests.launching.ArgumentParsingTests)  Time elapsed: 0.206 s
04:44:20 testEscape(org.eclipse.debug.tests.launching.ArgumentParsingTests)  Time elapsed: 0.184 s
04:44:20 testDisconnectedAndWriteProcesses(org.eclipse.debug.tests.launching.LaunchTests)  Time elapsed: 2.256 s
04:44:20 testTerminatedAndWriteProcesses(org.eclipse.debug.tests.launching.LaunchTests)  Time elapsed: 2.201 s
04:44:20 testDisconnectedAndWriteTargets(org.eclipse.debug.tests.launching.LaunchTests)  Time elapsed: 2.234 s
04:44:20 testTerminatedAndWriteTargets(org.eclipse.debug.tests.launching.LaunchTests)  Time elapsed: 2.182 s
04:44:20 testStatusHandlerExtension(org.eclipse.debug.tests.statushandlers.StatusHandlerTests)  Time elapsed: 0.007 s
04:44:20 testDisableStatusHandlers(org.eclipse.debug.tests.statushandlers.StatusHandlerTests)  Time elapsed: 0.009 s
04:44:20 testStepFitlersExtension_01(org.eclipse.debug.tests.stepfilters.StepFiltersTests)  Time elapsed: 0.007 s
04:44:20 testStepFitlersExtension_02(org.eclipse.debug.tests.stepfilters.StepFiltersTests)  Time elapsed: 0.007 s
04:44:20 testMultilineRemove(org.eclipse.debug.tests.console.ConsoleDocumentAdapterTests)  Time elapsed: 0.034 s
04:44:20 testMultilineReplace(org.eclipse.debug.tests.console.ConsoleDocumentAdapterTests)  Time elapsed: 0.007 s
04:44:20 testChangeDocument(org.eclipse.debug.tests.console.ConsoleDocumentAdapterTests)  Time elapsed: 0.006 s
04:44:20 testInterfaceContract(org.eclipse.debug.tests.console.ConsoleDocumentAdapterTests)  Time elapsed: 0.007 s
04:44:20 testMultilineInserts(org.eclipse.debug.tests.console.ConsoleDocumentAdapterTests)  Time elapsed: 0.009 s
04:44:20 testManyLines(org.eclipse.debug.tests.console.ConsoleDocumentAdapterTests)  Time elapsed: 0.073 s
04:44:20 testSetText(org.eclipse.debug.tests.console.ConsoleDocumentAdapterTests)  Time elapsed: 0.007 s
04:44:20 testLineWrap(org.eclipse.debug.tests.console.ConsoleDocumentAdapterTests)  Time elapsed: 0.011 s
04:44:20 testSetWidth(org.eclipse.debug.tests.console.ConsoleDocumentAdapterTests)  Time elapsed: 0.007 s
04:44:20 testShowAllConsoles(org.eclipse.debug.tests.console.ConsoleManagerTests)  Time elapsed: 4.972 s
04:44:20 testConsoleOutputStreamLastR(org.eclipse.debug.tests.console.ConsoleTests)  Time elapsed: 0.647 s
04:44:20 testConsoleOutputStreamClosed(org.eclipse.debug.tests.console.ConsoleTests)  Time elapsed: 0.008 s
04:44:20 testSetNullEncoding(org.eclipse.debug.tests.console.ConsoleTests)  Time elapsed: 0.007 s
04:44:20 testFindReplaceIsEnabledOnConsoleOpen(org.eclipse.debug.tests.console.ConsoleTests)  Time elapsed: 0.455 s
04:44:20 testConsoleOutputStreamDocumentStreamClosed(org.eclipse.debug.tests.console.ConsoleTests)  Time elapsed: 0.008 s
04:44:20 testIOConsoleAvailable(org.eclipse.debug.tests.console.ConsoleTests)  Time elapsed: 0.113 s
04:44:20 testConsoleOutputStreamDocumentClosed(org.eclipse.debug.tests.console.ConsoleTests)  Time elapsed: 0.006 s
04:44:20 testConsoleOutputStreamEncoding(org.eclipse.debug.tests.console.ConsoleTests)  Time elapsed: 0.822 s
04:44:20 testInputFile(org.eclipse.debug.tests.console.IOConsoleTests)  Time elapsed: 0.321 s
04:44:20 testBackspaceControlCharacter(org.eclipse.debug.tests.console.IOConsoleTests)  Time elapsed: 6.803 s
04:44:20 testTrim(org.eclipse.debug.tests.console.IOConsoleTests)  Time elapsed: 0.539 s
04:44:20 testUserInput(org.eclipse.debug.tests.console.IOConsoleTests)  Time elapsed: 0.598 s
04:44:20 testControlCharacterSettings(org.eclipse.debug.tests.console.IOConsoleTests)  Time elapsed: 0.868 s
04:44:20 testCarriageReturnControlCharacter(org.eclipse.debug.tests.console.IOConsoleTests)  Time elapsed: 2.519 s
04:44:20 testIOPartitioner(org.eclipse.debug.tests.console.IOConsoleTests)  Time elapsed: 1.201 s
04:44:20 testMixedWriteAndInput(org.eclipse.debug.tests.console.IOConsoleTests)  Time elapsed: 4.412 s
04:44:20 testIConsoleDocumentPartitioner(org.eclipse.debug.tests.console.IOConsoleTests)  Time elapsed: 0.56 s
04:44:20 testConsoleClear(org.eclipse.debug.tests.console.IOConsoleTests)  Time elapsed: 2.17 s
04:44:20 testManyPartitions(org.eclipse.debug.tests.console.IOConsoleTests)  Time elapsed: 0.892 s
04:44:20 testWrites(org.eclipse.debug.tests.console.IOConsoleTests)  Time elapsed: 1.346 s
04:44:20 testInputFile(org.eclipse.debug.tests.console.IOConsoleFixedWidthTests)  Time elapsed: 0.301 s
04:44:20 testBackspaceControlCharacter(org.eclipse.debug.tests.console.IOConsoleFixedWidthTests)  Time elapsed: 6.88 s
04:44:20 testTrim(org.eclipse.debug.tests.console.IOConsoleFixedWidthTests)  Time elapsed: 0.625 s
04:44:20 testUserInput(org.eclipse.debug.tests.console.IOConsoleFixedWidthTests)  Time elapsed: 0.637 s
04:44:20 testControlCharacterSettings(org.eclipse.debug.tests.console.IOConsoleFixedWidthTests)  Time elapsed: 0.955 s
04:44:20 testCarriageReturnControlCharacter(org.eclipse.debug.tests.console.IOConsoleFixedWidthTests)  Time elapsed: 2.531 s
04:44:20 testIOPartitioner(org.eclipse.debug.tests.console.IOConsoleFixedWidthTests)  Time elapsed: 1.227 s
04:44:20 testMixedWriteAndInput(org.eclipse.debug.tests.console.IOConsoleFixedWidthTests)  Time elapsed: 4.715 s
04:44:20 testIConsoleDocumentPartitioner(org.eclipse.debug.tests.console.IOConsoleFixedWidthTests)  Time elapsed: 0.673 s
04:44:20 testConsoleClear(org.eclipse.debug.tests.console.IOConsoleFixedWidthTests)  Time elapsed: 2.16 s
04:44:20 testManyPartitions(org.eclipse.debug.tests.console.IOConsoleFixedWidthTests)  Time elapsed: 0.937 s
04:44:20 testWrites(org.eclipse.debug.tests.console.IOConsoleFixedWidthTests)  Time elapsed: 1.435 s
04:44:20 testProcessConsoleLifecycle(org.eclipse.debug.tests.console.ProcessConsoleManagerTests)  Time elapsed: 0.15 s
04:44:20 testBug546710_ConsoleCreationRaceCondition(org.eclipse.debug.tests.console.ProcessConsoleManagerTests)  Time elapsed: 0.128 s
04:44:20 testProcessTerminationNotificationWithInputFile(org.eclipse.debug.tests.console.ProcessConsoleTests)  Time elapsed: 0.217 s  <<< FAILURE!
04:44:20 junit.framework.AssertionFailedError: Test triggered errors. expected:<0> but was:<1>
04:44:20 	at org.eclipse.debug.tests.console.ProcessConsoleTests.tearDown(ProcessConsoleTests.java:88)
04:44:20 
04:44:20 testInputReadJobCancel(org.eclipse.debug.tests.console.ProcessConsoleTests)  Time elapsed: 0.02 s
04:44:20 testUTF8InputOdd(org.eclipse.debug.tests.console.ProcessConsoleTests)  Time elapsed: 0.122 s
04:44:20 testUTF8InputEven(org.eclipse.debug.tests.console.ProcessConsoleTests)  Time elapsed: 0.122 s
04:44:20 testProcessTerminationNotification(org.eclipse.debug.tests.console.ProcessConsoleTests)  Time elapsed: 0.217 s
04:44:20 testReceiveUTF8Odd(org.eclipse.debug.tests.console.StreamsProxyTests)  Time elapsed: 0.011 s
04:44:20 testReceiveUTF8Even(org.eclipse.debug.tests.console.StreamsProxyTests)  Time elapsed: 0.007 s
04:44:20 testStyleOverride(org.eclipse.debug.tests.console.TextConsoleViewerTest)  Time elapsed: 0.01 s
04:44:20 testTerminated(org.eclipse.debug.tests.launching.LaunchGroupTests)  Time elapsed: 2.101 s
04:44:20 testWaitForOutput(org.eclipse.debug.tests.launching.LaunchGroupTests)  Time elapsed: 7.064 s
04:44:20 testAdopt(org.eclipse.debug.tests.launching.LaunchGroupTests)  Time elapsed: 0.04 s
04:44:20 testDelay(org.eclipse.debug.tests.launching.LaunchGroupTests)  Time elapsed: 2.013 s
04:44:20 testNone(org.eclipse.debug.tests.launching.LaunchGroupTests)  Time elapsed: 0.012 s
04:44:20 testBuildBeforeLaunch(org.eclipse.debug.tests.launching.LaunchGroupTests)  Time elapsed: 0.012 s
04:44:20 testAdoptComplex(org.eclipse.debug.tests.launching.LaunchGroupTests)  Time elapsed: 0.015 s
04:44:20 testRename(org.eclipse.debug.tests.launching.LaunchGroupTests)  Time elapsed: 0.013 s
04:44:20 
04:44:20 Results:
04:44:20 
04:44:20 Failures: 
04:44:20   ProcessConsoleTests.tearDown:88 Test triggered errors. expected:<0> but was:<1>
04:44:20 
04:44:20 Tests run: 290, Failures: 1, Errors: 0, Skipped: 0
04:44:20 
04:44:21 [INFO] ------------------------------------------------------------------------
04:44:21 [INFO] Reactor Summary:
04:44:21 [INFO] 
04:44:21 [INFO] eclipse.platform.debug 4.14.0-SNAPSHOT ............. SUCCESS [ 27.753 s]
04:44:21 [INFO] org.eclipse.core.variables 3.4.700-SNAPSHOT ........ SUCCESS [ 55.925 s]
04:44:21 [INFO] org.eclipse.debug.core 3.14.100-SNAPSHOT ........... SUCCESS [ 55.340 s]
04:44:21 [INFO] org.eclipse.core.externaltools 1.1.500-SNAPSHOT .... SUCCESS [ 44.361 s]
04:44:21 [INFO] org.eclipse.debug.examples.core 1.4.600-SNAPSHOT ... SUCCESS [ 42.571 s]
04:44:21 [INFO] org.eclipse.ui.console 3.9.0-SNAPSHOT .............. SUCCESS [ 51.141 s]
04:44:21 [INFO] org.eclipse.debug.ui 3.14.300-SNAPSHOT ............. SUCCESS [01:39 min]
04:44:21 [INFO] org.eclipse.debug.examples.memory 1.102.200-SNAPSHOT SUCCESS [  6.576 s]
04:44:21 [INFO] org.eclipse.debug.examples.mixedmode 1.2.0-SNAPSHOT  SUCCESS [  8.454 s]
04:44:21 [INFO] org.eclipse.debug.examples.ui 1.6.300-SNAPSHOT ..... SUCCESS [ 56.421 s]
04:44:21 [INFO] org.eclipse.ui.externaltools 3.4.500-SNAPSHOT ...... SUCCESS [01:03 min]
04:44:21 [INFO] org.eclipse.debug.tests 3.11.500-SNAPSHOT .......... FAILURE [02:01 min]
04:44:21 [INFO] ------------------------------------------------------------------------
04:44:21 [INFO] BUILD FAILURE
04:44:21 [INFO] ------------------------------------------------------------------------
04:44:21 [INFO] Total time:  12:28 min
04:44:21 [INFO] Finished at: 2019-12-04T09:44:21Z
04:44:21 [INFO] ------------------------------------------------------------------------
04:44:21 [ERROR] Failed to execute goal org.eclipse.tycho:tycho-surefire-plugin:1.5.1:test (default-test) on project org.eclipse.debug.tests: There are test failures.
04:44:21 [ERROR] 
04:44:21 [ERROR] Please refer to /home/jenkins/agent/workspace/eclipse.platform.debug-Gerrit/org.eclipse.debug.tests/target/surefire-reports for the individual test results.
04:44:21 [ERROR] -> [Help 1]
04:44:21 [ERROR] 
04:44:21 [ERROR] To see the full stack trace of the errors, re-run Maven with the -e switch.
04:44:21 [ERROR] Re-run Maven using the -X switch to enable full debug logging.
04:44:21 [ERROR] 
04:44:21 [ERROR] For more information about the errors and possible solutions, please read the following articles:
04:44:21 [ERROR] [Help 1] http://cwiki.apache.org/confluence/display/MAVEN/MojoFailureException
04:44:21 [ERROR] 
04:44:21 [ERROR] After correcting the problems, you can resume the build with the command
04:44:21 [ERROR]   mvn <goals> -rf :org.eclipse.debug.tests
04:44:22 Build step 'Invoke top-level Maven targets' marked build as failure
04:44:22 Taking screenshot.
04:44:22 [eclipse.platform.debug-Gerrit] $ echo $XAUTHORITY
04:44:22 /home/jenkins/agent/workspace/eclipse.platform.debug-Gerrit/.Xauthority-9112440536070301800
04:44:22 [eclipse.platform.debug-Gerrit] $ ls -l $XAUTHORITY
04:44:22 -rw-r--r--. 1 default 1001080000 0 Dec  4 09:31 /home/jenkins/agent/workspace/eclipse.platform.debug-Gerrit/.Xauthority-9112440536070301800
04:44:22 [eclipse.platform.debug-Gerrit] $ import -window root -display :94 screenshot.jpg
04:44:22 Terminating xvnc.
04:46:26 [WARNINGS] Skipping publisher since build result is FAILURE
04:46:26 Recording test results
04:46:26 Archiving artifacts
04:46:27 Finished: FAILURE