FailedConsole Output

Skipping 2,705 KB.. Full Log
racketedNamespace2.pdtt](org.eclipse.php.core.tests.typeinference.TypeInferenceTests)  Time elapsed: 0.001 s
inference[workspace/typeinference/php53/testMethodReturnTypeFactoryMethod01.pdtt](org.eclipse.php.core.tests.typeinference.TypeInferenceTests)  Time elapsed: 0.001 s
inference[workspace/typeinference/php53/testNamespaceConstant1.pdtt](org.eclipse.php.core.tests.typeinference.TypeInferenceTests)  Time elapsed: 0.005 s
inference[workspace/typeinference/php53/testNamespaceConstant2.pdtt](org.eclipse.php.core.tests.typeinference.TypeInferenceTests)  Time elapsed: 0.032 s
inference[workspace/typeinference/php53/testNamespaceConstant3.pdtt](org.eclipse.php.core.tests.typeinference.TypeInferenceTests)  Time elapsed: 0.883 s
inference[workspace/typeinference/php54/testClassMember1.pdtt](org.eclipse.php.core.tests.typeinference.TypeInferenceTests)  Time elapsed: 0.008 s
inference[workspace/typeinference/php54/testClassMember2.pdtt](org.eclipse.php.core.tests.typeinference.TypeInferenceTests)  Time elapsed: 0.004 s
inference[workspace/typeinference/php55/testParentFieldAccess.pdtt](org.eclipse.php.core.tests.typeinference.TypeInferenceTests)  Time elapsed: 0.004 s
inference[workspace/typeinference/php55/testSelfClassInstanceCreation.pdtt](org.eclipse.php.core.tests.typeinference.TypeInferenceTests)  Time elapsed: 0.001 s
inference[workspace/typeinference/php55/testSelfFieldAccess.pdtt](org.eclipse.php.core.tests.typeinference.TypeInferenceTests)  Time elapsed: 0.003 s
inference[workspace/typeinference/php55/testSelfMethodReturnType.pdtt](org.eclipse.php.core.tests.typeinference.TypeInferenceTests)  Time elapsed: 0.004 s
inference[workspace/typeinference/php55/testSelfVarDeclaration.pdtt](org.eclipse.php.core.tests.typeinference.TypeInferenceTests)  Time elapsed: 0.003 s
inference[workspace/typeinference/php55/testYieldForeach.pdtt](org.eclipse.php.core.tests.typeinference.TypeInferenceTests)  Time elapsed: 0.026 s
inference[workspace/typeinference/php55/testYieldReturnType.pdtt](org.eclipse.php.core.tests.typeinference.TypeInferenceTests)  Time elapsed: 0.004 s
inference[workspace/typeinference/php5/testArrayAccess.pdtt](org.eclipse.php.core.tests.typeinference.TypeInferenceTests)  Time elapsed: 0.011 s
inference[workspace/typeinference/php5/testArrayCreationMultiTypes.pdtt](org.eclipse.php.core.tests.typeinference.TypeInferenceTests)  Time elapsed: 0.014 s
inference[workspace/typeinference/php5/testArrayCreationSingleType.pdtt](org.eclipse.php.core.tests.typeinference.TypeInferenceTests)  Time elapsed: 0.001 s
inference[workspace/typeinference/php5/testArrayTypeInference1.pdtt](org.eclipse.php.core.tests.typeinference.TypeInferenceTests)  Time elapsed: 0.003 s
inference[workspace/typeinference/php5/testArrayTypeInference2.pdtt](org.eclipse.php.core.tests.typeinference.TypeInferenceTests)  Time elapsed: 0.001 s
inference[workspace/typeinference/php5/testArrayTypeInference3.pdtt](org.eclipse.php.core.tests.typeinference.TypeInferenceTests)  Time elapsed: 0.001 s
inference[workspace/typeinference/php5/testArrayTypeInference4.pdtt](org.eclipse.php.core.tests.typeinference.TypeInferenceTests)  Time elapsed: 0.002 s
inference[workspace/typeinference/php5/testAssignmentScalar.pdtt](org.eclipse.php.core.tests.typeinference.TypeInferenceTests)  Time elapsed: 0.001 s
inference[workspace/typeinference/php5/testAssignmentScalarNested.pdtt](org.eclipse.php.core.tests.typeinference.TypeInferenceTests)  Time elapsed: 0.001 s
inference[workspace/typeinference/php5/testBacktickExpression.pdtt](org.eclipse.php.core.tests.typeinference.TypeInferenceTests)  Time elapsed: 0.001 s
inference[workspace/typeinference/php5/testBuiltinMethodReturnType.pdtt](org.eclipse.php.core.tests.typeinference.TypeInferenceTests)  Time elapsed: 0.017 s
inference[workspace/typeinference/php5/testCastObjectFromClass.pdtt](org.eclipse.php.core.tests.typeinference.TypeInferenceTests)  Time elapsed: 0.002 s
inference[workspace/typeinference/php5/testCastObjectFromScalar.pdtt](org.eclipse.php.core.tests.typeinference.TypeInferenceTests)  Time elapsed: 0.001 s
inference[workspace/typeinference/php5/testCastString.pdtt](org.eclipse.php.core.tests.typeinference.TypeInferenceTests)  Time elapsed: 0 s
inference[workspace/typeinference/php5/testCatchException.pdtt](org.eclipse.php.core.tests.typeinference.TypeInferenceTests)  Time elapsed: 0.001 s
inference[workspace/typeinference/php5/testClassConstant.pdtt](org.eclipse.php.core.tests.typeinference.TypeInferenceTests)  Time elapsed: 0.007 s
inference[workspace/typeinference/php5/testClassInstanceCreation.pdtt](org.eclipse.php.core.tests.typeinference.TypeInferenceTests)  Time elapsed: 0.001 s
inference[workspace/typeinference/php5/testClassVar.pdtt](org.eclipse.php.core.tests.typeinference.TypeInferenceTests)  Time elapsed: 0.003 s
inference[workspace/typeinference/php5/testClassVarConstructor.pdtt](org.eclipse.php.core.tests.typeinference.TypeInferenceTests)  Time elapsed: 0.024 s
inference[workspace/typeinference/php5/testClassVarMethodDecl.pdtt](org.eclipse.php.core.tests.typeinference.TypeInferenceTests)  Time elapsed: 0.003 s
inference[workspace/typeinference/php5/testClassVarNoPHPDoc.pdtt](org.eclipse.php.core.tests.typeinference.TypeInferenceTests)  Time elapsed: 0.003 s
inference[workspace/typeinference/php5/testClassVarPHPDoc.pdtt](org.eclipse.php.core.tests.typeinference.TypeInferenceTests)  Time elapsed: 0.002 s
inference[workspace/typeinference/php5/testClassVarPHPDoc2.pdtt](org.eclipse.php.core.tests.typeinference.TypeInferenceTests)  Time elapsed: 0.002 s
inference[workspace/typeinference/php5/testCloneObject.pdtt](org.eclipse.php.core.tests.typeinference.TypeInferenceTests)  Time elapsed: 0.002 s
inference[workspace/typeinference/php5/testCombineWithGlobal.pdtt](org.eclipse.php.core.tests.typeinference.TypeInferenceTests)  Time elapsed: 0.023 s
inference[workspace/typeinference/php5/testCombinesObject.pdtt](org.eclipse.php.core.tests.typeinference.TypeInferenceTests)  Time elapsed: 0.002 s
inference[workspace/typeinference/php5/testConditionalExpression.pdtt](org.eclipse.php.core.tests.typeinference.TypeInferenceTests)  Time elapsed: 0 s
inference[workspace/typeinference/php5/testConstant.pdtt](org.eclipse.php.core.tests.typeinference.TypeInferenceTests)  Time elapsed: 0.001 s
inference[workspace/typeinference/php5/testForeachStatement.pdtt](org.eclipse.php.core.tests.typeinference.TypeInferenceTests)  Time elapsed: 0.003 s
inference[workspace/typeinference/php5/testFunctionReturnType.pdtt](org.eclipse.php.core.tests.typeinference.TypeInferenceTests)  Time elapsed: 0.003 s
inference[workspace/typeinference/php5/testFunctionReturnTypeAmbiguous.pdtt](org.eclipse.php.core.tests.typeinference.TypeInferenceTests)  Time elapsed: 0.003 s
inference[workspace/typeinference/php5/testFunctionReturnTypeNoPHPDoc.pdtt](org.eclipse.php.core.tests.typeinference.TypeInferenceTests)  Time elapsed: 0.003 s
inference[workspace/typeinference/php5/testFunctionReturnTypePHPDoc.pdtt](org.eclipse.php.core.tests.typeinference.TypeInferenceTests)  Time elapsed: 0.003 s
inference[workspace/typeinference/php5/testFunctionReturnTypePHPDoc1.pdtt](org.eclipse.php.core.tests.typeinference.TypeInferenceTests)  Time elapsed: 0.004 s
inference[workspace/typeinference/php5/testFunctionReturnTypePHPDoc2.pdtt](org.eclipse.php.core.tests.typeinference.TypeInferenceTests)  Time elapsed: 0.004 s
inference[workspace/typeinference/php5/testFunctionReturnTypePHPDoc3.pdtt](org.eclipse.php.core.tests.typeinference.TypeInferenceTests)  Time elapsed: 0.003 s
inference[workspace/typeinference/php5/testFunctionReturnTypeRecursive.pdtt](org.eclipse.php.core.tests.typeinference.TypeInferenceTests)  Time elapsed: 0.003 s
inference[workspace/typeinference/php5/testGlobalDeclaredInsideFunction.pdtt](org.eclipse.php.core.tests.typeinference.TypeInferenceTests)  Time elapsed: 0.004 s
inference[workspace/typeinference/php5/testInfixOperatorPlus.pdtt](org.eclipse.php.core.tests.typeinference.TypeInferenceTests)  Time elapsed: 0.001 s
inference[workspace/typeinference/php5/testInheritdoc01.pdtt](org.eclipse.php.core.tests.typeinference.TypeInferenceTests)  Time elapsed: 0.003 s
inference[workspace/typeinference/php5/testInstanceOfCondition1.pdtt](org.eclipse.php.core.tests.typeinference.TypeInferenceTests)  Time elapsed: 0.002 s
inference[workspace/typeinference/php5/testInstanceOfCondition2.pdtt](org.eclipse.php.core.tests.typeinference.TypeInferenceTests)  Time elapsed: 0.001 s
inference[workspace/typeinference/php5/testInstanceOfCondition3.pdtt](org.eclipse.php.core.tests.typeinference.TypeInferenceTests)  Time elapsed: 0.001 s
inference[workspace/typeinference/php5/testIteratorTypeInference1.pdtt](org.eclipse.php.core.tests.typeinference.TypeInferenceTests)  Time elapsed: 0.039 s
inference[workspace/typeinference/php5/testIteratorTypeInference2.pdtt](org.eclipse.php.core.tests.typeinference.TypeInferenceTests)  Time elapsed: 0.028 s
inference[workspace/typeinference/php5/testIteratorTypeInference3.pdtt](org.eclipse.php.core.tests.typeinference.TypeInferenceTests)  Time elapsed: 0.004 s
inference[workspace/typeinference/php5/testMethodReturnType.pdtt](org.eclipse.php.core.tests.typeinference.TypeInferenceTests)  Time elapsed: 0.003 s
inference[workspace/typeinference/php5/testMethodReturnType1.pdtt](org.eclipse.php.core.tests.typeinference.TypeInferenceTests)  Time elapsed: 0.005 s
inference[workspace/typeinference/php5/testMethodReturnTypePHPDoc.pdtt](org.eclipse.php.core.tests.typeinference.TypeInferenceTests)  Time elapsed: 0.007 s
inference[workspace/typeinference/php5/testMethodReturnTypePHPDoc1.pdtt](org.eclipse.php.core.tests.typeinference.TypeInferenceTests)  Time elapsed: 0.003 s
inference[workspace/typeinference/php5/testMethodReturnTypePHPDocForSelf.pdtt](org.eclipse.php.core.tests.typeinference.TypeInferenceTests)  Time elapsed: 0.005 s
inference[workspace/typeinference/php5/testObject.pdtt](org.eclipse.php.core.tests.typeinference.TypeInferenceTests)  Time elapsed: 0.002 s
inference[workspace/typeinference/php5/testOverriddenMethodReturnType.pdtt](org.eclipse.php.core.tests.typeinference.TypeInferenceTests)  Time elapsed: 0.004 s
inference[workspace/typeinference/php5/testOverridenMethodReturnTypePHPDoc.pdtt](org.eclipse.php.core.tests.typeinference.TypeInferenceTests)  Time elapsed: 0.003 s
inference[workspace/typeinference/php5/testOverridesGlobal.pdtt](org.eclipse.php.core.tests.typeinference.TypeInferenceTests)  Time elapsed: 0.001 s
inference[workspace/typeinference/php5/testOverridesGlobalInner.pdtt](org.eclipse.php.core.tests.typeinference.TypeInferenceTests)  Time elapsed: 0.001 s
inference[workspace/typeinference/php5/testOverridesObject.pdtt](org.eclipse.php.core.tests.typeinference.TypeInferenceTests)  Time elapsed: 0.001 s
inference[workspace/typeinference/php5/testPHPDocArgumentReference.pdtt](org.eclipse.php.core.tests.typeinference.TypeInferenceTests)  Time elapsed: 0.001 s
inference[workspace/typeinference/php5/testPHPDocArgumentReference1.pdtt](org.eclipse.php.core.tests.typeinference.TypeInferenceTests)  Time elapsed: 0.003 s
inference[workspace/typeinference/php5/testPHPDocVarComment.pdtt](org.eclipse.php.core.tests.typeinference.TypeInferenceTests)  Time elapsed: 0.001 s
inference[workspace/typeinference/php5/testParentClassVarDecl.pdtt](org.eclipse.php.core.tests.typeinference.TypeInferenceTests)  Time elapsed: 0.003 s
inference[workspace/typeinference/php5/testParentFieldAccess.pdtt](org.eclipse.php.core.tests.typeinference.TypeInferenceTests)  Time elapsed: 0.004 s
inference[workspace/typeinference/php5/testParentMethodReturnType.pdtt](org.eclipse.php.core.tests.typeinference.TypeInferenceTests)  Time elapsed: 0.037 s
inference[workspace/typeinference/php5/testPostfixOperatorPlusPlus.pdtt](org.eclipse.php.core.tests.typeinference.TypeInferenceTests)  Time elapsed: 0.002 s
inference[workspace/typeinference/php5/testPrefixOperatorPlusPlus.pdtt](org.eclipse.php.core.tests.typeinference.TypeInferenceTests)  Time elapsed: 0.001 s
inference[workspace/typeinference/php5/testScalarNumber.pdtt](org.eclipse.php.core.tests.typeinference.TypeInferenceTests)  Time elapsed: 0.002 s
inference[workspace/typeinference/php5/testSelfClassInstanceCreation.pdtt](org.eclipse.php.core.tests.typeinference.TypeInferenceTests)  Time elapsed: 0.002 s
inference[workspace/typeinference/php5/testSelfFieldAccess.pdtt](org.eclipse.php.core.tests.typeinference.TypeInferenceTests)  Time elapsed: 0.003 s
inference[workspace/typeinference/php5/testSelfMethodReturnType.pdtt](org.eclipse.php.core.tests.typeinference.TypeInferenceTests)  Time elapsed: 0.032 s
inference[workspace/typeinference/php5/testSelfVarDeclaration.pdtt](org.eclipse.php.core.tests.typeinference.TypeInferenceTests)  Time elapsed: 0.004 s
inference[workspace/typeinference/php5/testStaticMethodReturnType.pdtt](org.eclipse.php.core.tests.typeinference.TypeInferenceTests)  Time elapsed: 0.006 s
inference[workspace/typeinference/php5/testThis.pdtt](org.eclipse.php.core.tests.typeinference.TypeInferenceTests)  Time elapsed: 0.001 s
inference[workspace/typeinference/php5/testTypedArgumentReference.pdtt](org.eclipse.php.core.tests.typeinference.TypeInferenceTests)  Time elapsed: 0.002 s
inference[workspace/typeinference/php5/testUnaryOperationMinus.pdtt](org.eclipse.php.core.tests.typeinference.TypeInferenceTests)  Time elapsed: 0.001 s
inference[workspace/typeinference/php5/testUnaryOperationNot.pdtt](org.eclipse.php.core.tests.typeinference.TypeInferenceTests)  Time elapsed: 0.002 s
inference[workspace/typeinference/php5/testUnaryOperationTilda.pdtt](org.eclipse.php.core.tests.typeinference.TypeInferenceTests)  Time elapsed: 0.001 s
inference[workspace/typeinference/php53/testBracketedNamespace1.pdtt](org.eclipse.php.core.tests.typeinference.TypeInferenceTests)  Time elapsed: 0.002 s
inference[workspace/typeinference/php53/testBracketedNamespace2.pdtt](org.eclipse.php.core.tests.typeinference.TypeInferenceTests)  Time elapsed: 0.001 s
inference[workspace/typeinference/php53/testMethodReturnTypeFactoryMethod01.pdtt](org.eclipse.php.core.tests.typeinference.TypeInferenceTests)  Time elapsed: 0.002 s
inference[workspace/typeinference/php53/testNamespaceConstant1.pdtt](org.eclipse.php.core.tests.typeinference.TypeInferenceTests)  Time elapsed: 0.004 s
inference[workspace/typeinference/php53/testNamespaceConstant2.pdtt](org.eclipse.php.core.tests.typeinference.TypeInferenceTests)  Time elapsed: 0.031 s
inference[workspace/typeinference/php53/testNamespaceConstant3.pdtt](org.eclipse.php.core.tests.typeinference.TypeInferenceTests)  Time elapsed: 0.341 s
inference[workspace/typeinference/php54/testClassMember1.pdtt](org.eclipse.php.core.tests.typeinference.TypeInferenceTests)  Time elapsed: 0.004 s
inference[workspace/typeinference/php54/testClassMember2.pdtt](org.eclipse.php.core.tests.typeinference.TypeInferenceTests)  Time elapsed: 0.003 s
inference[workspace/typeinference/php55/testParentFieldAccess.pdtt](org.eclipse.php.core.tests.typeinference.TypeInferenceTests)  Time elapsed: 0.003 s
inference[workspace/typeinference/php55/testSelfClassInstanceCreation.pdtt](org.eclipse.php.core.tests.typeinference.TypeInferenceTests)  Time elapsed: 0.001 s
inference[workspace/typeinference/php55/testSelfFieldAccess.pdtt](org.eclipse.php.core.tests.typeinference.TypeInferenceTests)  Time elapsed: 0.003 s
inference[workspace/typeinference/php55/testSelfMethodReturnType.pdtt](org.eclipse.php.core.tests.typeinference.TypeInferenceTests)  Time elapsed: 0.002 s
inference[workspace/typeinference/php55/testSelfVarDeclaration.pdtt](org.eclipse.php.core.tests.typeinference.TypeInferenceTests)  Time elapsed: 0.003 s
inference[workspace/typeinference/php55/testYieldForeach.pdtt](org.eclipse.php.core.tests.typeinference.TypeInferenceTests)  Time elapsed: 0.005 s
inference[workspace/typeinference/php55/testYieldReturnType.pdtt](org.eclipse.php.core.tests.typeinference.TypeInferenceTests)  Time elapsed: 0.003 s
inference[workspace/typeinference/php5/testArrayAccess.pdtt](org.eclipse.php.core.tests.typeinference.TypeInferenceTests)  Time elapsed: 0.054 s
inference[workspace/typeinference/php5/testArrayCreationMultiTypes.pdtt](org.eclipse.php.core.tests.typeinference.TypeInferenceTests)  Time elapsed: 0.002 s
inference[workspace/typeinference/php5/testArrayCreationSingleType.pdtt](org.eclipse.php.core.tests.typeinference.TypeInferenceTests)  Time elapsed: 0.001 s
inference[workspace/typeinference/php5/testArrayTypeInference1.pdtt](org.eclipse.php.core.tests.typeinference.TypeInferenceTests)  Time elapsed: 0.003 s
inference[workspace/typeinference/php5/testArrayTypeInference2.pdtt](org.eclipse.php.core.tests.typeinference.TypeInferenceTests)  Time elapsed: 0.001 s
inference[workspace/typeinference/php5/testArrayTypeInference3.pdtt](org.eclipse.php.core.tests.typeinference.TypeInferenceTests)  Time elapsed: 0.001 s
inference[workspace/typeinference/php5/testArrayTypeInference4.pdtt](org.eclipse.php.core.tests.typeinference.TypeInferenceTests)  Time elapsed: 0.001 s
inference[workspace/typeinference/php5/testAssignmentScalar.pdtt](org.eclipse.php.core.tests.typeinference.TypeInferenceTests)  Time elapsed: 0.001 s
inference[workspace/typeinference/php5/testAssignmentScalarNested.pdtt](org.eclipse.php.core.tests.typeinference.TypeInferenceTests)  Time elapsed: 0 s
inference[workspace/typeinference/php5/testBacktickExpression.pdtt](org.eclipse.php.core.tests.typeinference.TypeInferenceTests)  Time elapsed: 0.001 s
inference[workspace/typeinference/php5/testBuiltinMethodReturnType.pdtt](org.eclipse.php.core.tests.typeinference.TypeInferenceTests)  Time elapsed: 0.004 s
inference[workspace/typeinference/php5/testCastObjectFromClass.pdtt](org.eclipse.php.core.tests.typeinference.TypeInferenceTests)  Time elapsed: 0.001 s
inference[workspace/typeinference/php5/testCastObjectFromScalar.pdtt](org.eclipse.php.core.tests.typeinference.TypeInferenceTests)  Time elapsed: 0 s
inference[workspace/typeinference/php5/testCastString.pdtt](org.eclipse.php.core.tests.typeinference.TypeInferenceTests)  Time elapsed: 0.001 s
inference[workspace/typeinference/php5/testCatchException.pdtt](org.eclipse.php.core.tests.typeinference.TypeInferenceTests)  Time elapsed: 0.001 s
inference[workspace/typeinference/php5/testClassConstant.pdtt](org.eclipse.php.core.tests.typeinference.TypeInferenceTests)  Time elapsed: 0.003 s
inference[workspace/typeinference/php5/testClassInstanceCreation.pdtt](org.eclipse.php.core.tests.typeinference.TypeInferenceTests)  Time elapsed: 0.001 s
inference[workspace/typeinference/php5/testClassVar.pdtt](org.eclipse.php.core.tests.typeinference.TypeInferenceTests)  Time elapsed: 0.004 s
inference[workspace/typeinference/php5/testClassVarConstructor.pdtt](org.eclipse.php.core.tests.typeinference.TypeInferenceTests)  Time elapsed: 0.022 s
inference[workspace/typeinference/php5/testClassVarMethodDecl.pdtt](org.eclipse.php.core.tests.typeinference.TypeInferenceTests)  Time elapsed: 0.003 s
inference[workspace/typeinference/php5/testClassVarNoPHPDoc.pdtt](org.eclipse.php.core.tests.typeinference.TypeInferenceTests)  Time elapsed: 0.002 s
inference[workspace/typeinference/php5/testClassVarPHPDoc.pdtt](org.eclipse.php.core.tests.typeinference.TypeInferenceTests)  Time elapsed: 0.003 s
inference[workspace/typeinference/php5/testClassVarPHPDoc2.pdtt](org.eclipse.php.core.tests.typeinference.TypeInferenceTests)  Time elapsed: 0.004 s
inference[workspace/typeinference/php5/testCloneObject.pdtt](org.eclipse.php.core.tests.typeinference.TypeInferenceTests)  Time elapsed: 0.001 s
inference[workspace/typeinference/php5/testCombineWithGlobal.pdtt](org.eclipse.php.core.tests.typeinference.TypeInferenceTests)  Time elapsed: 0.007 s
inference[workspace/typeinference/php5/testCombinesObject.pdtt](org.eclipse.php.core.tests.typeinference.TypeInferenceTests)  Time elapsed: 0.001 s
inference[workspace/typeinference/php5/testConditionalExpression.pdtt](org.eclipse.php.core.tests.typeinference.TypeInferenceTests)  Time elapsed: 0.001 s
inference[workspace/typeinference/php5/testConstant.pdtt](org.eclipse.php.core.tests.typeinference.TypeInferenceTests)  Time elapsed: 0.001 s
inference[workspace/typeinference/php5/testForeachStatement.pdtt](org.eclipse.php.core.tests.typeinference.TypeInferenceTests)  Time elapsed: 0.003 s
inference[workspace/typeinference/php5/testFunctionReturnType.pdtt](org.eclipse.php.core.tests.typeinference.TypeInferenceTests)  Time elapsed: 0.003 s
inference[workspace/typeinference/php5/testFunctionReturnTypeAmbiguous.pdtt](org.eclipse.php.core.tests.typeinference.TypeInferenceTests)  Time elapsed: 0.003 s
inference[workspace/typeinference/php5/testFunctionReturnTypeNoPHPDoc.pdtt](org.eclipse.php.core.tests.typeinference.TypeInferenceTests)  Time elapsed: 0.003 s
inference[workspace/typeinference/php5/testFunctionReturnTypePHPDoc.pdtt](org.eclipse.php.core.tests.typeinference.TypeInferenceTests)  Time elapsed: 0.002 s
inference[workspace/typeinference/php5/testFunctionReturnTypePHPDoc1.pdtt](org.eclipse.php.core.tests.typeinference.TypeInferenceTests)  Time elapsed: 0.003 s
inference[workspace/typeinference/php5/testFunctionReturnTypePHPDoc2.pdtt](org.eclipse.php.core.tests.typeinference.TypeInferenceTests)  Time elapsed: 0.002 s
inference[workspace/typeinference/php5/testFunctionReturnTypePHPDoc3.pdtt](org.eclipse.php.core.tests.typeinference.TypeInferenceTests)  Time elapsed: 0.003 s
inference[workspace/typeinference/php5/testFunctionReturnTypeRecursive.pdtt](org.eclipse.php.core.tests.typeinference.TypeInferenceTests)  Time elapsed: 0.003 s
inference[workspace/typeinference/php5/testGlobalDeclaredInsideFunction.pdtt](org.eclipse.php.core.tests.typeinference.TypeInferenceTests)  Time elapsed: 0.02 s
inference[workspace/typeinference/php5/testInfixOperatorPlus.pdtt](org.eclipse.php.core.tests.typeinference.TypeInferenceTests)  Time elapsed: 0.001 s
inference[workspace/typeinference/php5/testInheritdoc01.pdtt](org.eclipse.php.core.tests.typeinference.TypeInferenceTests)  Time elapsed: 0.004 s
inference[workspace/typeinference/php5/testInstanceOfCondition1.pdtt](org.eclipse.php.core.tests.typeinference.TypeInferenceTests)  Time elapsed: 0.001 s
inference[workspace/typeinference/php5/testInstanceOfCondition2.pdtt](org.eclipse.php.core.tests.typeinference.TypeInferenceTests)  Time elapsed: 0.001 s
inference[workspace/typeinference/php5/testInstanceOfCondition3.pdtt](org.eclipse.php.core.tests.typeinference.TypeInferenceTests)  Time elapsed: 0.002 s
inference[workspace/typeinference/php5/testIteratorTypeInference1.pdtt](org.eclipse.php.core.tests.typeinference.TypeInferenceTests)  Time elapsed: 0.004 s
inference[workspace/typeinference/php5/testIteratorTypeInference2.pdtt](org.eclipse.php.core.tests.typeinference.TypeInferenceTests)  Time elapsed: 0.004 s
inference[workspace/typeinference/php5/testIteratorTypeInference3.pdtt](org.eclipse.php.core.tests.typeinference.TypeInferenceTests)  Time elapsed: 0.005 s
inference[workspace/typeinference/php5/testMethodReturnType.pdtt](org.eclipse.php.core.tests.typeinference.TypeInferenceTests)  Time elapsed: 0.003 s
inference[workspace/typeinference/php5/testMethodReturnType1.pdtt](org.eclipse.php.core.tests.typeinference.TypeInferenceTests)  Time elapsed: 0.004 s
inference[workspace/typeinference/php5/testMethodReturnTypePHPDoc.pdtt](org.eclipse.php.core.tests.typeinference.TypeInferenceTests)  Time elapsed: 0.003 s
inference[workspace/typeinference/php5/testMethodReturnTypePHPDoc1.pdtt](org.eclipse.php.core.tests.typeinference.TypeInferenceTests)  Time elapsed: 0.006 s
inference[workspace/typeinference/php5/testMethodReturnTypePHPDocForSelf.pdtt](org.eclipse.php.core.tests.typeinference.TypeInferenceTests)  Time elapsed: 0.004 s
inference[workspace/typeinference/php5/testObject.pdtt](org.eclipse.php.core.tests.typeinference.TypeInferenceTests)  Time elapsed: 0.001 s
inference[workspace/typeinference/php5/testOverriddenMethodReturnType.pdtt](org.eclipse.php.core.tests.typeinference.TypeInferenceTests)  Time elapsed: 0.003 s
inference[workspace/typeinference/php5/testOverridenMethodReturnTypePHPDoc.pdtt](org.eclipse.php.core.tests.typeinference.TypeInferenceTests)  Time elapsed: 0.004 s
inference[workspace/typeinference/php5/testOverridesGlobal.pdtt](org.eclipse.php.core.tests.typeinference.TypeInferenceTests)  Time elapsed: 0.002 s
inference[workspace/typeinference/php5/testOverridesGlobalInner.pdtt](org.eclipse.php.core.tests.typeinference.TypeInferenceTests)  Time elapsed: 0.001 s
inference[workspace/typeinference/php5/testOverridesObject.pdtt](org.eclipse.php.core.tests.typeinference.TypeInferenceTests)  Time elapsed: 0.001 s
inference[workspace/typeinference/php5/testPHPDocArgumentReference.pdtt](org.eclipse.php.core.tests.typeinference.TypeInferenceTests)  Time elapsed: 0.001 s
inference[workspace/typeinference/php5/testPHPDocArgumentReference1.pdtt](org.eclipse.php.core.tests.typeinference.TypeInferenceTests)  Time elapsed: 0.004 s
inference[workspace/typeinference/php5/testPHPDocVarComment.pdtt](org.eclipse.php.core.tests.typeinference.TypeInferenceTests)  Time elapsed: 0.001 s
inference[workspace/typeinference/php5/testParentClassVarDecl.pdtt](org.eclipse.php.core.tests.typeinference.TypeInferenceTests)  Time elapsed: 0.003 s
inference[workspace/typeinference/php5/testParentFieldAccess.pdtt](org.eclipse.php.core.tests.typeinference.TypeInferenceTests)  Time elapsed: 0.003 s
inference[workspace/typeinference/php5/testParentMethodReturnType.pdtt](org.eclipse.php.core.tests.typeinference.TypeInferenceTests)  Time elapsed: 0.033 s
inference[workspace/typeinference/php5/testPostfixOperatorPlusPlus.pdtt](org.eclipse.php.core.tests.typeinference.TypeInferenceTests)  Time elapsed: 0.002 s
inference[workspace/typeinference/php5/testPrefixOperatorPlusPlus.pdtt](org.eclipse.php.core.tests.typeinference.TypeInferenceTests)  Time elapsed: 0.001 s
inference[workspace/typeinference/php5/testScalarNumber.pdtt](org.eclipse.php.core.tests.typeinference.TypeInferenceTests)  Time elapsed: 0.001 s
inference[workspace/typeinference/php5/testSelfClassInstanceCreation.pdtt](org.eclipse.php.core.tests.typeinference.TypeInferenceTests)  Time elapsed: 0.001 s
inference[workspace/typeinference/php5/testSelfFieldAccess.pdtt](org.eclipse.php.core.tests.typeinference.TypeInferenceTests)  Time elapsed: 0.003 s
inference[workspace/typeinference/php5/testSelfMethodReturnType.pdtt](org.eclipse.php.core.tests.typeinference.TypeInferenceTests)  Time elapsed: 0.031 s
inference[workspace/typeinference/php5/testSelfVarDeclaration.pdtt](org.eclipse.php.core.tests.typeinference.TypeInferenceTests)  Time elapsed: 0.003 s
inference[workspace/typeinference/php5/testStaticMethodReturnType.pdtt](org.eclipse.php.core.tests.typeinference.TypeInferenceTests)  Time elapsed: 0.003 s
inference[workspace/typeinference/php5/testThis.pdtt](org.eclipse.php.core.tests.typeinference.TypeInferenceTests)  Time elapsed: 0.001 s
inference[workspace/typeinference/php5/testTypedArgumentReference.pdtt](org.eclipse.php.core.tests.typeinference.TypeInferenceTests)  Time elapsed: 0.002 s
inference[workspace/typeinference/php5/testUnaryOperationMinus.pdtt](org.eclipse.php.core.tests.typeinference.TypeInferenceTests)  Time elapsed: 0.001 s
inference[workspace/typeinference/php5/testUnaryOperationNot.pdtt](org.eclipse.php.core.tests.typeinference.TypeInferenceTests)  Time elapsed: 0.001 s
inference[workspace/typeinference/php5/testUnaryOperationTilda.pdtt](org.eclipse.php.core.tests.typeinference.TypeInferenceTests)  Time elapsed: 0.001 s
inference[workspace/typeinference/php53/testBracketedNamespace1.pdtt](org.eclipse.php.core.tests.typeinference.TypeInferenceTests)  Time elapsed: 0.003 s
inference[workspace/typeinference/php53/testBracketedNamespace2.pdtt](org.eclipse.php.core.tests.typeinference.TypeInferenceTests)  Time elapsed: 0.001 s
inference[workspace/typeinference/php53/testMethodReturnTypeFactoryMethod01.pdtt](org.eclipse.php.core.tests.typeinference.TypeInferenceTests)  Time elapsed: 0.001 s
inference[workspace/typeinference/php53/testNamespaceConstant1.pdtt](org.eclipse.php.core.tests.typeinference.TypeInferenceTests)  Time elapsed: 0.008 s
inference[workspace/typeinference/php53/testNamespaceConstant2.pdtt](org.eclipse.php.core.tests.typeinference.TypeInferenceTests)  Time elapsed: 0.037 s
inference[workspace/typeinference/php53/testNamespaceConstant3.pdtt](org.eclipse.php.core.tests.typeinference.TypeInferenceTests)  Time elapsed: 0.955 s
inference[workspace/typeinference/php54/testClassMember1.pdtt](org.eclipse.php.core.tests.typeinference.TypeInferenceTests)  Time elapsed: 2.519 s
inference[workspace/typeinference/php54/testClassMember2.pdtt](org.eclipse.php.core.tests.typeinference.TypeInferenceTests)  Time elapsed: 0.005 s
inference[workspace/typeinference/php55/testParentFieldAccess.pdtt](org.eclipse.php.core.tests.typeinference.TypeInferenceTests)  Time elapsed: 0.004 s
inference[workspace/typeinference/php55/testSelfClassInstanceCreation.pdtt](org.eclipse.php.core.tests.typeinference.TypeInferenceTests)  Time elapsed: 0.002 s
inference[workspace/typeinference/php55/testSelfFieldAccess.pdtt](org.eclipse.php.core.tests.typeinference.TypeInferenceTests)  Time elapsed: 0.004 s
inference[workspace/typeinference/php55/testSelfMethodReturnType.pdtt](org.eclipse.php.core.tests.typeinference.TypeInferenceTests)  Time elapsed: 0.004 s
inference[workspace/typeinference/php55/testSelfVarDeclaration.pdtt](org.eclipse.php.core.tests.typeinference.TypeInferenceTests)  Time elapsed: 0.003 s
inference[workspace/typeinference/php55/testYieldForeach.pdtt](org.eclipse.php.core.tests.typeinference.TypeInferenceTests)  Time elapsed: 0.006 s
inference[workspace/typeinference/php55/testYieldReturnType.pdtt](org.eclipse.php.core.tests.typeinference.TypeInferenceTests)  Time elapsed: 0.003 s
testCachedReferencedFiles(org.eclipse.php.core.tests.filenetwork.FileNetworkTests)  Time elapsed: 0.173 s
testSearchMethodBadNetwork(org.eclipse.php.core.tests.filenetwork.FileNetworkTests)  Time elapsed: 0.003 s
testSearchMethod(org.eclipse.php.core.tests.filenetwork.FileNetworkTests)  Time elapsed: 0.001 s
testReferencingFiles(org.eclipse.php.core.tests.filenetwork.FileNetworkTests)  Time elapsed: 0.001 s
testReferencedFiles(org.eclipse.php.core.tests.filenetwork.FileNetworkTests)  Time elapsed: 0.001 s
parser[workspace/phpdoc_parser/test491991.pdtt](org.eclipse.php.core.tests.compiler_ast.phpdoc.PHPDocParserTests)  Time elapsed: 0.001 s
parser[workspace/phpdoc_parser/testInheritDocTag.pdtt](org.eclipse.php.core.tests.compiler_ast.phpdoc.PHPDocParserTests)  Time elapsed: 0 s
parser[workspace/phpdoc_parser/testParamTag.pdtt](org.eclipse.php.core.tests.compiler_ast.phpdoc.PHPDocParserTests)  Time elapsed: 0.001 s
parser[workspace/phpdoc_parser/testReturnMultipleTag.pdtt](org.eclipse.php.core.tests.compiler_ast.phpdoc.PHPDocParserTests)  Time elapsed: 0 s
parser[workspace/phpdoc_parser/testReturnTag.pdtt](org.eclipse.php.core.tests.compiler_ast.phpdoc.PHPDocParserTests)  Time elapsed: 0 s
parser[workspace/phpdoc_parser/testThrowsTag.pdtt](org.eclipse.php.core.tests.compiler_ast.phpdoc.PHPDocParserTests)  Time elapsed: 0 s
parser[workspace/phpdoc_parser/testUnsupportedTag1.pdtt](org.eclipse.php.core.tests.compiler_ast.phpdoc.PHPDocParserTests)  Time elapsed: 0.001 s
parser[workspace/phpdoc_parser/testUnsupportedTag2.pdtt](org.eclipse.php.core.tests.compiler_ast.phpdoc.PHPDocParserTests)  Time elapsed: 0 s
parser[workspace/phpdoc_parser/testUnsupportedTag3.pdtt](org.eclipse.php.core.tests.compiler_ast.phpdoc.PHPDocParserTests)  Time elapsed: 0.001 s
parser[workspace/phpdoc_parser/testUnsupportedTag4.pdtt](org.eclipse.php.core.tests.compiler_ast.phpdoc.PHPDocParserTests)  Time elapsed: 0 s
parser[workspace/phpdoc_parser/testUnsupportedTag5.pdtt](org.eclipse.php.core.tests.compiler_ast.phpdoc.PHPDocParserTests)  Time elapsed: 0.002 s
parser[workspace/phpdoc_parser/testVarTag.pdtt](org.eclipse.php.core.tests.compiler_ast.phpdoc.PHPDocParserTests)  Time elapsed: 0 s
testVarWithModifiers10(org.eclipse.php.core.tests.compiler_ast.phpdoc.PHPDocAwareDeclarationTests)  Time elapsed: 0.002 s
testVar(org.eclipse.php.core.tests.compiler_ast.phpdoc.PHPDocAwareDeclarationTests)  Time elapsed: 0 s
testClass(org.eclipse.php.core.tests.compiler_ast.phpdoc.PHPDocAwareDeclarationTests)  Time elapsed: 0 s
testClassFinal(org.eclipse.php.core.tests.compiler_ast.phpdoc.PHPDocAwareDeclarationTests)  Time elapsed: 0.001 s
testClassNegative(org.eclipse.php.core.tests.compiler_ast.phpdoc.PHPDocAwareDeclarationTests)  Time elapsed: 0 s
testClassAbstract(org.eclipse.php.core.tests.compiler_ast.phpdoc.PHPDocAwareDeclarationTests)  Time elapsed: 0 s
testInterface(org.eclipse.php.core.tests.compiler_ast.phpdoc.PHPDocAwareDeclarationTests)  Time elapsed: 0 s
testMethodWithModifiers10(org.eclipse.php.core.tests.compiler_ast.phpdoc.PHPDocAwareDeclarationTests)  Time elapsed: 0.001 s
testMethodWithModifiers11(org.eclipse.php.core.tests.compiler_ast.phpdoc.PHPDocAwareDeclarationTests)  Time elapsed: 0 s
testMethodWithModifiers12(org.eclipse.php.core.tests.compiler_ast.phpdoc.PHPDocAwareDeclarationTests)  Time elapsed: 0 s
testMethodWithModifiers13(org.eclipse.php.core.tests.compiler_ast.phpdoc.PHPDocAwareDeclarationTests)  Time elapsed: 0.001 s
testMethodWithModifiers14(org.eclipse.php.core.tests.compiler_ast.phpdoc.PHPDocAwareDeclarationTests)  Time elapsed: 0 s
testMethodWithModifiers15(org.eclipse.php.core.tests.compiler_ast.phpdoc.PHPDocAwareDeclarationTests)  Time elapsed: 0 s
testMethodWithModifiers16(org.eclipse.php.core.tests.compiler_ast.phpdoc.PHPDocAwareDeclarationTests)  Time elapsed: 0.001 s
testMethodWithModifiers17(org.eclipse.php.core.tests.compiler_ast.phpdoc.PHPDocAwareDeclarationTests)  Time elapsed: 0 s
testMethod(org.eclipse.php.core.tests.compiler_ast.phpdoc.PHPDocAwareDeclarationTests)  Time elapsed: 0 s
testVarWithModifiers1(org.eclipse.php.core.tests.compiler_ast.phpdoc.PHPDocAwareDeclarationTests)  Time elapsed: 0 s
testVarWithModifiers2(org.eclipse.php.core.tests.compiler_ast.phpdoc.PHPDocAwareDeclarationTests)  Time elapsed: 0 s
testVarWithModifiers3(org.eclipse.php.core.tests.compiler_ast.phpdoc.PHPDocAwareDeclarationTests)  Time elapsed: 0 s
testVarWithModifiers4(org.eclipse.php.core.tests.compiler_ast.phpdoc.PHPDocAwareDeclarationTests)  Time elapsed: 0.001 s
testVarWithModifiers5(org.eclipse.php.core.tests.compiler_ast.phpdoc.PHPDocAwareDeclarationTests)  Time elapsed: 0 s
testVarWithModifiers6(org.eclipse.php.core.tests.compiler_ast.phpdoc.PHPDocAwareDeclarationTests)  Time elapsed: 0 s
testVarWithModifiers7(org.eclipse.php.core.tests.compiler_ast.phpdoc.PHPDocAwareDeclarationTests)  Time elapsed: 0.001 s
testVarWithModifiers8(org.eclipse.php.core.tests.compiler_ast.phpdoc.PHPDocAwareDeclarationTests)  Time elapsed: 0 s
testVarWithModifiers9(org.eclipse.php.core.tests.compiler_ast.phpdoc.PHPDocAwareDeclarationTests)  Time elapsed: 0 s
testMethodWithModifiers1(org.eclipse.php.core.tests.compiler_ast.phpdoc.PHPDocAwareDeclarationTests)  Time elapsed: 0 s
testMethodWithModifiers2(org.eclipse.php.core.tests.compiler_ast.phpdoc.PHPDocAwareDeclarationTests)  Time elapsed: 0.001 s
testMethodWithModifiers3(org.eclipse.php.core.tests.compiler_ast.phpdoc.PHPDocAwareDeclarationTests)  Time elapsed: 0 s
testMethodWithModifiers4(org.eclipse.php.core.tests.compiler_ast.phpdoc.PHPDocAwareDeclarationTests)  Time elapsed: 0 s
testMethodWithModifiers5(org.eclipse.php.core.tests.compiler_ast.phpdoc.PHPDocAwareDeclarationTests)  Time elapsed: 0.001 s
testMethodWithModifiers6(org.eclipse.php.core.tests.compiler_ast.phpdoc.PHPDocAwareDeclarationTests)  Time elapsed: 0 s
testMethodWithModifiers7(org.eclipse.php.core.tests.compiler_ast.phpdoc.PHPDocAwareDeclarationTests)  Time elapsed: 0 s
testMethodWithModifiers8(org.eclipse.php.core.tests.compiler_ast.phpdoc.PHPDocAwareDeclarationTests)  Time elapsed: 0 s
testMethodWithModifiers9(org.eclipse.php.core.tests.compiler_ast.phpdoc.PHPDocAwareDeclarationTests)  Time elapsed: 0.001 s
includePathGetAfterBPChange1(org.eclipse.php.core.tests.includepath.IncludePathManagerTests)  Time elapsed: 0.287 s
includePathGetAfterBPChange2(org.eclipse.php.core.tests.includepath.IncludePathManagerTests)  Time elapsed: 0.309 s
includePathGet(org.eclipse.php.core.tests.includepath.IncludePathManagerTests)  Time elapsed: 0.256 s
includePathSet(org.eclipse.php.core.tests.includepath.IncludePathManagerTests)  Time elapsed: 0.155 s
constructorBinding(org.eclipse.php.core.tests.dom_ast.binding.BindingTests)  Time elapsed: 1.198 s
thisFieldAccessBinding(org.eclipse.php.core.tests.dom_ast.binding.BindingTests)  Time elapsed: 0.016 s
interfaceDeclarationBinding(org.eclipse.php.core.tests.dom_ast.binding.BindingTests)  Time elapsed: 0.006 s
isSubTypeCompatibleTrue(org.eclipse.php.core.tests.dom_ast.binding.BindingTests)  Time elapsed: 0.006 s
basicType(org.eclipse.php.core.tests.dom_ast.binding.BindingTests)  Time elapsed: 0.004 s
fieldAccessBinding(org.eclipse.php.core.tests.dom_ast.binding.BindingTests)  Time elapsed: 0.007 s
getDeclaredFields(org.eclipse.php.core.tests.dom_ast.binding.BindingTests)  Time elapsed: 0.005 s
binaryName(org.eclipse.php.core.tests.dom_ast.binding.BindingTests)  Time elapsed: 0.004 s
methodInvocationBinding(org.eclipse.php.core.tests.dom_ast.binding.BindingTests)  Time elapsed: 0.004 s
staticConstantAccessBinding(org.eclipse.php.core.tests.dom_ast.binding.BindingTests)  Time elapsed: 0.003 s
overrides(org.eclipse.php.core.tests.dom_ast.binding.BindingTests)  Time elapsed: 0.006 s
includeBinding(org.eclipse.php.core.tests.dom_ast.binding.BindingTests)  Time elapsed: 0.005 s
isPrimitive(org.eclipse.php.core.tests.dom_ast.binding.BindingTests)  Time elapsed: 0.002 s
functionDeclarationBinding(org.eclipse.php.core.tests.dom_ast.binding.BindingTests)  Time elapsed: 0.006 s
basicExpression(org.eclipse.php.core.tests.dom_ast.binding.BindingTests)  Time elapsed: 0.002 s
methodDeclarationGeneratorBinding(org.eclipse.php.core.tests.dom_ast.binding.BindingTests)  Time elapsed: 0.002 s
staticFieldAccessBinding(org.eclipse.php.core.tests.dom_ast.binding.BindingTests)  Time elapsed: 0.004 s
methodDeclarationBinding(org.eclipse.php.core.tests.dom_ast.binding.BindingTests)  Time elapsed: 0.002 s
isNullType(org.eclipse.php.core.tests.dom_ast.binding.BindingTests)  Time elapsed: 0.001 s
expressionBinding(org.eclipse.php.core.tests.dom_ast.binding.BindingTests)  Time elapsed: 0.001 s
isInterface(org.eclipse.php.core.tests.dom_ast.binding.BindingTests)  Time elapsed: 0.004 s
staticMethodInvocationBinding(org.eclipse.php.core.tests.dom_ast.binding.BindingTests)  Time elapsed: 0.039 s
getDeclaredMethods(org.eclipse.php.core.tests.dom_ast.binding.BindingTests)  Time elapsed: 0.005 s
isArray(org.eclipse.php.core.tests.dom_ast.binding.BindingTests)  Time elapsed: 0.003 s
isClass(org.eclipse.php.core.tests.dom_ast.binding.BindingTests)  Time elapsed: 0.005 s
functionInvocationBinding(org.eclipse.php.core.tests.dom_ast.binding.BindingTests)  Time elapsed: 0.022 s
isSubTypeCompatibleFalse(org.eclipse.php.core.tests.dom_ast.binding.BindingTests)  Time elapsed: 0.045 s
classDeclarationBinding(org.eclipse.php.core.tests.dom_ast.binding.BindingTests)  Time elapsed: 0.003 s
test[workspace/phpmodelutils/php55/getFullName1.pdtt](org.eclipse.php.core.tests.phpmodelutils.PHPModelUtilsTests)  Time elapsed: 0.01 s
test[workspace/phpmodelutils/php55/getFullName2.pdtt](org.eclipse.php.core.tests.phpmodelutils.PHPModelUtilsTests)  Time elapsed: 0.003 s
test[workspace/document_lexer/php5/comments.pdtt](org.eclipse.php.core.tests.document.lexer.DocumentLexerTests)  Time elapsed: 0.008 s
test[workspace/document_lexer/php5/comments2.pdtt](org.eclipse.php.core.tests.document.lexer.DocumentLexerTests)  Time elapsed: 0 s
test[workspace/document_lexer/php5/heredocs.pdtt](org.eclipse.php.core.tests.document.lexer.DocumentLexerTests)  Time elapsed: 0.001 s
test[workspace/document_lexer/php5/heredocs2.pdtt](org.eclipse.php.core.tests.document.lexer.DocumentLexerTests)  Time elapsed: 0 s
test[workspace/document_lexer/php5/heredocs3.pdtt](org.eclipse.php.core.tests.document.lexer.DocumentLexerTests)  Time elapsed: 0.001 s
test[workspace/document_lexer/php5/heredocs4.pdtt](org.eclipse.php.core.tests.document.lexer.DocumentLexerTests)  Time elapsed: 0 s
test[workspace/document_lexer/php5/heredocs5.pdtt](org.eclipse.php.core.tests.document.lexer.DocumentLexerTests)  Time elapsed: 0 s
test[workspace/document_lexer/php5/operators.pdtt](org.eclipse.php.core.tests.document.lexer.DocumentLexerTests)  Time elapsed: 0.001 s
test[workspace/document_lexer/php5/reserved_words.pdtt](org.eclipse.php.core.tests.document.lexer.DocumentLexerTests)  Time elapsed: 0 s
test[workspace/document_lexer/php5/sample.pdtt](org.eclipse.php.core.tests.document.lexer.DocumentLexerTests)  Time elapsed: 0.065 s
test[workspace/document_lexer/php5/strings.pdtt](org.eclipse.php.core.tests.document.lexer.DocumentLexerTests)  Time elapsed: 0 s
test[workspace/document_lexer/php5/test491991.pdtt](org.eclipse.php.core.tests.document.lexer.DocumentLexerTests)  Time elapsed: 0.001 s
test[workspace/document_lexer/php5/testPhpQuotedStrings.pdtt](org.eclipse.php.core.tests.document.lexer.DocumentLexerTests)  Time elapsed: 0.006 s
test[workspace/document_lexer/php5/unicode.pdtt](org.eclipse.php.core.tests.document.lexer.DocumentLexerTests)  Time elapsed: 0 s
test[workspace/document_lexer/php53/comments.pdtt](org.eclipse.php.core.tests.document.lexer.DocumentLexerTests)  Time elapsed: 0 s
test[workspace/document_lexer/php53/comments2.pdtt](org.eclipse.php.core.tests.document.lexer.DocumentLexerTests)  Time elapsed: 0.001 s
test[workspace/document_lexer/php53/heredocs.pdtt](org.eclipse.php.core.tests.document.lexer.DocumentLexerTests)  Time elapsed: 0 s
test[workspace/document_lexer/php53/heredocs2.pdtt](org.eclipse.php.core.tests.document.lexer.DocumentLexerTests)  Time elapsed: 0.001 s
test[workspace/document_lexer/php53/heredocs3.pdtt](org.eclipse.php.core.tests.document.lexer.DocumentLexerTests)  Time elapsed: 0 s
test[workspace/document_lexer/php53/heredocs4.pdtt](org.eclipse.php.core.tests.document.lexer.DocumentLexerTests)  Time elapsed: 0 s
test[workspace/document_lexer/php53/heredocs5.pdtt](org.eclipse.php.core.tests.document.lexer.DocumentLexerTests)  Time elapsed: 0.001 s
test[workspace/document_lexer/php53/heredocs6.pdtt](org.eclipse.php.core.tests.document.lexer.DocumentLexerTests)  Time elapsed: 0 s
test[workspace/document_lexer/php53/heredocs7.pdtt](org.eclipse.php.core.tests.document.lexer.DocumentLexerTests)  Time elapsed: 0 s
test[workspace/document_lexer/php53/nested_nowdoc.pdtt](org.eclipse.php.core.tests.document.lexer.DocumentLexerTests)  Time elapsed: 0 s
test[workspace/document_lexer/php53/nowdoc.pdtt](org.eclipse.php.core.tests.document.lexer.DocumentLexerTests)  Time elapsed: 0 s
test[workspace/document_lexer/php53/operators.pdtt](org.eclipse.php.core.tests.document.lexer.DocumentLexerTests)  Time elapsed: 0.001 s
test[workspace/document_lexer/php53/reserved_words.pdtt](org.eclipse.php.core.tests.document.lexer.DocumentLexerTests)  Time elapsed: 0.001 s
test[workspace/document_lexer/php53/sample.pdtt](org.eclipse.php.core.tests.document.lexer.DocumentLexerTests)  Time elapsed: 0.037 s
test[workspace/document_lexer/php53/strings.pdtt](org.eclipse.php.core.tests.document.lexer.DocumentLexerTests)  Time elapsed: 0 s
test[workspace/document_lexer/php53/test491991.pdtt](org.eclipse.php.core.tests.document.lexer.DocumentLexerTests)  Time elapsed: 0.001 s
test[workspace/document_lexer/php53/testPhpQuotedStrings.pdtt](org.eclipse.php.core.tests.document.lexer.DocumentLexerTests)  Time elapsed: 0.001 s
test[workspace/document_lexer/php53/unicode.pdtt](org.eclipse.php.core.tests.document.lexer.DocumentLexerTests)  Time elapsed: 0 s
test[workspace/document_lexer/php53/comments.pdtt](org.eclipse.php.core.tests.document.lexer.DocumentLexerTests)  Time elapsed: 0 s
test[workspace/document_lexer/php53/comments2.pdtt](org.eclipse.php.core.tests.document.lexer.DocumentLexerTests)  Time elapsed: 0.001 s
test[workspace/document_lexer/php53/heredocs.pdtt](org.eclipse.php.core.tests.document.lexer.DocumentLexerTests)  Time elapsed: 0 s
test[workspace/document_lexer/php53/heredocs2.pdtt](org.eclipse.php.core.tests.document.lexer.DocumentLexerTests)  Time elapsed: 0 s
test[workspace/document_lexer/php53/heredocs3.pdtt](org.eclipse.php.core.tests.document.lexer.DocumentLexerTests)  Time elapsed: 0 s
test[workspace/document_lexer/php53/heredocs4.pdtt](org.eclipse.php.core.tests.document.lexer.DocumentLexerTests)  Time elapsed: 0.001 s
test[workspace/document_lexer/php53/heredocs5.pdtt](org.eclipse.php.core.tests.document.lexer.DocumentLexerTests)  Time elapsed: 0 s
test[workspace/document_lexer/php53/heredocs6.pdtt](org.eclipse.php.core.tests.document.lexer.DocumentLexerTests)  Time elapsed: 0 s
test[workspace/document_lexer/php53/heredocs7.pdtt](org.eclipse.php.core.tests.document.lexer.DocumentLexerTests)  Time elapsed: 0 s
test[workspace/document_lexer/php53/nested_nowdoc.pdtt](org.eclipse.php.core.tests.document.lexer.DocumentLexerTests)  Time elapsed: 0 s
test[workspace/document_lexer/php53/nowdoc.pdtt](org.eclipse.php.core.tests.document.lexer.DocumentLexerTests)  Time elapsed: 0 s
test[workspace/document_lexer/php53/operators.pdtt](org.eclipse.php.core.tests.document.lexer.DocumentLexerTests)  Time elapsed: 0.001 s
test[workspace/document_lexer/php53/reserved_words.pdtt](org.eclipse.php.core.tests.document.lexer.DocumentLexerTests)  Time elapsed: 0.001 s
test[workspace/document_lexer/php53/sample.pdtt](org.eclipse.php.core.tests.document.lexer.DocumentLexerTests)  Time elapsed: 0.037 s
test[workspace/document_lexer/php53/strings.pdtt](org.eclipse.php.core.tests.document.lexer.DocumentLexerTests)  Time elapsed: 0 s
test[workspace/document_lexer/php53/test491991.pdtt](org.eclipse.php.core.tests.document.lexer.DocumentLexerTests)  Time elapsed: 0 s
test[workspace/document_lexer/php53/testPhpQuotedStrings.pdtt](org.eclipse.php.core.tests.document.lexer.DocumentLexerTests)  Time elapsed: 0.001 s
test[workspace/document_lexer/php53/unicode.pdtt](org.eclipse.php.core.tests.document.lexer.DocumentLexerTests)  Time elapsed: 0.001 s
test[workspace/document_lexer/php54/arrayInitializer1.pdtt](org.eclipse.php.core.tests.document.lexer.DocumentLexerTests)  Time elapsed: 0 s
test[workspace/document_lexer/php54/arrayInitializer3.pdtt](org.eclipse.php.core.tests.document.lexer.DocumentLexerTests)  Time elapsed: 0 s
test[workspace/document_lexer/php54/callable1.pdtt](org.eclipse.php.core.tests.document.lexer.DocumentLexerTests)  Time elapsed: 0 s
test[workspace/document_lexer/php54/classInitializer1.pdtt](org.eclipse.php.core.tests.document.lexer.DocumentLexerTests)  Time elapsed: 0 s
test[workspace/document_lexer/php54/expression1.pdtt](org.eclipse.php.core.tests.document.lexer.DocumentLexerTests)  Time elapsed: 0 s
test[workspace/document_lexer/php54/methodInvocation1.pdtt](org.eclipse.php.core.tests.document.lexer.DocumentLexerTests)  Time elapsed: 0 s
test[workspace/document_lexer/php54/testStaticLambdaFunction.pdtt](org.eclipse.php.core.tests.document.lexer.DocumentLexerTests)  Time elapsed: 0 s
test[workspace/document_lexer/php54/testTrait1.pdtt](org.eclipse.php.core.tests.document.lexer.DocumentLexerTests)  Time elapsed: 0.001 s
test[workspace/document_lexer/php54/testTrait2.pdtt](org.eclipse.php.core.tests.document.lexer.DocumentLexerTests)  Time elapsed: 0 s
test[workspace/document_lexer/php54/testTrait3.pdtt](org.eclipse.php.core.tests.document.lexer.DocumentLexerTests)  Time elapsed: 0 s
test[workspace/document_lexer/php54/testTrait4.pdtt](org.eclipse.php.core.tests.document.lexer.DocumentLexerTests)  Time elapsed: 0.001 s
test[workspace/document_lexer/php54/testTrait5.pdtt](org.eclipse.php.core.tests.document.lexer.DocumentLexerTests)  Time elapsed: 0 s
test[workspace/document_lexer/php54/testTrait6.pdtt](org.eclipse.php.core.tests.document.lexer.DocumentLexerTests)  Time elapsed: 0 s
test[workspace/document_lexer/php54/testTrait7.pdtt](org.eclipse.php.core.tests.document.lexer.DocumentLexerTests)  Time elapsed: 0 s
test[workspace/document_lexer/php54/testTrait8.pdtt](org.eclipse.php.core.tests.document.lexer.DocumentLexerTests)  Time elapsed: 0 s
test[workspace/document_lexer/php54/testTrait9.pdtt](org.eclipse.php.core.tests.document.lexer.DocumentLexerTests)  Time elapsed: 0.001 s
test[workspace/document_lexer/php53/comments.pdtt](org.eclipse.php.core.tests.document.lexer.DocumentLexerTests)  Time elapsed: 0 s
test[workspace/document_lexer/php53/comments2.pdtt](org.eclipse.php.core.tests.document.lexer.DocumentLexerTests)  Time elapsed: 0 s
test[workspace/document_lexer/php53/heredocs.pdtt](org.eclipse.php.core.tests.document.lexer.DocumentLexerTests)  Time elapsed: 0 s
test[workspace/document_lexer/php53/heredocs2.pdtt](org.eclipse.php.core.tests.document.lexer.DocumentLexerTests)  Time elapsed: 0.001 s
test[workspace/document_lexer/php53/heredocs3.pdtt](org.eclipse.php.core.tests.document.lexer.DocumentLexerTests)  Time elapsed: 0 s
test[workspace/document_lexer/php53/heredocs4.pdtt](org.eclipse.php.core.tests.document.lexer.DocumentLexerTests)  Time elapsed: 0 s
test[workspace/document_lexer/php53/heredocs5.pdtt](org.eclipse.php.core.tests.document.lexer.DocumentLexerTests)  Time elapsed: 0 s
test[workspace/document_lexer/php53/heredocs6.pdtt](org.eclipse.php.core.tests.document.lexer.DocumentLexerTests)  Time elapsed: 0 s
test[workspace/document_lexer/php53/heredocs7.pdtt](org.eclipse.php.core.tests.document.lexer.DocumentLexerTests)  Time elapsed: 0 s
test[workspace/document_lexer/php53/nested_nowdoc.pdtt](org.eclipse.php.core.tests.document.lexer.DocumentLexerTests)  Time elapsed: 0 s
test[workspace/document_lexer/php53/nowdoc.pdtt](org.eclipse.php.core.tests.document.lexer.DocumentLexerTests)  Time elapsed: 0.001 s
test[workspace/document_lexer/php53/operators.pdtt](org.eclipse.php.core.tests.document.lexer.DocumentLexerTests)  Time elapsed: 0 s
test[workspace/document_lexer/php53/reserved_words.pdtt](org.eclipse.php.core.tests.document.lexer.DocumentLexerTests)  Time elapsed: 0 s
test[workspace/document_lexer/php53/sample.pdtt](org.eclipse.php.core.tests.document.lexer.DocumentLexerTests)  Time elapsed: 0.041 s
test[workspace/document_lexer/php53/strings.pdtt](org.eclipse.php.core.tests.document.lexer.DocumentLexerTests)  Time elapsed: 0 s
test[workspace/document_lexer/php53/test491991.pdtt](org.eclipse.php.core.tests.document.lexer.DocumentLexerTests)  Time elapsed: 0.001 s
test[workspace/document_lexer/php53/testPhpQuotedStrings.pdtt](org.eclipse.php.core.tests.document.lexer.DocumentLexerTests)  Time elapsed: 0.001 s
test[workspace/document_lexer/php53/unicode.pdtt](org.eclipse.php.core.tests.document.lexer.DocumentLexerTests)  Time elapsed: 0 s
test[workspace/document_lexer/php54/arrayInitializer1.pdtt](org.eclipse.php.core.tests.document.lexer.DocumentLexerTests)  Time elapsed: 0 s
test[workspace/document_lexer/php54/arrayInitializer3.pdtt](org.eclipse.php.core.tests.document.lexer.DocumentLexerTests)  Time elapsed: 0 s
test[workspace/document_lexer/php54/callable1.pdtt](org.eclipse.php.core.tests.document.lexer.DocumentLexerTests)  Time elapsed: 0 s
test[workspace/document_lexer/php54/classInitializer1.pdtt](org.eclipse.php.core.tests.document.lexer.DocumentLexerTests)  Time elapsed: 0 s
test[workspace/document_lexer/php54/expression1.pdtt](org.eclipse.php.core.tests.document.lexer.DocumentLexerTests)  Time elapsed: 0.001 s
test[workspace/document_lexer/php54/methodInvocation1.pdtt](org.eclipse.php.core.tests.document.lexer.DocumentLexerTests)  Time elapsed: 0 s
test[workspace/document_lexer/php54/testStaticLambdaFunction.pdtt](org.eclipse.php.core.tests.document.lexer.DocumentLexerTests)  Time elapsed: 0 s
test[workspace/document_lexer/php54/testTrait1.pdtt](org.eclipse.php.core.tests.document.lexer.DocumentLexerTests)  Time elapsed: 0 s
test[workspace/document_lexer/php54/testTrait2.pdtt](org.eclipse.php.core.tests.document.lexer.DocumentLexerTests)  Time elapsed: 0 s
test[workspace/document_lexer/php54/testTrait3.pdtt](org.eclipse.php.core.tests.document.lexer.DocumentLexerTests)  Time elapsed: 0 s
test[workspace/document_lexer/php54/testTrait4.pdtt](org.eclipse.php.core.tests.document.lexer.DocumentLexerTests)  Time elapsed: 0 s
test[workspace/document_lexer/php54/testTrait5.pdtt](org.eclipse.php.core.tests.document.lexer.DocumentLexerTests)  Time elapsed: 0 s
test[workspace/document_lexer/php54/testTrait6.pdtt](org.eclipse.php.core.tests.document.lexer.DocumentLexerTests)  Time elapsed: 0 s
test[workspace/document_lexer/php54/testTrait7.pdtt](org.eclipse.php.core.tests.document.lexer.DocumentLexerTests)  Time elapsed: 0.001 s
test[workspace/document_lexer/php54/testTrait8.pdtt](org.eclipse.php.core.tests.document.lexer.DocumentLexerTests)  Time elapsed: 0 s
test[workspace/document_lexer/php54/testTrait9.pdtt](org.eclipse.php.core.tests.document.lexer.DocumentLexerTests)  Time elapsed: 0 s
test[workspace/document_lexer/php55/arrayInitializer1.pdtt](org.eclipse.php.core.tests.document.lexer.DocumentLexerTests)  Time elapsed: 0 s
test[workspace/document_lexer/php55/arrayInitializer2.pdtt](org.eclipse.php.core.tests.document.lexer.DocumentLexerTests)  Time elapsed: 0 s
test[workspace/document_lexer/php55/classConstant.pdtt](org.eclipse.php.core.tests.document.lexer.DocumentLexerTests)  Time elapsed: 0 s
test[workspace/document_lexer/php55/generatorMethod.pdtt](org.eclipse.php.core.tests.document.lexer.DocumentLexerTests)  Time elapsed: 0 s
test[workspace/document_lexer/php55/parentSelfCaseinsensitive.pdtt](org.eclipse.php.core.tests.document.lexer.DocumentLexerTests)  Time elapsed: 0.001 s
test[workspace/document_lexer/php55/scalarDereference.pdtt](org.eclipse.php.core.tests.document.lexer.DocumentLexerTests)  Time elapsed: 0 s
test[workspace/document_lexer/php55/testTryFinally1.pdtt](org.eclipse.php.core.tests.document.lexer.DocumentLexerTests)  Time elapsed: 0 s
test[workspace/document_lexer/php55/testTryFinally2.pdtt](org.eclipse.php.core.tests.document.lexer.DocumentLexerTests)  Time elapsed: 0 s
test[workspace/document_lexer/php53/comments.pdtt](org.eclipse.php.core.tests.document.lexer.DocumentLexerTests)  Time elapsed: 0 s
test[workspace/document_lexer/php53/comments2.pdtt](org.eclipse.php.core.tests.document.lexer.DocumentLexerTests)  Time elapsed: 0 s
test[workspace/document_lexer/php53/heredocs.pdtt](org.eclipse.php.core.tests.document.lexer.DocumentLexerTests)  Time elapsed: 0.001 s
test[workspace/document_lexer/php53/heredocs2.pdtt](org.eclipse.php.core.tests.document.lexer.DocumentLexerTests)  Time elapsed: 0 s
test[workspace/document_lexer/php53/heredocs3.pdtt](org.eclipse.php.core.tests.document.lexer.DocumentLexerTests)  Time elapsed: 0 s
test[workspace/document_lexer/php53/heredocs4.pdtt](org.eclipse.php.core.tests.document.lexer.DocumentLexerTests)  Time elapsed: 0 s
test[workspace/document_lexer/php53/heredocs5.pdtt](org.eclipse.php.core.tests.document.lexer.DocumentLexerTests)  Time elapsed: 0 s
test[workspace/document_lexer/php53/heredocs6.pdtt](org.eclipse.php.core.tests.document.lexer.DocumentLexerTests)  Time elapsed: 0 s
test[workspace/document_lexer/php53/heredocs7.pdtt](org.eclipse.php.core.tests.document.lexer.DocumentLexerTests)  Time elapsed: 0 s
test[workspace/document_lexer/php53/nested_nowdoc.pdtt](org.eclipse.php.core.tests.document.lexer.DocumentLexerTests)  Time elapsed: 0 s
test[workspace/document_lexer/php53/nowdoc.pdtt](org.eclipse.php.core.tests.document.lexer.DocumentLexerTests)  Time elapsed: 0 s
test[workspace/document_lexer/php53/operators.pdtt](org.eclipse.php.core.tests.document.lexer.DocumentLexerTests)  Time elapsed: 0 s
test[workspace/document_lexer/php53/reserved_words.pdtt](org.eclipse.php.core.tests.document.lexer.DocumentLexerTests)  Time elapsed: 0.001 s
test[workspace/document_lexer/php53/sample.pdtt](org.eclipse.php.core.tests.document.lexer.DocumentLexerTests)  Time elapsed: 0.041 s
test[workspace/document_lexer/php53/strings.pdtt](org.eclipse.php.core.tests.document.lexer.DocumentLexerTests)  Time elapsed: 0.001 s
test[workspace/document_lexer/php53/test491991.pdtt](org.eclipse.php.core.tests.document.lexer.DocumentLexerTests)  Time elapsed: 0.001 s
test[workspace/document_lexer/php53/testPhpQuotedStrings.pdtt](org.eclipse.php.core.tests.document.lexer.DocumentLexerTests)  Time elapsed: 0.001 s
test[workspace/document_lexer/php53/unicode.pdtt](org.eclipse.php.core.tests.document.lexer.DocumentLexerTests)  Time elapsed: 0 s
test[workspace/document_lexer/php54/arrayInitializer1.pdtt](org.eclipse.php.core.tests.document.lexer.DocumentLexerTests)  Time elapsed: 0 s
test[workspace/document_lexer/php54/arrayInitializer3.pdtt](org.eclipse.php.core.tests.document.lexer.DocumentLexerTests)  Time elapsed: 0 s
test[workspace/document_lexer/php54/callable1.pdtt](org.eclipse.php.core.tests.document.lexer.DocumentLexerTests)  Time elapsed: 0 s
test[workspace/document_lexer/php54/classInitializer1.pdtt](org.eclipse.php.core.tests.document.lexer.DocumentLexerTests)  Time elapsed: 0 s
test[workspace/document_lexer/php54/expression1.pdtt](org.eclipse.php.core.tests.document.lexer.DocumentLexerTests)  Time elapsed: 0 s
test[workspace/document_lexer/php54/methodInvocation1.pdtt](org.eclipse.php.core.tests.document.lexer.DocumentLexerTests)  Time elapsed: 0.001 s
test[workspace/document_lexer/php54/testStaticLambdaFunction.pdtt](org.eclipse.php.core.tests.document.lexer.DocumentLexerTests)  Time elapsed: 0 s
test[workspace/document_lexer/php54/testTrait1.pdtt](org.eclipse.php.core.tests.document.lexer.DocumentLexerTests)  Time elapsed: 0 s
test[workspace/document_lexer/php54/testTrait2.pdtt](org.eclipse.php.core.tests.document.lexer.DocumentLexerTests)  Time elapsed: 0 s
test[workspace/document_lexer/php54/testTrait3.pdtt](org.eclipse.php.core.tests.document.lexer.DocumentLexerTests)  Time elapsed: 0.001 s
test[workspace/document_lexer/php54/testTrait4.pdtt](org.eclipse.php.core.tests.document.lexer.DocumentLexerTests)  Time elapsed: 0 s
test[workspace/document_lexer/php54/testTrait5.pdtt](org.eclipse.php.core.tests.document.lexer.DocumentLexerTests)  Time elapsed: 0.001 s
test[workspace/document_lexer/php54/testTrait6.pdtt](org.eclipse.php.core.tests.document.lexer.DocumentLexerTests)  Time elapsed: 0 s
test[workspace/document_lexer/php54/testTrait7.pdtt](org.eclipse.php.core.tests.document.lexer.DocumentLexerTests)  Time elapsed: 0.001 s
test[workspace/document_lexer/php54/testTrait8.pdtt](org.eclipse.php.core.tests.document.lexer.DocumentLexerTests)  Time elapsed: 0 s
test[workspace/document_lexer/php54/testTrait9.pdtt](org.eclipse.php.core.tests.document.lexer.DocumentLexerTests)  Time elapsed: 0 s
test[workspace/document_lexer/php56/argumentUnpacking01.pdtt](org.eclipse.php.core.tests.document.lexer.DocumentLexerTests)  Time elapsed: 0 s
test[workspace/document_lexer/php56/constScalarExpression01.pdtt](org.eclipse.php.core.tests.document.lexer.DocumentLexerTests)  Time elapsed: 0 s
test[workspace/document_lexer/php56/powOperator01.pdtt](org.eclipse.php.core.tests.document.lexer.DocumentLexerTests)  Time elapsed: 0 s
test[workspace/document_lexer/php56/useConst01.pdtt](org.eclipse.php.core.tests.document.lexer.DocumentLexerTests)  Time elapsed: 0.001 s
test[workspace/document_lexer/php56/useFunction01.pdtt](org.eclipse.php.core.tests.document.lexer.DocumentLexerTests)  Time elapsed: 0 s
test[workspace/document_lexer/php56/variadicParameter01.pdtt](org.eclipse.php.core.tests.document.lexer.DocumentLexerTests)  Time elapsed: 0 s
test[workspace/document_lexer/php7/argumentUnpacking01.pdtt](org.eclipse.php.core.tests.document.lexer.DocumentLexerTests)  Time elapsed: 0 s
test[workspace/document_lexer/php7/arrayInitializer1.pdtt](org.eclipse.php.core.tests.document.lexer.DocumentLexerTests)  Time elapsed: 0 s
test[workspace/document_lexer/php7/arrayInitializer2.pdtt](org.eclipse.php.core.tests.document.lexer.DocumentLexerTests)  Time elapsed: 0.001 s
test[workspace/document_lexer/php7/classConstant.pdtt](org.eclipse.php.core.tests.document.lexer.DocumentLexerTests)  Time elapsed: 0 s
test[workspace/document_lexer/php7/coalesceOperator01.pdtt](org.eclipse.php.core.tests.document.lexer.DocumentLexerTests)  Time elapsed: 0 s
test[workspace/document_lexer/php7/constScalarExpression01.pdtt](org.eclipse.php.core.tests.document.lexer.DocumentLexerTests)  Time elapsed: 0 s
test[workspace/document_lexer/php7/generatorDelegation01.pdtt](org.eclipse.php.core.tests.document.lexer.DocumentLexerTests)  Time elapsed: 0 s
test[workspace/document_lexer/php7/generatorMethod.pdtt](org.eclipse.php.core.tests.document.lexer.DocumentLexerTests)  Time elapsed: 0 s
test[workspace/document_lexer/php7/groupUseStatement01.pdtt](org.eclipse.php.core.tests.document.lexer.DocumentLexerTests)  Time elapsed: 0.001 s
test[workspace/document_lexer/php7/groupUseStatement01B.pdtt](org.eclipse.php.core.tests.document.lexer.DocumentLexerTests)  Time elapsed: 0 s
test[workspace/document_lexer/php7/groupUseStatement02.pdtt](org.eclipse.php.core.tests.document.lexer.DocumentLexerTests)  Time elapsed: 0 s
test[workspace/document_lexer/php7/groupUseStatement02B.pdtt](org.eclipse.php.core.tests.document.lexer.DocumentLexerTests)  Time elapsed: 0 s
test[workspace/document_lexer/php7/groupUseStatement03.pdtt](org.eclipse.php.core.tests.document.lexer.DocumentLexerTests)  Time elapsed: 0 s
test[workspace/document_lexer/php7/groupUseStatement03B.pdtt](org.eclipse.php.core.tests.document.lexer.DocumentLexerTests)  Time elapsed: 0.001 s
test[workspace/document_lexer/php7/parentSelfCaseinsensitive.pdtt](org.eclipse.php.core.tests.document.lexer.DocumentLexerTests)  Time elapsed: 0 s
test[workspace/document_lexer/php7/powOperator01.pdtt](org.eclipse.php.core.tests.document.lexer.DocumentLexerTests)  Time elapsed: 0 s
test[workspace/document_lexer/php7/scalarDereference.pdtt](org.eclipse.php.core.tests.document.lexer.DocumentLexerTests)  Time elapsed: 0 s
test[workspace/document_lexer/php7/semiReservedWords.pdtt](org.eclipse.php.core.tests.document.lexer.DocumentLexerTests)  Time elapsed: 0.001 s
test[workspace/document_lexer/php7/spaceshipOperator01.pdtt](org.eclipse.php.core.tests.document.lexer.DocumentLexerTests)  Time elapsed: 0 s
test[workspace/document_lexer/php7/testTryFinally1.pdtt](org.eclipse.php.core.tests.document.lexer.DocumentLexerTests)  Time elapsed: 0 s
test[workspace/document_lexer/php7/testTryFinally2.pdtt](org.eclipse.php.core.tests.document.lexer.DocumentLexerTests)  Time elapsed: 0 s
test[workspace/document_lexer/php7/useConst01.pdtt](org.eclipse.php.core.tests.document.lexer.DocumentLexerTests)  Time elapsed: 0 s
test[workspace/document_lexer/php7/useFunction01.pdtt](org.eclipse.php.core.tests.document.lexer.DocumentLexerTests)  Time elapsed: 0 s
test[workspace/document_lexer/php7/variadicParameter01.pdtt](org.eclipse.php.core.tests.document.lexer.DocumentLexerTests)  Time elapsed: 0.001 s
test[workspace/document_lexer/php73/heredocs.pdtt](org.eclipse.php.core.tests.document.lexer.DocumentLexerTests)  Time elapsed: 0 s
test[workspace/document_lexer/php73/heredocs10.pdtt](org.eclipse.php.core.tests.document.lexer.DocumentLexerTests)  Time elapsed: 0.001 s
test[workspace/document_lexer/php73/heredocs11.pdtt](org.eclipse.php.core.tests.document.lexer.DocumentLexerTests)  Time elapsed: 0.001 s
test[workspace/document_lexer/php73/heredocs2.pdtt](org.eclipse.php.core.tests.document.lexer.DocumentLexerTests)  Time elapsed: 0 s
test[workspace/document_lexer/php73/heredocs3.pdtt](org.eclipse.php.core.tests.document.lexer.DocumentLexerTests)  Time elapsed: 0.001 s
test[workspace/document_lexer/php73/heredocs4.pdtt](org.eclipse.php.core.tests.document.lexer.DocumentLexerTests)  Time elapsed: 0 s
test[workspace/document_lexer/php73/heredocs5.pdtt](org.eclipse.php.core.tests.document.lexer.DocumentLexerTests)  Time elapsed: 0 s
test[workspace/document_lexer/php73/heredocs6.pdtt](org.eclipse.php.core.tests.document.lexer.DocumentLexerTests)  Time elapsed: 0 s
test[workspace/document_lexer/php73/heredocs7.pdtt](org.eclipse.php.core.tests.document.lexer.DocumentLexerTests)  Time elapsed: 0.001 s
test[workspace/document_lexer/php73/heredocs8.pdtt](org.eclipse.php.core.tests.document.lexer.DocumentLexerTests)  Time elapsed: 0 s
test[workspace/document_lexer/php73/heredocs9.pdtt](org.eclipse.php.core.tests.document.lexer.DocumentLexerTests)  Time elapsed: 0.001 s
test[workspace/document_lexer/php73/nested_nowdoc.pdtt](org.eclipse.php.core.tests.document.lexer.DocumentLexerTests)  Time elapsed: 0 s
test[workspace/document_lexer/php73/nowdoc.pdtt](org.eclipse.php.core.tests.document.lexer.DocumentLexerTests)  Time elapsed: 0 s
test[workspace/document_lexer/php73/nowdoc2.pdtt](org.eclipse.php.core.tests.document.lexer.DocumentLexerTests)  Time elapsed: 0.002 s
test[workspace/document_lexer/php73/testPhpQuotedStrings.pdtt](org.eclipse.php.core.tests.document.lexer.DocumentLexerTests)  Time elapsed: 0.001 s
test[workspace/document_lexer/php73/unicode.pdtt](org.eclipse.php.core.tests.document.lexer.DocumentLexerTests)  Time elapsed: 0 s
test[workspace/document_lexer/php74/testArraySpreadOperator.pdtt](org.eclipse.php.core.tests.document.lexer.DocumentLexerTests)  Time elapsed: 0.001 s
test[workspace/document_lexer/php74/testArrowFunctions.pdtt](org.eclipse.php.core.tests.document.lexer.DocumentLexerTests)  Time elapsed: 0.001 s
test[workspace/document_lexer/php74/testNullCoalesceOperator.pdtt](org.eclipse.php.core.tests.document.lexer.DocumentLexerTests)  Time elapsed: 0 s
test[workspace/document_lexer/php74/testNumericLiteralSeparator.pdtt](org.eclipse.php.core.tests.document.lexer.DocumentLexerTests)  Time elapsed: 0.001 s
test[workspace/document_lexer/php74/testTypedProperties.pdtt](org.eclipse.php.core.tests.document.lexer.DocumentLexerTests)  Time elapsed: 0 s
partitionStandalone(org.eclipse.php.core.tests.document.partitioner.PHPPartitionerTests)  Time elapsed: 0.21 s
partitionPHPAsHTMLAttributeKey(org.eclipse.php.core.tests.document.partitioner.PHPPartitionerTests)  Time elapsed: 0.186 s
partitionPHPAsHTMLAttributeValue(org.eclipse.php.core.tests.document.partitioner.PHPPartitionerTests)  Time elapsed: 0.174 s
partitionInHTML(org.eclipse.php.core.tests.document.partitioner.PHPPartitionerTests)  Time elapsed: 0.185 s
runTest[/jobs/genie.pdt/pdt-sonar/workspace/tests/org.eclipse.php.core.tests/workspace/phar/pear2coverage - org.eclipse.php.internal.core.phar.PharPackage@1f8e1096 - 0 - SHA1](org.eclipse.php.core.tests.phar.PharFileTest)  Time elapsed: 0.028 s
runTest[/jobs/genie.pdt/pdt-sonar/workspace/tests/org.eclipse.php.core.tests/workspace/phar/pear2coverage - org.eclipse.php.internal.core.phar.PharPackage@1f8e1096 - 2 - SHA1](org.eclipse.php.core.tests.phar.PharFileTest)  Time elapsed: 0.152 s
runTest[/jobs/genie.pdt/pdt-sonar/workspace/tests/org.eclipse.php.core.tests/workspace/phar/pear2coverage - org.eclipse.php.internal.core.phar.PharPackage@1f8e1096 - 1 - MD5](org.eclipse.php.core.tests.phar.PharFileTest)  Time elapsed: 0.01 s
runTest[/jobs/genie.pdt/pdt-sonar/workspace/tests/org.eclipse.php.core.tests/workspace/phar/phar2 - org.eclipse.php.internal.core.phar.PharPackage@13a35d3b - 0 - SHA1](org.eclipse.php.core.tests.phar.PharFileTest)  Time elapsed: 0.004 s
runTest[/jobs/genie.pdt/pdt-sonar/workspace/tests/org.eclipse.php.core.tests/workspace/phar/phar2 - org.eclipse.php.internal.core.phar.PharPackage@13a35d3b - 2 - SHA1](org.eclipse.php.core.tests.phar.PharFileTest)  Time elapsed: 0.007 s
runTest[/jobs/genie.pdt/pdt-sonar/workspace/tests/org.eclipse.php.core.tests/workspace/phar/phar2 - org.eclipse.php.internal.core.phar.PharPackage@13a35d3b - 1 - MD5](org.eclipse.php.core.tests.phar.PharFileTest)  Time elapsed: 0.004 s
concileConstant(org.eclipse.php.internal.core.ast.locator.PHPElementConciliatorTest)  Time elapsed: 0.019 s
concileGlobalExists(org.eclipse.php.internal.core.ast.locator.PHPElementConciliatorTest)  Time elapsed: 0.01 s
concileProgram(org.eclipse.php.internal.core.ast.locator.PHPElementConciliatorTest)  Time elapsed: 0.065 s
localVar1(org.eclipse.php.internal.core.ast.locator.PHPElementConciliatorTest)  Time elapsed: 0.003 s
funExists1(org.eclipse.php.internal.core.ast.locator.PHPElementConciliatorTest)  Time elapsed: 0.003 s
concileFunc(org.eclipse.php.internal.core.ast.locator.PHPElementConciliatorTest)  Time elapsed: 0.001 s
concileInterface1(org.eclipse.php.internal.core.ast.locator.PHPElementConciliatorTest)  Time elapsed: 0.004 s
concileClassNameExists(org.eclipse.php.internal.core.ast.locator.PHPElementConciliatorTest)  Time elapsed: 0.002 s
concileMethod1(org.eclipse.php.internal.core.ast.locator.PHPElementConciliatorTest)  Time elapsed: 0.003 s
concileMethod2(org.eclipse.php.internal.core.ast.locator.PHPElementConciliatorTest)  Time elapsed: 0.002 s
concileMethod3(org.eclipse.php.internal.core.ast.locator.PHPElementConciliatorTest)  Time elapsed: 0.002 s
concileMethod4(org.eclipse.php.internal.core.ast.locator.PHPElementConciliatorTest)  Time elapsed: 0.002 s
concileClsMemberExists(org.eclipse.php.internal.core.ast.locator.PHPElementConciliatorTest)  Time elapsed: 0.003 s
concileField1(org.eclipse.php.internal.core.ast.locator.PHPElementConciliatorTest)  Time elapsed: 0.002 s
concileField2(org.eclipse.php.internal.core.ast.locator.PHPElementConciliatorTest)  Time elapsed: 0.001 s
concileField3(org.eclipse.php.internal.core.ast.locator.PHPElementConciliatorTest)  Time elapsed: 0.001 s
concileGlobalVar1(org.eclipse.php.internal.core.ast.locator.PHPElementConciliatorTest)  Time elapsed: 0.001 s
concileGlobalVar2(org.eclipse.php.internal.core.ast.locator.PHPElementConciliatorTest)  Time elapsed: 0.001 s
concileConstantExists(org.eclipse.php.internal.core.ast.locator.PHPElementConciliatorTest)  Time elapsed: 0.002 s
concileStaticField1(org.eclipse.php.internal.core.ast.locator.PHPElementConciliatorTest)  Time elapsed: 0.001 s
concileClassName1(org.eclipse.php.internal.core.ast.locator.PHPElementConciliatorTest)  Time elapsed: 0.002 s
concileClassName2(org.eclipse.php.internal.core.ast.locator.PHPElementConciliatorTest)  Time elapsed: 0.002 s
concileConstant1(org.eclipse.php.internal.core.ast.locator.PHPElementConciliatorTest)  Time elapsed: 0.001 s
concileClassName(org.eclipse.php.internal.core.ast.locator.PHPElementConciliatorTest)  Time elapsed: 0.001 s
localVarExists(org.eclipse.php.internal.core.ast.locator.PHPElementConciliatorTest)  Time elapsed: 0.002 s
concileGlobalVar(org.eclipse.php.internal.core.ast.locator.PHPElementConciliatorTest)  Time elapsed: 0.002 s
concileInterface(org.eclipse.php.internal.core.ast.locator.PHPElementConciliatorTest)  Time elapsed: 0.001 s
localVar(org.eclipse.php.internal.core.ast.locator.PHPElementConciliatorTest)  Time elapsed: 0.001 s
concileFunc1(org.eclipse.php.internal.core.ast.locator.PHPElementConciliatorTest)  Time elapsed: 0.002 s
concileConstant(org.eclipse.php.internal.core.ast.locator.PHPElementConciliatorV5_3Test)  Time elapsed: 0.008 s
concileProgram(org.eclipse.php.internal.core.ast.locator.PHPElementConciliatorV5_3Test)  Time elapsed: 0.003 s
concileFunc(org.eclipse.php.internal.core.ast.locator.PHPElementConciliatorV5_3Test)  Time elapsed: 0.003 s
concileInterface1(org.eclipse.php.internal.core.ast.locator.PHPElementConciliatorV5_3Test)  Time elapsed: 0.003 s
concileMethod1(org.eclipse.php.internal.core.ast.locator.PHPElementConciliatorV5_3Test)  Time elapsed: 0.003 s
concileMethod2(org.eclipse.php.internal.core.ast.locator.PHPElementConciliatorV5_3Test)  Time elapsed: 0.002 s
concileMethod3(org.eclipse.php.internal.core.ast.locator.PHPElementConciliatorV5_3Test)  Time elapsed: 0.001 s
concileMethod4(org.eclipse.php.internal.core.ast.locator.PHPElementConciliatorV5_3Test)  Time elapsed: 0.002 s
concileField1(org.eclipse.php.internal.core.ast.locator.PHPElementConciliatorV5_3Test)  Time elapsed: 0.002 s
concileField2(org.eclipse.php.internal.core.ast.locator.PHPElementConciliatorV5_3Test)  Time elapsed: 0.001 s
concileGlobalVar1(org.eclipse.php.internal.core.ast.locator.PHPElementConciliatorV5_3Test)  Time elapsed: 0.002 s
concileStaticField1(org.eclipse.php.internal.core.ast.locator.PHPElementConciliatorV5_3Test)  Time elapsed: 0.002 s
concileClassName1(org.eclipse.php.internal.core.ast.locator.PHPElementConciliatorV5_3Test)  Time elapsed: 0.001 s
concileClassName2(org.eclipse.php.internal.core.ast.locator.PHPElementConciliatorV5_3Test)  Time elapsed: 0.002 s
concileConstant1(org.eclipse.php.internal.core.ast.locator.PHPElementConciliatorV5_3Test)  Time elapsed: 0.001 s
concileConstant2(org.eclipse.php.internal.core.ast.locator.PHPElementConciliatorV5_3Test)  Time elapsed: 0.001 s
concileConstant3(org.eclipse.php.internal.core.ast.locator.PHPElementConciliatorV5_3Test)  Time elapsed: 0.002 s
concileClassName(org.eclipse.php.internal.core.ast.locator.PHPElementConciliatorV5_3Test)  Time elapsed: 0.001 s
concileGlobalVar(org.eclipse.php.internal.core.ast.locator.PHPElementConciliatorV5_3Test)  Time elapsed: 0.002 s
concileInterface(org.eclipse.php.internal.core.ast.locator.PHPElementConciliatorV5_3Test)  Time elapsed: 0.001 s
localVar(org.eclipse.php.internal.core.ast.locator.PHPElementConciliatorV5_3Test)  Time elapsed: 0.002 s
concileFunc1(org.eclipse.php.internal.core.ast.locator.PHPElementConciliatorV5_3Test)  Time elapsed: 0.002 s
concileConstant(org.eclipse.php.internal.core.ast.locator.PHPElementConciliatorV5_4Test)  Time elapsed: 0.007 s
concileProgram(org.eclipse.php.internal.core.ast.locator.PHPElementConciliatorV5_4Test)  Time elapsed: 0.005 s
concileFunc(org.eclipse.php.internal.core.ast.locator.PHPElementConciliatorV5_4Test)  Time elapsed: 0.003 s
concileInterface1(org.eclipse.php.internal.core.ast.locator.PHPElementConciliatorV5_4Test)  Time elapsed: 0.003 s
concileMethod1(org.eclipse.php.internal.core.ast.locator.PHPElementConciliatorV5_4Test)  Time elapsed: 0.003 s
concileMethod2(org.eclipse.php.internal.core.ast.locator.PHPElementConciliatorV5_4Test)  Time elapsed: 0.002 s
concileMethod3(org.eclipse.php.internal.core.ast.locator.PHPElementConciliatorV5_4Test)  Time elapsed: 0.002 s
concileMethod4(org.eclipse.php.internal.core.ast.locator.PHPElementConciliatorV5_4Test)  Time elapsed: 0.002 s
concileField1(org.eclipse.php.internal.core.ast.locator.PHPElementConciliatorV5_4Test)  Time elapsed: 0.001 s
concileField2(org.eclipse.php.internal.core.ast.locator.PHPElementConciliatorV5_4Test)  Time elapsed: 0.001 s
concileGlobalVar1(org.eclipse.php.internal.core.ast.locator.PHPElementConciliatorV5_4Test)  Time elapsed: 0.002 s
concileStaticField1(org.eclipse.php.internal.core.ast.locator.PHPElementConciliatorV5_4Test)  Time elapsed: 0.001 s
concileClassName1(org.eclipse.php.internal.core.ast.locator.PHPElementConciliatorV5_4Test)  Time elapsed: 0.001 s
concileClassName2(org.eclipse.php.internal.core.ast.locator.PHPElementConciliatorV5_4Test)  Time elapsed: 0.002 s
concileConstant1(org.eclipse.php.internal.core.ast.locator.PHPElementConciliatorV5_4Test)  Time elapsed: 0.001 s
concileConstant2(org.eclipse.php.internal.core.ast.locator.PHPElementConciliatorV5_4Test)  Time elapsed: 0.002 s
concileConstant3(org.eclipse.php.internal.core.ast.locator.PHPElementConciliatorV5_4Test)  Time elapsed: 0.001 s
concileClassName(org.eclipse.php.internal.core.ast.locator.PHPElementConciliatorV5_4Test)  Time elapsed: 0.001 s
concileGlobalVar(org.eclipse.php.internal.core.ast.locator.PHPElementConciliatorV5_4Test)  Time elapsed: 0.002 s
concileInterface(org.eclipse.php.internal.core.ast.locator.PHPElementConciliatorV5_4Test)  Time elapsed: 0.001 s
localVar(org.eclipse.php.internal.core.ast.locator.PHPElementConciliatorV5_4Test)  Time elapsed: 0.002 s
concileFunc1(org.eclipse.php.internal.core.ast.locator.PHPElementConciliatorV5_4Test)  Time elapsed: 0.001 s
concileConstant(org.eclipse.php.internal.core.ast.locator.PHPElementConciliatorV5_5Test)  Time elapsed: 0.012 s
concileProgram(org.eclipse.php.internal.core.ast.locator.PHPElementConciliatorV5_5Test)  Time elapsed: 0.005 s
concileFunc(org.eclipse.php.internal.core.ast.locator.PHPElementConciliatorV5_5Test)  Time elapsed: 0.005 s
concileInterface1(org.eclipse.php.internal.core.ast.locator.PHPElementConciliatorV5_5Test)  Time elapsed: 0.003 s
concileMethod1(org.eclipse.php.internal.core.ast.locator.PHPElementConciliatorV5_5Test)  Time elapsed: 0.003 s
concileMethod2(org.eclipse.php.internal.core.ast.locator.PHPElementConciliatorV5_5Test)  Time elapsed: 0.002 s
concileMethod3(org.eclipse.php.internal.core.ast.locator.PHPElementConciliatorV5_5Test)  Time elapsed: 0.003 s
concileMethod4(org.eclipse.php.internal.core.ast.locator.PHPElementConciliatorV5_5Test)  Time elapsed: 0.002 s
concileField1(org.eclipse.php.internal.core.ast.locator.PHPElementConciliatorV5_5Test)  Time elapsed: 0.003 s
concileField2(org.eclipse.php.internal.core.ast.locator.PHPElementConciliatorV5_5Test)  Time elapsed: 0.002 s
concileGlobalVar1(org.eclipse.php.internal.core.ast.locator.PHPElementConciliatorV5_5Test)  Time elapsed: 0.003 s
concileStaticField1(org.eclipse.php.internal.core.ast.locator.PHPElementConciliatorV5_5Test)  Time elapsed: 0.002 s
concileClassName1(org.eclipse.php.internal.core.ast.locator.PHPElementConciliatorV5_5Test)  Time elapsed: 0.002 s
concileClassName2(org.eclipse.php.internal.core.ast.locator.PHPElementConciliatorV5_5Test)  Time elapsed: 0.002 s
concileConstant1(org.eclipse.php.internal.core.ast.locator.PHPElementConciliatorV5_5Test)  Time elapsed: 0.002 s
concileConstant2(org.eclipse.php.internal.core.ast.locator.PHPElementConciliatorV5_5Test)  Time elapsed: 0.002 s
concileConstant3(org.eclipse.php.internal.core.ast.locator.PHPElementConciliatorV5_5Test)  Time elapsed: 0.002 s
concileClassName(org.eclipse.php.internal.core.ast.locator.PHPElementConciliatorV5_5Test)  Time elapsed: 0.001 s
concileGlobalVar(org.eclipse.php.internal.core.ast.locator.PHPElementConciliatorV5_5Test)  Time elapsed: 0.002 s
concileInterface(org.eclipse.php.internal.core.ast.locator.PHPElementConciliatorV5_5Test)  Time elapsed: 0.002 s
localVar(org.eclipse.php.internal.core.ast.locator.PHPElementConciliatorV5_5Test)  Time elapsed: 0.002 s
concileFunc1(org.eclipse.php.internal.core.ast.locator.PHPElementConciliatorV5_5Test)  Time elapsed: 0.002 s
concileConstant(org.eclipse.php.internal.core.ast.locator.PHPElementConciliatorV5_6Test)  Time elapsed: 0.013 s
concileProgram(org.eclipse.php.internal.core.ast.locator.PHPElementConciliatorV5_6Test)  Time elapsed: 0.007 s
concileFunc(org.eclipse.php.internal.core.ast.locator.PHPElementConciliatorV5_6Test)  Time elapsed: 0.003 s
concileInterface1(org.eclipse.php.internal.core.ast.locator.PHPElementConciliatorV5_6Test)  Time elapsed: 0.002 s
concileMethod1(org.eclipse.php.internal.core.ast.locator.PHPElementConciliatorV5_6Test)  Time elapsed: 0.003 s
concileMethod2(org.eclipse.php.internal.core.ast.locator.PHPElementConciliatorV5_6Test)  Time elapsed: 0.001 s
concileMethod3(org.eclipse.php.internal.core.ast.locator.PHPElementConciliatorV5_6Test)  Time elapsed: 0.002 s
concileMethod4(org.eclipse.php.internal.core.ast.locator.PHPElementConciliatorV5_6Test)  Time elapsed: 0.002 s
concileField1(org.eclipse.php.internal.core.ast.locator.PHPElementConciliatorV5_6Test)  Time elapsed: 0.001 s
concileField2(org.eclipse.php.internal.core.ast.locator.PHPElementConciliatorV5_6Test)  Time elapsed: 0.002 s
concileGlobalVar1(org.eclipse.php.internal.core.ast.locator.PHPElementConciliatorV5_6Test)  Time elapsed: 0.001 s
concileStaticField1(org.eclipse.php.internal.core.ast.locator.PHPElementConciliatorV5_6Test)  Time elapsed: 0.002 s
concileClassName1(org.eclipse.php.internal.core.ast.locator.PHPElementConciliatorV5_6Test)  Time elapsed: 0.001 s
concileClassName2(org.eclipse.php.internal.core.ast.locator.PHPElementConciliatorV5_6Test)  Time elapsed: 0.002 s
concileConstant1(org.eclipse.php.internal.core.ast.locator.PHPElementConciliatorV5_6Test)  Time elapsed: 0.002 s
concileConstant2(org.eclipse.php.internal.core.ast.locator.PHPElementConciliatorV5_6Test)  Time elapsed: 0.001 s
concileConstant3(org.eclipse.php.internal.core.ast.locator.PHPElementConciliatorV5_6Test)  Time elapsed: 0.002 s
concileClassName(org.eclipse.php.internal.core.ast.locator.PHPElementConciliatorV5_6Test)  Time elapsed: 0.001 s
concileGlobalVar(org.eclipse.php.internal.core.ast.locator.PHPElementConciliatorV5_6Test)  Time elapsed: 0.001 s
concileInterface(org.eclipse.php.internal.core.ast.locator.PHPElementConciliatorV5_6Test)  Time elapsed: 0.001 s
localVar(org.eclipse.php.internal.core.ast.locator.PHPElementConciliatorV5_6Test)  Time elapsed: 0.002 s
concileFunc1(org.eclipse.php.internal.core.ast.locator.PHPElementConciliatorV5_6Test)  Time elapsed: 0.001 s
concileLambdaFunctionReturnType(org.eclipse.php.internal.core.ast.locator.PHPElementConciliatorV7Test)  Time elapsed: 0.032 s
concileFunctionReturnType(org.eclipse.php.internal.core.ast.locator.PHPElementConciliatorV7Test)  Time elapsed: 0.004 s
concileAnonymousClassDeclaration(org.eclipse.php.internal.core.ast.locator.PHPElementConciliatorV7Test)  Time elapsed: 0.003 s
concileConstant(org.eclipse.php.internal.core.ast.locator.PHPElementConciliatorV7Test)  Time elapsed: 0.005 s
concileProgram(org.eclipse.php.internal.core.ast.locator.PHPElementConciliatorV7Test)  Time elapsed: 0.004 s
concileFunc(org.eclipse.php.internal.core.ast.locator.PHPElementConciliatorV7Test)  Time elapsed: 0.002 s
concileInterface1(org.eclipse.php.internal.core.ast.locator.PHPElementConciliatorV7Test)  Time elapsed: 0.002 s
concileMethod1(org.eclipse.php.internal.core.ast.locator.PHPElementConciliatorV7Test)  Time elapsed: 0.005 s
concileMethod2(org.eclipse.php.internal.core.ast.locator.PHPElementConciliatorV7Test)  Time elapsed: 0.002 s
concileMethod3(org.eclipse.php.internal.core.ast.locator.PHPElementConciliatorV7Test)  Time elapsed: 0.002 s
concileMethod4(org.eclipse.php.internal.core.ast.locator.PHPElementConciliatorV7Test)  Time elapsed: 0.002 s
concileField1(org.eclipse.php.internal.core.ast.locator.PHPElementConciliatorV7Test)  Time elapsed: 0.002 s
concileField2(org.eclipse.php.internal.core.ast.locator.PHPElementConciliatorV7Test)  Time elapsed: 0.002 s
concileGlobalVar1(org.eclipse.php.internal.core.ast.locator.PHPElementConciliatorV7Test)  Time elapsed: 0.002 s
concileStaticField1(org.eclipse.php.internal.core.ast.locator.PHPElementConciliatorV7Test)  Time elapsed: 0.002 s
concileClassName1(org.eclipse.php.internal.core.ast.locator.PHPElementConciliatorV7Test)  Time elapsed: 0.002 s
concileClassName2(org.eclipse.php.internal.core.ast.locator.PHPElementConciliatorV7Test)  Time elapsed: 0.003 s
concileConstant1(org.eclipse.php.internal.core.ast.locator.PHPElementConciliatorV7Test)  Time elapsed: 0.002 s
concileConstant2(org.eclipse.php.internal.core.ast.locator.PHPElementConciliatorV7Test)  Time elapsed: 0.002 s
concileConstant3(org.eclipse.php.internal.core.ast.locator.PHPElementConciliatorV7Test)  Time elapsed: 0.002 s
concileClassName(org.eclipse.php.internal.core.ast.locator.PHPElementConciliatorV7Test)  Time elapsed: 0.002 s
concileGlobalVar(org.eclipse.php.internal.core.ast.locator.PHPElementConciliatorV7Test)  Time elapsed: 0.002 s
concileInterface(org.eclipse.php.internal.core.ast.locator.PHPElementConciliatorV7Test)  Time elapsed: 0.002 s
localVar(org.eclipse.php.internal.core.ast.locator.PHPElementConciliatorV7Test)  Time elapsed: 0.002 s
concileFunc1(org.eclipse.php.internal.core.ast.locator.PHPElementConciliatorV7Test)  Time elapsed: 0.004 s
occurrences[workspace/markoccurrence/php5/testClassMembersOccurrences1.pdtt](org.eclipse.php.core.tests.markoccurrence.MarkOccurrenceTests)  Time elapsed: 0.034 s
occurrences[workspace/markoccurrence/php5/testClassMembersOccurrences2.pdtt](org.eclipse.php.core.tests.markoccurrence.MarkOccurrenceTests)  Time elapsed: 0.008 s
occurrences[workspace/markoccurrence/php5/testClassMembersOccurrences3.pdtt](org.eclipse.php.core.tests.markoccurrence.MarkOccurrenceTests)  Time elapsed: 0.027 s
occurrences[workspace/markoccurrence/php5/testClassNameOccurrences1.pdtt](org.eclipse.php.core.tests.markoccurrence.MarkOccurrenceTests)  Time elapsed: 0.005 s
occurrences[workspace/markoccurrence/php5/testClassNameOccurrences3.pdtt](org.eclipse.php.core.tests.markoccurrence.MarkOccurrenceTests)  Time elapsed: 0.002 s
occurrences[workspace/markoccurrence/php5/testConstantOccurrences1.pdtt](org.eclipse.php.core.tests.markoccurrence.MarkOccurrenceTests)  Time elapsed: 0.004 s
occurrences[workspace/markoccurrence/php5/testConstantOccurrences2.pdtt](org.eclipse.php.core.tests.markoccurrence.MarkOccurrenceTests)  Time elapsed: 0.002 s
occurrences[workspace/markoccurrence/php5/testFunctionOccurrences1.pdtt](org.eclipse.php.core.tests.markoccurrence.MarkOccurrenceTests)  Time elapsed: 0.003 s
occurrences[workspace/markoccurrence/php5/testFunctionOccurrences2.pdtt](org.eclipse.php.core.tests.markoccurrence.MarkOccurrenceTests)  Time elapsed: 0.002 s
occurrences[workspace/markoccurrence/php5/testGlobalVariableOccurrences1.pdtt](org.eclipse.php.core.tests.markoccurrence.MarkOccurrenceTests)  Time elapsed: 0.004 s
occurrences[workspace/markoccurrence/php5/testGlobalVariableOccurrences2.pdtt](org.eclipse.php.core.tests.markoccurrence.MarkOccurrenceTests)  Time elapsed: 0.002 s
occurrences[workspace/markoccurrence/php5/testLocalVariableOccurrences1.pdtt](org.eclipse.php.core.tests.markoccurrence.MarkOccurrenceTests)  Time elapsed: 0.002 s
occurrences[workspace/markoccurrence/php5/testLocalVariableOccurrences2.pdtt](org.eclipse.php.core.tests.markoccurrence.MarkOccurrenceTests)  Time elapsed: 0.002 s
occurrences[workspace/markoccurrence/php5/testPhpQuotedStrings.pdtt](org.eclipse.php.core.tests.markoccurrence.MarkOccurrenceTests)  Time elapsed: 0.003 s
occurrences[workspace/markoccurrence/php5/testClassMembersOccurrences1.pdtt](org.eclipse.php.core.tests.markoccurrence.MarkOccurrenceTests)  Time elapsed: 0.012 s
occurrences[workspace/markoccurrence/php5/testClassMembersOccurrences2.pdtt](org.eclipse.php.core.tests.markoccurrence.MarkOccurrenceTests)  Time elapsed: 0.007 s
occurrences[workspace/markoccurrence/php5/testClassMembersOccurrences3.pdtt](org.eclipse.php.core.tests.markoccurrence.MarkOccurrenceTests)  Time elapsed: 0.005 s
occurrences[workspace/markoccurrence/php5/testClassNameOccurrences1.pdtt](org.eclipse.php.core.tests.markoccurrence.MarkOccurrenceTests)  Time elapsed: 0.001 s
occurrences[workspace/markoccurrence/php5/testClassNameOccurrences3.pdtt](org.eclipse.php.core.tests.markoccurrence.MarkOccurrenceTests)  Time elapsed: 0.002 s
occurrences[workspace/markoccurrence/php5/testConstantOccurrences1.pdtt](org.eclipse.php.core.tests.markoccurrence.MarkOccurrenceTests)  Time elapsed: 0.002 s
occurrences[workspace/markoccurrence/php5/testConstantOccurrences2.pdtt](org.eclipse.php.core.tests.markoccurrence.MarkOccurrenceTests)  Time elapsed: 0.001 s
occurrences[workspace/markoccurrence/php5/testFunctionOccurrences1.pdtt](org.eclipse.php.core.tests.markoccurrence.MarkOccurrenceTests)  Time elapsed: 0.002 s
occurrences[workspace/markoccurrence/php5/testFunctionOccurrences2.pdtt](org.eclipse.php.core.tests.markoccurrence.MarkOccurrenceTests)  Time elapsed: 0.001 s
occurrences[workspace/markoccurrence/php5/testGlobalVariableOccurrences1.pdtt](org.eclipse.php.core.tests.markoccurrence.MarkOccurrenceTests)  Time elapsed: 0.002 s
occurrences[workspace/markoccurrence/php5/testGlobalVariableOccurrences2.pdtt](org.eclipse.php.core.tests.markoccurrence.MarkOccurrenceTests)  Time elapsed: 0.001 s
occurrences[workspace/markoccurrence/php5/testLocalVariableOccurrences1.pdtt](org.eclipse.php.core.tests.markoccurrence.MarkOccurrenceTests)  Time elapsed: 0.002 s
occurrences[workspace/markoccurrence/php5/testLocalVariableOccurrences2.pdtt](org.eclipse.php.core.tests.markoccurrence.MarkOccurrenceTests)  Time elapsed: 0.001 s
occurrences[workspace/markoccurrence/php5/testPhpQuotedStrings.pdtt](org.eclipse.php.core.tests.markoccurrence.MarkOccurrenceTests)  Time elapsed: 0.003 s
occurrences[workspace/markoccurrence/php53/testClassMembersOccurrences1.pdtt](org.eclipse.php.core.tests.markoccurrence.MarkOccurrenceTests)  Time elapsed: 0.005 s
occurrences[workspace/markoccurrence/php53/testClassMembersOccurrences2.pdtt](org.eclipse.php.core.tests.markoccurrence.MarkOccurrenceTests)  Time elapsed: 0.004 s
occurrences[workspace/markoccurrence/php53/testClassMembersOccurrences3.pdtt](org.eclipse.php.core.tests.markoccurrence.MarkOccurrenceTests)  Time elapsed: 0.005 s
occurrences[workspace/markoccurrence/php53/testClassNameOccurrences1.pdtt](org.eclipse.php.core.tests.markoccurrence.MarkOccurrenceTests)  Time elapsed: 0.003 s
occurrences[workspace/markoccurrence/php53/testFunctionOccurrences1.pdtt](org.eclipse.php.core.tests.markoccurrence.MarkOccurrenceTests)  Time elapsed: 0.003 s
occurrences[workspace/markoccurrence/php53/testGlobalConstantOccurrences1.pdtt](org.eclipse.php.core.tests.markoccurrence.MarkOccurrenceTests)  Time elapsed: 0.002 s
occurrences[workspace/markoccurrence/php53/testGlobalConstantOccurrences2.pdtt](org.eclipse.php.core.tests.markoccurrence.MarkOccurrenceTests)  Time elapsed: 0.003 s
occurrences[workspace/markoccurrence/php53/testGlobalVariableOccurrences1.pdtt](org.eclipse.php.core.tests.markoccurrence.MarkOccurrenceTests)  Time elapsed: 0.002 s
occurrences[workspace/markoccurrence/php53/testGlobalVariableOccurrences3.pdtt](org.eclipse.php.core.tests.markoccurrence.MarkOccurrenceTests)  Time elapsed: 0.002 s
occurrences[workspace/markoccurrence/php53/testLocalVariableOccurrences1.pdtt](org.eclipse.php.core.tests.markoccurrence.MarkOccurrenceTests)  Time elapsed: 0.001 s
occurrences[workspace/markoccurrence/php53/testLocalVariableOccurrences2.pdtt](org.eclipse.php.core.tests.markoccurrence.MarkOccurrenceTests)  Time elapsed: 0.002 s
occurrences[workspace/markoccurrence/php5/testClassMembersOccurrences1.pdtt](org.eclipse.php.core.tests.markoccurrence.MarkOccurrenceTests)  Time elapsed: 0.018 s
occurrences[workspace/markoccurrence/php5/testClassMembersOccurrences2.pdtt](org.eclipse.php.core.tests.markoccurrence.MarkOccurrenceTests)  Time elapsed: 0.005 s
occurrences[workspace/markoccurrence/php5/testClassMembersOccurrences3.pdtt](org.eclipse.php.core.tests.markoccurrence.MarkOccurrenceTests)  Time elapsed: 0.005 s
occurrences[workspace/markoccurrence/php5/testClassNameOccurrences1.pdtt](org.eclipse.php.core.tests.markoccurrence.MarkOccurrenceTests)  Time elapsed: 0.005 s
occurrences[workspace/markoccurrence/php5/testClassNameOccurrences3.pdtt](org.eclipse.php.core.tests.markoccurrence.MarkOccurrenceTests)  Time elapsed: 0.001 s
occurrences[workspace/markoccurrence/php5/testConstantOccurrences1.pdtt](org.eclipse.php.core.tests.markoccurrence.MarkOccurrenceTests)  Time elapsed: 0.001 s
occurrences[workspace/markoccurrence/php5/testConstantOccurrences2.pdtt](org.eclipse.php.core.tests.markoccurrence.MarkOccurrenceTests)  Time elapsed: 0.002 s
occurrences[workspace/markoccurrence/php5/testFunctionOccurrences1.pdtt](org.eclipse.php.core.tests.markoccurrence.MarkOccurrenceTests)  Time elapsed: 0.001 s
occurrences[workspace/markoccurrence/php5/testFunctionOccurrences2.pdtt](org.eclipse.php.core.tests.markoccurrence.MarkOccurrenceTests)  Time elapsed: 0.001 s
occurrences[workspace/markoccurrence/php5/testGlobalVariableOccurrences1.pdtt](org.eclipse.php.core.tests.markoccurrence.MarkOccurrenceTests)  Time elapsed: 0.001 s
occurrences[workspace/markoccurrence/php5/testGlobalVariableOccurrences2.pdtt](org.eclipse.php.core.tests.markoccurrence.MarkOccurrenceTests)  Time elapsed: 0.002 s
occurrences[workspace/markoccurrence/php5/testLocalVariableOccurrences1.pdtt](org.eclipse.php.core.tests.markoccurrence.MarkOccurrenceTests)  Time elapsed: 0.001 s
occurrences[workspace/markoccurrence/php5/testLocalVariableOccurrences2.pdtt](org.eclipse.php.core.tests.markoccurrence.MarkOccurrenceTests)  Time elapsed: 0.002 s
occurrences[workspace/markoccurrence/php5/testPhpQuotedStrings.pdtt](org.eclipse.php.core.tests.markoccurrence.MarkOccurrenceTests)  Time elapsed: 0.003 s
occurrences[workspace/markoccurrence/php53/testClassMembersOccurrences1.pdtt](org.eclipse.php.core.tests.markoccurrence.MarkOccurrenceTests)  Time elapsed: 0.007 s
occurrences[workspace/markoccurrence/php53/testClassMembersOccurrences2.pdtt](org.eclipse.php.core.tests.markoccurrence.MarkOccurrenceTests)  Time elapsed: 0.005 s
occurrences[workspace/markoccurrence/php53/testClassMembersOccurrences3.pdtt](org.eclipse.php.core.tests.markoccurrence.MarkOccurrenceTests)  Time elapsed: 0.004 s
occurrences[workspace/markoccurrence/php53/testClassNameOccurrences1.pdtt](org.eclipse.php.core.tests.markoccurrence.MarkOccurrenceTests)  Time elapsed: 0.002 s
occurrences[workspace/markoccurrence/php53/testFunctionOccurrences1.pdtt](org.eclipse.php.core.tests.markoccurrence.MarkOccurrenceTests)  Time elapsed: 0.002 s
occurrences[workspace/markoccurrence/php53/testGlobalConstantOccurrences1.pdtt](org.eclipse.php.core.tests.markoccurrence.MarkOccurrenceTests)  Time elapsed: 0.002 s
occurrences[workspace/markoccurrence/php53/testGlobalConstantOccurrences2.pdtt](org.eclipse.php.core.tests.markoccurrence.MarkOccurrenceTests)  Time elapsed: 0.002 s
occurrences[workspace/markoccurrence/php53/testGlobalVariableOccurrences1.pdtt](org.eclipse.php.core.tests.markoccurrence.MarkOccurrenceTests)  Time elapsed: 0.002 s
occurrences[workspace/markoccurrence/php53/testGlobalVariableOccurrences3.pdtt](org.eclipse.php.core.tests.markoccurrence.MarkOccurrenceTests)  Time elapsed: 0.001 s
occurrences[workspace/markoccurrence/php53/testLocalVariableOccurrences1.pdtt](org.eclipse.php.core.tests.markoccurrence.MarkOccurrenceTests)  Time elapsed: 0.002 s
occurrences[workspace/markoccurrence/php53/testLocalVariableOccurrences2.pdtt](org.eclipse.php.core.tests.markoccurrence.MarkOccurrenceTests)  Time elapsed: 0.002 s
occurrences[workspace/markoccurrence/php54/testTraitMembersOccurrences1.pdtt](org.eclipse.php.core.tests.markoccurrence.MarkOccurrenceTests)  Time elapsed: 0.006 s
occurrences[workspace/markoccurrence/php54/testTraitMembersOccurrences2.pdtt](org.eclipse.php.core.tests.markoccurrence.MarkOccurrenceTests)  Time elapsed: 0.005 s
occurrences[workspace/markoccurrence/php54/testTraitMembersOccurrences3.pdtt](org.eclipse.php.core.tests.markoccurrence.MarkOccurrenceTests)  Time elapsed: 0.006 s
occurrences[workspace/markoccurrence/php54/testTraitMembersOccurrences4.pdtt](org.eclipse.php.core.tests.markoccurrence.MarkOccurrenceTests)  Time elapsed: 0.005 s
occurrences[workspace/markoccurrence/php54/testTraitMembersOccurrences5.pdtt](org.eclipse.php.core.tests.markoccurrence.MarkOccurrenceTests)  Time elapsed: 0.005 s
occurrences[workspace/markoccurrence/php54/testTraitMembersOccurrences6.pdtt](org.eclipse.php.core.tests.markoccurrence.MarkOccurrenceTests)  Time elapsed: 0.005 s
occurrences[workspace/markoccurrence/php54/testTraitMembersOccurrences7.pdtt](org.eclipse.php.core.tests.markoccurrence.MarkOccurrenceTests)  Time elapsed: 0.005 s
occurrences[workspace/markoccurrence/php54/testTraitMembersOccurrences8.pdtt](org.eclipse.php.core.tests.markoccurrence.MarkOccurrenceTests)  Time elapsed: 0.007 s
occurrences[workspace/markoccurrence/php5/testClassMembersOccurrences1.pdtt](org.eclipse.php.core.tests.markoccurrence.MarkOccurrenceTests)  Time elapsed: 0.019 s
occurrences[workspace/markoccurrence/php5/testClassMembersOccurrences2.pdtt](org.eclipse.php.core.tests.markoccurrence.MarkOccurrenceTests)  Time elapsed: 0.014 s
occurrences[workspace/markoccurrence/php5/testClassMembersOccurrences3.pdtt](org.eclipse.php.core.tests.markoccurrence.MarkOccurrenceTests)  Time elapsed: 0.007 s
occurrences[workspace/markoccurrence/php5/testClassNameOccurrences1.pdtt](org.eclipse.php.core.tests.markoccurrence.MarkOccurrenceTests)  Time elapsed: 0.001 s
occurrences[workspace/markoccurrence/php5/testClassNameOccurrences3.pdtt](org.eclipse.php.core.tests.markoccurrence.MarkOccurrenceTests)  Time elapsed: 0.002 s
occurrences[workspace/markoccurrence/php5/testConstantOccurrences1.pdtt](org.eclipse.php.core.tests.markoccurrence.MarkOccurrenceTests)  Time elapsed: 0.002 s
occurrences[workspace/markoccurrence/php5/testConstantOccurrences2.pdtt](org.eclipse.php.core.tests.markoccurrence.MarkOccurrenceTests)  Time elapsed: 0.001 s
occurrences[workspace/markoccurrence/php5/testFunctionOccurrences1.pdtt](org.eclipse.php.core.tests.markoccurrence.MarkOccurrenceTests)  Time elapsed: 0.002 s
occurrences[workspace/markoccurrence/php5/testFunctionOccurrences2.pdtt](org.eclipse.php.core.tests.markoccurrence.MarkOccurrenceTests)  Time elapsed: 0.002 s
occurrences[workspace/markoccurrence/php5/testGlobalVariableOccurrences1.pdtt](org.eclipse.php.core.tests.markoccurrence.MarkOccurrenceTests)  Time elapsed: 0.001 s
occurrences[workspace/markoccurrence/php5/testGlobalVariableOccurrences2.pdtt](org.eclipse.php.core.tests.markoccurrence.MarkOccurrenceTests)  Time elapsed: 0.001 s
occurrences[workspace/markoccurrence/php5/testLocalVariableOccurrences1.pdtt](org.eclipse.php.core.tests.markoccurrence.MarkOccurrenceTests)  Time elapsed: 0.002 s
occurrences[workspace/markoccurrence/php5/testLocalVariableOccurrences2.pdtt](org.eclipse.php.core.tests.markoccurrence.MarkOccurrenceTests)  Time elapsed: 0.001 s
occurrences[workspace/markoccurrence/php5/testPhpQuotedStrings.pdtt](org.eclipse.php.core.tests.markoccurrence.MarkOccurrenceTests)  Time elapsed: 0.003 s
occurrences[workspace/markoccurrence/php53/testClassMembersOccurrences1.pdtt](org.eclipse.php.core.tests.markoccurrence.MarkOccurrenceTests)  Time elapsed: 0.007 s
occurrences[workspace/markoccurrence/php53/testClassMembersOccurrences2.pdtt](org.eclipse.php.core.tests.markoccurrence.MarkOccurrenceTests)  Time elapsed: 0.003 s
occurrences[workspace/markoccurrence/php53/testClassMembersOccurrences3.pdtt](org.eclipse.php.core.tests.markoccurrence.MarkOccurrenceTests)  Time elapsed: 0.004 s
occurrences[workspace/markoccurrence/php53/testClassNameOccurrences1.pdtt](org.eclipse.php.core.tests.markoccurrence.MarkOccurrenceTests)  Time elapsed: 0.003 s
occurrences[workspace/markoccurrence/php53/testFunctionOccurrences1.pdtt](org.eclipse.php.core.tests.markoccurrence.MarkOccurrenceTests)  Time elapsed: 0.003 s
occurrences[workspace/markoccurrence/php53/testGlobalConstantOccurrences1.pdtt](org.eclipse.php.core.tests.markoccurrence.MarkOccurrenceTests)  Time elapsed: 0.002 s
occurrences[workspace/markoccurrence/php53/testGlobalConstantOccurrences2.pdtt](org.eclipse.php.core.tests.markoccurrence.MarkOccurrenceTests)  Time elapsed: 0.003 s
occurrences[workspace/markoccurrence/php53/testGlobalVariableOccurrences1.pdtt](org.eclipse.php.core.tests.markoccurrence.MarkOccurrenceTests)  Time elapsed: 0.001 s
occurrences[workspace/markoccurrence/php53/testGlobalVariableOccurrences3.pdtt](org.eclipse.php.core.tests.markoccurrence.MarkOccurrenceTests)  Time elapsed: 0.002 s
occurrences[workspace/markoccurrence/php53/testLocalVariableOccurrences1.pdtt](org.eclipse.php.core.tests.markoccurrence.MarkOccurrenceTests)  Time elapsed: 0.001 s
occurrences[workspace/markoccurrence/php53/testLocalVariableOccurrences2.pdtt](org.eclipse.php.core.tests.markoccurrence.MarkOccurrenceTests)  Time elapsed: 0.002 s
occurrences[workspace/markoccurrence/php54/testTraitMembersOccurrences1.pdtt](org.eclipse.php.core.tests.markoccurrence.MarkOccurrenceTests)  Time elapsed: 0.005 s
occurrences[workspace/markoccurrence/php54/testTraitMembersOccurrences2.pdtt](org.eclipse.php.core.tests.markoccurrence.MarkOccurrenceTests)  Time elapsed: 0.067 s
occurrences[workspace/markoccurrence/php54/testTraitMembersOccurrences3.pdtt](org.eclipse.php.core.tests.markoccurrence.MarkOccurrenceTests)  Time elapsed: 0.007 s
occurrences[workspace/markoccurrence/php54/testTraitMembersOccurrences4.pdtt](org.eclipse.php.core.tests.markoccurrence.MarkOccurrenceTests)  Time elapsed: 0.005 s
occurrences[workspace/markoccurrence/php54/testTraitMembersOccurrences5.pdtt](org.eclipse.php.core.tests.markoccurrence.MarkOccurrenceTests)  Time elapsed: 0.006 s
occurrences[workspace/markoccurrence/php54/testTraitMembersOccurrences6.pdtt](org.eclipse.php.core.tests.markoccurrence.MarkOccurrenceTests)  Time elapsed: 0.005 s
occurrences[workspace/markoccurrence/php54/testTraitMembersOccurrences7.pdtt](org.eclipse.php.core.tests.markoccurrence.MarkOccurrenceTests)  Time elapsed: 0.004 s
occurrences[workspace/markoccurrence/php54/testTraitMembersOccurrences8.pdtt](org.eclipse.php.core.tests.markoccurrence.MarkOccurrenceTests)  Time elapsed: 0.004 s
occurrences[workspace/markoccurrence/php5/testClassMembersOccurrences1.pdtt](org.eclipse.php.core.tests.markoccurrence.MarkOccurrenceTests)  Time elapsed: 0.034 s
occurrences[workspace/markoccurrence/php5/testClassMembersOccurrences2.pdtt](org.eclipse.php.core.tests.markoccurrence.MarkOccurrenceTests)  Time elapsed: 0.005 s
occurrences[workspace/markoccurrence/php5/testClassMembersOccurrences3.pdtt](org.eclipse.php.core.tests.markoccurrence.MarkOccurrenceTests)  Time elapsed: 0.006 s
occurrences[workspace/markoccurrence/php5/testClassNameOccurrences1.pdtt](org.eclipse.php.core.tests.markoccurrence.MarkOccurrenceTests)  Time elapsed: 0.002 s
occurrences[workspace/markoccurrence/php5/testClassNameOccurrences3.pdtt](org.eclipse.php.core.tests.markoccurrence.MarkOccurrenceTests)  Time elapsed: 0.002 s
occurrences[workspace/markoccurrence/php5/testConstantOccurrences1.pdtt](org.eclipse.php.core.tests.markoccurrence.MarkOccurrenceTests)  Time elapsed: 0.002 s
occurrences[workspace/markoccurrence/php5/testConstantOccurrences2.pdtt](org.eclipse.php.core.tests.markoccurrence.MarkOccurrenceTests)  Time elapsed: 0.001 s
occurrences[workspace/markoccurrence/php5/testFunctionOccurrences1.pdtt](org.eclipse.php.core.tests.markoccurrence.MarkOccurrenceTests)  Time elapsed: 0.002 s
occurrences[workspace/markoccurrence/php5/testFunctionOccurrences2.pdtt](org.eclipse.php.core.tests.markoccurrence.MarkOccurrenceTests)  Time elapsed: 0.002 s
occurrences[workspace/markoccurrence/php5/testGlobalVariableOccurrences1.pdtt](org.eclipse.php.core.tests.markoccurrence.MarkOccurrenceTests)  Time elapsed: 0.001 s
occurrences[workspace/markoccurrence/php5/testGlobalVariableOccurrences2.pdtt](org.eclipse.php.core.tests.markoccurrence.MarkOccurrenceTests)  Time elapsed: 0.002 s
occurrences[workspace/markoccurrence/php5/testLocalVariableOccurrences1.pdtt](org.eclipse.php.core.tests.markoccurrence.MarkOccurrenceTests)  Time elapsed: 0.001 s
occurrences[workspace/markoccurrence/php5/testLocalVariableOccurrences2.pdtt](org.eclipse.php.core.tests.markoccurrence.MarkOccurrenceTests)  Time elapsed: 0.002 s
occurrences[workspace/markoccurrence/php5/testPhpQuotedStrings.pdtt](org.eclipse.php.core.tests.markoccurrence.MarkOccurrenceTests)  Time elapsed: 0.002 s
occurrences[workspace/markoccurrence/php53/testClassMembersOccurrences1.pdtt](org.eclipse.php.core.tests.markoccurrence.MarkOccurrenceTests)  Time elapsed: 0.006 s
occurrences[workspace/markoccurrence/php53/testClassMembersOccurrences2.pdtt](org.eclipse.php.core.tests.markoccurrence.MarkOccurrenceTests)  Time elapsed: 0.004 s
occurrences[workspace/markoccurrence/php53/testClassMembersOccurrences3.pdtt](org.eclipse.php.core.tests.markoccurrence.MarkOccurrenceTests)  Time elapsed: 0.004 s
occurrences[workspace/markoccurrence/php53/testClassNameOccurrences1.pdtt](org.eclipse.php.core.tests.markoccurrence.MarkOccurrenceTests)  Time elapsed: 0.003 s
occurrences[workspace/markoccurrence/php53/testFunctionOccurrences1.pdtt](org.eclipse.php.core.tests.markoccurrence.MarkOccurrenceTests)  Time elapsed: 0.004 s
occurrences[workspace/markoccurrence/php53/testGlobalConstantOccurrences1.pdtt](org.eclipse.php.core.tests.markoccurrence.MarkOccurrenceTests)  Time elapsed: 0.003 s
occurrences[workspace/markoccurrence/php53/testGlobalConstantOccurrences2.pdtt](org.eclipse.php.core.tests.markoccurrence.MarkOccurrenceTests)  Time elapsed: 0.003 s
occurrences[workspace/markoccurrence/php53/testGlobalVariableOccurrences1.pdtt](org.eclipse.php.core.tests.markoccurrence.MarkOccurrenceTests)  Time elapsed: 0.003 s
occurrences[workspace/markoccurrence/php53/testGlobalVariableOccurrences3.pdtt](org.eclipse.php.core.tests.markoccurrence.MarkOccurrenceTests)  Time elapsed: 0.002 s
occurrences[workspace/markoccurrence/php53/testLocalVariableOccurrences1.pdtt](org.eclipse.php.core.tests.markoccurrence.MarkOccurrenceTests)  Time elapsed: 0.001 s
occurrences[workspace/markoccurrence/php53/testLocalVariableOccurrences2.pdtt](org.eclipse.php.core.tests.markoccurrence.MarkOccurrenceTests)  Time elapsed: 0.002 s
occurrences[workspace/markoccurrence/php54/testTraitMembersOccurrences1.pdtt](org.eclipse.php.core.tests.markoccurrence.MarkOccurrenceTests)  Time elapsed: 0.008 s
occurrences[workspace/markoccurrence/php54/testTraitMembersOccurrences2.pdtt](org.eclipse.php.core.tests.markoccurrence.MarkOccurrenceTests)  Time elapsed: 0.006 s
occurrences[workspace/markoccurrence/php54/testTraitMembersOccurrences3.pdtt](org.eclipse.php.core.tests.markoccurrence.MarkOccurrenceTests)  Time elapsed: 0.007 s
occurrences[workspace/markoccurrence/php54/testTraitMembersOccurrences4.pdtt](org.eclipse.php.core.tests.markoccurrence.MarkOccurrenceTests)  Time elapsed: 0.007 s
occurrences[workspace/markoccurrence/php54/testTraitMembersOccurrences5.pdtt](org.eclipse.php.core.tests.markoccurrence.MarkOccurrenceTests)  Time elapsed: 0.007 s
occurrences[workspace/markoccurrence/php54/testTraitMembersOccurrences6.pdtt](org.eclipse.php.core.tests.markoccurrence.MarkOccurrenceTests)  Time elapsed: 0.005 s
occurrences[workspace/markoccurrence/php54/testTraitMembersOccurrences7.pdtt](org.eclipse.php.core.tests.markoccurrence.MarkOccurrenceTests)  Time elapsed: 0.006 s
occurrences[workspace/markoccurrence/php54/testTraitMembersOccurrences8.pdtt](org.eclipse.php.core.tests.markoccurrence.MarkOccurrenceTests)  Time elapsed: 0.005 s
occurrences[workspace/markoccurrence/php56/testVariadicParameter01.pdtt](org.eclipse.php.core.tests.markoccurrence.MarkOccurrenceTests)  Time elapsed: 0.002 s
occurrences[workspace/markoccurrence/php5/testClassMembersOccurrences1.pdtt](org.eclipse.php.core.tests.markoccurrence.MarkOccurrenceTests)  Time elapsed: 0.017 s
occurrences[workspace/markoccurrence/php5/testClassMembersOccurrences2.pdtt](org.eclipse.php.core.tests.markoccurrence.MarkOccurrenceTests)  Time elapsed: 0.009 s
occurrences[workspace/markoccurrence/php5/testClassMembersOccurrences3.pdtt](org.eclipse.php.core.tests.markoccurrence.MarkOccurrenceTests)  Time elapsed: 0.008 s
occurrences[workspace/markoccurrence/php5/testClassNameOccurrences1.pdtt](org.eclipse.php.core.tests.markoccurrence.MarkOccurrenceTests)  Time elapsed: 0.003 s
occurrences[workspace/markoccurrence/php5/testClassNameOccurrences3.pdtt](org.eclipse.php.core.tests.markoccurrence.MarkOccurrenceTests)  Time elapsed: 0.003 s
occurrences[workspace/markoccurrence/php5/testConstantOccurrences1.pdtt](org.eclipse.php.core.tests.markoccurrence.MarkOccurrenceTests)  Time elapsed: 0.003 s
occurrences[workspace/markoccurrence/php5/testConstantOccurrences2.pdtt](org.eclipse.php.core.tests.markoccurrence.MarkOccurrenceTests)  Time elapsed: 0.003 s
occurrences[workspace/markoccurrence/php5/testFunctionOccurrences1.pdtt](org.eclipse.php.core.tests.markoccurrence.MarkOccurrenceTests)  Time elapsed: 0.003 s
occurrences[workspace/markoccurrence/php5/testFunctionOccurrences2.pdtt](org.eclipse.php.core.tests.markoccurrence.MarkOccurrenceTests)  Time elapsed: 0.002 s
occurrences[workspace/markoccurrence/php5/testGlobalVariableOccurrences1.pdtt](org.eclipse.php.core.tests.markoccurrence.MarkOccurrenceTests)  Time elapsed: 0.002 s
occurrences[workspace/markoccurrence/php5/testGlobalVariableOccurrences2.pdtt](org.eclipse.php.core.tests.markoccurrence.MarkOccurrenceTests)  Time elapsed: 0.002 s
occurrences[workspace/markoccurrence/php5/testLocalVariableOccurrences1.pdtt](org.eclipse.php.core.tests.markoccurrence.MarkOccurrenceTests)  Time elapsed: 0.002 s
occurrences[workspace/markoccurrence/php5/testLocalVariableOccurrences2.pdtt](org.eclipse.php.core.tests.markoccurrence.MarkOccurrenceTests)  Time elapsed: 0.002 s
occurrences[workspace/markoccurrence/php5/testPhpQuotedStrings.pdtt](org.eclipse.php.core.tests.markoccurrence.MarkOccurrenceTests)  Time elapsed: 0.002 s
occurrences[workspace/markoccurrence/php53/testClassMembersOccurrences1.pdtt](org.eclipse.php.core.tests.markoccurrence.MarkOccurrenceTests)  Time elapsed: 0.006 s
occurrences[workspace/markoccurrence/php53/testClassMembersOccurrences2.pdtt](org.eclipse.php.core.tests.markoccurrence.MarkOccurrenceTests)  Time elapsed: 0.004 s
occurrences[workspace/markoccurrence/php53/testClassMembersOccurrences3.pdtt](org.eclipse.php.core.tests.markoccurrence.MarkOccurrenceTests)  Time elapsed: 0.003 s
occurrences[workspace/markoccurrence/php53/testClassNameOccurrences1.pdtt](org.eclipse.php.core.tests.markoccurrence.MarkOccurrenceTests)  Time elapsed: 0.003 s
occurrences[workspace/markoccurrence/php53/testFunctionOccurrences1.pdtt](org.eclipse.php.core.tests.markoccurrence.MarkOccurrenceTests)  Time elapsed: 0.002 s
occurrences[workspace/markoccurrence/php53/testGlobalConstantOccurrences1.pdtt](org.eclipse.php.core.tests.markoccurrence.MarkOccurrenceTests)  Time elapsed: 0.005 s
occurrences[workspace/markoccurrence/php53/testGlobalConstantOccurrences2.pdtt](org.eclipse.php.core.tests.markoccurrence.MarkOccurrenceTests)  Time elapsed: 0.002 s
occurrences[workspace/markoccurrence/php53/testGlobalVariableOccurrences1.pdtt](org.eclipse.php.core.tests.markoccurrence.MarkOccurrenceTests)  Time elapsed: 0.002 s
occurrences[workspace/markoccurrence/php53/testGlobalVariableOccurrences3.pdtt](org.eclipse.php.core.tests.markoccurrence.MarkOccurrenceTests)  Time elapsed: 0.002 s
occurrences[workspace/markoccurrence/php53/testLocalVariableOccurrences1.pdtt](org.eclipse.php.core.tests.markoccurrence.MarkOccurrenceTests)  Time elapsed: 0.001 s
occurrences[workspace/markoccurrence/php53/testLocalVariableOccurrences2.pdtt](org.eclipse.php.core.tests.markoccurrence.MarkOccurrenceTests)  Time elapsed: 0.004 s
occurrences[workspace/markoccurrence/php54/testTraitMembersOccurrences1.pdtt](org.eclipse.php.core.tests.markoccurrence.MarkOccurrenceTests)  Time elapsed: 0.008 s
occurrences[workspace/markoccurrence/php54/testTraitMembersOccurrences2.pdtt](org.eclipse.php.core.tests.markoccurrence.MarkOccurrenceTests)  Time elapsed: 0.006 s
occurrences[workspace/markoccurrence/php54/testTraitMembersOccurrences3.pdtt](org.eclipse.php.core.tests.markoccurrence.MarkOccurrenceTests)  Time elapsed: 0.006 s
occurrences[workspace/markoccurrence/php54/testTraitMembersOccurrences4.pdtt](org.eclipse.php.core.tests.markoccurrence.MarkOccurrenceTests)  Time elapsed: 0.005 s
occurrences[workspace/markoccurrence/php54/testTraitMembersOccurrences5.pdtt](org.eclipse.php.core.tests.markoccurrence.MarkOccurrenceTests)  Time elapsed: 0.005 s
occurrences[workspace/markoccurrence/php54/testTraitMembersOccurrences6.pdtt](org.eclipse.php.core.tests.markoccurrence.MarkOccurrenceTests)  Time elapsed: 0.005 s
occurrences[workspace/markoccurrence/php54/testTraitMembersOccurrences7.pdtt](org.eclipse.php.core.tests.markoccurrence.MarkOccurrenceTests)  Time elapsed: 0.006 s
occurrences[workspace/markoccurrence/php54/testTraitMembersOccurrences8.pdtt](org.eclipse.php.core.tests.markoccurrence.MarkOccurrenceTests)  Time elapsed: 0.006 s
occurrences[workspace/markoccurrence/php56/testVariadicParameter01.pdtt](org.eclipse.php.core.tests.markoccurrence.MarkOccurrenceTests)  Time elapsed: 0.002 s
occurrences[workspace/markoccurrence/php5/testClassMembersOccurrences1.pdtt](org.eclipse.php.core.tests.markoccurrence.MarkOccurrenceTests)  Time elapsed: 0.012 s
occurrences[workspace/markoccurrence/php5/testClassMembersOccurrences2.pdtt](org.eclipse.php.core.tests.markoccurrence.MarkOccurrenceTests)  Time elapsed: 0.004 s
occurrences[workspace/markoccurrence/php5/testClassMembersOccurrences3.pdtt](org.eclipse.php.core.tests.markoccurrence.MarkOccurrenceTests)  Time elapsed: 0.006 s
occurrences[workspace/markoccurrence/php5/testClassNameOccurrences1.pdtt](org.eclipse.php.core.tests.markoccurrence.MarkOccurrenceTests)  Time elapsed: 0.002 s
occurrences[workspace/markoccurrence/php5/testClassNameOccurrences3.pdtt](org.eclipse.php.core.tests.markoccurrence.MarkOccurrenceTests)  Time elapsed: 0.002 s
occurrences[workspace/markoccurrence/php5/testConstantOccurrences1.pdtt](org.eclipse.php.core.tests.markoccurrence.MarkOccurrenceTests)  Time elapsed: 0.002 s
occurrences[workspace/markoccurrence/php5/testConstantOccurrences2.pdtt](org.eclipse.php.core.tests.markoccurrence.MarkOccurrenceTests)  Time elapsed: 0.001 s
occurrences[workspace/markoccurrence/php5/testFunctionOccurrences1.pdtt](org.eclipse.php.core.tests.markoccurrence.MarkOccurrenceTests)  Time elapsed: 0.001 s
occurrences[workspace/markoccurrence/php5/testFunctionOccurrences2.pdtt](org.eclipse.php.core.tests.markoccurrence.MarkOccurrenceTests)  Time elapsed: 0.002 s
occurrences[workspace/markoccurrence/php5/testGlobalVariableOccurrences1.pdtt](org.eclipse.php.core.tests.markoccurrence.MarkOccurrenceTests)  Time elapsed: 0.001 s
occurrences[workspace/markoccurrence/php5/testGlobalVariableOccurrences2.pdtt](org.eclipse.php.core.tests.markoccurrence.MarkOccurrenceTests)  Time elapsed: 0.002 s
occurrences[workspace/markoccurrence/php5/testLocalVariableOccurrences1.pdtt](org.eclipse.php.core.tests.markoccurrence.MarkOccurrenceTests)  Time elapsed: 0.001 s
occurrences[workspace/markoccurrence/php5/testLocalVariableOccurrences2.pdtt](org.eclipse.php.core.tests.markoccurrence.MarkOccurrenceTests)  Time elapsed: 0.001 s
occurrences[workspace/markoccurrence/php5/testPhpQuotedStrings.pdtt](org.eclipse.php.core.tests.markoccurrence.MarkOccurrenceTests)  Time elapsed: 0.003 s
occurrences[workspace/markoccurrence/php53/testClassMembersOccurrences1.pdtt](org.eclipse.php.core.tests.markoccurrence.MarkOccurrenceTests)  Time elapsed: 0.005 s
occurrences[workspace/markoccurrence/php53/testClassMembersOccurrences2.pdtt](org.eclipse.php.core.tests.markoccurrence.MarkOccurrenceTests)  Time elapsed: 0.003 s
occurrences[workspace/markoccurrence/php53/testClassMembersOccurrences3.pdtt](org.eclipse.php.core.tests.markoccurrence.MarkOccurrenceTests)  Time elapsed: 0.004 s
occurrences[workspace/markoccurrence/php53/testClassNameOccurrences1.pdtt](org.eclipse.php.core.tests.markoccurrence.MarkOccurrenceTests)  Time elapsed: 0.002 s
occurrences[workspace/markoccurrence/php53/testFunctionOccurrences1.pdtt](org.eclipse.php.core.tests.markoccurrence.MarkOccurrenceTests)  Time elapsed: 0.003 s
occurrences[workspace/markoccurrence/php53/testGlobalConstantOccurrences1.pdtt](org.eclipse.php.core.tests.markoccurrence.MarkOccurrenceTests)  Time elapsed: 0.002 s
occurrences[workspace/markoccurrence/php53/testGlobalConstantOccurrences2.pdtt](org.eclipse.php.core.tests.markoccurrence.MarkOccurrenceTests)  Time elapsed: 0.002 s
occurrences[workspace/markoccurrence/php53/testGlobalVariableOccurrences1.pdtt](org.eclipse.php.core.tests.markoccurrence.MarkOccurrenceTests)  Time elapsed: 0.002 s
occurrences[workspace/markoccurrence/php53/testGlobalVariableOccurrences3.pdtt](org.eclipse.php.core.tests.markoccurrence.MarkOccurrenceTests)  Time elapsed: 0.012 s
occurrences[workspace/markoccurrence/php53/testLocalVariableOccurrences1.pdtt](org.eclipse.php.core.tests.markoccurrence.MarkOccurrenceTests)  Time elapsed: 0.001 s
occurrences[workspace/markoccurrence/php53/testLocalVariableOccurrences2.pdtt](org.eclipse.php.core.tests.markoccurrence.MarkOccurrenceTests)  Time elapsed: 0.002 s
occurrences[workspace/markoccurrence/php54/testTraitMembersOccurrences1.pdtt](org.eclipse.php.core.tests.markoccurrence.MarkOccurrenceTests)  Time elapsed: 0.007 s
occurrences[workspace/markoccurrence/php54/testTraitMembersOccurrences2.pdtt](org.eclipse.php.core.tests.markoccurrence.MarkOccurrenceTests)  Time elapsed: 0.005 s
occurrences[workspace/markoccurrence/php54/testTraitMembersOccurrences3.pdtt](org.eclipse.php.core.tests.markoccurrence.MarkOccurrenceTests)  Time elapsed: 0.006 s
occurrences[workspace/markoccurrence/php54/testTraitMembersOccurrences4.pdtt](org.eclipse.php.core.tests.markoccurrence.MarkOccurrenceTests)  Time elapsed: 0.005 s
occurrences[workspace/markoccurrence/php54/testTraitMembersOccurrences5.pdtt](org.eclipse.php.core.tests.markoccurrence.MarkOccurrenceTests)  Time elapsed: 0.004 s
occurrences[workspace/markoccurrence/php54/testTraitMembersOccurrences6.pdtt](org.eclipse.php.core.tests.markoccurrence.MarkOccurrenceTests)  Time elapsed: 0.004 s
occurrences[workspace/markoccurrence/php54/testTraitMembersOccurrences7.pdtt](org.eclipse.php.core.tests.markoccurrence.MarkOccurrenceTests)  Time elapsed: 0.005 s
occurrences[workspace/markoccurrence/php54/testTraitMembersOccurrences8.pdtt](org.eclipse.php.core.tests.markoccurrence.MarkOccurrenceTests)  Time elapsed: 0.005 s
occurrences[workspace/markoccurrence/php56/testVariadicParameter01.pdtt](org.eclipse.php.core.tests.markoccurrence.MarkOccurrenceTests)  Time elapsed: 0.002 s
occurrences[workspace/markoccurrence/php71/multipleCatch01.pdtt](org.eclipse.php.core.tests.markoccurrence.MarkOccurrenceTests)  Time elapsed: 0.002 s
occurrences[workspace/markoccurrence/php5/testClassMembersOccurrences1.pdtt](org.eclipse.php.core.tests.markoccurrence.MarkOccurrenceTests)  Time elapsed: 0.012 s
occurrences[workspace/markoccurrence/php5/testClassMembersOccurrences2.pdtt](org.eclipse.php.core.tests.markoccurrence.MarkOccurrenceTests)  Time elapsed: 0.02 s
occurrences[workspace/markoccurrence/php5/testClassMembersOccurrences3.pdtt](org.eclipse.php.core.tests.markoccurrence.MarkOccurrenceTests)  Time elapsed: 0.01 s
occurrences[workspace/markoccurrence/php5/testClassNameOccurrences1.pdtt](org.eclipse.php.core.tests.markoccurrence.MarkOccurrenceTests)  Time elapsed: 0.001 s
occurrences[workspace/markoccurrence/php5/testClassNameOccurrences3.pdtt](org.eclipse.php.core.tests.markoccurrence.MarkOccurrenceTests)  Time elapsed: 0.002 s
occurrences[workspace/markoccurrence/php5/testConstantOccurrences1.pdtt](org.eclipse.php.core.tests.markoccurrence.MarkOccurrenceTests)  Time elapsed: 0.001 s
occurrences[workspace/markoccurrence/php5/testConstantOccurrences2.pdtt](org.eclipse.php.core.tests.markoccurrence.MarkOccurrenceTests)  Time elapsed: 0.002 s
occurrences[workspace/markoccurrence/php5/testFunctionOccurrences1.pdtt](org.eclipse.php.core.tests.markoccurrence.MarkOccurrenceTests)  Time elapsed: 0.002 s
occurrences[workspace/markoccurrence/php5/testFunctionOccurrences2.pdtt](org.eclipse.php.core.tests.markoccurrence.MarkOccurrenceTests)  Time elapsed: 0.002 s
occurrences[workspace/markoccurrence/php5/testGlobalVariableOccurrences1.pdtt](org.eclipse.php.core.tests.markoccurrence.MarkOccurrenceTests)  Time elapsed: 0.002 s
occurrences[workspace/markoccurrence/php5/testGlobalVariableOccurrences2.pdtt](org.eclipse.php.core.tests.markoccurrence.MarkOccurrenceTests)  Time elapsed: 0.002 s
occurrences[workspace/markoccurrence/php5/testLocalVariableOccurrences1.pdtt](org.eclipse.php.core.tests.markoccurrence.MarkOccurrenceTests)  Time elapsed: 0.002 s
occurrences[workspace/markoccurrence/php5/testLocalVariableOccurrences2.pdtt](org.eclipse.php.core.tests.markoccurrence.MarkOccurrenceTests)  Time elapsed: 0.002 s
occurrences[workspace/markoccurrence/php5/testPhpQuotedStrings.pdtt](org.eclipse.php.core.tests.markoccurrence.MarkOccurrenceTests)  Time elapsed: 0.003 s
occurrences[workspace/markoccurrence/php53/testClassMembersOccurrences1.pdtt](org.eclipse.php.core.tests.markoccurrence.MarkOccurrenceTests)  Time elapsed: 0.007 s
occurrences[workspace/markoccurrence/php53/testClassMembersOccurrences2.pdtt](org.eclipse.php.core.tests.markoccurrence.MarkOccurrenceTests)  Time elapsed: 0.004 s
occurrences[workspace/markoccurrence/php53/testClassMembersOccurrences3.pdtt](org.eclipse.php.core.tests.markoccurrence.MarkOccurrenceTests)  Time elapsed: 0.004 s
occurrences[workspace/markoccurrence/php53/testClassNameOccurrences1.pdtt](org.eclipse.php.core.tests.markoccurrence.MarkOccurrenceTests)  Time elapsed: 0.003 s
occurrences[workspace/markoccurrence/php53/testFunctionOccurrences1.pdtt](org.eclipse.php.core.tests.markoccurrence.MarkOccurrenceTests)  Time elapsed: 0.002 s
occurrences[workspace/markoccurrence/php53/testGlobalConstantOccurrences1.pdtt](org.eclipse.php.core.tests.markoccurrence.MarkOccurrenceTests)  Time elapsed: 0.003 s
occurrences[workspace/markoccurrence/php53/testGlobalConstantOccurrences2.pdtt](org.eclipse.php.core.tests.markoccurrence.MarkOccurrenceTests)  Time elapsed: 0.003 s
occurrences[workspace/markoccurrence/php53/testGlobalVariableOccurrences1.pdtt](org.eclipse.php.core.tests.markoccurrence.MarkOccurrenceTests)  Time elapsed: 0.002 s
occurrences[workspace/markoccurrence/php53/testGlobalVariableOccurrences3.pdtt](org.eclipse.php.core.tests.markoccurrence.MarkOccurrenceTests)  Time elapsed: 0.002 s
occurrences[workspace/markoccurrence/php53/testLocalVariableOccurrences1.pdtt](org.eclipse.php.core.tests.markoccurrence.MarkOccurrenceTests)  Time elapsed: 0.002 s
occurrences[workspace/markoccurrence/php53/testLocalVariableOccurrences2.pdtt](org.eclipse.php.core.tests.markoccurrence.MarkOccurrenceTests)  Time elapsed: 0.002 s
occurrences[workspace/markoccurrence/php54/testTraitMembersOccurrences1.pdtt](org.eclipse.php.core.tests.markoccurrence.MarkOccurrenceTests)  Time elapsed: 0.009 s
occurrences[workspace/markoccurrence/php54/testTraitMembersOccurrences2.pdtt](org.eclipse.php.core.tests.markoccurrence.MarkOccurrenceTests)  Time elapsed: 0.016 s
occurrences[workspace/markoccurrence/php54/testTraitMembersOccurrences3.pdtt](org.eclipse.php.core.tests.markoccurrence.MarkOccurrenceTests)  Time elapsed: 0.012 s
occurrences[workspace/markoccurrence/php54/testTraitMembersOccurrences4.pdtt](org.eclipse.php.core.tests.markoccurrence.MarkOccurrenceTests)  Time elapsed: 0.012 s
occurrences[workspace/markoccurrence/php54/testTraitMembersOccurrences5.pdtt](org.eclipse.php.core.tests.markoccurrence.MarkOccurrenceTests)  Time elapsed: 0.012 s
occurrences[workspace/markoccurrence/php54/testTraitMembersOccurrences6.pdtt](org.eclipse.php.core.tests.markoccurrence.MarkOccurrenceTests)  Time elapsed: 0.011 s
occurrences[workspace/markoccurrence/php54/testTraitMembersOccurrences7.pdtt](org.eclipse.php.core.tests.markoccurrence.MarkOccurrenceTests)  Time elapsed: 0.011 s
occurrences[workspace/markoccurrence/php54/testTraitMembersOccurrences8.pdtt](org.eclipse.php.core.tests.markoccurrence.MarkOccurrenceTests)  Time elapsed: 0.011 s
occurrences[workspace/markoccurrence/php56/testVariadicParameter01.pdtt](org.eclipse.php.core.tests.markoccurrence.MarkOccurrenceTests)  Time elapsed: 0.002 s
occurrences[workspace/markoccurrence/php71/multipleCatch01.pdtt](org.eclipse.php.core.tests.markoccurrence.MarkOccurrenceTests)  Time elapsed: 0.004 s
occurrences[workspace/markoccurrence/php5/testClassMembersOccurrences1.pdtt](org.eclipse.php.core.tests.markoccurrence.MarkOccurrenceTests)  Time elapsed: 0.021 s
occurrences[workspace/markoccurrence/php5/testClassMembersOccurrences2.pdtt](org.eclipse.php.core.tests.markoccurrence.MarkOccurrenceTests)  Time elapsed: 0.012 s
occurrences[workspace/markoccurrence/php5/testClassMembersOccurrences3.pdtt](org.eclipse.php.core.tests.markoccurrence.MarkOccurrenceTests)  Time elapsed: 0.007 s
occurrences[workspace/markoccurrence/php5/testClassNameOccurrences1.pdtt](org.eclipse.php.core.tests.markoccurrence.MarkOccurrenceTests)  Time elapsed: 0.002 s
occurrences[workspace/markoccurrence/php5/testClassNameOccurrences3.pdtt](org.eclipse.php.core.tests.markoccurrence.MarkOccurrenceTests)  Time elapsed: 0.002 s
occurrences[workspace/markoccurrence/php5/testConstantOccurrences1.pdtt](org.eclipse.php.core.tests.markoccurrence.MarkOccurrenceTests)  Time elapsed: 0.002 s
occurrences[workspace/markoccurrence/php5/testConstantOccurrences2.pdtt](org.eclipse.php.core.tests.markoccurrence.MarkOccurrenceTests)  Time elapsed: 0.002 s
occurrences[workspace/markoccurrence/php5/testFunctionOccurrences1.pdtt](org.eclipse.php.core.tests.markoccurrence.MarkOccurrenceTests)  Time elapsed: 0.002 s
occurrences[workspace/markoccurrence/php5/testFunctionOccurrences2.pdtt](org.eclipse.php.core.tests.markoccurrence.MarkOccurrenceTests)  Time elapsed: 0.001 s
occurrences[workspace/markoccurrence/php5/testGlobalVariableOccurrences1.pdtt](org.eclipse.php.core.tests.markoccurrence.MarkOccurrenceTests)  Time elapsed: 0.002 s
occurrences[workspace/markoccurrence/php5/testGlobalVariableOccurrences2.pdtt](org.eclipse.php.core.tests.markoccurrence.MarkOccurrenceTests)  Time elapsed: 0.001 s
occurrences[workspace/markoccurrence/php5/testLocalVariableOccurrences1.pdtt](org.eclipse.php.core.tests.markoccurrence.MarkOccurrenceTests)  Time elapsed: 0.002 s
occurrences[workspace/markoccurrence/php5/testLocalVariableOccurrences2.pdtt](org.eclipse.php.core.tests.markoccurrence.MarkOccurrenceTests)  Time elapsed: 0.002 s
occurrences[workspace/markoccurrence/php5/testPhpQuotedStrings.pdtt](org.eclipse.php.core.tests.markoccurrence.MarkOccurrenceTests)  Time elapsed: 0.003 s
occurrences[workspace/markoccurrence/php53/testClassMembersOccurrences1.pdtt](org.eclipse.php.core.tests.markoccurrence.MarkOccurrenceTests)  Time elapsed: 0.008 s
occurrences[workspace/markoccurrence/php53/testClassMembersOccurrences2.pdtt](org.eclipse.php.core.tests.markoccurrence.MarkOccurrenceTests)  Time elapsed: 0.007 s
occurrences[workspace/markoccurrence/php53/testClassMembersOccurrences3.pdtt](org.eclipse.php.core.tests.markoccurrence.MarkOccurrenceTests)  Time elapsed: 0.005 s
occurrences[workspace/markoccurrence/php53/testClassNameOccurrences1.pdtt](org.eclipse.php.core.tests.markoccurrence.MarkOccurrenceTests)  Time elapsed: 0.005 s
occurrences[workspace/markoccurrence/php53/testFunctionOccurrences1.pdtt](org.eclipse.php.core.tests.markoccurrence.MarkOccurrenceTests)  Time elapsed: 0.003 s
occurrences[workspace/markoccurrence/php53/testGlobalConstantOccurrences1.pdtt](org.eclipse.php.core.tests.markoccurrence.MarkOccurrenceTests)  Time elapsed: 0.004 s
occurrences[workspace/markoccurrence/php53/testGlobalConstantOccurrences2.pdtt](org.eclipse.php.core.tests.markoccurrence.MarkOccurrenceTests)  Time elapsed: 0.004 s
occurrences[workspace/markoccurrence/php53/testGlobalVariableOccurrences1.pdtt](org.eclipse.php.core.tests.markoccurrence.MarkOccurrenceTests)  Time elapsed: 0.002 s
occurrences[workspace/markoccurrence/php53/testGlobalVariableOccurrences3.pdtt](org.eclipse.php.core.tests.markoccurrence.MarkOccurrenceTests)  Time elapsed: 0.001 s
occurrences[workspace/markoccurrence/php53/testLocalVariableOccurrences1.pdtt](org.eclipse.php.core.tests.markoccurrence.MarkOccurrenceTests)  Time elapsed: 0.001 s
occurrences[workspace/markoccurrence/php53/testLocalVariableOccurrences2.pdtt](org.eclipse.php.core.tests.markoccurrence.MarkOccurrenceTests)  Time elapsed: 0.002 s
occurrences[workspace/markoccurrence/php54/testTraitMembersOccurrences1.pdtt](org.eclipse.php.core.tests.markoccurrence.MarkOccurrenceTests)  Time elapsed: 0.009 s
occurrences[workspace/markoccurrence/php54/testTraitMembersOccurrences2.pdtt](org.eclipse.php.core.tests.markoccurrence.MarkOccurrenceTests)  Time elapsed: 0.01 s
occurrences[workspace/markoccurrence/php54/testTraitMembersOccurrences3.pdtt](org.eclipse.php.core.tests.markoccurrence.MarkOccurrenceTests)  Time elapsed: 0.009 s
occurrences[workspace/markoccurrence/php54/testTraitMembersOccurrences4.pdtt](org.eclipse.php.core.tests.markoccurrence.MarkOccurrenceTests)  Time elapsed: 0.008 s
occurrences[workspace/markoccurrence/php54/testTraitMembersOccurrences5.pdtt](org.eclipse.php.core.tests.markoccurrence.MarkOccurrenceTests)  Time elapsed: 0.007 s
occurrences[workspace/markoccurrence/php54/testTraitMembersOccurrences6.pdtt](org.eclipse.php.core.tests.markoccurrence.MarkOccurrenceTests)  Time elapsed: 0.006 s
occurrences[workspace/markoccurrence/php54/testTraitMembersOccurrences7.pdtt](org.eclipse.php.core.tests.markoccurrence.MarkOccurrenceTests)  Time elapsed: 0.007 s
occurrences[workspace/markoccurrence/php54/testTraitMembersOccurrences8.pdtt](org.eclipse.php.core.tests.markoccurrence.MarkOccurrenceTests)  Time elapsed: 0.007 s
occurrences[workspace/markoccurrence/php56/testVariadicParameter01.pdtt](org.eclipse.php.core.tests.markoccurrence.MarkOccurrenceTests)  Time elapsed: 0.009 s
occurrences[workspace/markoccurrence/php71/multipleCatch01.pdtt](org.eclipse.php.core.tests.markoccurrence.MarkOccurrenceTests)  Time elapsed: 0.002 s
occurrences[workspace/markoccurrence/php73/testPhpQuotedStrings.pdtt](org.eclipse.php.core.tests.markoccurrence.MarkOccurrenceTests)  Time elapsed: 0.003 s
occurrences[workspace/markoccurrence/php5/testClassMembersOccurrences1.pdtt](org.eclipse.php.core.tests.markoccurrence.MarkOccurrenceTests)  Time elapsed: 0.057 s
occurrences[workspace/markoccurrence/php5/testClassMembersOccurrences2.pdtt](org.eclipse.php.core.tests.markoccurrence.MarkOccurrenceTests)  Time elapsed: 0.008 s
occurrences[workspace/markoccurrence/php5/testClassMembersOccurrences3.pdtt](org.eclipse.php.core.tests.markoccurrence.MarkOccurrenceTests)  Time elapsed: 0.007 s
occurrences[workspace/markoccurrence/php5/testClassNameOccurrences1.pdtt](org.eclipse.php.core.tests.markoccurrence.MarkOccurrenceTests)  Time elapsed: 0.002 s
occurrences[workspace/markoccurrence/php5/testClassNameOccurrences3.pdtt](org.eclipse.php.core.tests.markoccurrence.MarkOccurrenceTests)  Time elapsed: 0.002 s
occurrences[workspace/markoccurrence/php5/testConstantOccurrences1.pdtt](org.eclipse.php.core.tests.markoccurrence.MarkOccurrenceTests)  Time elapsed: 0.002 s
occurrences[workspace/markoccurrence/php5/testConstantOccurrences2.pdtt](org.eclipse.php.core.tests.markoccurrence.MarkOccurrenceTests)  Time elapsed: 0.001 s
occurrences[workspace/markoccurrence/php5/testFunctionOccurrences1.pdtt](org.eclipse.php.core.tests.markoccurrence.MarkOccurrenceTests)  Time elapsed: 0.001 s
occurrences[workspace/markoccurrence/php5/testFunctionOccurrences2.pdtt](org.eclipse.php.core.tests.markoccurrence.MarkOccurrenceTests)  Time elapsed: 0.001 s
occurrences[workspace/markoccurrence/php5/testGlobalVariableOccurrences1.pdtt](org.eclipse.php.core.tests.markoccurrence.MarkOccurrenceTests)  Time elapsed: 0.001 s
occurrences[workspace/markoccurrence/php5/testGlobalVariableOccurrences2.pdtt](org.eclipse.php.core.tests.markoccurrence.MarkOccurrenceTests)  Time elapsed: 0.002 s
occurrences[workspace/markoccurrence/php5/testLocalVariableOccurrences1.pdtt](org.eclipse.php.core.tests.markoccurrence.MarkOccurrenceTests)  Time elapsed: 0.001 s
occurrences[workspace/markoccurrence/php5/testLocalVariableOccurrences2.pdtt](org.eclipse.php.core.tests.markoccurrence.MarkOccurrenceTests)  Time elapsed: 0.001 s
occurrences[workspace/markoccurrence/php5/testPhpQuotedStrings.pdtt](org.eclipse.php.core.tests.markoccurrence.MarkOccurrenceTests)  Time elapsed: 0.002 s
occurrences[workspace/markoccurrence/php53/testClassMembersOccurrences1.pdtt](org.eclipse.php.core.tests.markoccurrence.MarkOccurrenceTests)  Time elapsed: 0.005 s
occurrences[workspace/markoccurrence/php53/testClassMembersOccurrences2.pdtt](org.eclipse.php.core.tests.markoccurrence.MarkOccurrenceTests)  Time elapsed: 0.003 s
occurrences[workspace/markoccurrence/php53/testClassMembersOccurrences3.pdtt](org.eclipse.php.core.tests.markoccurrence.MarkOccurrenceTests)  Time elapsed: 0.004 s
occurrences[workspace/markoccurrence/php53/testClassNameOccurrences1.pdtt](org.eclipse.php.core.tests.markoccurrence.MarkOccurrenceTests)  Time elapsed: 0.003 s
occurrences[workspace/markoccurrence/php53/testFunctionOccurrences1.pdtt](org.eclipse.php.core.tests.markoccurrence.MarkOccurrenceTests)  Time elapsed: 0.002 s
occurrences[workspace/markoccurrence/php53/testGlobalConstantOccurrences1.pdtt](org.eclipse.php.core.tests.markoccurrence.MarkOccurrenceTests)  Time elapsed: 0.004 s
occurrences[workspace/markoccurrence/php53/testGlobalConstantOccurrences2.pdtt](org.eclipse.php.core.tests.markoccurrence.MarkOccurrenceTests)  Time elapsed: 0.003 s
occurrences[workspace/markoccurrence/php53/testGlobalVariableOccurrences1.pdtt](org.eclipse.php.core.tests.markoccurrence.MarkOccurrenceTests)  Time elapsed: 0.002 s
occurrences[workspace/markoccurrence/php53/testGlobalVariableOccurrences3.pdtt](org.eclipse.php.core.tests.markoccurrence.MarkOccurrenceTests)  Time elapsed: 0.002 s
occurrences[workspace/markoccurrence/php53/testLocalVariableOccurrences1.pdtt](org.eclipse.php.core.tests.markoccurrence.MarkOccurrenceTests)  Time elapsed: 0.001 s
occurrences[workspace/markoccurrence/php53/testLocalVariableOccurrences2.pdtt](org.eclipse.php.core.tests.markoccurrence.MarkOccurrenceTests)  Time elapsed: 0.002 s
occurrences[workspace/markoccurrence/php54/testTraitMembersOccurrences1.pdtt](org.eclipse.php.core.tests.markoccurrence.MarkOccurrenceTests)  Time elapsed: 0.006 s
occurrences[workspace/markoccurrence/php54/testTraitMembersOccurrences2.pdtt](org.eclipse.php.core.tests.markoccurrence.MarkOccurrenceTests)  Time elapsed: 0.008 s
occurrences[workspace/markoccurrence/php54/testTraitMembersOccurrences3.pdtt](org.eclipse.php.core.tests.markoccurrence.MarkOccurrenceTests)  Time elapsed: 0.006 s
occurrences[workspace/markoccurrence/php54/testTraitMembersOccurrences4.pdtt](org.eclipse.php.core.tests.markoccurrence.MarkOccurrenceTests)  Time elapsed: 0.005 s
occurrences[workspace/markoccurrence/php54/testTraitMembersOccurrences5.pdtt](org.eclipse.php.core.tests.markoccurrence.MarkOccurrenceTests)  Time elapsed: 0.005 s
occurrences[workspace/markoccurrence/php54/testTraitMembersOccurrences6.pdtt](org.eclipse.php.core.tests.markoccurrence.MarkOccurrenceTests)  Time elapsed: 0.004 s
occurrences[workspace/markoccurrence/php54/testTraitMembersOccurrences7.pdtt](org.eclipse.php.core.tests.markoccurrence.MarkOccurrenceTests)  Time elapsed: 0.005 s
occurrences[workspace/markoccurrence/php54/testTraitMembersOccurrences8.pdtt](org.eclipse.php.core.tests.markoccurrence.MarkOccurrenceTests)  Time elapsed: 0.005 s
occurrences[workspace/markoccurrence/php56/testVariadicParameter01.pdtt](org.eclipse.php.core.tests.markoccurrence.MarkOccurrenceTests)  Time elapsed: 0.002 s
occurrences[workspace/markoccurrence/php71/multipleCatch01.pdtt](org.eclipse.php.core.tests.markoccurrence.MarkOccurrenceTests)  Time elapsed: 0.002 s
occurrences[workspace/markoccurrence/php73/testPhpQuotedStrings.pdtt](org.eclipse.php.core.tests.markoccurrence.MarkOccurrenceTests)  Time elapsed: 0.003 s
simpleXml(org.eclipse.php.core.tests.searchEngine.PHP5LanguageModelTest)  Time elapsed: 0.019 s
sockets(org.eclipse.php.core.tests.searchEngine.PHP5LanguageModelTest)  Time elapsed: 0.001 s
mime_magic(org.eclipse.php.core.tests.searchEngine.PHP5LanguageModelTest)  Time elapsed: 0 s
bcmath(org.eclipse.php.core.tests.searchEngine.PHP5LanguageModelTest)  Time elapsed: 0 s
reflection(org.eclipse.php.core.tests.searchEngine.PHP5LanguageModelTest)  Time elapsed: 0 s
filter(org.eclipse.php.core.tests.searchEngine.PHP5LanguageModelTest)  Time elapsed: 0 s
openssl(org.eclipse.php.core.tests.searchEngine.PHP5LanguageModelTest)  Time elapsed: 0.001 s
mcrypt(org.eclipse.php.core.tests.searchEngine.PHP5LanguageModelTest)  Time elapsed: 0 s
mysqli(org.eclipse.php.core.tests.searchEngine.PHP5LanguageModelTest)  Time elapsed: 0 s
Ibm_db2(org.eclipse.php.core.tests.searchEngine.PHP5LanguageModelTest)  Time elapsed: 0 s
sqlite(org.eclipse.php.core.tests.searchEngine.PHP5LanguageModelTest)  Time elapsed: 0 s
xmlreader(org.eclipse.php.core.tests.searchEngine.PHP5LanguageModelTest)  Time elapsed: 0 s
xmlwriter(org.eclipse.php.core.tests.searchEngine.PHP5LanguageModelTest)  Time elapsed: 0 s
calendar(org.eclipse.php.core.tests.searchEngine.PHP5LanguageModelTest)  Time elapsed: 0 s
gettext(org.eclipse.php.core.tests.searchEngine.PHP5LanguageModelTest)  Time elapsed: 0.001 s
gd(org.eclipse.php.core.tests.searchEngine.PHP5LanguageModelTest)  Time elapsed: 0 s
bz2(org.eclipse.php.core.tests.searchEngine.PHP5LanguageModelTest)  Time elapsed: 0 s
dom(org.eclipse.php.core.tests.searchEngine.PHP5LanguageModelTest)  Time elapsed: 0 s
ftp(org.eclipse.php.core.tests.searchEngine.PHP5LanguageModelTest)  Time elapsed: 0.001 s
pdo(org.eclipse.php.core.tests.searchEngine.PHP5LanguageModelTest)  Time elapsed: 0 s
spl(org.eclipse.php.core.tests.searchEngine.PHP5LanguageModelTest)  Time elapsed: 0 s
xml(org.eclipse.php.core.tests.searchEngine.PHP5LanguageModelTest)  Time elapsed: 0 s
xsl(org.eclipse.php.core.tests.searchEngine.PHP5LanguageModelTest)  Time elapsed: 0 s
zip(org.eclipse.php.core.tests.searchEngine.PHP5LanguageModelTest)  Time elapsed: 0 s
Imap(org.eclipse.php.core.tests.searchEngine.PHP5LanguageModelTest)  Time elapsed: 0.001 s
Intl(org.eclipse.php.core.tests.searchEngine.PHP5LanguageModelTest)  Time elapsed: 0 s
curl(org.eclipse.php.core.tests.searchEngine.PHP5LanguageModelTest)  Time elapsed: 0 s
date(org.eclipse.php.core.tests.searchEngine.PHP5LanguageModelTest)  Time elapsed: 0 s
exif(org.eclipse.php.core.tests.searchEngine.PHP5LanguageModelTest)  Time elapsed: 0 s
hash(org.eclipse.php.core.tests.searchEngine.PHP5LanguageModelTest)  Time elapsed: 0 s
json(org.eclipse.php.core.tests.searchEngine.PHP5LanguageModelTest)  Time elapsed: 0.001 s
ldap(org.eclipse.php.core.tests.searchEngine.PHP5LanguageModelTest)  Time elapsed: 0 s
oci8(org.eclipse.php.core.tests.searchEngine.PHP5LanguageModelTest)  Time elapsed: 0 s
pcre(org.eclipse.php.core.tests.searchEngine.PHP5LanguageModelTest)  Time elapsed: 0 s
soap(org.eclipse.php.core.tests.searchEngine.PHP5LanguageModelTest)  Time elapsed: 0 s
tidy(org.eclipse.php.core.tests.searchEngine.PHP5LanguageModelTest)  Time elapsed: 0 s
zlib(org.eclipse.php.core.tests.searchEngine.PHP5LanguageModelTest)  Time elapsed: 0 s
Iconv(org.eclipse.php.core.tests.searchEngine.PHP5LanguageModelTest)  Time elapsed: 0.001 s
ctype(org.eclipse.php.core.tests.searchEngine.PHP5LanguageModelTest)  Time elapsed: 0 s
mhash(org.eclipse.php.core.tests.searchEngine.PHP5LanguageModelTest)  Time elapsed: 0 s
mysql(org.eclipse.php.core.tests.searchEngine.PHP5LanguageModelTest)  Time elapsed: 0 s
pgsql(org.eclipse.php.core.tests.searchEngine.PHP5LanguageModelTest)  Time elapsed: 0 s
posix(org.eclipse.php.core.tests.searchEngine.PHP5LanguageModelTest)  Time elapsed: 0 s
tokenizer(org.eclipse.php.core.tests.searchEngine.PHP5LanguageModelTest)  Time elapsed: 0 s
standard(org.eclipse.php.core.tests.searchEngine.PHP5LanguageModelTest)  Time elapsed: 0 s
session(org.eclipse.php.core.tests.searchEngine.PHP5LanguageModelTest)  Time elapsed: 0 s
simpleXml(org.eclipse.php.core.tests.searchEngine.PHP53LanguageModelTest)  Time elapsed: 0.004 s
sockets(org.eclipse.php.core.tests.searchEngine.PHP53LanguageModelTest)  Time elapsed: 0.001 s
mime_magic(org.eclipse.php.core.tests.searchEngine.PHP53LanguageModelTest)  Time elapsed: 0 s
bcmath(org.eclipse.php.core.tests.searchEngine.PHP53LanguageModelTest)  Time elapsed: 0.001 s
reflection(org.eclipse.php.core.tests.searchEngine.PHP53LanguageModelTest)  Time elapsed: 0 s
filter(org.eclipse.php.core.tests.searchEngine.PHP53LanguageModelTest)  Time elapsed: 0 s
openssl(org.eclipse.php.core.tests.searchEngine.PHP53LanguageModelTest)  Time elapsed: 0.001 s
mcrypt(org.eclipse.php.core.tests.searchEngine.PHP53LanguageModelTest)  Time elapsed: 0 s
mysqli(org.eclipse.php.core.tests.searchEngine.PHP53LanguageModelTest)  Time elapsed: 0 s
sqlite(org.eclipse.php.core.tests.searchEngine.PHP53LanguageModelTest)  Time elapsed: 0.001 s
xmlreader(org.eclipse.php.core.tests.searchEngine.PHP53LanguageModelTest)  Time elapsed: 0 s
xmlwriter(org.eclipse.php.core.tests.searchEngine.PHP53LanguageModelTest)  Time elapsed: 0 s
calendar(org.eclipse.php.core.tests.searchEngine.PHP53LanguageModelTest)  Time elapsed: 0.001 s
gettext(org.eclipse.php.core.tests.searchEngine.PHP53LanguageModelTest)  Time elapsed: 0 s
gd(org.eclipse.php.core.tests.searchEngine.PHP53LanguageModelTest)  Time elapsed: 0 s
bz2(org.eclipse.php.core.tests.searchEngine.PHP53LanguageModelTest)  Time elapsed: 0 s
dom(org.eclipse.php.core.tests.searchEngine.PHP53LanguageModelTest)  Time elapsed: 0 s
ftp(org.eclipse.php.core.tests.searchEngine.PHP53LanguageModelTest)  Time elapsed: 0.001 s
pdo(org.eclipse.php.core.tests.searchEngine.PHP53LanguageModelTest)  Time elapsed: 0 s
spl(org.eclipse.php.core.tests.searchEngine.PHP53LanguageModelTest)  Time elapsed: 0 s
xml(org.eclipse.php.core.tests.searchEngine.PHP53LanguageModelTest)  Time elapsed: 0 s
xsl(org.eclipse.php.core.tests.searchEngine.PHP53LanguageModelTest)  Time elapsed: 0 s
zip(org.eclipse.php.core.tests.searchEngine.PHP53LanguageModelTest)  Time elapsed: 0.001 s
curl(org.eclipse.php.core.tests.searchEngine.PHP53LanguageModelTest)  Time elapsed: 0 s
date(org.eclipse.php.core.tests.searchEngine.PHP53LanguageModelTest)  Time elapsed: 0 s
exif(org.eclipse.php.core.tests.searchEngine.PHP53LanguageModelTest)  Time elapsed: 0.001 s
hash(org.eclipse.php.core.tests.searchEngine.PHP53LanguageModelTest)  Time elapsed: 0 s
imap(org.eclipse.php.core.tests.searchEngine.PHP53LanguageModelTest)  Time elapsed: 0 s
intl(org.eclipse.php.core.tests.searchEngine.PHP53LanguageModelTest)  Time elapsed: 0.001 s
json(org.eclipse.php.core.tests.searchEngine.PHP53LanguageModelTest)  Time elapsed: 0 s
ldap(org.eclipse.php.core.tests.searchEngine.PHP53LanguageModelTest)  Time elapsed: 0 s
oci8(org.eclipse.php.core.tests.searchEngine.PHP53LanguageModelTest)  Time elapsed: 0 s
pcre(org.eclipse.php.core.tests.searchEngine.PHP53LanguageModelTest)  Time elapsed: 0.001 s
soap(org.eclipse.php.core.tests.searchEngine.PHP53LanguageModelTest)  Time elapsed: 0 s
tidy(org.eclipse.php.core.tests.searchEngine.PHP53LanguageModelTest)  Time elapsed: 0 s
zlib(org.eclipse.php.core.tests.searchEngine.PHP53LanguageModelTest)  Time elapsed: 0.001 s
ctype(org.eclipse.php.core.tests.searchEngine.PHP53LanguageModelTest)  Time elapsed: 0 s
iconv(org.eclipse.php.core.tests.searchEngine.PHP53LanguageModelTest)  Time elapsed: 0 s
mhash(org.eclipse.php.core.tests.searchEngine.PHP53LanguageModelTest)  Time elapsed: 0.001 s
mysql(org.eclipse.php.core.tests.searchEngine.PHP53LanguageModelTest)  Time elapsed: 0 s
pgsql(org.eclipse.php.core.tests.searchEngine.PHP53LanguageModelTest)  Time elapsed: 0 s
posix(org.eclipse.php.core.tests.searchEngine.PHP53LanguageModelTest)  Time elapsed: 0.001 s
tokenizer(org.eclipse.php.core.tests.searchEngine.PHP53LanguageModelTest)  Time elapsed: 0 s
standard(org.eclipse.php.core.tests.searchEngine.PHP53LanguageModelTest)  Time elapsed: 0 s
ibm_db2(org.eclipse.php.core.tests.searchEngine.PHP53LanguageModelTest)  Time elapsed: 0.001 s
session(org.eclipse.php.core.tests.searchEngine.PHP53LanguageModelTest)  Time elapsed: 0 s
search[workspace/searchEngine/php5/searchClassField1.pdtt](org.eclipse.php.core.tests.searchEngine.SearchFieldTests)  Time elapsed: 0.019 s
suggestStaticObjectOperator(org.eclipse.php.core.tests.text.PHPTextSequenceUtilitiesTests)  Time elapsed: 0.001 s
ignoreInternalCall(org.eclipse.php.core.tests.text.PHPTextSequenceUtilitiesTests)  Time elapsed: 0 s
singleArgument(org.eclipse.php.core.tests.text.PHPTextSequenceUtilitiesTests)  Time elapsed: 0 s
singleArgumentIgnoreParenthesis(org.eclipse.php.core.tests.text.PHPTextSequenceUtilitiesTests)  Time elapsed: 0 s
suggestObjectOperator(org.eclipse.php.core.tests.text.PHPTextSequenceUtilitiesTests)  Time elapsed: 0 s
nestedCall(org.eclipse.php.core.tests.text.PHPTextSequenceUtilitiesTests)  Time elapsed: 0 s
multiArgumentIgnore(org.eclipse.php.core.tests.text.PHPTextSequenceUtilitiesTests)  Time elapsed: 0 s
multiArgumentIgnore2(org.eclipse.php.core.tests.text.PHPTextSequenceUtilitiesTests)  Time elapsed: 0 s
ignoreObjecOperator(org.eclipse.php.core.tests.text.PHPTextSequenceUtilitiesTests)  Time elapsed: 0 s
singleArgumentDoubleQuote(org.eclipse.php.core.tests.text.PHPTextSequenceUtilitiesTests)  Time elapsed: 0 s
singleArgumentIgnore(org.eclipse.php.core.tests.text.PHPTextSequenceUtilitiesTests)  Time elapsed: 0 s
emptyArgumentList(org.eclipse.php.core.tests.text.PHPTextSequenceUtilitiesTests)  Time elapsed: 0 s
testSimpleResolveNamespace(org.eclipse.php.core.tests.util.NamespaceResolverTests)  Time elapsed: 0.004 s
testSimpleBuildpathResolveNamespace(org.eclipse.php.core.tests.util.NamespaceResolverTests)  Time elapsed: 0 s
testSimpleBuildpathResolveLocation(org.eclipse.php.core.tests.util.NamespaceResolverTests)  Time elapsed: 0 s
testSimpleResolveLocation(org.eclipse.php.core.tests.util.NamespaceResolverTests)  Time elapsed: 0 s

Results:

Failures: 
org.eclipse.php.core.tests.codeassist.CodeAssistTests.assist[workspace/codeassist/php55/testTraitConflict1.pdtt](org.eclipse.php.core.tests.codeassist.CodeAssistTests)
  Run 1: PASS
  Run 2: PASS
  Run 3: PASS
  Run 4: PASS
  Run 5: PASS
  Run 6: PASS
  Run 7: CodeAssistTests.assist:181->compareProposals:329 
EXPECTED COMPLETIONS LIST:
-----------------------------
method(smallTalk)
method(bigTalk)
method(foo)
field(class)

ACTUAL COMPLETIONS LIST:
-----------------------------
field(class)
method(foo)
method(smallTalk)



Tests run: 14614, Failures: 1, Errors: 0, Skipped: 0

[INFO] 
[INFO] ------------------------------------------------------------------------
[INFO] Skipping PHP Development Tools (PDT)
[INFO] This project has been banned from the build due to previous failures.
[INFO] ------------------------------------------------------------------------
[INFO] ------------------------------------------------------------------------
[INFO] Reactor Summary for PHP Development Tools (PDT) 7.1.0-SNAPSHOT:
[INFO] 
[INFO] PHP Development Tools (PDT) ........................ SUCCESS [  0.060 s]
[INFO] plugins ............................................ SUCCESS [  0.002 s]
[INFO] org.eclipse.php.help ............................... SUCCESS [ 45.690 s]
[INFO] org.eclipse.php.core.parser ........................ SUCCESS [  2.041 s]
[INFO] org.eclipse.php.core ............................... SUCCESS [ 19.574 s]
[INFO] org.eclipse.php.server.core ........................ SUCCESS [  0.389 s]
[INFO] org.eclipse.php.ui ................................. SUCCESS [  4.642 s]
[INFO] org.eclipse.php.debug.daemon ....................... SUCCESS [  0.300 s]
[INFO] org.eclipse.php.debug.core ......................... SUCCESS [  1.696 s]
[INFO] org.eclipse.php.debug.ui ........................... SUCCESS [ 14.513 s]
[INFO] org.eclipse.php.formatter.core ..................... SUCCESS [  7.177 s]
[INFO] org.eclipse.php.formatter.ui ....................... SUCCESS [  0.630 s]
[INFO] org.eclipse.php.mylyn.ui ........................... SUCCESS [  0.380 s]
[INFO] org.eclipse.php.refactoring.core ................... SUCCESS [  0.951 s]
[INFO] org.eclipse.php.refactoring.ui ..................... SUCCESS [  2.427 s]
[INFO] org.eclipse.php.server.ui .......................... SUCCESS [  0.662 s]
[INFO] org.eclipse.php.astview ............................ SUCCESS [  0.488 s]
[INFO] org.eclipse.php.composer.api ....................... SUCCESS [ 11.791 s]
[INFO] org.eclipse.php.composer.core ...................... SUCCESS [ 11.050 s]
[INFO] org.eclipse.php.composer.ui ........................ SUCCESS [  1.023 s]
[INFO] org.eclipse.php.builtin.server.core ................ SUCCESS [  5.130 s]
[INFO] org.eclipse.php.builtin.server.ui .................. SUCCESS [  0.821 s]
[INFO] org.eclipse.php.phpunit ............................ SUCCESS [  1.300 s]
[INFO] org.eclipse.php.profile.core ....................... SUCCESS [  0.497 s]
[INFO] org.eclipse.php.profile.ui ......................... SUCCESS [  0.809 s]
[INFO] org.eclipse.php.rdt.sync.ui ........................ SUCCESS [  0.227 s]
[INFO] tests .............................................. SUCCESS [  1.132 s]
[INFO] org.eclipse.php.core.tests ......................... FAILURE [10:26 min]
[INFO] org.eclipse.php.formatter.core.tests ............... SKIPPED
[INFO] org.eclipse.php.refactoring.core.tests ............. SKIPPED
[INFO] org.eclipse.php.ui.tests ........................... SKIPPED
[INFO] org.eclipse.php.composer.api.tests ................. SKIPPED
[INFO] org.eclipse.php.composer.tests ..................... SKIPPED
[INFO] org.eclipse.php.profile.core.tests ................. SKIPPED
[INFO] features ........................................... SKIPPED
[INFO] org.eclipse.php .................................... SKIPPED
[INFO] org.eclipse.php.composer ........................... SKIPPED
[INFO] org.eclipse.php.phpunit.feature .................... SKIPPED
[INFO] org.eclipse.php.profiler ........................... SKIPPED
[INFO] org.eclipse.php.rdt.sync ........................... SKIPPED
[INFO] org.eclipse.php.mylyn .............................. SKIPPED
[INFO] org.eclipse.php.source ............................. SKIPPED
[INFO] org.eclipse.php.test ............................... SKIPPED
[INFO] org.eclipse.php.sdk ................................ SKIPPED
[INFO] org.eclipse.php.target.current ..................... SKIPPED
[INFO] org.eclipse.php.repository ......................... SKIPPED
[INFO] ------------------------------------------------------------------------
[INFO] BUILD FAILURE
[INFO] ------------------------------------------------------------------------
[INFO] Total time:  13:21 min
[INFO] Finished at: 2020-01-08T20:58:47-05:00
[INFO] ------------------------------------------------------------------------
[ERROR] Failed to execute goal org.eclipse.tycho:tycho-surefire-plugin:1.4.0:test (default-test) on project org.eclipse.php.core.tests: There are test failures.
[ERROR] 
[ERROR] Please refer to /jobs/genie.pdt/pdt-sonar/workspace/tests/org.eclipse.php.core.tests/target/surefire-reports for the individual test results.
[ERROR] -> [Help 1]
[ERROR] 
[ERROR] To see the full stack trace of the errors, re-run Maven with the -e switch.
[ERROR] Re-run Maven using the -X switch to enable full debug logging.
[ERROR] 
[ERROR] For more information about the errors and possible solutions, please read the following articles:
[ERROR] [Help 1] http://cwiki.apache.org/confluence/display/MAVEN/MojoFailureException
[ERROR] 
[ERROR] After correcting the problems, you can resume the build with the command
[ERROR]   mvn <goals> -rf :org.eclipse.php.core.tests
Build step 'Invoke top-level Maven targets' marked build as failure
Terminating xvnc.
Started calculate disk usage of build
Finished Calculation of disk usage of build in 0 seconds
Started calculate disk usage of workspace
Finished Calculation of disk usage of workspace in 0 seconds
Finished: FAILURE