FailedConsole Output

Skipping 2,320 KB.. Full Log
ionNot.pdtt](org.eclipse.php.core.tests.typeinference.TypeInferenceTests)  Time elapsed: 0.001 sec
inference[workspace/typeinference/php5/testUnaryOperationTilda.pdtt](org.eclipse.php.core.tests.typeinference.TypeInferenceTests)  Time elapsed: 0.001 sec
inference[workspace/typeinference/php5/testArrayAccess.pdtt](org.eclipse.php.core.tests.typeinference.TypeInferenceTests)  Time elapsed: 0.198 sec
inference[workspace/typeinference/php5/testArrayCreationMultiTypes.pdtt](org.eclipse.php.core.tests.typeinference.TypeInferenceTests)  Time elapsed: 0.016 sec
inference[workspace/typeinference/php5/testArrayCreationSingleType.pdtt](org.eclipse.php.core.tests.typeinference.TypeInferenceTests)  Time elapsed: 0.023 sec
inference[workspace/typeinference/php5/testArrayTypeInference1.pdtt](org.eclipse.php.core.tests.typeinference.TypeInferenceTests)  Time elapsed: 0.005 sec
inference[workspace/typeinference/php5/testArrayTypeInference2.pdtt](org.eclipse.php.core.tests.typeinference.TypeInferenceTests)  Time elapsed: 0.002 sec
inference[workspace/typeinference/php5/testArrayTypeInference3.pdtt](org.eclipse.php.core.tests.typeinference.TypeInferenceTests)  Time elapsed: 0.015 sec
inference[workspace/typeinference/php5/testArrayTypeInference4.pdtt](org.eclipse.php.core.tests.typeinference.TypeInferenceTests)  Time elapsed: 0.002 sec
inference[workspace/typeinference/php5/testAssignmentScalar.pdtt](org.eclipse.php.core.tests.typeinference.TypeInferenceTests)  Time elapsed: 0.001 sec
inference[workspace/typeinference/php5/testAssignmentScalarNested.pdtt](org.eclipse.php.core.tests.typeinference.TypeInferenceTests)  Time elapsed: 0.001 sec
inference[workspace/typeinference/php5/testBacktickExpression.pdtt](org.eclipse.php.core.tests.typeinference.TypeInferenceTests)  Time elapsed: 0.001 sec
inference[workspace/typeinference/php5/testBuiltinMethodReturnType.pdtt](org.eclipse.php.core.tests.typeinference.TypeInferenceTests)  Time elapsed: 0.006 sec
inference[workspace/typeinference/php5/testCastObjectFromClass.pdtt](org.eclipse.php.core.tests.typeinference.TypeInferenceTests)  Time elapsed: 0.001 sec
inference[workspace/typeinference/php5/testCastObjectFromScalar.pdtt](org.eclipse.php.core.tests.typeinference.TypeInferenceTests)  Time elapsed: 0.001 sec
inference[workspace/typeinference/php5/testCastString.pdtt](org.eclipse.php.core.tests.typeinference.TypeInferenceTests)  Time elapsed: 0.001 sec
inference[workspace/typeinference/php5/testCatchException.pdtt](org.eclipse.php.core.tests.typeinference.TypeInferenceTests)  Time elapsed: 0.001 sec
inference[workspace/typeinference/php5/testClassConstant.pdtt](org.eclipse.php.core.tests.typeinference.TypeInferenceTests)  Time elapsed: 0.008 sec
inference[workspace/typeinference/php5/testClassInstanceCreation.pdtt](org.eclipse.php.core.tests.typeinference.TypeInferenceTests)  Time elapsed: 0.003 sec
inference[workspace/typeinference/php5/testClassVar.pdtt](org.eclipse.php.core.tests.typeinference.TypeInferenceTests)  Time elapsed: 0.007 sec
inference[workspace/typeinference/php5/testClassVarConstructor.pdtt](org.eclipse.php.core.tests.typeinference.TypeInferenceTests)  Time elapsed: 0.017 sec
inference[workspace/typeinference/php5/testClassVarMethodDecl.pdtt](org.eclipse.php.core.tests.typeinference.TypeInferenceTests)  Time elapsed: 0.008 sec
inference[workspace/typeinference/php5/testClassVarNoPHPDoc.pdtt](org.eclipse.php.core.tests.typeinference.TypeInferenceTests)  Time elapsed: 0.008 sec
inference[workspace/typeinference/php5/testClassVarPHPDoc.pdtt](org.eclipse.php.core.tests.typeinference.TypeInferenceTests)  Time elapsed: 0.022 sec
inference[workspace/typeinference/php5/testClassVarPHPDoc2.pdtt](org.eclipse.php.core.tests.typeinference.TypeInferenceTests)  Time elapsed: 0.009 sec
inference[workspace/typeinference/php5/testCloneObject.pdtt](org.eclipse.php.core.tests.typeinference.TypeInferenceTests)  Time elapsed: 0.002 sec
inference[workspace/typeinference/php5/testCombineWithGlobal.pdtt](org.eclipse.php.core.tests.typeinference.TypeInferenceTests)  Time elapsed: 0.007 sec
inference[workspace/typeinference/php5/testCombinesObject.pdtt](org.eclipse.php.core.tests.typeinference.TypeInferenceTests)  Time elapsed: 0.002 sec
inference[workspace/typeinference/php5/testConditionalExpression.pdtt](org.eclipse.php.core.tests.typeinference.TypeInferenceTests)  Time elapsed: 0.001 sec
inference[workspace/typeinference/php5/testConstant.pdtt](org.eclipse.php.core.tests.typeinference.TypeInferenceTests)  Time elapsed: 0.002 sec
inference[workspace/typeinference/php5/testForeachStatement.pdtt](org.eclipse.php.core.tests.typeinference.TypeInferenceTests)  Time elapsed: 0.004 sec
inference[workspace/typeinference/php5/testFunctionReturnType.pdtt](org.eclipse.php.core.tests.typeinference.TypeInferenceTests)  Time elapsed: 0.01 sec
inference[workspace/typeinference/php5/testFunctionReturnTypeAmbiguous.pdtt](org.eclipse.php.core.tests.typeinference.TypeInferenceTests)  Time elapsed: 0.012 sec
inference[workspace/typeinference/php5/testFunctionReturnTypeNoPHPDoc.pdtt](org.eclipse.php.core.tests.typeinference.TypeInferenceTests)  Time elapsed: 0.058 sec
inference[workspace/typeinference/php5/testFunctionReturnTypePHPDoc.pdtt](org.eclipse.php.core.tests.typeinference.TypeInferenceTests)  Time elapsed: 0.016 sec
inference[workspace/typeinference/php5/testFunctionReturnTypePHPDoc1.pdtt](org.eclipse.php.core.tests.typeinference.TypeInferenceTests)  Time elapsed: 0.05 sec
inference[workspace/typeinference/php5/testFunctionReturnTypePHPDoc2.pdtt](org.eclipse.php.core.tests.typeinference.TypeInferenceTests)  Time elapsed: 0.005 sec
inference[workspace/typeinference/php5/testFunctionReturnTypePHPDoc3.pdtt](org.eclipse.php.core.tests.typeinference.TypeInferenceTests)  Time elapsed: 0.005 sec
inference[workspace/typeinference/php5/testFunctionReturnTypeRecursive.pdtt](org.eclipse.php.core.tests.typeinference.TypeInferenceTests)  Time elapsed: 0.005 sec
inference[workspace/typeinference/php5/testGlobalDeclaredInsideFunction.pdtt](org.eclipse.php.core.tests.typeinference.TypeInferenceTests)  Time elapsed: 0.007 sec
inference[workspace/typeinference/php5/testInfixOperatorPlus.pdtt](org.eclipse.php.core.tests.typeinference.TypeInferenceTests)  Time elapsed: 0.001 sec
inference[workspace/typeinference/php5/testInheritdoc01.pdtt](org.eclipse.php.core.tests.typeinference.TypeInferenceTests)  Time elapsed: 0.009 sec
inference[workspace/typeinference/php5/testInstanceOfCondition1.pdtt](org.eclipse.php.core.tests.typeinference.TypeInferenceTests)  Time elapsed: 0.002 sec
inference[workspace/typeinference/php5/testInstanceOfCondition2.pdtt](org.eclipse.php.core.tests.typeinference.TypeInferenceTests)  Time elapsed: 0.001 sec
inference[workspace/typeinference/php5/testInstanceOfCondition3.pdtt](org.eclipse.php.core.tests.typeinference.TypeInferenceTests)  Time elapsed: 0.002 sec
inference[workspace/typeinference/php5/testIteratorTypeInference1.pdtt](org.eclipse.php.core.tests.typeinference.TypeInferenceTests)  Time elapsed: 0.009 sec
inference[workspace/typeinference/php5/testIteratorTypeInference2.pdtt](org.eclipse.php.core.tests.typeinference.TypeInferenceTests)  Time elapsed: 0.009 sec
inference[workspace/typeinference/php5/testIteratorTypeInference3.pdtt](org.eclipse.php.core.tests.typeinference.TypeInferenceTests)  Time elapsed: 0.008 sec
inference[workspace/typeinference/php5/testMethodReturnType.pdtt](org.eclipse.php.core.tests.typeinference.TypeInferenceTests)  Time elapsed: 0.007 sec
inference[workspace/typeinference/php5/testMethodReturnType1.pdtt](org.eclipse.php.core.tests.typeinference.TypeInferenceTests)  Time elapsed: 0.009 sec
inference[workspace/typeinference/php5/testMethodReturnTypePHPDoc.pdtt](org.eclipse.php.core.tests.typeinference.TypeInferenceTests)  Time elapsed: 0.009 sec
inference[workspace/typeinference/php5/testMethodReturnTypePHPDoc1.pdtt](org.eclipse.php.core.tests.typeinference.TypeInferenceTests)  Time elapsed: 0.007 sec
inference[workspace/typeinference/php5/testMethodReturnTypePHPDocForSelf.pdtt](org.eclipse.php.core.tests.typeinference.TypeInferenceTests)  Time elapsed: 0.008 sec
inference[workspace/typeinference/php5/testObject.pdtt](org.eclipse.php.core.tests.typeinference.TypeInferenceTests)  Time elapsed: 0.002 sec
inference[workspace/typeinference/php5/testOverriddenMethodReturnType.pdtt](org.eclipse.php.core.tests.typeinference.TypeInferenceTests)  Time elapsed: 0.007 sec
inference[workspace/typeinference/php5/testOverridenMethodReturnTypePHPDoc.pdtt](org.eclipse.php.core.tests.typeinference.TypeInferenceTests)  Time elapsed: 0.007 sec
inference[workspace/typeinference/php5/testOverridesGlobal.pdtt](org.eclipse.php.core.tests.typeinference.TypeInferenceTests)  Time elapsed: 0.002 sec
inference[workspace/typeinference/php5/testOverridesGlobalInner.pdtt](org.eclipse.php.core.tests.typeinference.TypeInferenceTests)  Time elapsed: 0.001 sec
inference[workspace/typeinference/php5/testOverridesObject.pdtt](org.eclipse.php.core.tests.typeinference.TypeInferenceTests)  Time elapsed: 0.056 sec
inference[workspace/typeinference/php5/testPHPDocArgumentReference.pdtt](org.eclipse.php.core.tests.typeinference.TypeInferenceTests)  Time elapsed: 0.001 sec
inference[workspace/typeinference/php5/testPHPDocArgumentReference1.pdtt](org.eclipse.php.core.tests.typeinference.TypeInferenceTests)  Time elapsed: 0.009 sec
inference[workspace/typeinference/php5/testPHPDocVarComment.pdtt](org.eclipse.php.core.tests.typeinference.TypeInferenceTests)  Time elapsed: 0.002 sec
inference[workspace/typeinference/php5/testParentClassVarDecl.pdtt](org.eclipse.php.core.tests.typeinference.TypeInferenceTests)  Time elapsed: 0.008 sec
inference[workspace/typeinference/php5/testParentFieldAccess.pdtt](org.eclipse.php.core.tests.typeinference.TypeInferenceTests)  Time elapsed: 0.008 sec
inference[workspace/typeinference/php5/testParentMethodReturnType.pdtt](org.eclipse.php.core.tests.typeinference.TypeInferenceTests)  Time elapsed: 0.007 sec
inference[workspace/typeinference/php5/testPostfixOperatorPlusPlus.pdtt](org.eclipse.php.core.tests.typeinference.TypeInferenceTests)  Time elapsed: 0.002 sec
inference[workspace/typeinference/php5/testPrefixOperatorPlusPlus.pdtt](org.eclipse.php.core.tests.typeinference.TypeInferenceTests)  Time elapsed: 0.014 sec
inference[workspace/typeinference/php5/testScalarNumber.pdtt](org.eclipse.php.core.tests.typeinference.TypeInferenceTests)  Time elapsed: 0.01 sec
inference[workspace/typeinference/php5/testSelfClassInstanceCreation.pdtt](org.eclipse.php.core.tests.typeinference.TypeInferenceTests)  Time elapsed: 0.009 sec
inference[workspace/typeinference/php5/testSelfFieldAccess.pdtt](org.eclipse.php.core.tests.typeinference.TypeInferenceTests)  Time elapsed: 0.035 sec
inference[workspace/typeinference/php5/testSelfMethodReturnType.pdtt](org.eclipse.php.core.tests.typeinference.TypeInferenceTests)  Time elapsed: 0.01 sec
inference[workspace/typeinference/php5/testSelfVarDeclaration.pdtt](org.eclipse.php.core.tests.typeinference.TypeInferenceTests)  Time elapsed: 0.008 sec
inference[workspace/typeinference/php5/testStaticMethodReturnType.pdtt](org.eclipse.php.core.tests.typeinference.TypeInferenceTests)  Time elapsed: 0.137 sec
inference[workspace/typeinference/php5/testThis.pdtt](org.eclipse.php.core.tests.typeinference.TypeInferenceTests)  Time elapsed: 0.005 sec
inference[workspace/typeinference/php5/testTypedArgumentReference.pdtt](org.eclipse.php.core.tests.typeinference.TypeInferenceTests)  Time elapsed: 0.003 sec
inference[workspace/typeinference/php5/testUnaryOperationMinus.pdtt](org.eclipse.php.core.tests.typeinference.TypeInferenceTests)  Time elapsed: 0.002 sec
inference[workspace/typeinference/php5/testUnaryOperationNot.pdtt](org.eclipse.php.core.tests.typeinference.TypeInferenceTests)  Time elapsed: 0.003 sec
inference[workspace/typeinference/php5/testUnaryOperationTilda.pdtt](org.eclipse.php.core.tests.typeinference.TypeInferenceTests)  Time elapsed: 0.017 sec
inference[workspace/typeinference/php54/testClassMember1.pdtt](org.eclipse.php.core.tests.typeinference.TypeInferenceTests)  Time elapsed: 0.012 sec
inference[workspace/typeinference/php54/testClassMember2.pdtt](org.eclipse.php.core.tests.typeinference.TypeInferenceTests)  Time elapsed: 0.012 sec
inference[workspace/typeinference/php5/testArrayAccess.pdtt](org.eclipse.php.core.tests.typeinference.TypeInferenceTests)  Time elapsed: 0.014 sec
inference[workspace/typeinference/php5/testArrayCreationMultiTypes.pdtt](org.eclipse.php.core.tests.typeinference.TypeInferenceTests)  Time elapsed: 0.013 sec
inference[workspace/typeinference/php5/testArrayCreationSingleType.pdtt](org.eclipse.php.core.tests.typeinference.TypeInferenceTests)  Time elapsed: 0.003 sec
inference[workspace/typeinference/php5/testArrayTypeInference1.pdtt](org.eclipse.php.core.tests.typeinference.TypeInferenceTests)  Time elapsed: 0.005 sec
inference[workspace/typeinference/php5/testArrayTypeInference2.pdtt](org.eclipse.php.core.tests.typeinference.TypeInferenceTests)  Time elapsed: 0.002 sec
inference[workspace/typeinference/php5/testArrayTypeInference3.pdtt](org.eclipse.php.core.tests.typeinference.TypeInferenceTests)  Time elapsed: 0.001 sec
inference[workspace/typeinference/php5/testArrayTypeInference4.pdtt](org.eclipse.php.core.tests.typeinference.TypeInferenceTests)  Time elapsed: 0.002 sec
inference[workspace/typeinference/php5/testAssignmentScalar.pdtt](org.eclipse.php.core.tests.typeinference.TypeInferenceTests)  Time elapsed: 0.001 sec
inference[workspace/typeinference/php5/testAssignmentScalarNested.pdtt](org.eclipse.php.core.tests.typeinference.TypeInferenceTests)  Time elapsed: 0.002 sec
inference[workspace/typeinference/php5/testBacktickExpression.pdtt](org.eclipse.php.core.tests.typeinference.TypeInferenceTests)  Time elapsed: 0.001 sec
inference[workspace/typeinference/php5/testBuiltinMethodReturnType.pdtt](org.eclipse.php.core.tests.typeinference.TypeInferenceTests)  Time elapsed: 0.005 sec
inference[workspace/typeinference/php5/testCastObjectFromClass.pdtt](org.eclipse.php.core.tests.typeinference.TypeInferenceTests)  Time elapsed: 0.002 sec
inference[workspace/typeinference/php5/testCastObjectFromScalar.pdtt](org.eclipse.php.core.tests.typeinference.TypeInferenceTests)  Time elapsed: 0.001 sec
inference[workspace/typeinference/php5/testCastString.pdtt](org.eclipse.php.core.tests.typeinference.TypeInferenceTests)  Time elapsed: 0.001 sec
inference[workspace/typeinference/php5/testCatchException.pdtt](org.eclipse.php.core.tests.typeinference.TypeInferenceTests)  Time elapsed: 0.001 sec
inference[workspace/typeinference/php5/testClassConstant.pdtt](org.eclipse.php.core.tests.typeinference.TypeInferenceTests)  Time elapsed: 0.009 sec
inference[workspace/typeinference/php5/testClassInstanceCreation.pdtt](org.eclipse.php.core.tests.typeinference.TypeInferenceTests)  Time elapsed: 0.002 sec
inference[workspace/typeinference/php5/testClassVar.pdtt](org.eclipse.php.core.tests.typeinference.TypeInferenceTests)  Time elapsed: 0.006 sec
inference[workspace/typeinference/php5/testClassVarConstructor.pdtt](org.eclipse.php.core.tests.typeinference.TypeInferenceTests)  Time elapsed: 0.006 sec
inference[workspace/typeinference/php5/testClassVarMethodDecl.pdtt](org.eclipse.php.core.tests.typeinference.TypeInferenceTests)  Time elapsed: 0.005 sec
inference[workspace/typeinference/php5/testClassVarNoPHPDoc.pdtt](org.eclipse.php.core.tests.typeinference.TypeInferenceTests)  Time elapsed: 0.067 sec
inference[workspace/typeinference/php5/testClassVarPHPDoc.pdtt](org.eclipse.php.core.tests.typeinference.TypeInferenceTests)  Time elapsed: 0.038 sec
inference[workspace/typeinference/php5/testClassVarPHPDoc2.pdtt](org.eclipse.php.core.tests.typeinference.TypeInferenceTests)  Time elapsed: 0.008 sec
inference[workspace/typeinference/php5/testCloneObject.pdtt](org.eclipse.php.core.tests.typeinference.TypeInferenceTests)  Time elapsed: 0.003 sec
inference[workspace/typeinference/php5/testCombineWithGlobal.pdtt](org.eclipse.php.core.tests.typeinference.TypeInferenceTests)  Time elapsed: 0.012 sec
inference[workspace/typeinference/php5/testCombinesObject.pdtt](org.eclipse.php.core.tests.typeinference.TypeInferenceTests)  Time elapsed: 0.003 sec
inference[workspace/typeinference/php5/testConditionalExpression.pdtt](org.eclipse.php.core.tests.typeinference.TypeInferenceTests)  Time elapsed: 0.002 sec
inference[workspace/typeinference/php5/testConstant.pdtt](org.eclipse.php.core.tests.typeinference.TypeInferenceTests)  Time elapsed: 0.001 sec
inference[workspace/typeinference/php5/testForeachStatement.pdtt](org.eclipse.php.core.tests.typeinference.TypeInferenceTests)  Time elapsed: 0.007 sec
inference[workspace/typeinference/php5/testFunctionReturnType.pdtt](org.eclipse.php.core.tests.typeinference.TypeInferenceTests)  Time elapsed: 0.007 sec
inference[workspace/typeinference/php5/testFunctionReturnTypeAmbiguous.pdtt](org.eclipse.php.core.tests.typeinference.TypeInferenceTests)  Time elapsed: 0.007 sec
inference[workspace/typeinference/php5/testFunctionReturnTypeNoPHPDoc.pdtt](org.eclipse.php.core.tests.typeinference.TypeInferenceTests)  Time elapsed: 0.007 sec
inference[workspace/typeinference/php5/testFunctionReturnTypePHPDoc.pdtt](org.eclipse.php.core.tests.typeinference.TypeInferenceTests)  Time elapsed: 0.006 sec
inference[workspace/typeinference/php5/testFunctionReturnTypePHPDoc1.pdtt](org.eclipse.php.core.tests.typeinference.TypeInferenceTests)  Time elapsed: 0.007 sec
inference[workspace/typeinference/php5/testFunctionReturnTypePHPDoc2.pdtt](org.eclipse.php.core.tests.typeinference.TypeInferenceTests)  Time elapsed: 0.006 sec
inference[workspace/typeinference/php5/testFunctionReturnTypePHPDoc3.pdtt](org.eclipse.php.core.tests.typeinference.TypeInferenceTests)  Time elapsed: 0.007 sec
inference[workspace/typeinference/php5/testFunctionReturnTypeRecursive.pdtt](org.eclipse.php.core.tests.typeinference.TypeInferenceTests)  Time elapsed: 0.008 sec
inference[workspace/typeinference/php5/testGlobalDeclaredInsideFunction.pdtt](org.eclipse.php.core.tests.typeinference.TypeInferenceTests)  Time elapsed: 0.01 sec
inference[workspace/typeinference/php5/testInfixOperatorPlus.pdtt](org.eclipse.php.core.tests.typeinference.TypeInferenceTests)  Time elapsed: 0.002 sec
inference[workspace/typeinference/php5/testInheritdoc01.pdtt](org.eclipse.php.core.tests.typeinference.TypeInferenceTests)  Time elapsed: 0.011 sec
inference[workspace/typeinference/php5/testInstanceOfCondition1.pdtt](org.eclipse.php.core.tests.typeinference.TypeInferenceTests)  Time elapsed: 0.001 sec
inference[workspace/typeinference/php5/testInstanceOfCondition2.pdtt](org.eclipse.php.core.tests.typeinference.TypeInferenceTests)  Time elapsed: 0.002 sec
inference[workspace/typeinference/php5/testInstanceOfCondition3.pdtt](org.eclipse.php.core.tests.typeinference.TypeInferenceTests)  Time elapsed: 0.006 sec
inference[workspace/typeinference/php5/testIteratorTypeInference1.pdtt](org.eclipse.php.core.tests.typeinference.TypeInferenceTests)  Time elapsed: 0.012 sec
inference[workspace/typeinference/php5/testIteratorTypeInference2.pdtt](org.eclipse.php.core.tests.typeinference.TypeInferenceTests)  Time elapsed: 0.008 sec
inference[workspace/typeinference/php5/testIteratorTypeInference3.pdtt](org.eclipse.php.core.tests.typeinference.TypeInferenceTests)  Time elapsed: 0.005 sec
inference[workspace/typeinference/php5/testMethodReturnType.pdtt](org.eclipse.php.core.tests.typeinference.TypeInferenceTests)  Time elapsed: 0.004 sec
inference[workspace/typeinference/php5/testMethodReturnType1.pdtt](org.eclipse.php.core.tests.typeinference.TypeInferenceTests)  Time elapsed: 0.007 sec
inference[workspace/typeinference/php5/testMethodReturnTypePHPDoc.pdtt](org.eclipse.php.core.tests.typeinference.TypeInferenceTests)  Time elapsed: 0.006 sec
inference[workspace/typeinference/php5/testMethodReturnTypePHPDoc1.pdtt](org.eclipse.php.core.tests.typeinference.TypeInferenceTests)  Time elapsed: 0.008 sec
inference[workspace/typeinference/php5/testMethodReturnTypePHPDocForSelf.pdtt](org.eclipse.php.core.tests.typeinference.TypeInferenceTests)  Time elapsed: 0.006 sec
inference[workspace/typeinference/php5/testObject.pdtt](org.eclipse.php.core.tests.typeinference.TypeInferenceTests)  Time elapsed: 0.001 sec
inference[workspace/typeinference/php5/testOverriddenMethodReturnType.pdtt](org.eclipse.php.core.tests.typeinference.TypeInferenceTests)  Time elapsed: 0.009 sec
inference[workspace/typeinference/php5/testOverridenMethodReturnTypePHPDoc.pdtt](org.eclipse.php.core.tests.typeinference.TypeInferenceTests)  Time elapsed: 0.013 sec
inference[workspace/typeinference/php5/testOverridesGlobal.pdtt](org.eclipse.php.core.tests.typeinference.TypeInferenceTests)  Time elapsed: 0.003 sec
inference[workspace/typeinference/php5/testOverridesGlobalInner.pdtt](org.eclipse.php.core.tests.typeinference.TypeInferenceTests)  Time elapsed: 0.003 sec
inference[workspace/typeinference/php5/testOverridesObject.pdtt](org.eclipse.php.core.tests.typeinference.TypeInferenceTests)  Time elapsed: 0.002 sec
inference[workspace/typeinference/php5/testPHPDocArgumentReference.pdtt](org.eclipse.php.core.tests.typeinference.TypeInferenceTests)  Time elapsed: 0.002 sec
inference[workspace/typeinference/php5/testPHPDocArgumentReference1.pdtt](org.eclipse.php.core.tests.typeinference.TypeInferenceTests)  Time elapsed: 0.01 sec
inference[workspace/typeinference/php5/testPHPDocVarComment.pdtt](org.eclipse.php.core.tests.typeinference.TypeInferenceTests)  Time elapsed: 0.003 sec
inference[workspace/typeinference/php5/testParentClassVarDecl.pdtt](org.eclipse.php.core.tests.typeinference.TypeInferenceTests)  Time elapsed: 0.01 sec
inference[workspace/typeinference/php5/testParentFieldAccess.pdtt](org.eclipse.php.core.tests.typeinference.TypeInferenceTests)  Time elapsed: 0.006 sec
inference[workspace/typeinference/php5/testParentMethodReturnType.pdtt](org.eclipse.php.core.tests.typeinference.TypeInferenceTests)  Time elapsed: 0.005 sec
inference[workspace/typeinference/php5/testPostfixOperatorPlusPlus.pdtt](org.eclipse.php.core.tests.typeinference.TypeInferenceTests)  Time elapsed: 0.002 sec
inference[workspace/typeinference/php5/testPrefixOperatorPlusPlus.pdtt](org.eclipse.php.core.tests.typeinference.TypeInferenceTests)  Time elapsed: 0.002 sec
inference[workspace/typeinference/php5/testScalarNumber.pdtt](org.eclipse.php.core.tests.typeinference.TypeInferenceTests)  Time elapsed: 0.001 sec
inference[workspace/typeinference/php5/testSelfClassInstanceCreation.pdtt](org.eclipse.php.core.tests.typeinference.TypeInferenceTests)  Time elapsed: 0.002 sec
inference[workspace/typeinference/php5/testSelfFieldAccess.pdtt](org.eclipse.php.core.tests.typeinference.TypeInferenceTests)  Time elapsed: 0.005 sec
inference[workspace/typeinference/php5/testSelfMethodReturnType.pdtt](org.eclipse.php.core.tests.typeinference.TypeInferenceTests)  Time elapsed: 0.005 sec
inference[workspace/typeinference/php5/testSelfVarDeclaration.pdtt](org.eclipse.php.core.tests.typeinference.TypeInferenceTests)  Time elapsed: 0.005 sec
inference[workspace/typeinference/php5/testStaticMethodReturnType.pdtt](org.eclipse.php.core.tests.typeinference.TypeInferenceTests)  Time elapsed: 0.041 sec
inference[workspace/typeinference/php5/testThis.pdtt](org.eclipse.php.core.tests.typeinference.TypeInferenceTests)  Time elapsed: 0.003 sec
inference[workspace/typeinference/php5/testTypedArgumentReference.pdtt](org.eclipse.php.core.tests.typeinference.TypeInferenceTests)  Time elapsed: 0.001 sec
inference[workspace/typeinference/php5/testUnaryOperationMinus.pdtt](org.eclipse.php.core.tests.typeinference.TypeInferenceTests)  Time elapsed: 0.001 sec
inference[workspace/typeinference/php5/testUnaryOperationNot.pdtt](org.eclipse.php.core.tests.typeinference.TypeInferenceTests)  Time elapsed: 0.002 sec
inference[workspace/typeinference/php5/testUnaryOperationTilda.pdtt](org.eclipse.php.core.tests.typeinference.TypeInferenceTests)  Time elapsed: 0.001 sec
inference[workspace/typeinference/php54/testClassMember1.pdtt](org.eclipse.php.core.tests.typeinference.TypeInferenceTests)  Time elapsed: 0.008 sec
inference[workspace/typeinference/php54/testClassMember2.pdtt](org.eclipse.php.core.tests.typeinference.TypeInferenceTests)  Time elapsed: 0.006 sec
inference[workspace/typeinference/php55/testParentFieldAccess.pdtt](org.eclipse.php.core.tests.typeinference.TypeInferenceTests)  Time elapsed: 0.005 sec
inference[workspace/typeinference/php55/testSelfClassInstanceCreation.pdtt](org.eclipse.php.core.tests.typeinference.TypeInferenceTests)  Time elapsed: 0.003 sec
inference[workspace/typeinference/php55/testSelfFieldAccess.pdtt](org.eclipse.php.core.tests.typeinference.TypeInferenceTests)  Time elapsed: 0.004 sec
inference[workspace/typeinference/php55/testSelfMethodReturnType.pdtt](org.eclipse.php.core.tests.typeinference.TypeInferenceTests)  Time elapsed: 0.004 sec
inference[workspace/typeinference/php55/testSelfVarDeclaration.pdtt](org.eclipse.php.core.tests.typeinference.TypeInferenceTests)  Time elapsed: 0.005 sec
inference[workspace/typeinference/php55/testYieldForeach.pdtt](org.eclipse.php.core.tests.typeinference.TypeInferenceTests)  Time elapsed: 0.009 sec
inference[workspace/typeinference/php55/testYieldReturnType.pdtt](org.eclipse.php.core.tests.typeinference.TypeInferenceTests)  Time elapsed: 0.007 sec
inference[workspace/typeinference/php5/testArrayAccess.pdtt](org.eclipse.php.core.tests.typeinference.TypeInferenceTests)  Time elapsed: 0.008 sec
inference[workspace/typeinference/php5/testArrayCreationMultiTypes.pdtt](org.eclipse.php.core.tests.typeinference.TypeInferenceTests)  Time elapsed: 0.004 sec
inference[workspace/typeinference/php5/testArrayCreationSingleType.pdtt](org.eclipse.php.core.tests.typeinference.TypeInferenceTests)  Time elapsed: 0.002 sec
inference[workspace/typeinference/php5/testArrayTypeInference1.pdtt](org.eclipse.php.core.tests.typeinference.TypeInferenceTests)  Time elapsed: 0.003 sec
inference[workspace/typeinference/php5/testArrayTypeInference2.pdtt](org.eclipse.php.core.tests.typeinference.TypeInferenceTests)  Time elapsed: 0.003 sec
inference[workspace/typeinference/php5/testArrayTypeInference3.pdtt](org.eclipse.php.core.tests.typeinference.TypeInferenceTests)  Time elapsed: 0.004 sec
inference[workspace/typeinference/php5/testArrayTypeInference4.pdtt](org.eclipse.php.core.tests.typeinference.TypeInferenceTests)  Time elapsed: 0.002 sec
inference[workspace/typeinference/php5/testAssignmentScalar.pdtt](org.eclipse.php.core.tests.typeinference.TypeInferenceTests)  Time elapsed: 0.001 sec
inference[workspace/typeinference/php5/testAssignmentScalarNested.pdtt](org.eclipse.php.core.tests.typeinference.TypeInferenceTests)  Time elapsed: 0.507 sec
inference[workspace/typeinference/php5/testBacktickExpression.pdtt](org.eclipse.php.core.tests.typeinference.TypeInferenceTests)  Time elapsed: 0.001 sec
inference[workspace/typeinference/php5/testBuiltinMethodReturnType.pdtt](org.eclipse.php.core.tests.typeinference.TypeInferenceTests)  Time elapsed: 0.006 sec
inference[workspace/typeinference/php5/testCastObjectFromClass.pdtt](org.eclipse.php.core.tests.typeinference.TypeInferenceTests)  Time elapsed: 0.002 sec
inference[workspace/typeinference/php5/testCastObjectFromScalar.pdtt](org.eclipse.php.core.tests.typeinference.TypeInferenceTests)  Time elapsed: 0.002 sec
inference[workspace/typeinference/php5/testCastString.pdtt](org.eclipse.php.core.tests.typeinference.TypeInferenceTests)  Time elapsed: 0.002 sec
inference[workspace/typeinference/php5/testCatchException.pdtt](org.eclipse.php.core.tests.typeinference.TypeInferenceTests)  Time elapsed: 0.001 sec
inference[workspace/typeinference/php5/testClassConstant.pdtt](org.eclipse.php.core.tests.typeinference.TypeInferenceTests)  Time elapsed: 0.02 sec
inference[workspace/typeinference/php5/testClassInstanceCreation.pdtt](org.eclipse.php.core.tests.typeinference.TypeInferenceTests)  Time elapsed: 0.004 sec
inference[workspace/typeinference/php5/testClassVar.pdtt](org.eclipse.php.core.tests.typeinference.TypeInferenceTests)  Time elapsed: 0.02 sec
inference[workspace/typeinference/php5/testClassVarConstructor.pdtt](org.eclipse.php.core.tests.typeinference.TypeInferenceTests)  Time elapsed: 0.016 sec
inference[workspace/typeinference/php5/testClassVarMethodDecl.pdtt](org.eclipse.php.core.tests.typeinference.TypeInferenceTests)  Time elapsed: 0.019 sec
inference[workspace/typeinference/php5/testClassVarNoPHPDoc.pdtt](org.eclipse.php.core.tests.typeinference.TypeInferenceTests)  Time elapsed: 0.021 sec
inference[workspace/typeinference/php5/testClassVarPHPDoc.pdtt](org.eclipse.php.core.tests.typeinference.TypeInferenceTests)  Time elapsed: 0.022 sec
inference[workspace/typeinference/php5/testClassVarPHPDoc2.pdtt](org.eclipse.php.core.tests.typeinference.TypeInferenceTests)  Time elapsed: 0.018 sec
inference[workspace/typeinference/php5/testCloneObject.pdtt](org.eclipse.php.core.tests.typeinference.TypeInferenceTests)  Time elapsed: 0.005 sec
inference[workspace/typeinference/php5/testCombineWithGlobal.pdtt](org.eclipse.php.core.tests.typeinference.TypeInferenceTests)  Time elapsed: 0.012 sec
inference[workspace/typeinference/php5/testCombinesObject.pdtt](org.eclipse.php.core.tests.typeinference.TypeInferenceTests)  Time elapsed: 0.004 sec
inference[workspace/typeinference/php5/testConditionalExpression.pdtt](org.eclipse.php.core.tests.typeinference.TypeInferenceTests)  Time elapsed: 0.002 sec
inference[workspace/typeinference/php5/testConstant.pdtt](org.eclipse.php.core.tests.typeinference.TypeInferenceTests)  Time elapsed: 0.002 sec
inference[workspace/typeinference/php5/testForeachStatement.pdtt](org.eclipse.php.core.tests.typeinference.TypeInferenceTests)  Time elapsed: 0.561 sec
inference[workspace/typeinference/php5/testFunctionReturnType.pdtt](org.eclipse.php.core.tests.typeinference.TypeInferenceTests)  Time elapsed: 12.763 sec
inference[workspace/typeinference/php5/testFunctionReturnTypeAmbiguous.pdtt](org.eclipse.php.core.tests.typeinference.TypeInferenceTests)  Time elapsed: 0.53 sec
inference[workspace/typeinference/php5/testFunctionReturnTypeNoPHPDoc.pdtt](org.eclipse.php.core.tests.typeinference.TypeInferenceTests)  Time elapsed: 0.565 sec
inference[workspace/typeinference/php5/testFunctionReturnTypePHPDoc.pdtt](org.eclipse.php.core.tests.typeinference.TypeInferenceTests)  Time elapsed: 0.516 sec
inference[workspace/typeinference/php5/testFunctionReturnTypePHPDoc1.pdtt](org.eclipse.php.core.tests.typeinference.TypeInferenceTests)  Time elapsed: 0.287 sec
inference[workspace/typeinference/php5/testFunctionReturnTypePHPDoc2.pdtt](org.eclipse.php.core.tests.typeinference.TypeInferenceTests)  Time elapsed: 0.713 sec
inference[workspace/typeinference/php5/testFunctionReturnTypePHPDoc3.pdtt](org.eclipse.php.core.tests.typeinference.TypeInferenceTests)  Time elapsed: 0.335 sec
inference[workspace/typeinference/php5/testFunctionReturnTypeRecursive.pdtt](org.eclipse.php.core.tests.typeinference.TypeInferenceTests)  Time elapsed: 0.011 sec
inference[workspace/typeinference/php5/testGlobalDeclaredInsideFunction.pdtt](org.eclipse.php.core.tests.typeinference.TypeInferenceTests)  Time elapsed: 0.224 sec
inference[workspace/typeinference/php5/testInfixOperatorPlus.pdtt](org.eclipse.php.core.tests.typeinference.TypeInferenceTests)  Time elapsed: 0.002 sec
inference[workspace/typeinference/php5/testInheritdoc01.pdtt](org.eclipse.php.core.tests.typeinference.TypeInferenceTests)  Time elapsed: 0.048 sec
inference[workspace/typeinference/php5/testInstanceOfCondition1.pdtt](org.eclipse.php.core.tests.typeinference.TypeInferenceTests)  Time elapsed: 0.002 sec
inference[workspace/typeinference/php5/testInstanceOfCondition2.pdtt](org.eclipse.php.core.tests.typeinference.TypeInferenceTests)  Time elapsed: 0.001 sec
inference[workspace/typeinference/php5/testInstanceOfCondition3.pdtt](org.eclipse.php.core.tests.typeinference.TypeInferenceTests)  Time elapsed: 0.001 sec
inference[workspace/typeinference/php5/testIteratorTypeInference1.pdtt](org.eclipse.php.core.tests.typeinference.TypeInferenceTests)  Time elapsed: 0.725 sec
inference[workspace/typeinference/php5/testIteratorTypeInference2.pdtt](org.eclipse.php.core.tests.typeinference.TypeInferenceTests)  Time elapsed: 0.022 sec
inference[workspace/typeinference/php5/testIteratorTypeInference3.pdtt](org.eclipse.php.core.tests.typeinference.TypeInferenceTests)  Time elapsed: 0.019 sec
inference[workspace/typeinference/php5/testMethodReturnType.pdtt](org.eclipse.php.core.tests.typeinference.TypeInferenceTests)  Time elapsed: 0.017 sec
inference[workspace/typeinference/php5/testMethodReturnType1.pdtt](org.eclipse.php.core.tests.typeinference.TypeInferenceTests)  Time elapsed: 0.017 sec
inference[workspace/typeinference/php5/testMethodReturnTypePHPDoc.pdtt](org.eclipse.php.core.tests.typeinference.TypeInferenceTests)  Time elapsed: 0.551 sec
inference[workspace/typeinference/php5/testMethodReturnTypePHPDoc1.pdtt](org.eclipse.php.core.tests.typeinference.TypeInferenceTests)  Time elapsed: 0.02 sec
inference[workspace/typeinference/php5/testMethodReturnTypePHPDocForSelf.pdtt](org.eclipse.php.core.tests.typeinference.TypeInferenceTests)  Time elapsed: 0.021 sec
inference[workspace/typeinference/php5/testObject.pdtt](org.eclipse.php.core.tests.typeinference.TypeInferenceTests)  Time elapsed: 0.003 sec
inference[workspace/typeinference/php5/testOverriddenMethodReturnType.pdtt](org.eclipse.php.core.tests.typeinference.TypeInferenceTests)  Time elapsed: 0.016 sec
inference[workspace/typeinference/php5/testOverridenMethodReturnTypePHPDoc.pdtt](org.eclipse.php.core.tests.typeinference.TypeInferenceTests)  Time elapsed: 0.015 sec
inference[workspace/typeinference/php5/testOverridesGlobal.pdtt](org.eclipse.php.core.tests.typeinference.TypeInferenceTests)  Time elapsed: 0.002 sec
inference[workspace/typeinference/php5/testOverridesGlobalInner.pdtt](org.eclipse.php.core.tests.typeinference.TypeInferenceTests)  Time elapsed: 0.002 sec
inference[workspace/typeinference/php5/testOverridesObject.pdtt](org.eclipse.php.core.tests.typeinference.TypeInferenceTests)  Time elapsed: 0.001 sec
inference[workspace/typeinference/php5/testPHPDocArgumentReference.pdtt](org.eclipse.php.core.tests.typeinference.TypeInferenceTests)  Time elapsed: 0.002 sec
inference[workspace/typeinference/php5/testPHPDocArgumentReference1.pdtt](org.eclipse.php.core.tests.typeinference.TypeInferenceTests)  Time elapsed: 0.014 sec
inference[workspace/typeinference/php5/testPHPDocVarComment.pdtt](org.eclipse.php.core.tests.typeinference.TypeInferenceTests)  Time elapsed: 0.002 sec
inference[workspace/typeinference/php5/testParentClassVarDecl.pdtt](org.eclipse.php.core.tests.typeinference.TypeInferenceTests)  Time elapsed: 0.02 sec
inference[workspace/typeinference/php5/testParentFieldAccess.pdtt](org.eclipse.php.core.tests.typeinference.TypeInferenceTests)  Time elapsed: 0.025 sec
inference[workspace/typeinference/php5/testParentMethodReturnType.pdtt](org.eclipse.php.core.tests.typeinference.TypeInferenceTests)  Time elapsed: 0.019 sec
inference[workspace/typeinference/php5/testPostfixOperatorPlusPlus.pdtt](org.eclipse.php.core.tests.typeinference.TypeInferenceTests)  Time elapsed: 0.003 sec
inference[workspace/typeinference/php5/testPrefixOperatorPlusPlus.pdtt](org.eclipse.php.core.tests.typeinference.TypeInferenceTests)  Time elapsed: 0.003 sec
inference[workspace/typeinference/php5/testScalarNumber.pdtt](org.eclipse.php.core.tests.typeinference.TypeInferenceTests)  Time elapsed: 0.002 sec
inference[workspace/typeinference/php5/testSelfClassInstanceCreation.pdtt](org.eclipse.php.core.tests.typeinference.TypeInferenceTests)  Time elapsed: 0.006 sec
inference[workspace/typeinference/php5/testSelfFieldAccess.pdtt](org.eclipse.php.core.tests.typeinference.TypeInferenceTests)  Time elapsed: 0.022 sec
inference[workspace/typeinference/php5/testSelfMethodReturnType.pdtt](org.eclipse.php.core.tests.typeinference.TypeInferenceTests)  Time elapsed: 0.016 sec
inference[workspace/typeinference/php5/testSelfVarDeclaration.pdtt](org.eclipse.php.core.tests.typeinference.TypeInferenceTests)  Time elapsed: 0.042 sec
inference[workspace/typeinference/php5/testStaticMethodReturnType.pdtt](org.eclipse.php.core.tests.typeinference.TypeInferenceTests)  Time elapsed: 0.354 sec
inference[workspace/typeinference/php5/testThis.pdtt](org.eclipse.php.core.tests.typeinference.TypeInferenceTests)  Time elapsed: 0.003 sec
inference[workspace/typeinference/php5/testTypedArgumentReference.pdtt](org.eclipse.php.core.tests.typeinference.TypeInferenceTests)  Time elapsed: 0.003 sec
inference[workspace/typeinference/php5/testUnaryOperationMinus.pdtt](org.eclipse.php.core.tests.typeinference.TypeInferenceTests)  Time elapsed: 0.002 sec
inference[workspace/typeinference/php5/testUnaryOperationNot.pdtt](org.eclipse.php.core.tests.typeinference.TypeInferenceTests)  Time elapsed: 0.097 sec
inference[workspace/typeinference/php5/testUnaryOperationTilda.pdtt](org.eclipse.php.core.tests.typeinference.TypeInferenceTests)  Time elapsed: 0.266 sec
inference[workspace/typeinference/php54/testClassMember1.pdtt](org.eclipse.php.core.tests.typeinference.TypeInferenceTests)  Time elapsed: 0.014 sec
inference[workspace/typeinference/php54/testClassMember2.pdtt](org.eclipse.php.core.tests.typeinference.TypeInferenceTests)  Time elapsed: 0.014 sec
inference[workspace/typeinference/php55/testParentFieldAccess.pdtt](org.eclipse.php.core.tests.typeinference.TypeInferenceTests)  Time elapsed: 0.017 sec
inference[workspace/typeinference/php55/testSelfClassInstanceCreation.pdtt](org.eclipse.php.core.tests.typeinference.TypeInferenceTests)  Time elapsed: 0.005 sec
inference[workspace/typeinference/php55/testSelfFieldAccess.pdtt](org.eclipse.php.core.tests.typeinference.TypeInferenceTests)  Time elapsed: 0.009 sec
inference[workspace/typeinference/php55/testSelfMethodReturnType.pdtt](org.eclipse.php.core.tests.typeinference.TypeInferenceTests)  Time elapsed: 0.009 sec
inference[workspace/typeinference/php55/testSelfVarDeclaration.pdtt](org.eclipse.php.core.tests.typeinference.TypeInferenceTests)  Time elapsed: 0.009 sec
inference[workspace/typeinference/php55/testYieldForeach.pdtt](org.eclipse.php.core.tests.typeinference.TypeInferenceTests)  Time elapsed: 0.01 sec
inference[workspace/typeinference/php55/testYieldReturnType.pdtt](org.eclipse.php.core.tests.typeinference.TypeInferenceTests)  Time elapsed: 0.029 sec
inference[workspace/typeinference/php5/testArrayAccess.pdtt](org.eclipse.php.core.tests.typeinference.TypeInferenceTests)  Time elapsed: 0.123 sec
inference[workspace/typeinference/php5/testArrayCreationMultiTypes.pdtt](org.eclipse.php.core.tests.typeinference.TypeInferenceTests)  Time elapsed: 0.35 sec
inference[workspace/typeinference/php5/testArrayCreationSingleType.pdtt](org.eclipse.php.core.tests.typeinference.TypeInferenceTests)  Time elapsed: 0.003 sec
inference[workspace/typeinference/php5/testArrayTypeInference1.pdtt](org.eclipse.php.core.tests.typeinference.TypeInferenceTests)  Time elapsed: 0.003 sec
inference[workspace/typeinference/php5/testArrayTypeInference2.pdtt](org.eclipse.php.core.tests.typeinference.TypeInferenceTests)  Time elapsed: 0.002 sec
inference[workspace/typeinference/php5/testArrayTypeInference3.pdtt](org.eclipse.php.core.tests.typeinference.TypeInferenceTests)  Time elapsed: 0.001 sec
inference[workspace/typeinference/php5/testArrayTypeInference4.pdtt](org.eclipse.php.core.tests.typeinference.TypeInferenceTests)  Time elapsed: 0.002 sec
inference[workspace/typeinference/php5/testAssignmentScalar.pdtt](org.eclipse.php.core.tests.typeinference.TypeInferenceTests)  Time elapsed: 0.001 sec
inference[workspace/typeinference/php5/testAssignmentScalarNested.pdtt](org.eclipse.php.core.tests.typeinference.TypeInferenceTests)  Time elapsed: 0.001 sec
inference[workspace/typeinference/php5/testBacktickExpression.pdtt](org.eclipse.php.core.tests.typeinference.TypeInferenceTests)  Time elapsed: 0.002 sec
inference[workspace/typeinference/php5/testBuiltinMethodReturnType.pdtt](org.eclipse.php.core.tests.typeinference.TypeInferenceTests)  Time elapsed: 0.004 sec
inference[workspace/typeinference/php5/testCastObjectFromClass.pdtt](org.eclipse.php.core.tests.typeinference.TypeInferenceTests)  Time elapsed: 0.001 sec
inference[workspace/typeinference/php5/testCastObjectFromScalar.pdtt](org.eclipse.php.core.tests.typeinference.TypeInferenceTests)  Time elapsed: 0.002 sec
inference[workspace/typeinference/php5/testCastString.pdtt](org.eclipse.php.core.tests.typeinference.TypeInferenceTests)  Time elapsed: 0.001 sec
inference[workspace/typeinference/php5/testCatchException.pdtt](org.eclipse.php.core.tests.typeinference.TypeInferenceTests)  Time elapsed: 0.001 sec
inference[workspace/typeinference/php5/testClassConstant.pdtt](org.eclipse.php.core.tests.typeinference.TypeInferenceTests)  Time elapsed: 0.007 sec
inference[workspace/typeinference/php5/testClassInstanceCreation.pdtt](org.eclipse.php.core.tests.typeinference.TypeInferenceTests)  Time elapsed: 0.002 sec
inference[workspace/typeinference/php5/testClassVar.pdtt](org.eclipse.php.core.tests.typeinference.TypeInferenceTests)  Time elapsed: 0.005 sec
inference[workspace/typeinference/php5/testClassVarConstructor.pdtt](org.eclipse.php.core.tests.typeinference.TypeInferenceTests)  Time elapsed: 0.006 sec
inference[workspace/typeinference/php5/testClassVarMethodDecl.pdtt](org.eclipse.php.core.tests.typeinference.TypeInferenceTests)  Time elapsed: 0.004 sec
inference[workspace/typeinference/php5/testClassVarNoPHPDoc.pdtt](org.eclipse.php.core.tests.typeinference.TypeInferenceTests)  Time elapsed: 0.081 sec
inference[workspace/typeinference/php5/testClassVarPHPDoc.pdtt](org.eclipse.php.core.tests.typeinference.TypeInferenceTests)  Time elapsed: 0.005 sec
inference[workspace/typeinference/php5/testClassVarPHPDoc2.pdtt](org.eclipse.php.core.tests.typeinference.TypeInferenceTests)  Time elapsed: 0.004 sec
inference[workspace/typeinference/php5/testCloneObject.pdtt](org.eclipse.php.core.tests.typeinference.TypeInferenceTests)  Time elapsed: 0.001 sec
inference[workspace/typeinference/php5/testCombineWithGlobal.pdtt](org.eclipse.php.core.tests.typeinference.TypeInferenceTests)  Time elapsed: 0.009 sec
inference[workspace/typeinference/php5/testCombinesObject.pdtt](org.eclipse.php.core.tests.typeinference.TypeInferenceTests)  Time elapsed: 0.003 sec
inference[workspace/typeinference/php5/testConditionalExpression.pdtt](org.eclipse.php.core.tests.typeinference.TypeInferenceTests)  Time elapsed: 0.002 sec
inference[workspace/typeinference/php5/testConstant.pdtt](org.eclipse.php.core.tests.typeinference.TypeInferenceTests)  Time elapsed: 0.001 sec
inference[workspace/typeinference/php5/testForeachStatement.pdtt](org.eclipse.php.core.tests.typeinference.TypeInferenceTests)  Time elapsed: 0.011 sec
inference[workspace/typeinference/php5/testFunctionReturnType.pdtt](org.eclipse.php.core.tests.typeinference.TypeInferenceTests)  Time elapsed: 0.016 sec
inference[workspace/typeinference/php5/testFunctionReturnTypeAmbiguous.pdtt](org.eclipse.php.core.tests.typeinference.TypeInferenceTests)  Time elapsed: 0.007 sec
inference[workspace/typeinference/php5/testFunctionReturnTypeNoPHPDoc.pdtt](org.eclipse.php.core.tests.typeinference.TypeInferenceTests)  Time elapsed: 0.005 sec
inference[workspace/typeinference/php5/testFunctionReturnTypePHPDoc.pdtt](org.eclipse.php.core.tests.typeinference.TypeInferenceTests)  Time elapsed: 0.003 sec
inference[workspace/typeinference/php5/testFunctionReturnTypePHPDoc1.pdtt](org.eclipse.php.core.tests.typeinference.TypeInferenceTests)  Time elapsed: 0.003 sec
inference[workspace/typeinference/php5/testFunctionReturnTypePHPDoc2.pdtt](org.eclipse.php.core.tests.typeinference.TypeInferenceTests)  Time elapsed: 0.026 sec
inference[workspace/typeinference/php5/testFunctionReturnTypePHPDoc3.pdtt](org.eclipse.php.core.tests.typeinference.TypeInferenceTests)  Time elapsed: 0.007 sec
inference[workspace/typeinference/php5/testFunctionReturnTypeRecursive.pdtt](org.eclipse.php.core.tests.typeinference.TypeInferenceTests)  Time elapsed: 0.006 sec
inference[workspace/typeinference/php5/testGlobalDeclaredInsideFunction.pdtt](org.eclipse.php.core.tests.typeinference.TypeInferenceTests)  Time elapsed: 0.014 sec
inference[workspace/typeinference/php5/testInfixOperatorPlus.pdtt](org.eclipse.php.core.tests.typeinference.TypeInferenceTests)  Time elapsed: 0.002 sec
inference[workspace/typeinference/php5/testInheritdoc01.pdtt](org.eclipse.php.core.tests.typeinference.TypeInferenceTests)  Time elapsed: 0.009 sec
inference[workspace/typeinference/php5/testInstanceOfCondition1.pdtt](org.eclipse.php.core.tests.typeinference.TypeInferenceTests)  Time elapsed: 0.002 sec
inference[workspace/typeinference/php5/testInstanceOfCondition2.pdtt](org.eclipse.php.core.tests.typeinference.TypeInferenceTests)  Time elapsed: 0.002 sec
inference[workspace/typeinference/php5/testInstanceOfCondition3.pdtt](org.eclipse.php.core.tests.typeinference.TypeInferenceTests)  Time elapsed: 0.002 sec
inference[workspace/typeinference/php5/testIteratorTypeInference1.pdtt](org.eclipse.php.core.tests.typeinference.TypeInferenceTests)  Time elapsed: 0.008 sec
inference[workspace/typeinference/php5/testIteratorTypeInference2.pdtt](org.eclipse.php.core.tests.typeinference.TypeInferenceTests)  Time elapsed: 0.008 sec
inference[workspace/typeinference/php5/testIteratorTypeInference3.pdtt](org.eclipse.php.core.tests.typeinference.TypeInferenceTests)  Time elapsed: 0.008 sec
inference[workspace/typeinference/php5/testMethodReturnType.pdtt](org.eclipse.php.core.tests.typeinference.TypeInferenceTests)  Time elapsed: 0.006 sec
inference[workspace/typeinference/php5/testMethodReturnType1.pdtt](org.eclipse.php.core.tests.typeinference.TypeInferenceTests)  Time elapsed: 0.008 sec
inference[workspace/typeinference/php5/testMethodReturnTypePHPDoc.pdtt](org.eclipse.php.core.tests.typeinference.TypeInferenceTests)  Time elapsed: 0.007 sec
inference[workspace/typeinference/php5/testMethodReturnTypePHPDoc1.pdtt](org.eclipse.php.core.tests.typeinference.TypeInferenceTests)  Time elapsed: 0.006 sec
inference[workspace/typeinference/php5/testMethodReturnTypePHPDocForSelf.pdtt](org.eclipse.php.core.tests.typeinference.TypeInferenceTests)  Time elapsed: 0.006 sec
inference[workspace/typeinference/php5/testObject.pdtt](org.eclipse.php.core.tests.typeinference.TypeInferenceTests)  Time elapsed: 0.002 sec
inference[workspace/typeinference/php5/testOverriddenMethodReturnType.pdtt](org.eclipse.php.core.tests.typeinference.TypeInferenceTests)  Time elapsed: 0.005 sec
inference[workspace/typeinference/php5/testOverridenMethodReturnTypePHPDoc.pdtt](org.eclipse.php.core.tests.typeinference.TypeInferenceTests)  Time elapsed: 0.005 sec
inference[workspace/typeinference/php5/testOverridesGlobal.pdtt](org.eclipse.php.core.tests.typeinference.TypeInferenceTests)  Time elapsed: 0.001 sec
inference[workspace/typeinference/php5/testOverridesGlobalInner.pdtt](org.eclipse.php.core.tests.typeinference.TypeInferenceTests)  Time elapsed: 0.002 sec
inference[workspace/typeinference/php5/testOverridesObject.pdtt](org.eclipse.php.core.tests.typeinference.TypeInferenceTests)  Time elapsed: 0.001 sec
inference[workspace/typeinference/php5/testPHPDocArgumentReference.pdtt](org.eclipse.php.core.tests.typeinference.TypeInferenceTests)  Time elapsed: 0.002 sec
inference[workspace/typeinference/php5/testPHPDocArgumentReference1.pdtt](org.eclipse.php.core.tests.typeinference.TypeInferenceTests)  Time elapsed: 0.006 sec
inference[workspace/typeinference/php5/testPHPDocVarComment.pdtt](org.eclipse.php.core.tests.typeinference.TypeInferenceTests)  Time elapsed: 0.001 sec
inference[workspace/typeinference/php5/testParentClassVarDecl.pdtt](org.eclipse.php.core.tests.typeinference.TypeInferenceTests)  Time elapsed: 0.005 sec
inference[workspace/typeinference/php5/testParentFieldAccess.pdtt](org.eclipse.php.core.tests.typeinference.TypeInferenceTests)  Time elapsed: 0.005 sec
inference[workspace/typeinference/php5/testParentMethodReturnType.pdtt](org.eclipse.php.core.tests.typeinference.TypeInferenceTests)  Time elapsed: 0.006 sec
inference[workspace/typeinference/php5/testPostfixOperatorPlusPlus.pdtt](org.eclipse.php.core.tests.typeinference.TypeInferenceTests)  Time elapsed: 0.001 sec
inference[workspace/typeinference/php5/testPrefixOperatorPlusPlus.pdtt](org.eclipse.php.core.tests.typeinference.TypeInferenceTests)  Time elapsed: 0.002 sec
inference[workspace/typeinference/php5/testScalarNumber.pdtt](org.eclipse.php.core.tests.typeinference.TypeInferenceTests)  Time elapsed: 0.001 sec
inference[workspace/typeinference/php5/testSelfClassInstanceCreation.pdtt](org.eclipse.php.core.tests.typeinference.TypeInferenceTests)  Time elapsed: 0.001 sec
inference[workspace/typeinference/php5/testSelfFieldAccess.pdtt](org.eclipse.php.core.tests.typeinference.TypeInferenceTests)  Time elapsed: 0.005 sec
inference[workspace/typeinference/php5/testSelfMethodReturnType.pdtt](org.eclipse.php.core.tests.typeinference.TypeInferenceTests)  Time elapsed: 0.006 sec
inference[workspace/typeinference/php5/testSelfVarDeclaration.pdtt](org.eclipse.php.core.tests.typeinference.TypeInferenceTests)  Time elapsed: 0.004 sec
inference[workspace/typeinference/php5/testStaticMethodReturnType.pdtt](org.eclipse.php.core.tests.typeinference.TypeInferenceTests)  Time elapsed: 0.029 sec
inference[workspace/typeinference/php5/testThis.pdtt](org.eclipse.php.core.tests.typeinference.TypeInferenceTests)  Time elapsed: 0.002 sec
inference[workspace/typeinference/php5/testTypedArgumentReference.pdtt](org.eclipse.php.core.tests.typeinference.TypeInferenceTests)  Time elapsed: 0.001 sec
inference[workspace/typeinference/php5/testUnaryOperationMinus.pdtt](org.eclipse.php.core.tests.typeinference.TypeInferenceTests)  Time elapsed: 0.001 sec
inference[workspace/typeinference/php5/testUnaryOperationNot.pdtt](org.eclipse.php.core.tests.typeinference.TypeInferenceTests)  Time elapsed: 0.001 sec
inference[workspace/typeinference/php5/testUnaryOperationTilda.pdtt](org.eclipse.php.core.tests.typeinference.TypeInferenceTests)  Time elapsed: 0.001 sec
inference[workspace/typeinference/php54/testClassMember1.pdtt](org.eclipse.php.core.tests.typeinference.TypeInferenceTests)  Time elapsed: 0.004 sec
inference[workspace/typeinference/php54/testClassMember2.pdtt](org.eclipse.php.core.tests.typeinference.TypeInferenceTests)  Time elapsed: 0.004 sec
inference[workspace/typeinference/php55/testParentFieldAccess.pdtt](org.eclipse.php.core.tests.typeinference.TypeInferenceTests)  Time elapsed: 0.004 sec
inference[workspace/typeinference/php55/testSelfClassInstanceCreation.pdtt](org.eclipse.php.core.tests.typeinference.TypeInferenceTests)  Time elapsed: 0.002 sec
inference[workspace/typeinference/php55/testSelfFieldAccess.pdtt](org.eclipse.php.core.tests.typeinference.TypeInferenceTests)  Time elapsed: 0.004 sec
inference[workspace/typeinference/php55/testSelfMethodReturnType.pdtt](org.eclipse.php.core.tests.typeinference.TypeInferenceTests)  Time elapsed: 0.004 sec
inference[workspace/typeinference/php55/testSelfVarDeclaration.pdtt](org.eclipse.php.core.tests.typeinference.TypeInferenceTests)  Time elapsed: 0.004 sec
inference[workspace/typeinference/php55/testYieldForeach.pdtt](org.eclipse.php.core.tests.typeinference.TypeInferenceTests)  Time elapsed: 1.159 sec
inference[workspace/typeinference/php55/testYieldReturnType.pdtt](org.eclipse.php.core.tests.typeinference.TypeInferenceTests)  Time elapsed: 0.007 sec
testCachedReferencedFiles(org.eclipse.php.core.tests.filenetwork.FileNetworkTests)  Time elapsed: 0.182 sec
testSearchMethodBadNetwork(org.eclipse.php.core.tests.filenetwork.FileNetworkTests)  Time elapsed: 0.008 sec
testSearchMethod(org.eclipse.php.core.tests.filenetwork.FileNetworkTests)  Time elapsed: 0.001 sec
testReferencingFiles(org.eclipse.php.core.tests.filenetwork.FileNetworkTests)  Time elapsed: 0.001 sec
testReferencedFiles(org.eclipse.php.core.tests.filenetwork.FileNetworkTests)  Time elapsed: 0.001 sec
parser[workspace/phpdoc_parser/test491991.pdtt](org.eclipse.php.core.tests.compiler_ast.phpdoc.PHPDocParserTests)  Time elapsed: 0.001 sec
parser[workspace/phpdoc_parser/testInheritDocTag.pdtt](org.eclipse.php.core.tests.compiler_ast.phpdoc.PHPDocParserTests)  Time elapsed: 0 sec
parser[workspace/phpdoc_parser/testParamTag.pdtt](org.eclipse.php.core.tests.compiler_ast.phpdoc.PHPDocParserTests)  Time elapsed: 0 sec
parser[workspace/phpdoc_parser/testReturnMultipleTag.pdtt](org.eclipse.php.core.tests.compiler_ast.phpdoc.PHPDocParserTests)  Time elapsed: 0.001 sec
parser[workspace/phpdoc_parser/testReturnTag.pdtt](org.eclipse.php.core.tests.compiler_ast.phpdoc.PHPDocParserTests)  Time elapsed: 0 sec
parser[workspace/phpdoc_parser/testThrowsTag.pdtt](org.eclipse.php.core.tests.compiler_ast.phpdoc.PHPDocParserTests)  Time elapsed: 0 sec
parser[workspace/phpdoc_parser/testVarTag.pdtt](org.eclipse.php.core.tests.compiler_ast.phpdoc.PHPDocParserTests)  Time elapsed: 0 sec
testVarWithModifiers10(org.eclipse.php.core.tests.compiler_ast.phpdoc.PHPDocAwareDeclarationTests)  Time elapsed: 0.001 sec
testVar(org.eclipse.php.core.tests.compiler_ast.phpdoc.PHPDocAwareDeclarationTests)  Time elapsed: 0.001 sec
testClass(org.eclipse.php.core.tests.compiler_ast.phpdoc.PHPDocAwareDeclarationTests)  Time elapsed: 0 sec
testClassFinal(org.eclipse.php.core.tests.compiler_ast.phpdoc.PHPDocAwareDeclarationTests)  Time elapsed: 0 sec
testClassNegative(org.eclipse.php.core.tests.compiler_ast.phpdoc.PHPDocAwareDeclarationTests)  Time elapsed: 0 sec
testClassAbstract(org.eclipse.php.core.tests.compiler_ast.phpdoc.PHPDocAwareDeclarationTests)  Time elapsed: 0 sec
testInterface(org.eclipse.php.core.tests.compiler_ast.phpdoc.PHPDocAwareDeclarationTests)  Time elapsed: 0.001 sec
testMethodWithModifiers10(org.eclipse.php.core.tests.compiler_ast.phpdoc.PHPDocAwareDeclarationTests)  Time elapsed: 0 sec
testMethodWithModifiers11(org.eclipse.php.core.tests.compiler_ast.phpdoc.PHPDocAwareDeclarationTests)  Time elapsed: 0 sec
testMethodWithModifiers12(org.eclipse.php.core.tests.compiler_ast.phpdoc.PHPDocAwareDeclarationTests)  Time elapsed: 0 sec
testMethodWithModifiers13(org.eclipse.php.core.tests.compiler_ast.phpdoc.PHPDocAwareDeclarationTests)  Time elapsed: 0 sec
testMethodWithModifiers14(org.eclipse.php.core.tests.compiler_ast.phpdoc.PHPDocAwareDeclarationTests)  Time elapsed: 0.001 sec
testMethodWithModifiers15(org.eclipse.php.core.tests.compiler_ast.phpdoc.PHPDocAwareDeclarationTests)  Time elapsed: 0 sec
testMethodWithModifiers16(org.eclipse.php.core.tests.compiler_ast.phpdoc.PHPDocAwareDeclarationTests)  Time elapsed: 0 sec
testMethodWithModifiers17(org.eclipse.php.core.tests.compiler_ast.phpdoc.PHPDocAwareDeclarationTests)  Time elapsed: 0 sec
testMethod(org.eclipse.php.core.tests.compiler_ast.phpdoc.PHPDocAwareDeclarationTests)  Time elapsed: 0 sec
testVarWithModifiers1(org.eclipse.php.core.tests.compiler_ast.phpdoc.PHPDocAwareDeclarationTests)  Time elapsed: 0 sec
testVarWithModifiers2(org.eclipse.php.core.tests.compiler_ast.phpdoc.PHPDocAwareDeclarationTests)  Time elapsed: 0 sec
testVarWithModifiers3(org.eclipse.php.core.tests.compiler_ast.phpdoc.PHPDocAwareDeclarationTests)  Time elapsed: 0 sec
testVarWithModifiers4(org.eclipse.php.core.tests.compiler_ast.phpdoc.PHPDocAwareDeclarationTests)  Time elapsed: 0 sec
testVarWithModifiers5(org.eclipse.php.core.tests.compiler_ast.phpdoc.PHPDocAwareDeclarationTests)  Time elapsed: 0.001 sec
testVarWithModifiers6(org.eclipse.php.core.tests.compiler_ast.phpdoc.PHPDocAwareDeclarationTests)  Time elapsed: 0 sec
testVarWithModifiers7(org.eclipse.php.core.tests.compiler_ast.phpdoc.PHPDocAwareDeclarationTests)  Time elapsed: 0 sec
testVarWithModifiers8(org.eclipse.php.core.tests.compiler_ast.phpdoc.PHPDocAwareDeclarationTests)  Time elapsed: 0 sec
testVarWithModifiers9(org.eclipse.php.core.tests.compiler_ast.phpdoc.PHPDocAwareDeclarationTests)  Time elapsed: 0 sec
testMethodWithModifiers1(org.eclipse.php.core.tests.compiler_ast.phpdoc.PHPDocAwareDeclarationTests)  Time elapsed: 0 sec
testMethodWithModifiers2(org.eclipse.php.core.tests.compiler_ast.phpdoc.PHPDocAwareDeclarationTests)  Time elapsed: 0.001 sec
testMethodWithModifiers3(org.eclipse.php.core.tests.compiler_ast.phpdoc.PHPDocAwareDeclarationTests)  Time elapsed: 0 sec
testMethodWithModifiers4(org.eclipse.php.core.tests.compiler_ast.phpdoc.PHPDocAwareDeclarationTests)  Time elapsed: 0 sec
testMethodWithModifiers5(org.eclipse.php.core.tests.compiler_ast.phpdoc.PHPDocAwareDeclarationTests)  Time elapsed: 0 sec
testMethodWithModifiers6(org.eclipse.php.core.tests.compiler_ast.phpdoc.PHPDocAwareDeclarationTests)  Time elapsed: 0 sec
testMethodWithModifiers7(org.eclipse.php.core.tests.compiler_ast.phpdoc.PHPDocAwareDeclarationTests)  Time elapsed: 0.001 sec
testMethodWithModifiers8(org.eclipse.php.core.tests.compiler_ast.phpdoc.PHPDocAwareDeclarationTests)  Time elapsed: 0 sec
testMethodWithModifiers9(org.eclipse.php.core.tests.compiler_ast.phpdoc.PHPDocAwareDeclarationTests)  Time elapsed: 0 sec
includePathGetAfterBPChange1(org.eclipse.php.core.tests.includepath.IncludePathManagerTests)  Time elapsed: 0.332 sec
includePathGetAfterBPChange2(org.eclipse.php.core.tests.includepath.IncludePathManagerTests)  Time elapsed: 0.398 sec
includePathGet(org.eclipse.php.core.tests.includepath.IncludePathManagerTests)  Time elapsed: 1.566 sec
includePathSet(org.eclipse.php.core.tests.includepath.IncludePathManagerTests)  Time elapsed: 0.622 sec
constructorBinding(org.eclipse.php.core.tests.dom_ast.binding.BindingTests)  Time elapsed: 0.563 sec
thisFieldAccessBinding(org.eclipse.php.core.tests.dom_ast.binding.BindingTests)  Time elapsed: 0.018 sec
interfaceDeclarationBinding(org.eclipse.php.core.tests.dom_ast.binding.BindingTests)  Time elapsed: 0.006 sec
isSubTypeCompatibleTrue(org.eclipse.php.core.tests.dom_ast.binding.BindingTests)  Time elapsed: 0.005 sec
basicType(org.eclipse.php.core.tests.dom_ast.binding.BindingTests)  Time elapsed: 0.004 sec
fieldAccessBinding(org.eclipse.php.core.tests.dom_ast.binding.BindingTests)  Time elapsed: 0.006 sec
getDeclaredFields(org.eclipse.php.core.tests.dom_ast.binding.BindingTests)  Time elapsed: 0.006 sec
binaryName(org.eclipse.php.core.tests.dom_ast.binding.BindingTests)  Time elapsed: 0.005 sec
methodInvocationBinding(org.eclipse.php.core.tests.dom_ast.binding.BindingTests)  Time elapsed: 0.004 sec
staticConstantAccessBinding(org.eclipse.php.core.tests.dom_ast.binding.BindingTests)  Time elapsed: 0.008 sec
overrides(org.eclipse.php.core.tests.dom_ast.binding.BindingTests)  Time elapsed: 0.006 sec
includeBinding(org.eclipse.php.core.tests.dom_ast.binding.BindingTests)  Time elapsed: 0.005 sec
isPrimitive(org.eclipse.php.core.tests.dom_ast.binding.BindingTests)  Time elapsed: 0.003 sec
functionDeclarationBinding(org.eclipse.php.core.tests.dom_ast.binding.BindingTests)  Time elapsed: 0.002 sec
basicExpression(org.eclipse.php.core.tests.dom_ast.binding.BindingTests)  Time elapsed: 0.002 sec
methodDeclarationGeneratorBinding(org.eclipse.php.core.tests.dom_ast.binding.BindingTests)  Time elapsed: 0.002 sec
staticFieldAccessBinding(org.eclipse.php.core.tests.dom_ast.binding.BindingTests)  Time elapsed: 0.004 sec
methodDeclarationBinding(org.eclipse.php.core.tests.dom_ast.binding.BindingTests)  Time elapsed: 0.005 sec
isNullType(org.eclipse.php.core.tests.dom_ast.binding.BindingTests)  Time elapsed: 0.003 sec
expressionBinding(org.eclipse.php.core.tests.dom_ast.binding.BindingTests)  Time elapsed: 0.002 sec
isInterface(org.eclipse.php.core.tests.dom_ast.binding.BindingTests)  Time elapsed: 0.007 sec
staticMethodInvocationBinding(org.eclipse.php.core.tests.dom_ast.binding.BindingTests)  Time elapsed: 0.007 sec
getDeclaredMethods(org.eclipse.php.core.tests.dom_ast.binding.BindingTests)  Time elapsed: 0.005 sec
isArray(org.eclipse.php.core.tests.dom_ast.binding.BindingTests)  Time elapsed: 0.003 sec
isClass(org.eclipse.php.core.tests.dom_ast.binding.BindingTests)  Time elapsed: 0.004 sec
functionInvocationBinding(org.eclipse.php.core.tests.dom_ast.binding.BindingTests)  Time elapsed: 0.029 sec
isSubTypeCompatibleFalse(org.eclipse.php.core.tests.dom_ast.binding.BindingTests)  Time elapsed: 0.006 sec
classDeclarationBinding(org.eclipse.php.core.tests.dom_ast.binding.BindingTests)  Time elapsed: 0.005 sec
test[workspace/document_lexer/php5/comments.pdtt](org.eclipse.php.core.tests.document.lexer.DocumentLexerTests)  Time elapsed: 0.008 sec
test[workspace/document_lexer/php5/comments2.pdtt](org.eclipse.php.core.tests.document.lexer.DocumentLexerTests)  Time elapsed: 0 sec
test[workspace/document_lexer/php5/heredocs.pdtt](org.eclipse.php.core.tests.document.lexer.DocumentLexerTests)  Time elapsed: 0 sec
test[workspace/document_lexer/php5/heredocs2.pdtt](org.eclipse.php.core.tests.document.lexer.DocumentLexerTests)  Time elapsed: 0 sec
test[workspace/document_lexer/php5/operators.pdtt](org.eclipse.php.core.tests.document.lexer.DocumentLexerTests)  Time elapsed: 0.001 sec
test[workspace/document_lexer/php5/reserved_words.pdtt](org.eclipse.php.core.tests.document.lexer.DocumentLexerTests)  Time elapsed: 0 sec
test[workspace/document_lexer/php5/sample.pdtt](org.eclipse.php.core.tests.document.lexer.DocumentLexerTests)  Time elapsed: 0.074 sec
test[workspace/document_lexer/php5/strings.pdtt](org.eclipse.php.core.tests.document.lexer.DocumentLexerTests)  Time elapsed: 0 sec
test[workspace/document_lexer/php5/test491991.pdtt](org.eclipse.php.core.tests.document.lexer.DocumentLexerTests)  Time elapsed: 0.001 sec
test[workspace/document_lexer/php5/testPhpQuotedStrings.pdtt](org.eclipse.php.core.tests.document.lexer.DocumentLexerTests)  Time elapsed: 0.002 sec
test[workspace/document_lexer/php5/unicode.pdtt](org.eclipse.php.core.tests.document.lexer.DocumentLexerTests)  Time elapsed: 0 sec
test[workspace/document_lexer/php53/comments.pdtt](org.eclipse.php.core.tests.document.lexer.DocumentLexerTests)  Time elapsed: 0 sec
test[workspace/document_lexer/php53/comments2.pdtt](org.eclipse.php.core.tests.document.lexer.DocumentLexerTests)  Time elapsed: 0 sec
test[workspace/document_lexer/php53/heredocs.pdtt](org.eclipse.php.core.tests.document.lexer.DocumentLexerTests)  Time elapsed: 0 sec
test[workspace/document_lexer/php53/heredocs2.pdtt](org.eclipse.php.core.tests.document.lexer.DocumentLexerTests)  Time elapsed: 0 sec
test[workspace/document_lexer/php53/nested_nowdoc.pdtt](org.eclipse.php.core.tests.document.lexer.DocumentLexerTests)  Time elapsed: 0.001 sec
test[workspace/document_lexer/php53/nowdoc.pdtt](org.eclipse.php.core.tests.document.lexer.DocumentLexerTests)  Time elapsed: 0 sec
test[workspace/document_lexer/php53/operators.pdtt](org.eclipse.php.core.tests.document.lexer.DocumentLexerTests)  Time elapsed: 0.001 sec
test[workspace/document_lexer/php53/reserved_words.pdtt](org.eclipse.php.core.tests.document.lexer.DocumentLexerTests)  Time elapsed: 0.001 sec
test[workspace/document_lexer/php53/sample.pdtt](org.eclipse.php.core.tests.document.lexer.DocumentLexerTests)  Time elapsed: 0.072 sec
test[workspace/document_lexer/php53/strings.pdtt](org.eclipse.php.core.tests.document.lexer.DocumentLexerTests)  Time elapsed: 0 sec
test[workspace/document_lexer/php53/test491991.pdtt](org.eclipse.php.core.tests.document.lexer.DocumentLexerTests)  Time elapsed: 0.001 sec
test[workspace/document_lexer/php53/testPhpQuotedStrings.pdtt](org.eclipse.php.core.tests.document.lexer.DocumentLexerTests)  Time elapsed: 0.001 sec
test[workspace/document_lexer/php53/unicode.pdtt](org.eclipse.php.core.tests.document.lexer.DocumentLexerTests)  Time elapsed: 0 sec
test[workspace/document_lexer/php53/comments.pdtt](org.eclipse.php.core.tests.document.lexer.DocumentLexerTests)  Time elapsed: 0 sec
test[workspace/document_lexer/php53/comments2.pdtt](org.eclipse.php.core.tests.document.lexer.DocumentLexerTests)  Time elapsed: 0.001 sec
test[workspace/document_lexer/php53/heredocs.pdtt](org.eclipse.php.core.tests.document.lexer.DocumentLexerTests)  Time elapsed: 0 sec
test[workspace/document_lexer/php53/heredocs2.pdtt](org.eclipse.php.core.tests.document.lexer.DocumentLexerTests)  Time elapsed: 0 sec
test[workspace/document_lexer/php53/nested_nowdoc.pdtt](org.eclipse.php.core.tests.document.lexer.DocumentLexerTests)  Time elapsed: 0 sec
test[workspace/document_lexer/php53/nowdoc.pdtt](org.eclipse.php.core.tests.document.lexer.DocumentLexerTests)  Time elapsed: 0.001 sec
test[workspace/document_lexer/php53/operators.pdtt](org.eclipse.php.core.tests.document.lexer.DocumentLexerTests)  Time elapsed: 0 sec
test[workspace/document_lexer/php53/reserved_words.pdtt](org.eclipse.php.core.tests.document.lexer.DocumentLexerTests)  Time elapsed: 0.001 sec
test[workspace/document_lexer/php53/sample.pdtt](org.eclipse.php.core.tests.document.lexer.DocumentLexerTests)  Time elapsed: 0.073 sec
test[workspace/document_lexer/php53/strings.pdtt](org.eclipse.php.core.tests.document.lexer.DocumentLexerTests)  Time elapsed: 0 sec
test[workspace/document_lexer/php53/test491991.pdtt](org.eclipse.php.core.tests.document.lexer.DocumentLexerTests)  Time elapsed: 0 sec
test[workspace/document_lexer/php53/testPhpQuotedStrings.pdtt](org.eclipse.php.core.tests.document.lexer.DocumentLexerTests)  Time elapsed: 0.001 sec
test[workspace/document_lexer/php53/unicode.pdtt](org.eclipse.php.core.tests.document.lexer.DocumentLexerTests)  Time elapsed: 0 sec
test[workspace/document_lexer/php54/arrayInitializer1.pdtt](org.eclipse.php.core.tests.document.lexer.DocumentLexerTests)  Time elapsed: 0 sec
test[workspace/document_lexer/php54/arrayInitializer3.pdtt](org.eclipse.php.core.tests.document.lexer.DocumentLexerTests)  Time elapsed: 0 sec
test[workspace/document_lexer/php54/callable1.pdtt](org.eclipse.php.core.tests.document.lexer.DocumentLexerTests)  Time elapsed: 0 sec
test[workspace/document_lexer/php54/classInitializer1.pdtt](org.eclipse.php.core.tests.document.lexer.DocumentLexerTests)  Time elapsed: 0 sec
test[workspace/document_lexer/php54/expression1.pdtt](org.eclipse.php.core.tests.document.lexer.DocumentLexerTests)  Time elapsed: 0.001 sec
test[workspace/document_lexer/php54/methodInvocation1.pdtt](org.eclipse.php.core.tests.document.lexer.DocumentLexerTests)  Time elapsed: 0 sec
test[workspace/document_lexer/php54/testStaticLambdaFunction.pdtt](org.eclipse.php.core.tests.document.lexer.DocumentLexerTests)  Time elapsed: 0 sec
test[workspace/document_lexer/php54/testTrait1.pdtt](org.eclipse.php.core.tests.document.lexer.DocumentLexerTests)  Time elapsed: 0 sec
test[workspace/document_lexer/php54/testTrait2.pdtt](org.eclipse.php.core.tests.document.lexer.DocumentLexerTests)  Time elapsed: 0 sec
test[workspace/document_lexer/php54/testTrait3.pdtt](org.eclipse.php.core.tests.document.lexer.DocumentLexerTests)  Time elapsed: 0 sec
test[workspace/document_lexer/php54/testTrait4.pdtt](org.eclipse.php.core.tests.document.lexer.DocumentLexerTests)  Time elapsed: 0.001 sec
test[workspace/document_lexer/php54/testTrait5.pdtt](org.eclipse.php.core.tests.document.lexer.DocumentLexerTests)  Time elapsed: 0 sec
test[workspace/document_lexer/php54/testTrait6.pdtt](org.eclipse.php.core.tests.document.lexer.DocumentLexerTests)  Time elapsed: 0.001 sec
test[workspace/document_lexer/php54/testTrait7.pdtt](org.eclipse.php.core.tests.document.lexer.DocumentLexerTests)  Time elapsed: 0 sec
test[workspace/document_lexer/php54/testTrait8.pdtt](org.eclipse.php.core.tests.document.lexer.DocumentLexerTests)  Time elapsed: 0 sec
test[workspace/document_lexer/php54/testTrait9.pdtt](org.eclipse.php.core.tests.document.lexer.DocumentLexerTests)  Time elapsed: 0 sec
test[workspace/document_lexer/php53/comments.pdtt](org.eclipse.php.core.tests.document.lexer.DocumentLexerTests)  Time elapsed: 0.001 sec
test[workspace/document_lexer/php53/comments2.pdtt](org.eclipse.php.core.tests.document.lexer.DocumentLexerTests)  Time elapsed: 0 sec
test[workspace/document_lexer/php53/heredocs.pdtt](org.eclipse.php.core.tests.document.lexer.DocumentLexerTests)  Time elapsed: 0 sec
test[workspace/document_lexer/php53/heredocs2.pdtt](org.eclipse.php.core.tests.document.lexer.DocumentLexerTests)  Time elapsed: 0 sec
test[workspace/document_lexer/php53/nested_nowdoc.pdtt](org.eclipse.php.core.tests.document.lexer.DocumentLexerTests)  Time elapsed: 0.001 sec
test[workspace/document_lexer/php53/nowdoc.pdtt](org.eclipse.php.core.tests.document.lexer.DocumentLexerTests)  Time elapsed: 0 sec
test[workspace/document_lexer/php53/operators.pdtt](org.eclipse.php.core.tests.document.lexer.DocumentLexerTests)  Time elapsed: 0.001 sec
test[workspace/document_lexer/php53/reserved_words.pdtt](org.eclipse.php.core.tests.document.lexer.DocumentLexerTests)  Time elapsed: 0 sec
test[workspace/document_lexer/php53/sample.pdtt](org.eclipse.php.core.tests.document.lexer.DocumentLexerTests)  Time elapsed: 0.077 sec
test[workspace/document_lexer/php53/strings.pdtt](org.eclipse.php.core.tests.document.lexer.DocumentLexerTests)  Time elapsed: 0 sec
test[workspace/document_lexer/php53/test491991.pdtt](org.eclipse.php.core.tests.document.lexer.DocumentLexerTests)  Time elapsed: 0.001 sec
test[workspace/document_lexer/php53/testPhpQuotedStrings.pdtt](org.eclipse.php.core.tests.document.lexer.DocumentLexerTests)  Time elapsed: 0.001 sec
test[workspace/document_lexer/php53/unicode.pdtt](org.eclipse.php.core.tests.document.lexer.DocumentLexerTests)  Time elapsed: 0 sec
test[workspace/document_lexer/php54/arrayInitializer1.pdtt](org.eclipse.php.core.tests.document.lexer.DocumentLexerTests)  Time elapsed: 0 sec
test[workspace/document_lexer/php54/arrayInitializer3.pdtt](org.eclipse.php.core.tests.document.lexer.DocumentLexerTests)  Time elapsed: 0 sec
test[workspace/document_lexer/php54/callable1.pdtt](org.eclipse.php.core.tests.document.lexer.DocumentLexerTests)  Time elapsed: 0.001 sec
test[workspace/document_lexer/php54/classInitializer1.pdtt](org.eclipse.php.core.tests.document.lexer.DocumentLexerTests)  Time elapsed: 0 sec
test[workspace/document_lexer/php54/expression1.pdtt](org.eclipse.php.core.tests.document.lexer.DocumentLexerTests)  Time elapsed: 0 sec
test[workspace/document_lexer/php54/methodInvocation1.pdtt](org.eclipse.php.core.tests.document.lexer.DocumentLexerTests)  Time elapsed: 0 sec
test[workspace/document_lexer/php54/testStaticLambdaFunction.pdtt](org.eclipse.php.core.tests.document.lexer.DocumentLexerTests)  Time elapsed: 0 sec
test[workspace/document_lexer/php54/testTrait1.pdtt](org.eclipse.php.core.tests.document.lexer.DocumentLexerTests)  Time elapsed: 0 sec
test[workspace/document_lexer/php54/testTrait2.pdtt](org.eclipse.php.core.tests.document.lexer.DocumentLexerTests)  Time elapsed: 0.001 sec
test[workspace/document_lexer/php54/testTrait3.pdtt](org.eclipse.php.core.tests.document.lexer.DocumentLexerTests)  Time elapsed: 0 sec
test[workspace/document_lexer/php54/testTrait4.pdtt](org.eclipse.php.core.tests.document.lexer.DocumentLexerTests)  Time elapsed: 0 sec
test[workspace/document_lexer/php54/testTrait5.pdtt](org.eclipse.php.core.tests.document.lexer.DocumentLexerTests)  Time elapsed: 0 sec
test[workspace/document_lexer/php54/testTrait6.pdtt](org.eclipse.php.core.tests.document.lexer.DocumentLexerTests)  Time elapsed: 0 sec
test[workspace/document_lexer/php54/testTrait7.pdtt](org.eclipse.php.core.tests.document.lexer.DocumentLexerTests)  Time elapsed: 0 sec
test[workspace/document_lexer/php54/testTrait8.pdtt](org.eclipse.php.core.tests.document.lexer.DocumentLexerTests)  Time elapsed: 0 sec
test[workspace/document_lexer/php54/testTrait9.pdtt](org.eclipse.php.core.tests.document.lexer.DocumentLexerTests)  Time elapsed: 0 sec
test[workspace/document_lexer/php55/arrayInitializer1.pdtt](org.eclipse.php.core.tests.document.lexer.DocumentLexerTests)  Time elapsed: 0.001 sec
test[workspace/document_lexer/php55/arrayInitializer2.pdtt](org.eclipse.php.core.tests.document.lexer.DocumentLexerTests)  Time elapsed: 0 sec
test[workspace/document_lexer/php55/classConstant.pdtt](org.eclipse.php.core.tests.document.lexer.DocumentLexerTests)  Time elapsed: 0 sec
test[workspace/document_lexer/php55/generatorMethod.pdtt](org.eclipse.php.core.tests.document.lexer.DocumentLexerTests)  Time elapsed: 0 sec
test[workspace/document_lexer/php55/parentSelfCaseinsensitive.pdtt](org.eclipse.php.core.tests.document.lexer.DocumentLexerTests)  Time elapsed: 0 sec
test[workspace/document_lexer/php55/scalarDereference.pdtt](org.eclipse.php.core.tests.document.lexer.DocumentLexerTests)  Time elapsed: 0 sec
test[workspace/document_lexer/php55/testTryFinally1.pdtt](org.eclipse.php.core.tests.document.lexer.DocumentLexerTests)  Time elapsed: 0 sec
test[workspace/document_lexer/php55/testTryFinally2.pdtt](org.eclipse.php.core.tests.document.lexer.DocumentLexerTests)  Time elapsed: 0 sec
test[workspace/document_lexer/php53/comments.pdtt](org.eclipse.php.core.tests.document.lexer.DocumentLexerTests)  Time elapsed: 0 sec
test[workspace/document_lexer/php53/comments2.pdtt](org.eclipse.php.core.tests.document.lexer.DocumentLexerTests)  Time elapsed: 0 sec
test[workspace/document_lexer/php53/heredocs.pdtt](org.eclipse.php.core.tests.document.lexer.DocumentLexerTests)  Time elapsed: 0 sec
test[workspace/document_lexer/php53/heredocs2.pdtt](org.eclipse.php.core.tests.document.lexer.DocumentLexerTests)  Time elapsed: 0.001 sec
test[workspace/document_lexer/php53/nested_nowdoc.pdtt](org.eclipse.php.core.tests.document.lexer.DocumentLexerTests)  Time elapsed: 0 sec
test[workspace/document_lexer/php53/nowdoc.pdtt](org.eclipse.php.core.tests.document.lexer.DocumentLexerTests)  Time elapsed: 0 sec
test[workspace/document_lexer/php53/operators.pdtt](org.eclipse.php.core.tests.document.lexer.DocumentLexerTests)  Time elapsed: 0 sec
test[workspace/document_lexer/php53/reserved_words.pdtt](org.eclipse.php.core.tests.document.lexer.DocumentLexerTests)  Time elapsed: 0.001 sec
test[workspace/document_lexer/php53/sample.pdtt](org.eclipse.php.core.tests.document.lexer.DocumentLexerTests)  Time elapsed: 0.073 sec
test[workspace/document_lexer/php53/strings.pdtt](org.eclipse.php.core.tests.document.lexer.DocumentLexerTests)  Time elapsed: 0 sec
test[workspace/document_lexer/php53/test491991.pdtt](org.eclipse.php.core.tests.document.lexer.DocumentLexerTests)  Time elapsed: 0.001 sec
test[workspace/document_lexer/php53/testPhpQuotedStrings.pdtt](org.eclipse.php.core.tests.document.lexer.DocumentLexerTests)  Time elapsed: 0.001 sec
test[workspace/document_lexer/php53/unicode.pdtt](org.eclipse.php.core.tests.document.lexer.DocumentLexerTests)  Time elapsed: 0 sec
test[workspace/document_lexer/php54/arrayInitializer1.pdtt](org.eclipse.php.core.tests.document.lexer.DocumentLexerTests)  Time elapsed: 0.001 sec
test[workspace/document_lexer/php54/arrayInitializer3.pdtt](org.eclipse.php.core.tests.document.lexer.DocumentLexerTests)  Time elapsed: 0 sec
test[workspace/document_lexer/php54/callable1.pdtt](org.eclipse.php.core.tests.document.lexer.DocumentLexerTests)  Time elapsed: 0 sec
test[workspace/document_lexer/php54/classInitializer1.pdtt](org.eclipse.php.core.tests.document.lexer.DocumentLexerTests)  Time elapsed: 0 sec
test[workspace/document_lexer/php54/expression1.pdtt](org.eclipse.php.core.tests.document.lexer.DocumentLexerTests)  Time elapsed: 0 sec
test[workspace/document_lexer/php54/methodInvocation1.pdtt](org.eclipse.php.core.tests.document.lexer.DocumentLexerTests)  Time elapsed: 0 sec
test[workspace/document_lexer/php54/testStaticLambdaFunction.pdtt](org.eclipse.php.core.tests.document.lexer.DocumentLexerTests)  Time elapsed: 0 sec
test[workspace/document_lexer/php54/testTrait1.pdtt](org.eclipse.php.core.tests.document.lexer.DocumentLexerTests)  Time elapsed: 0.001 sec
test[workspace/document_lexer/php54/testTrait2.pdtt](org.eclipse.php.core.tests.document.lexer.DocumentLexerTests)  Time elapsed: 0 sec
test[workspace/document_lexer/php54/testTrait3.pdtt](org.eclipse.php.core.tests.document.lexer.DocumentLexerTests)  Time elapsed: 0 sec
test[workspace/document_lexer/php54/testTrait4.pdtt](org.eclipse.php.core.tests.document.lexer.DocumentLexerTests)  Time elapsed: 0.001 sec
test[workspace/document_lexer/php54/testTrait5.pdtt](org.eclipse.php.core.tests.document.lexer.DocumentLexerTests)  Time elapsed: 0 sec
test[workspace/document_lexer/php54/testTrait6.pdtt](org.eclipse.php.core.tests.document.lexer.DocumentLexerTests)  Time elapsed: 0 sec
test[workspace/document_lexer/php54/testTrait7.pdtt](org.eclipse.php.core.tests.document.lexer.DocumentLexerTests)  Time elapsed: 0 sec
test[workspace/document_lexer/php54/testTrait8.pdtt](org.eclipse.php.core.tests.document.lexer.DocumentLexerTests)  Time elapsed: 0.001 sec
test[workspace/document_lexer/php54/testTrait9.pdtt](org.eclipse.php.core.tests.document.lexer.DocumentLexerTests)  Time elapsed: 0 sec
test[workspace/document_lexer/php56/argumentUnpacking01.pdtt](org.eclipse.php.core.tests.document.lexer.DocumentLexerTests)  Time elapsed: 0 sec
test[workspace/document_lexer/php56/constScalarExpression01.pdtt](org.eclipse.php.core.tests.document.lexer.DocumentLexerTests)  Time elapsed: 0 sec
test[workspace/document_lexer/php56/powOperator01.pdtt](org.eclipse.php.core.tests.document.lexer.DocumentLexerTests)  Time elapsed: 0 sec
test[workspace/document_lexer/php56/useConst01.pdtt](org.eclipse.php.core.tests.document.lexer.DocumentLexerTests)  Time elapsed: 0 sec
test[workspace/document_lexer/php56/useFunction01.pdtt](org.eclipse.php.core.tests.document.lexer.DocumentLexerTests)  Time elapsed: 0 sec
test[workspace/document_lexer/php56/variadicParameter01.pdtt](org.eclipse.php.core.tests.document.lexer.DocumentLexerTests)  Time elapsed: 0 sec
test[workspace/document_lexer/php7/argumentUnpacking01.pdtt](org.eclipse.php.core.tests.document.lexer.DocumentLexerTests)  Time elapsed: 0.001 sec
test[workspace/document_lexer/php7/arrayInitializer1.pdtt](org.eclipse.php.core.tests.document.lexer.DocumentLexerTests)  Time elapsed: 0 sec
test[workspace/document_lexer/php7/arrayInitializer2.pdtt](org.eclipse.php.core.tests.document.lexer.DocumentLexerTests)  Time elapsed: 0 sec
test[workspace/document_lexer/php7/classConstant.pdtt](org.eclipse.php.core.tests.document.lexer.DocumentLexerTests)  Time elapsed: 0 sec
test[workspace/document_lexer/php7/coalesceOperator01.pdtt](org.eclipse.php.core.tests.document.lexer.DocumentLexerTests)  Time elapsed: 0 sec
test[workspace/document_lexer/php7/constScalarExpression01.pdtt](org.eclipse.php.core.tests.document.lexer.DocumentLexerTests)  Time elapsed: 0.001 sec
test[workspace/document_lexer/php7/generatorDelegation01.pdtt](org.eclipse.php.core.tests.document.lexer.DocumentLexerTests)  Time elapsed: 0 sec
test[workspace/document_lexer/php7/generatorMethod.pdtt](org.eclipse.php.core.tests.document.lexer.DocumentLexerTests)  Time elapsed: 0 sec
test[workspace/document_lexer/php7/groupUseStatement01.pdtt](org.eclipse.php.core.tests.document.lexer.DocumentLexerTests)  Time elapsed: 0 sec
test[workspace/document_lexer/php7/groupUseStatement02.pdtt](org.eclipse.php.core.tests.document.lexer.DocumentLexerTests)  Time elapsed: 0 sec
test[workspace/document_lexer/php7/groupUseStatement03.pdtt](org.eclipse.php.core.tests.document.lexer.DocumentLexerTests)  Time elapsed: 0 sec
test[workspace/document_lexer/php7/parentSelfCaseinsensitive.pdtt](org.eclipse.php.core.tests.document.lexer.DocumentLexerTests)  Time elapsed: 0 sec
test[workspace/document_lexer/php7/powOperator01.pdtt](org.eclipse.php.core.tests.document.lexer.DocumentLexerTests)  Time elapsed: 0 sec
test[workspace/document_lexer/php7/scalarDereference.pdtt](org.eclipse.php.core.tests.document.lexer.DocumentLexerTests)  Time elapsed: 0 sec
test[workspace/document_lexer/php7/semiReservedWords.pdtt](org.eclipse.php.core.tests.document.lexer.DocumentLexerTests)  Time elapsed: 0 sec
test[workspace/document_lexer/php7/spaceshipOperator01.pdtt](org.eclipse.php.core.tests.document.lexer.DocumentLexerTests)  Time elapsed: 0 sec
test[workspace/document_lexer/php7/testTryFinally1.pdtt](org.eclipse.php.core.tests.document.lexer.DocumentLexerTests)  Time elapsed: 0 sec
test[workspace/document_lexer/php7/testTryFinally2.pdtt](org.eclipse.php.core.tests.document.lexer.DocumentLexerTests)  Time elapsed: 0 sec
test[workspace/document_lexer/php7/useConst01.pdtt](org.eclipse.php.core.tests.document.lexer.DocumentLexerTests)  Time elapsed: 0 sec
test[workspace/document_lexer/php7/useFunction01.pdtt](org.eclipse.php.core.tests.document.lexer.DocumentLexerTests)  Time elapsed: 0.001 sec
test[workspace/document_lexer/php7/variadicParameter01.pdtt](org.eclipse.php.core.tests.document.lexer.DocumentLexerTests)  Time elapsed: 0 sec
partitionPhpAsHTMLAttributeValue(org.eclipse.php.core.tests.document.partitioner.PHPPartitionerTests)  Time elapsed: 1.292 sec
partitionPhpAsHTMLAttributeKey(org.eclipse.php.core.tests.document.partitioner.PHPPartitionerTests)  Time elapsed: 0.237 sec
partitionStandalone(org.eclipse.php.core.tests.document.partitioner.PHPPartitionerTests)  Time elapsed: 0.288 sec
partitionInHTML(org.eclipse.php.core.tests.document.partitioner.PHPPartitionerTests)  Time elapsed: 1.257 sec
runTest[/jobs/genie.pdt/pdt-gerrit/workspace/tests/org.eclipse.php.core.tests/workspace/phar/phar2 - org.eclipse.php.internal.core.phar.PharPackage@1d77746b - 0 - SHA1](org.eclipse.php.core.tests.phar.PharFileTest)  Time elapsed: 0.124 sec
runTest[/jobs/genie.pdt/pdt-gerrit/workspace/tests/org.eclipse.php.core.tests/workspace/phar/phar2 - org.eclipse.php.internal.core.phar.PharPackage@1d77746b - 2 - SHA1](org.eclipse.php.core.tests.phar.PharFileTest)  Time elapsed: 0.036 sec
runTest[/jobs/genie.pdt/pdt-gerrit/workspace/tests/org.eclipse.php.core.tests/workspace/phar/phar2 - org.eclipse.php.internal.core.phar.PharPackage@1d77746b - 1 - MD5](org.eclipse.php.core.tests.phar.PharFileTest)  Time elapsed: 0.01 sec
runTest[/jobs/genie.pdt/pdt-gerrit/workspace/tests/org.eclipse.php.core.tests/workspace/phar/pear2coverage - org.eclipse.php.internal.core.phar.PharPackage@4ced17f3 - 0 - SHA1](org.eclipse.php.core.tests.phar.PharFileTest)  Time elapsed: 0.011 sec
runTest[/jobs/genie.pdt/pdt-gerrit/workspace/tests/org.eclipse.php.core.tests/workspace/phar/pear2coverage - org.eclipse.php.internal.core.phar.PharPackage@4ced17f3 - 2 - SHA1](org.eclipse.php.core.tests.phar.PharFileTest)  Time elapsed: 0.156 sec
runTest[/jobs/genie.pdt/pdt-gerrit/workspace/tests/org.eclipse.php.core.tests/workspace/phar/pear2coverage - org.eclipse.php.internal.core.phar.PharPackage@4ced17f3 - 1 - MD5](org.eclipse.php.core.tests.phar.PharFileTest)  Time elapsed: 0.01 sec
concileConstant(org.eclipse.php.internal.core.ast.locator.PhpElementConciliatorTest)  Time elapsed: 0.273 sec
concileGlobalExists(org.eclipse.php.internal.core.ast.locator.PhpElementConciliatorTest)  Time elapsed: 0.026 sec
concileProgram(org.eclipse.php.internal.core.ast.locator.PhpElementConciliatorTest)  Time elapsed: 0.006 sec
localVar1(org.eclipse.php.internal.core.ast.locator.PhpElementConciliatorTest)  Time elapsed: 0.002 sec
funExists1(org.eclipse.php.internal.core.ast.locator.PhpElementConciliatorTest)  Time elapsed: 0.002 sec
concileFunc(org.eclipse.php.internal.core.ast.locator.PhpElementConciliatorTest)  Time elapsed: 0.002 sec
concileInterface1(org.eclipse.php.internal.core.ast.locator.PhpElementConciliatorTest)  Time elapsed: 0.002 sec
concileClassNameExists(org.eclipse.php.internal.core.ast.locator.PhpElementConciliatorTest)  Time elapsed: 0.002 sec
concileMethod1(org.eclipse.php.internal.core.ast.locator.PhpElementConciliatorTest)  Time elapsed: 0.271 sec
concileMethod2(org.eclipse.php.internal.core.ast.locator.PhpElementConciliatorTest)  Time elapsed: 0.009 sec
concileMethod3(org.eclipse.php.internal.core.ast.locator.PhpElementConciliatorTest)  Time elapsed: 0.002 sec
concileMethod4(org.eclipse.php.internal.core.ast.locator.PhpElementConciliatorTest)  Time elapsed: 0.002 sec
concileClsMemberExists(org.eclipse.php.internal.core.ast.locator.PhpElementConciliatorTest)  Time elapsed: 0.003 sec
concileField1(org.eclipse.php.internal.core.ast.locator.PhpElementConciliatorTest)  Time elapsed: 0.004 sec
concileField2(org.eclipse.php.internal.core.ast.locator.PhpElementConciliatorTest)  Time elapsed: 0.003 sec
concileField3(org.eclipse.php.internal.core.ast.locator.PhpElementConciliatorTest)  Time elapsed: 0.007 sec
concileGlobalVar1(org.eclipse.php.internal.core.ast.locator.PhpElementConciliatorTest)  Time elapsed: 0.003 sec
concileGlobalVar2(org.eclipse.php.internal.core.ast.locator.PhpElementConciliatorTest)  Time elapsed: 0.003 sec
concileConstantExists(org.eclipse.php.internal.core.ast.locator.PhpElementConciliatorTest)  Time elapsed: 0.003 sec
concileStaticField1(org.eclipse.php.internal.core.ast.locator.PhpElementConciliatorTest)  Time elapsed: 0.003 sec
concileClassName1(org.eclipse.php.internal.core.ast.locator.PhpElementConciliatorTest)  Time elapsed: 0.002 sec
concileClassName2(org.eclipse.php.internal.core.ast.locator.PhpElementConciliatorTest)  Time elapsed: 0.003 sec
concileConstant1(org.eclipse.php.internal.core.ast.locator.PhpElementConciliatorTest)  Time elapsed: 0.003 sec
concileClassName(org.eclipse.php.internal.core.ast.locator.PhpElementConciliatorTest)  Time elapsed: 0.002 sec
localVarExists(org.eclipse.php.internal.core.ast.locator.PhpElementConciliatorTest)  Time elapsed: 0.003 sec
concileGlobalVar(org.eclipse.php.internal.core.ast.locator.PhpElementConciliatorTest)  Time elapsed: 0.001 sec
concileInterface(org.eclipse.php.internal.core.ast.locator.PhpElementConciliatorTest)  Time elapsed: 0.003 sec
localVar(org.eclipse.php.internal.core.ast.locator.PhpElementConciliatorTest)  Time elapsed: 0.002 sec
concileFunc1(org.eclipse.php.internal.core.ast.locator.PhpElementConciliatorTest)  Time elapsed: 0.004 sec
concileConstant(org.eclipse.php.internal.core.ast.locator.PhpElementConciliatorV5_3Test)  Time elapsed: 0.126 sec
concileProgram(org.eclipse.php.internal.core.ast.locator.PhpElementConciliatorV5_3Test)  Time elapsed: 0.03 sec
concileFunc(org.eclipse.php.internal.core.ast.locator.PhpElementConciliatorV5_3Test)  Time elapsed: 0.007 sec
concileInterface1(org.eclipse.php.internal.core.ast.locator.PhpElementConciliatorV5_3Test)  Time elapsed: 0.003 sec
concileMethod1(org.eclipse.php.internal.core.ast.locator.PhpElementConciliatorV5_3Test)  Time elapsed: 0.007 sec
concileMethod2(org.eclipse.php.internal.core.ast.locator.PhpElementConciliatorV5_3Test)  Time elapsed: 0.002 sec
concileMethod3(org.eclipse.php.internal.core.ast.locator.PhpElementConciliatorV5_3Test)  Time elapsed: 0.003 sec
concileMethod4(org.eclipse.php.internal.core.ast.locator.PhpElementConciliatorV5_3Test)  Time elapsed: 0.002 sec
concileField1(org.eclipse.php.internal.core.ast.locator.PhpElementConciliatorV5_3Test)  Time elapsed: 0.003 sec
concileField2(org.eclipse.php.internal.core.ast.locator.PhpElementConciliatorV5_3Test)  Time elapsed: 0.005 sec
concileGlobalVar1(org.eclipse.php.internal.core.ast.locator.PhpElementConciliatorV5_3Test)  Time elapsed: 0.003 sec
concileStaticField1(org.eclipse.php.internal.core.ast.locator.PhpElementConciliatorV5_3Test)  Time elapsed: 0.003 sec
concileClassName1(org.eclipse.php.internal.core.ast.locator.PhpElementConciliatorV5_3Test)  Time elapsed: 0.002 sec
concileClassName2(org.eclipse.php.internal.core.ast.locator.PhpElementConciliatorV5_3Test)  Time elapsed: 0.004 sec
concileConstant1(org.eclipse.php.internal.core.ast.locator.PhpElementConciliatorV5_3Test)  Time elapsed: 0.006 sec
concileConstant2(org.eclipse.php.internal.core.ast.locator.PhpElementConciliatorV5_3Test)  Time elapsed: 0.003 sec
concileConstant3(org.eclipse.php.internal.core.ast.locator.PhpElementConciliatorV5_3Test)  Time elapsed: 0.002 sec
concileClassName(org.eclipse.php.internal.core.ast.locator.PhpElementConciliatorV5_3Test)  Time elapsed: 0.002 sec
concileGlobalVar(org.eclipse.php.internal.core.ast.locator.PhpElementConciliatorV5_3Test)  Time elapsed: 0.004 sec
concileInterface(org.eclipse.php.internal.core.ast.locator.PhpElementConciliatorV5_3Test)  Time elapsed: 0.004 sec
localVar(org.eclipse.php.internal.core.ast.locator.PhpElementConciliatorV5_3Test)  Time elapsed: 0.003 sec
concileFunc1(org.eclipse.php.internal.core.ast.locator.PhpElementConciliatorV5_3Test)  Time elapsed: 0.004 sec
concileConstant(org.eclipse.php.internal.core.ast.locator.PhpElementConciliatorV5_4Test)  Time elapsed: 0.017 sec
concileProgram(org.eclipse.php.internal.core.ast.locator.PhpElementConciliatorV5_4Test)  Time elapsed: 0.05 sec
concileFunc(org.eclipse.php.internal.core.ast.locator.PhpElementConciliatorV5_4Test)  Time elapsed: 0.006 sec
concileInterface1(org.eclipse.php.internal.core.ast.locator.PhpElementConciliatorV5_4Test)  Time elapsed: 0.004 sec
concileMethod1(org.eclipse.php.internal.core.ast.locator.PhpElementConciliatorV5_4Test)  Time elapsed: 0.006 sec
concileMethod2(org.eclipse.php.internal.core.ast.locator.PhpElementConciliatorV5_4Test)  Time elapsed: 0.004 sec
concileMethod3(org.eclipse.php.internal.core.ast.locator.PhpElementConciliatorV5_4Test)  Time elapsed: 0.004 sec
concileMethod4(org.eclipse.php.internal.core.ast.locator.PhpElementConciliatorV5_4Test)  Time elapsed: 0.004 sec
concileField1(org.eclipse.php.internal.core.ast.locator.PhpElementConciliatorV5_4Test)  Time elapsed: 0.004 sec
concileField2(org.eclipse.php.internal.core.ast.locator.PhpElementConciliatorV5_4Test)  Time elapsed: 0.003 sec
concileGlobalVar1(org.eclipse.php.internal.core.ast.locator.PhpElementConciliatorV5_4Test)  Time elapsed: 0.003 sec
concileStaticField1(org.eclipse.php.internal.core.ast.locator.PhpElementConciliatorV5_4Test)  Time elapsed: 0.004 sec
concileClassName1(org.eclipse.php.internal.core.ast.locator.PhpElementConciliatorV5_4Test)  Time elapsed: 0.003 sec
concileClassName2(org.eclipse.php.internal.core.ast.locator.PhpElementConciliatorV5_4Test)  Time elapsed: 0.004 sec
concileConstant1(org.eclipse.php.internal.core.ast.locator.PhpElementConciliatorV5_4Test)  Time elapsed: 0.004 sec
concileConstant2(org.eclipse.php.internal.core.ast.locator.PhpElementConciliatorV5_4Test)  Time elapsed: 0.003 sec
concileConstant3(org.eclipse.php.internal.core.ast.locator.PhpElementConciliatorV5_4Test)  Time elapsed: 0.003 sec
concileClassName(org.eclipse.php.internal.core.ast.locator.PhpElementConciliatorV5_4Test)  Time elapsed: 0.003 sec
concileGlobalVar(org.eclipse.php.internal.core.ast.locator.PhpElementConciliatorV5_4Test)  Time elapsed: 0.003 sec
concileInterface(org.eclipse.php.internal.core.ast.locator.PhpElementConciliatorV5_4Test)  Time elapsed: 0.003 sec
localVar(org.eclipse.php.internal.core.ast.locator.PhpElementConciliatorV5_4Test)  Time elapsed: 0.003 sec
concileFunc1(org.eclipse.php.internal.core.ast.locator.PhpElementConciliatorV5_4Test)  Time elapsed: 0.003 sec
concileConstant(org.eclipse.php.internal.core.ast.locator.PhpElementConciliatorV5_5Test)  Time elapsed: 0.104 sec
concileProgram(org.eclipse.php.internal.core.ast.locator.PhpElementConciliatorV5_5Test)  Time elapsed: 0.048 sec
concileFunc(org.eclipse.php.internal.core.ast.locator.PhpElementConciliatorV5_5Test)  Time elapsed: 1.134 sec
concileInterface1(org.eclipse.php.internal.core.ast.locator.PhpElementConciliatorV5_5Test)  Time elapsed: 0.006 sec
concileMethod1(org.eclipse.php.internal.core.ast.locator.PhpElementConciliatorV5_5Test)  Time elapsed: 0.167 sec
concileMethod2(org.eclipse.php.internal.core.ast.locator.PhpElementConciliatorV5_5Test)  Time elapsed: 0.004 sec
concileMethod3(org.eclipse.php.internal.core.ast.locator.PhpElementConciliatorV5_5Test)  Time elapsed: 0.003 sec
concileMethod4(org.eclipse.php.internal.core.ast.locator.PhpElementConciliatorV5_5Test)  Time elapsed: 0.003 sec
concileField1(org.eclipse.php.internal.core.ast.locator.PhpElementConciliatorV5_5Test)  Time elapsed: 0.004 sec
concileField2(org.eclipse.php.internal.core.ast.locator.PhpElementConciliatorV5_5Test)  Time elapsed: 0.003 sec
concileGlobalVar1(org.eclipse.php.internal.core.ast.locator.PhpElementConciliatorV5_5Test)  Time elapsed: 0.003 sec
concileStaticField1(org.eclipse.php.internal.core.ast.locator.PhpElementConciliatorV5_5Test)  Time elapsed: 0.003 sec
concileClassName1(org.eclipse.php.internal.core.ast.locator.PhpElementConciliatorV5_5Test)  Time elapsed: 0.003 sec
concileClassName2(org.eclipse.php.internal.core.ast.locator.PhpElementConciliatorV5_5Test)  Time elapsed: 0.003 sec
concileConstant1(org.eclipse.php.internal.core.ast.locator.PhpElementConciliatorV5_5Test)  Time elapsed: 0.003 sec
concileConstant2(org.eclipse.php.internal.core.ast.locator.PhpElementConciliatorV5_5Test)  Time elapsed: 0.003 sec
concileConstant3(org.eclipse.php.internal.core.ast.locator.PhpElementConciliatorV5_5Test)  Time elapsed: 0.003 sec
concileClassName(org.eclipse.php.internal.core.ast.locator.PhpElementConciliatorV5_5Test)  Time elapsed: 0.003 sec
concileGlobalVar(org.eclipse.php.internal.core.ast.locator.PhpElementConciliatorV5_5Test)  Time elapsed: 0.002 sec
concileInterface(org.eclipse.php.internal.core.ast.locator.PhpElementConciliatorV5_5Test)  Time elapsed: 0.003 sec
localVar(org.eclipse.php.internal.core.ast.locator.PhpElementConciliatorV5_5Test)  Time elapsed: 0.003 sec
concileFunc1(org.eclipse.php.internal.core.ast.locator.PhpElementConciliatorV5_5Test)  Time elapsed: 0.003 sec
concileConstant(org.eclipse.php.internal.core.ast.locator.PhpElementConciliatorV5_6Test)  Time elapsed: 0.697 sec
concileProgram(org.eclipse.php.internal.core.ast.locator.PhpElementConciliatorV5_6Test)  Time elapsed: 0.144 sec
concileFunc(org.eclipse.php.internal.core.ast.locator.PhpElementConciliatorV5_6Test)  Time elapsed: 0.021 sec
concileInterface1(org.eclipse.php.internal.core.ast.locator.PhpElementConciliatorV5_6Test)  Time elapsed: 0.005 sec
concileMethod1(org.eclipse.php.internal.core.ast.locator.PhpElementConciliatorV5_6Test)  Time elapsed: 0.076 sec
concileMethod2(org.eclipse.php.internal.core.ast.locator.PhpElementConciliatorV5_6Test)  Time elapsed: 0.005 sec
concileMethod3(org.eclipse.php.internal.core.ast.locator.PhpElementConciliatorV5_6Test)  Time elapsed: 0.004 sec
concileMethod4(org.eclipse.php.internal.core.ast.locator.PhpElementConciliatorV5_6Test)  Time elapsed: 0.004 sec
concileField1(org.eclipse.php.internal.core.ast.locator.PhpElementConciliatorV5_6Test)  Time elapsed: 0.005 sec
concileField2(org.eclipse.php.internal.core.ast.locator.PhpElementConciliatorV5_6Test)  Time elapsed: 0.044 sec
concileGlobalVar1(org.eclipse.php.internal.core.ast.locator.PhpElementConciliatorV5_6Test)  Time elapsed: 0.272 sec
concileStaticField1(org.eclipse.php.internal.core.ast.locator.PhpElementConciliatorV5_6Test)  Time elapsed: 0.024 sec
concileClassName1(org.eclipse.php.internal.core.ast.locator.PhpElementConciliatorV5_6Test)  Time elapsed: 0.005 sec
concileClassName2(org.eclipse.php.internal.core.ast.locator.PhpElementConciliatorV5_6Test)  Time elapsed: 0.026 sec
concileConstant1(org.eclipse.php.internal.core.ast.locator.PhpElementConciliatorV5_6Test)  Time elapsed: 0.028 sec
concileConstant2(org.eclipse.php.internal.core.ast.locator.PhpElementConciliatorV5_6Test)  Time elapsed: 0.003 sec
concileConstant3(org.eclipse.php.internal.core.ast.locator.PhpElementConciliatorV5_6Test)  Time elapsed: 0.004 sec
concileClassName(org.eclipse.php.internal.core.ast.locator.PhpElementConciliatorV5_6Test)  Time elapsed: 0.003 sec
concileGlobalVar(org.eclipse.php.internal.core.ast.locator.PhpElementConciliatorV5_6Test)  Time elapsed: 0.004 sec
concileInterface(org.eclipse.php.internal.core.ast.locator.PhpElementConciliatorV5_6Test)  Time elapsed: 0.013 sec
localVar(org.eclipse.php.internal.core.ast.locator.PhpElementConciliatorV5_6Test)  Time elapsed: 0.004 sec
concileFunc1(org.eclipse.php.internal.core.ast.locator.PhpElementConciliatorV5_6Test)  Time elapsed: 0.003 sec
occurrences[workspace/markoccurrence/php5/testClassMembersOccurrences1.pdtt](org.eclipse.php.core.tests.markoccurrence.MarkOccurrenceTests)  Time elapsed: 0.746 sec
occurrences[workspace/markoccurrence/php5/testClassMembersOccurrences2.pdtt](org.eclipse.php.core.tests.markoccurrence.MarkOccurrenceTests)  Time elapsed: 0.017 sec
occurrences[workspace/markoccurrence/php5/testClassMembersOccurrences3.pdtt](org.eclipse.php.core.tests.markoccurrence.MarkOccurrenceTests)  Time elapsed: 0.015 sec
occurrences[workspace/markoccurrence/php5/testClassNameOccurrences1.pdtt](org.eclipse.php.core.tests.markoccurrence.MarkOccurrenceTests)  Time elapsed: 0.005 sec
occurrences[workspace/markoccurrence/php5/testClassNameOccurrences3.pdtt](org.eclipse.php.core.tests.markoccurrence.MarkOccurrenceTests)  Time elapsed: 0.004 sec
occurrences[workspace/markoccurrence/php5/testConstantOccurrences1.pdtt](org.eclipse.php.core.tests.markoccurrence.MarkOccurrenceTests)  Time elapsed: 0.003 sec
occurrences[workspace/markoccurrence/php5/testConstantOccurrences2.pdtt](org.eclipse.php.core.tests.markoccurrence.MarkOccurrenceTests)  Time elapsed: 0.002 sec
occurrences[workspace/markoccurrence/php5/testFunctionOccurrences1.pdtt](org.eclipse.php.core.tests.markoccurrence.MarkOccurrenceTests)  Time elapsed: 0.003 sec
occurrences[workspace/markoccurrence/php5/testFunctionOccurrences2.pdtt](org.eclipse.php.core.tests.markoccurrence.MarkOccurrenceTests)  Time elapsed: 0.001 sec
occurrences[workspace/markoccurrence/php5/testGlobalVariableOccurrences1.pdtt](org.eclipse.php.core.tests.markoccurrence.MarkOccurrenceTests)  Time elapsed: 0.002 sec
occurrences[workspace/markoccurrence/php5/testGlobalVariableOccurrences2.pdtt](org.eclipse.php.core.tests.markoccurrence.MarkOccurrenceTests)  Time elapsed: 0.002 sec
occurrences[workspace/markoccurrence/php5/testLocalVariableOccurrences1.pdtt](org.eclipse.php.core.tests.markoccurrence.MarkOccurrenceTests)  Time elapsed: 0.528 sec
occurrences[workspace/markoccurrence/php5/testLocalVariableOccurrences2.pdtt](org.eclipse.php.core.tests.markoccurrence.MarkOccurrenceTests)  Time elapsed: 0.014 sec
occurrences[workspace/markoccurrence/php5/testPhpQuotedStrings.pdtt](org.eclipse.php.core.tests.markoccurrence.MarkOccurrenceTests)  Time elapsed: 0.004 sec
occurrences[workspace/markoccurrence/php5/testClassMembersOccurrences1.pdtt](org.eclipse.php.core.tests.markoccurrence.MarkOccurrenceTests)  Time elapsed: 0.031 sec
occurrences[workspace/markoccurrence/php5/testClassMembersOccurrences2.pdtt](org.eclipse.php.core.tests.markoccurrence.MarkOccurrenceTests)  Time elapsed: 0.028 sec
occurrences[workspace/markoccurrence/php5/testClassMembersOccurrences3.pdtt](org.eclipse.php.core.tests.markoccurrence.MarkOccurrenceTests)  Time elapsed: 0.013 sec
occurrences[workspace/markoccurrence/php5/testClassNameOccurrences1.pdtt](org.eclipse.php.core.tests.markoccurrence.MarkOccurrenceTests)  Time elapsed: 0.004 sec
occurrences[workspace/markoccurrence/php5/testClassNameOccurrences3.pdtt](org.eclipse.php.core.tests.markoccurrence.MarkOccurrenceTests)  Time elapsed: 0.003 sec
occurrences[workspace/markoccurrence/php5/testConstantOccurrences1.pdtt](org.eclipse.php.core.tests.markoccurrence.MarkOccurrenceTests)  Time elapsed: 0.004 sec
occurrences[workspace/markoccurrence/php5/testConstantOccurrences2.pdtt](org.eclipse.php.core.tests.markoccurrence.MarkOccurrenceTests)  Time elapsed: 0.003 sec
occurrences[workspace/markoccurrence/php5/testFunctionOccurrences1.pdtt](org.eclipse.php.core.tests.markoccurrence.MarkOccurrenceTests)  Time elapsed: 0.007 sec
occurrences[workspace/markoccurrence/php5/testFunctionOccurrences2.pdtt](org.eclipse.php.core.tests.markoccurrence.MarkOccurrenceTests)  Time elapsed: 0.004 sec
occurrences[workspace/markoccurrence/php5/testGlobalVariableOccurrences1.pdtt](org.eclipse.php.core.tests.markoccurrence.MarkOccurrenceTests)  Time elapsed: 0.017 sec
occurrences[workspace/markoccurrence/php5/testGlobalVariableOccurrences2.pdtt](org.eclipse.php.core.tests.markoccurrence.MarkOccurrenceTests)  Time elapsed: 0.007 sec
occurrences[workspace/markoccurrence/php5/testLocalVariableOccurrences1.pdtt](org.eclipse.php.core.tests.markoccurrence.MarkOccurrenceTests)  Time elapsed: 0.005 sec
occurrences[workspace/markoccurrence/php5/testLocalVariableOccurrences2.pdtt](org.eclipse.php.core.tests.markoccurrence.MarkOccurrenceTests)  Time elapsed: 0.004 sec
occurrences[workspace/markoccurrence/php5/testPhpQuotedStrings.pdtt](org.eclipse.php.core.tests.markoccurrence.MarkOccurrenceTests)  Time elapsed: 0.004 sec
occurrences[workspace/markoccurrence/php53/testClassMembersOccurrences1.pdtt](org.eclipse.php.core.tests.markoccurrence.MarkOccurrenceTests)  Time elapsed: 0.012 sec
occurrences[workspace/markoccurrence/php53/testClassMembersOccurrences2.pdtt](org.eclipse.php.core.tests.markoccurrence.MarkOccurrenceTests)  Time elapsed: 0.01 sec
occurrences[workspace/markoccurrence/php53/testClassMembersOccurrences3.pdtt](org.eclipse.php.core.tests.markoccurrence.MarkOccurrenceTests)  Time elapsed: 0.007 sec
occurrences[workspace/markoccurrence/php53/testClassNameOccurrences1.pdtt](org.eclipse.php.core.tests.markoccurrence.MarkOccurrenceTests)  Time elapsed: 0.003 sec
occurrences[workspace/markoccurrence/php53/testFunctionOccurrences1.pdtt](org.eclipse.php.core.tests.markoccurrence.MarkOccurrenceTests)  Time elapsed: 0.003 sec
occurrences[workspace/markoccurrence/php53/testGlobalConstantOccurrences1.pdtt](org.eclipse.php.core.tests.markoccurrence.MarkOccurrenceTests)  Time elapsed: 0.003 sec
occurrences[workspace/markoccurrence/php53/testGlobalConstantOccurrences2.pdtt](org.eclipse.php.core.tests.markoccurrence.MarkOccurrenceTests)  Time elapsed: 0.002 sec
occurrences[workspace/markoccurrence/php53/testGlobalVariableOccurrences1.pdtt](org.eclipse.php.core.tests.markoccurrence.MarkOccurrenceTests)  Time elapsed: 0.003 sec
occurrences[workspace/markoccurrence/php53/testGlobalVariableOccurrences3.pdtt](org.eclipse.php.core.tests.markoccurrence.MarkOccurrenceTests)  Time elapsed: 0.002 sec
occurrences[workspace/markoccurrence/php53/testLocalVariableOccurrences1.pdtt](org.eclipse.php.core.tests.markoccurrence.MarkOccurrenceTests)  Time elapsed: 0.002 sec
occurrences[workspace/markoccurrence/php53/testLocalVariableOccurrences2.pdtt](org.eclipse.php.core.tests.markoccurrence.MarkOccurrenceTests)  Time elapsed: 0.002 sec
occurrences[workspace/markoccurrence/php5/testClassMembersOccurrences1.pdtt](org.eclipse.php.core.tests.markoccurrence.MarkOccurrenceTests)  Time elapsed: 1.621 sec
occurrences[workspace/markoccurrence/php5/testClassMembersOccurrences2.pdtt](org.eclipse.php.core.tests.markoccurrence.MarkOccurrenceTests)  Time elapsed: 0.059 sec
occurrences[workspace/markoccurrence/php5/testClassMembersOccurrences3.pdtt](org.eclipse.php.core.tests.markoccurrence.MarkOccurrenceTests)  Time elapsed: 0.02 sec
occurrences[workspace/markoccurrence/php5/testClassNameOccurrences1.pdtt](org.eclipse.php.core.tests.markoccurrence.MarkOccurrenceTests)  Time elapsed: 0.005 sec
occurrences[workspace/markoccurrence/php5/testClassNameOccurrences3.pdtt](org.eclipse.php.core.tests.markoccurrence.MarkOccurrenceTests)  Time elapsed: 0.002 sec
occurrences[workspace/markoccurrence/php5/testConstantOccurrences1.pdtt](org.eclipse.php.core.tests.markoccurrence.MarkOccurrenceTests)  Time elapsed: 0.003 sec
occurrences[workspace/markoccurrence/php5/testConstantOccurrences2.pdtt](org.eclipse.php.core.tests.markoccurrence.MarkOccurrenceTests)  Time elapsed: 0.002 sec
occurrences[workspace/markoccurrence/php5/testFunctionOccurrences1.pdtt](org.eclipse.php.core.tests.markoccurrence.MarkOccurrenceTests)  Time elapsed: 0.002 sec
occurrences[workspace/markoccurrence/php5/testFunctionOccurrences2.pdtt](org.eclipse.php.core.tests.markoccurrence.MarkOccurrenceTests)  Time elapsed: 0.002 sec
occurrences[workspace/markoccurrence/php5/testGlobalVariableOccurrences1.pdtt](org.eclipse.php.core.tests.markoccurrence.MarkOccurrenceTests)  Time elapsed: 0.002 sec
occurrences[workspace/markoccurrence/php5/testGlobalVariableOccurrences2.pdtt](org.eclipse.php.core.tests.markoccurrence.MarkOccurrenceTests)  Time elapsed: 0.002 sec
occurrences[workspace/markoccurrence/php5/testLocalVariableOccurrences1.pdtt](org.eclipse.php.core.tests.markoccurrence.MarkOccurrenceTests)  Time elapsed: 0.002 sec
occurrences[workspace/markoccurrence/php5/testLocalVariableOccurrences2.pdtt](org.eclipse.php.core.tests.markoccurrence.MarkOccurrenceTests)  Time elapsed: 0.002 sec
occurrences[workspace/markoccurrence/php5/testPhpQuotedStrings.pdtt](org.eclipse.php.core.tests.markoccurrence.MarkOccurrenceTests)  Time elapsed: 0.003 sec
occurrences[workspace/markoccurrence/php53/testClassMembersOccurrences1.pdtt](org.eclipse.php.core.tests.markoccurrence.MarkOccurrenceTests)  Time elapsed: 0.006 sec
occurrences[workspace/markoccurrence/php53/testClassMembersOccurrences2.pdtt](org.eclipse.php.core.tests.markoccurrence.MarkOccurrenceTests)  Time elapsed: 0.048 sec
occurrences[workspace/markoccurrence/php53/testClassMembersOccurrences3.pdtt](org.eclipse.php.core.tests.markoccurrence.MarkOccurrenceTests)  Time elapsed: 0.012 sec
occurrences[workspace/markoccurrence/php53/testClassNameOccurrences1.pdtt](org.eclipse.php.core.tests.markoccurrence.MarkOccurrenceTests)  Time elapsed: 0.006 sec
occurrences[workspace/markoccurrence/php53/testFunctionOccurrences1.pdtt](org.eclipse.php.core.tests.markoccurrence.MarkOccurrenceTests)  Time elapsed: 0.004 sec
occurrences[workspace/markoccurrence/php53/testGlobalConstantOccurrences1.pdtt](org.eclipse.php.core.tests.markoccurrence.MarkOccurrenceTests)  Time elapsed: 0.003 sec
occurrences[workspace/markoccurrence/php53/testGlobalConstantOccurrences2.pdtt](org.eclipse.php.core.tests.markoccurrence.MarkOccurrenceTests)  Time elapsed: 0.004 sec
occurrences[workspace/markoccurrence/php53/testGlobalVariableOccurrences1.pdtt](org.eclipse.php.core.tests.markoccurrence.MarkOccurrenceTests)  Time elapsed: 0.004 sec
occurrences[workspace/markoccurrence/php53/testGlobalVariableOccurrences3.pdtt](org.eclipse.php.core.tests.markoccurrence.MarkOccurrenceTests)  Time elapsed: 0.002 sec
occurrences[workspace/markoccurrence/php53/testLocalVariableOccurrences1.pdtt](org.eclipse.php.core.tests.markoccurrence.MarkOccurrenceTests)  Time elapsed: 0.004 sec
occurrences[workspace/markoccurrence/php53/testLocalVariableOccurrences2.pdtt](org.eclipse.php.core.tests.markoccurrence.MarkOccurrenceTests)  Time elapsed: 0.004 sec
occurrences[workspace/markoccurrence/php54/testTraitMembersOccurrences1.pdtt](org.eclipse.php.core.tests.markoccurrence.MarkOccurrenceTests)  Time elapsed: 0.017 sec
occurrences[workspace/markoccurrence/php54/testTraitMembersOccurrences2.pdtt](org.eclipse.php.core.tests.markoccurrence.MarkOccurrenceTests)  Time elapsed: 0.015 sec
occurrences[workspace/markoccurrence/php54/testTraitMembersOccurrences3.pdtt](org.eclipse.php.core.tests.markoccurrence.MarkOccurrenceTests)  Time elapsed: 0.015 sec
occurrences[workspace/markoccurrence/php54/testTraitMembersOccurrences4.pdtt](org.eclipse.php.core.tests.markoccurrence.MarkOccurrenceTests)  Time elapsed: 0.016 sec
occurrences[workspace/markoccurrence/php54/testTraitMembersOccurrences5.pdtt](org.eclipse.php.core.tests.markoccurrence.MarkOccurrenceTests)  Time elapsed: 0.013 sec
occurrences[workspace/markoccurrence/php54/testTraitMembersOccurrences6.pdtt](org.eclipse.php.core.tests.markoccurrence.MarkOccurrenceTests)  Time elapsed: 0.012 sec
occurrences[workspace/markoccurrence/php54/testTraitMembersOccurrences7.pdtt](org.eclipse.php.core.tests.markoccurrence.MarkOccurrenceTests)  Time elapsed: 0.012 sec
occurrences[workspace/markoccurrence/php54/testTraitMembersOccurrences8.pdtt](org.eclipse.php.core.tests.markoccurrence.MarkOccurrenceTests)  Time elapsed: 0.014 sec
occurrences[workspace/markoccurrence/php5/testClassMembersOccurrences1.pdtt](org.eclipse.php.core.tests.markoccurrence.MarkOccurrenceTests)  Time elapsed: 0.07 sec
occurrences[workspace/markoccurrence/php5/testClassMembersOccurrences2.pdtt](org.eclipse.php.core.tests.markoccurrence.MarkOccurrenceTests)  Time elapsed: 0.031 sec
occurrences[workspace/markoccurrence/php5/testClassMembersOccurrences3.pdtt](org.eclipse.php.core.tests.markoccurrence.MarkOccurrenceTests)  Time elapsed: 0.015 sec
occurrences[workspace/markoccurrence/php5/testClassNameOccurrences1.pdtt](org.eclipse.php.core.tests.markoccurrence.MarkOccurrenceTests)  Time elapsed: 0.004 sec
occurrences[workspace/markoccurrence/php5/testClassNameOccurrences3.pdtt](org.eclipse.php.core.tests.markoccurrence.MarkOccurrenceTests)  Time elapsed: 0.003 sec
occurrences[workspace/markoccurrence/php5/testConstantOccurrences1.pdtt](org.eclipse.php.core.tests.markoccurrence.MarkOccurrenceTests)  Time elapsed: 0.002 sec
occurrences[workspace/markoccurrence/php5/testConstantOccurrences2.pdtt](org.eclipse.php.core.tests.markoccurrence.MarkOccurrenceTests)  Time elapsed: 0.002 sec
occurrences[workspace/markoccurrence/php5/testFunctionOccurrences1.pdtt](org.eclipse.php.core.tests.markoccurrence.MarkOccurrenceTests)  Time elapsed: 0.002 sec
occurrences[workspace/markoccurrence/php5/testFunctionOccurrences2.pdtt](org.eclipse.php.core.tests.markoccurrence.MarkOccurrenceTests)  Time elapsed: 0.002 sec
occurrences[workspace/markoccurrence/php5/testGlobalVariableOccurrences1.pdtt](org.eclipse.php.core.tests.markoccurrence.MarkOccurrenceTests)  Time elapsed: 0.002 sec
occurrences[workspace/markoccurrence/php5/testGlobalVariableOccurrences2.pdtt](org.eclipse.php.core.tests.markoccurrence.MarkOccurrenceTests)  Time elapsed: 0.003 sec
occurrences[workspace/markoccurrence/php5/testLocalVariableOccurrences1.pdtt](org.eclipse.php.core.tests.markoccurrence.MarkOccurrenceTests)  Time elapsed: 0.003 sec
occurrences[workspace/markoccurrence/php5/testLocalVariableOccurrences2.pdtt](org.eclipse.php.core.tests.markoccurrence.MarkOccurrenceTests)  Time elapsed: 0.003 sec
occurrences[workspace/markoccurrence/php5/testPhpQuotedStrings.pdtt](org.eclipse.php.core.tests.markoccurrence.MarkOccurrenceTests)  Time elapsed: 0.004 sec
occurrences[workspace/markoccurrence/php53/testClassMembersOccurrences1.pdtt](org.eclipse.php.core.tests.markoccurrence.MarkOccurrenceTests)  Time elapsed: 0.012 sec
occurrences[workspace/markoccurrence/php53/testClassMembersOccurrences2.pdtt](org.eclipse.php.core.tests.markoccurrence.MarkOccurrenceTests)  Time elapsed: 0.006 sec
occurrences[workspace/markoccurrence/php53/testClassMembersOccurrences3.pdtt](org.eclipse.php.core.tests.markoccurrence.MarkOccurrenceTests)  Time elapsed: 0.005 sec
occurrences[workspace/markoccurrence/php53/testClassNameOccurrences1.pdtt](org.eclipse.php.core.tests.markoccurrence.MarkOccurrenceTests)  Time elapsed: 0.004 sec
occurrences[workspace/markoccurrence/php53/testFunctionOccurrences1.pdtt](org.eclipse.php.core.tests.markoccurrence.MarkOccurrenceTests)  Time elapsed: 0.003 sec
occurrences[workspace/markoccurrence/php53/testGlobalConstantOccurrences1.pdtt](org.eclipse.php.core.tests.markoccurrence.MarkOccurrenceTests)  Time elapsed: 0.002 sec
occurrences[workspace/markoccurrence/php53/testGlobalConstantOccurrences2.pdtt](org.eclipse.php.core.tests.markoccurrence.MarkOccurrenceTests)  Time elapsed: 0.003 sec
occurrences[workspace/markoccurrence/php53/testGlobalVariableOccurrences1.pdtt](org.eclipse.php.core.tests.markoccurrence.MarkOccurrenceTests)  Time elapsed: 0.016 sec
occurrences[workspace/markoccurrence/php53/testGlobalVariableOccurrences3.pdtt](org.eclipse.php.core.tests.markoccurrence.MarkOccurrenceTests)  Time elapsed: 0.003 sec
occurrences[workspace/markoccurrence/php53/testLocalVariableOccurrences1.pdtt](org.eclipse.php.core.tests.markoccurrence.MarkOccurrenceTests)  Time elapsed: 0.003 sec
occurrences[workspace/markoccurrence/php53/testLocalVariableOccurrences2.pdtt](org.eclipse.php.core.tests.markoccurrence.MarkOccurrenceTests)  Time elapsed: 0.002 sec
occurrences[workspace/markoccurrence/php54/testTraitMembersOccurrences1.pdtt](org.eclipse.php.core.tests.markoccurrence.MarkOccurrenceTests)  Time elapsed: 0.011 sec
occurrences[workspace/markoccurrence/php54/testTraitMembersOccurrences2.pdtt](org.eclipse.php.core.tests.markoccurrence.MarkOccurrenceTests)  Time elapsed: 0.008 sec
occurrences[workspace/markoccurrence/php54/testTraitMembersOccurrences3.pdtt](org.eclipse.php.core.tests.markoccurrence.MarkOccurrenceTests)  Time elapsed: 0.006 sec
occurrences[workspace/markoccurrence/php54/testTraitMembersOccurrences4.pdtt](org.eclipse.php.core.tests.markoccurrence.MarkOccurrenceTests)  Time elapsed: 0.007 sec
occurrences[workspace/markoccurrence/php54/testTraitMembersOccurrences5.pdtt](org.eclipse.php.core.tests.markoccurrence.MarkOccurrenceTests)  Time elapsed: 0.008 sec
occurrences[workspace/markoccurrence/php54/testTraitMembersOccurrences6.pdtt](org.eclipse.php.core.tests.markoccurrence.MarkOccurrenceTests)  Time elapsed: 0.007 sec
occurrences[workspace/markoccurrence/php54/testTraitMembersOccurrences7.pdtt](org.eclipse.php.core.tests.markoccurrence.MarkOccurrenceTests)  Time elapsed: 0.006 sec
occurrences[workspace/markoccurrence/php54/testTraitMembersOccurrences8.pdtt](org.eclipse.php.core.tests.markoccurrence.MarkOccurrenceTests)  Time elapsed: 0.007 sec
occurrences[workspace/markoccurrence/php5/testClassMembersOccurrences1.pdtt](org.eclipse.php.core.tests.markoccurrence.MarkOccurrenceTests)  Time elapsed: 0.053 sec
occurrences[workspace/markoccurrence/php5/testClassMembersOccurrences2.pdtt](org.eclipse.php.core.tests.markoccurrence.MarkOccurrenceTests)  Time elapsed: 0.033 sec
occurrences[workspace/markoccurrence/php5/testClassMembersOccurrences3.pdtt](org.eclipse.php.core.tests.markoccurrence.MarkOccurrenceTests)  Time elapsed: 0.027 sec
occurrences[workspace/markoccurrence/php5/testClassNameOccurrences1.pdtt](org.eclipse.php.core.tests.markoccurrence.MarkOccurrenceTests)  Time elapsed: 0.003 sec
occurrences[workspace/markoccurrence/php5/testClassNameOccurrences3.pdtt](org.eclipse.php.core.tests.markoccurrence.MarkOccurrenceTests)  Time elapsed: 0.003 sec
occurrences[workspace/markoccurrence/php5/testConstantOccurrences1.pdtt](org.eclipse.php.core.tests.markoccurrence.MarkOccurrenceTests)  Time elapsed: 0.002 sec
occurrences[workspace/markoccurrence/php5/testConstantOccurrences2.pdtt](org.eclipse.php.core.tests.markoccurrence.MarkOccurrenceTests)  Time elapsed: 0.002 sec
occurrences[workspace/markoccurrence/php5/testFunctionOccurrences1.pdtt](org.eclipse.php.core.tests.markoccurrence.MarkOccurrenceTests)  Time elapsed: 0.002 sec
occurrences[workspace/markoccurrence/php5/testFunctionOccurrences2.pdtt](org.eclipse.php.core.tests.markoccurrence.MarkOccurrenceTests)  Time elapsed: 0.003 sec
occurrences[workspace/markoccurrence/php5/testGlobalVariableOccurrences1.pdtt](org.eclipse.php.core.tests.markoccurrence.MarkOccurrenceTests)  Time elapsed: 0.003 sec
occurrences[workspace/markoccurrence/php5/testGlobalVariableOccurrences2.pdtt](org.eclipse.php.core.tests.markoccurrence.MarkOccurrenceTests)  Time elapsed: 0.002 sec
occurrences[workspace/markoccurrence/php5/testLocalVariableOccurrences1.pdtt](org.eclipse.php.core.tests.markoccurrence.MarkOccurrenceTests)  Time elapsed: 0.003 sec
occurrences[workspace/markoccurrence/php5/testLocalVariableOccurrences2.pdtt](org.eclipse.php.core.tests.markoccurrence.MarkOccurrenceTests)  Time elapsed: 0.004 sec
occurrences[workspace/markoccurrence/php5/testPhpQuotedStrings.pdtt](org.eclipse.php.core.tests.markoccurrence.MarkOccurrenceTests)  Time elapsed: 0.003 sec
occurrences[workspace/markoccurrence/php53/testClassMembersOccurrences1.pdtt](org.eclipse.php.core.tests.markoccurrence.MarkOccurrenceTests)  Time elapsed: 0.007 sec
occurrences[workspace/markoccurrence/php53/testClassMembersOccurrences2.pdtt](org.eclipse.php.core.tests.markoccurrence.MarkOccurrenceTests)  Time elapsed: 0.005 sec
occurrences[workspace/markoccurrence/php53/testClassMembersOccurrences3.pdtt](org.eclipse.php.core.tests.markoccurrence.MarkOccurrenceTests)  Time elapsed: 0.005 sec
occurrences[workspace/markoccurrence/php53/testClassNameOccurrences1.pdtt](org.eclipse.php.core.tests.markoccurrence.MarkOccurrenceTests)  Time elapsed: 0.003 sec
occurrences[workspace/markoccurrence/php53/testFunctionOccurrences1.pdtt](org.eclipse.php.core.tests.markoccurrence.MarkOccurrenceTests)  Time elapsed: 0.002 sec
occurrences[workspace/markoccurrence/php53/testGlobalConstantOccurrences1.pdtt](org.eclipse.php.core.tests.markoccurrence.MarkOccurrenceTests)  Time elapsed: 0.003 sec
occurrences[workspace/markoccurrence/php53/testGlobalConstantOccurrences2.pdtt](org.eclipse.php.core.tests.markoccurrence.MarkOccurrenceTests)  Time elapsed: 0.003 sec
occurrences[workspace/markoccurrence/php53/testGlobalVariableOccurrences1.pdtt](org.eclipse.php.core.tests.markoccurrence.MarkOccurrenceTests)  Time elapsed: 0.002 sec
occurrences[workspace/markoccurrence/php53/testGlobalVariableOccurrences3.pdtt](org.eclipse.php.core.tests.markoccurrence.MarkOccurrenceTests)  Time elapsed: 0.002 sec
occurrences[workspace/markoccurrence/php53/testLocalVariableOccurrences1.pdtt](org.eclipse.php.core.tests.markoccurrence.MarkOccurrenceTests)  Time elapsed: 0.003 sec
occurrences[workspace/markoccurrence/php53/testLocalVariableOccurrences2.pdtt](org.eclipse.php.core.tests.markoccurrence.MarkOccurrenceTests)  Time elapsed: 0.002 sec
occurrences[workspace/markoccurrence/php54/testTraitMembersOccurrences1.pdtt](org.eclipse.php.core.tests.markoccurrence.MarkOccurrenceTests)  Time elapsed: 0.009 sec
occurrences[workspace/markoccurrence/php54/testTraitMembersOccurrences2.pdtt](org.eclipse.php.core.tests.markoccurrence.MarkOccurrenceTests)  Time elapsed: 0.007 sec
occurrences[workspace/markoccurrence/php54/testTraitMembersOccurrences3.pdtt](org.eclipse.php.core.tests.markoccurrence.MarkOccurrenceTests)  Time elapsed: 0.007 sec
occurrences[workspace/markoccurrence/php54/testTraitMembersOccurrences4.pdtt](org.eclipse.php.core.tests.markoccurrence.MarkOccurrenceTests)  Time elapsed: 0.006 sec
occurrences[workspace/markoccurrence/php54/testTraitMembersOccurrences5.pdtt](org.eclipse.php.core.tests.markoccurrence.MarkOccurrenceTests)  Time elapsed: 0.006 sec
occurrences[workspace/markoccurrence/php54/testTraitMembersOccurrences6.pdtt](org.eclipse.php.core.tests.markoccurrence.MarkOccurrenceTests)  Time elapsed: 0.005 sec
occurrences[workspace/markoccurrence/php54/testTraitMembersOccurrences7.pdtt](org.eclipse.php.core.tests.markoccurrence.MarkOccurrenceTests)  Time elapsed: 0.007 sec
occurrences[workspace/markoccurrence/php54/testTraitMembersOccurrences8.pdtt](org.eclipse.php.core.tests.markoccurrence.MarkOccurrenceTests)  Time elapsed: 0.007 sec
occurrences[workspace/markoccurrence/php56/testVariadicParameter01.pdtt](org.eclipse.php.core.tests.markoccurrence.MarkOccurrenceTests)  Time elapsed: 0.003 sec
occurrences[workspace/markoccurrence/php5/testClassMembersOccurrences1.pdtt](org.eclipse.php.core.tests.markoccurrence.MarkOccurrenceTests)  Time elapsed: 2.09 sec
occurrences[workspace/markoccurrence/php5/testClassMembersOccurrences2.pdtt](org.eclipse.php.core.tests.markoccurrence.MarkOccurrenceTests)  Time elapsed: 0.188 sec
occurrences[workspace/markoccurrence/php5/testClassMembersOccurrences3.pdtt](org.eclipse.php.core.tests.markoccurrence.MarkOccurrenceTests)  Time elapsed: 0.02 sec
occurrences[workspace/markoccurrence/php5/testClassNameOccurrences1.pdtt](org.eclipse.php.core.tests.markoccurrence.MarkOccurrenceTests)  Time elapsed: 0.005 sec
occurrences[workspace/markoccurrence/php5/testClassNameOccurrences3.pdtt](org.eclipse.php.core.tests.markoccurrence.MarkOccurrenceTests)  Time elapsed: 0.003 sec
occurrences[workspace/markoccurrence/php5/testConstantOccurrences1.pdtt](org.eclipse.php.core.tests.markoccurrence.MarkOccurrenceTests)  Time elapsed: 0.003 sec
occurrences[workspace/markoccurrence/php5/testConstantOccurrences2.pdtt](org.eclipse.php.core.tests.markoccurrence.MarkOccurrenceTests)  Time elapsed: 0.003 sec
occurrences[workspace/markoccurrence/php5/testFunctionOccurrences1.pdtt](org.eclipse.php.core.tests.markoccurrence.MarkOccurrenceTests)  Time elapsed: 0.002 sec
occurrences[workspace/markoccurrence/php5/testFunctionOccurrences2.pdtt](org.eclipse.php.core.tests.markoccurrence.MarkOccurrenceTests)  Time elapsed: 0.004 sec
occurrences[workspace/markoccurrence/php5/testGlobalVariableOccurrences1.pdtt](org.eclipse.php.core.tests.markoccurrence.MarkOccurrenceTests)  Time elapsed: 0.002 sec
occurrences[workspace/markoccurrence/php5/testGlobalVariableOccurrences2.pdtt](org.eclipse.php.core.tests.markoccurrence.MarkOccurrenceTests)  Time elapsed: 0.004 sec
occurrences[workspace/markoccurrence/php5/testLocalVariableOccurrences1.pdtt](org.eclipse.php.core.tests.markoccurrence.MarkOccurrenceTests)  Time elapsed: 0.003 sec
occurrences[workspace/markoccurrence/php5/testLocalVariableOccurrences2.pdtt](org.eclipse.php.core.tests.markoccurrence.MarkOccurrenceTests)  Time elapsed: 0.003 sec
occurrences[workspace/markoccurrence/php5/testPhpQuotedStrings.pdtt](org.eclipse.php.core.tests.markoccurrence.MarkOccurrenceTests)  Time elapsed: 0.006 sec
occurrences[workspace/markoccurrence/php53/testClassMembersOccurrences1.pdtt](org.eclipse.php.core.tests.markoccurrence.MarkOccurrenceTests)  Time elapsed: 0.618 sec
occurrences[workspace/markoccurrence/php53/testClassMembersOccurrences2.pdtt](org.eclipse.php.core.tests.markoccurrence.MarkOccurrenceTests)  Time elapsed: 0.015 sec
occurrences[workspace/markoccurrence/php53/testClassMembersOccurrences3.pdtt](org.eclipse.php.core.tests.markoccurrence.MarkOccurrenceTests)  Time elapsed: 0.015 sec
occurrences[workspace/markoccurrence/php53/testClassNameOccurrences1.pdtt](org.eclipse.php.core.tests.markoccurrence.MarkOccurrenceTests)  Time elapsed: 0.011 sec
occurrences[workspace/markoccurrence/php53/testFunctionOccurrences1.pdtt](org.eclipse.php.core.tests.markoccurrence.MarkOccurrenceTests)  Time elapsed: 0.004 sec
occurrences[workspace/markoccurrence/php53/testGlobalConstantOccurrences1.pdtt](org.eclipse.php.core.tests.markoccurrence.MarkOccurrenceTests)  Time elapsed: 0.004 sec
occurrences[workspace/markoccurrence/php53/testGlobalConstantOccurrences2.pdtt](org.eclipse.php.core.tests.markoccurrence.MarkOccurrenceTests)  Time elapsed: 0.007 sec
occurrences[workspace/markoccurrence/php53/testGlobalVariableOccurrences1.pdtt](org.eclipse.php.core.tests.markoccurrence.MarkOccurrenceTests)  Time elapsed: 0.004 sec
occurrences[workspace/markoccurrence/php53/testGlobalVariableOccurrences3.pdtt](org.eclipse.php.core.tests.markoccurrence.MarkOccurrenceTests)  Time elapsed: 0.004 sec
occurrences[workspace/markoccurrence/php53/testLocalVariableOccurrences1.pdtt](org.eclipse.php.core.tests.markoccurrence.MarkOccurrenceTests)  Time elapsed: 0.003 sec
occurrences[workspace/markoccurrence/php53/testLocalVariableOccurrences2.pdtt](org.eclipse.php.core.tests.markoccurrence.MarkOccurrenceTests)  Time elapsed: 0.003 sec
occurrences[workspace/markoccurrence/php54/testTraitMembersOccurrences1.pdtt](org.eclipse.php.core.tests.markoccurrence.MarkOccurrenceTests)  Time elapsed: 0.018 sec
occurrences[workspace/markoccurrence/php54/testTraitMembersOccurrences2.pdtt](org.eclipse.php.core.tests.markoccurrence.MarkOccurrenceTests)  Time elapsed: 0.014 sec
occurrences[workspace/markoccurrence/php54/testTraitMembersOccurrences3.pdtt](org.eclipse.php.core.tests.markoccurrence.MarkOccurrenceTests)  Time elapsed: 0.014 sec
occurrences[workspace/markoccurrence/php54/testTraitMembersOccurrences4.pdtt](org.eclipse.php.core.tests.markoccurrence.MarkOccurrenceTests)  Time elapsed: 0.013 sec
occurrences[workspace/markoccurrence/php54/testTraitMembersOccurrences5.pdtt](org.eclipse.php.core.tests.markoccurrence.MarkOccurrenceTests)  Time elapsed: 0.012 sec
occurrences[workspace/markoccurrence/php54/testTraitMembersOccurrences6.pdtt](org.eclipse.php.core.tests.markoccurrence.MarkOccurrenceTests)  Time elapsed: 0.011 sec
occurrences[workspace/markoccurrence/php54/testTraitMembersOccurrences7.pdtt](org.eclipse.php.core.tests.markoccurrence.MarkOccurrenceTests)  Time elapsed: 0.012 sec
occurrences[workspace/markoccurrence/php54/testTraitMembersOccurrences8.pdtt](org.eclipse.php.core.tests.markoccurrence.MarkOccurrenceTests)  Time elapsed: 0.011 sec
occurrences[workspace/markoccurrence/php56/testVariadicParameter01.pdtt](org.eclipse.php.core.tests.markoccurrence.MarkOccurrenceTests)  Time elapsed: 0.002 sec
occurrences[workspace/markoccurrence/php5/testClassMembersOccurrences1.pdtt](org.eclipse.php.core.tests.markoccurrence.MarkOccurrenceTests)  Time elapsed: 0.703 sec
occurrences[workspace/markoccurrence/php5/testClassMembersOccurrences2.pdtt](org.eclipse.php.core.tests.markoccurrence.MarkOccurrenceTests)  Time elapsed: 0.035 sec
occurrences[workspace/markoccurrence/php5/testClassMembersOccurrences3.pdtt](org.eclipse.php.core.tests.markoccurrence.MarkOccurrenceTests)  Time elapsed: 0.016 sec
occurrences[workspace/markoccurrence/php5/testClassNameOccurrences1.pdtt](org.eclipse.php.core.tests.markoccurrence.MarkOccurrenceTests)  Time elapsed: 0.004 sec
occurrences[workspace/markoccurrence/php5/testClassNameOccurrences3.pdtt](org.eclipse.php.core.tests.markoccurrence.MarkOccurrenceTests)  Time elapsed: 0.003 sec
occurrences[workspace/markoccurrence/php5/testConstantOccurrences1.pdtt](org.eclipse.php.core.tests.markoccurrence.MarkOccurrenceTests)  Time elapsed: 0.001 sec
occurrences[workspace/markoccurrence/php5/testConstantOccurrences2.pdtt](org.eclipse.php.core.tests.markoccurrence.MarkOccurrenceTests)  Time elapsed: 0.001 sec
occurrences[workspace/markoccurrence/php5/testFunctionOccurrences1.pdtt](org.eclipse.php.core.tests.markoccurrence.MarkOccurrenceTests)  Time elapsed: 0.002 sec
occurrences[workspace/markoccurrence/php5/testFunctionOccurrences2.pdtt](org.eclipse.php.core.tests.markoccurrence.MarkOccurrenceTests)  Time elapsed: 0.002 sec
occurrences[workspace/markoccurrence/php5/testGlobalVariableOccurrences1.pdtt](org.eclipse.php.core.tests.markoccurrence.MarkOccurrenceTests)  Time elapsed: 0.001 sec
occurrences[workspace/markoccurrence/php5/testGlobalVariableOccurrences2.pdtt](org.eclipse.php.core.tests.markoccurrence.MarkOccurrenceTests)  Time elapsed: 0.001 sec
occurrences[workspace/markoccurrence/php5/testLocalVariableOccurrences1.pdtt](org.eclipse.php.core.tests.markoccurrence.MarkOccurrenceTests)  Time elapsed: 0.002 sec
occurrences[workspace/markoccurrence/php5/testLocalVariableOccurrences2.pdtt](org.eclipse.php.core.tests.markoccurrence.MarkOccurrenceTests)  Time elapsed: 0.001 sec
occurrences[workspace/markoccurrence/php5/testPhpQuotedStrings.pdtt](org.eclipse.php.core.tests.markoccurrence.MarkOccurrenceTests)  Time elapsed: 0.003 sec
occurrences[workspace/markoccurrence/php53/testClassMembersOccurrences1.pdtt](org.eclipse.php.core.tests.markoccurrence.MarkOccurrenceTests)  Time elapsed: 0.08 sec
occurrences[workspace/markoccurrence/php53/testClassMembersOccurrences2.pdtt](org.eclipse.php.core.tests.markoccurrence.MarkOccurrenceTests)  Time elapsed: 0.011 sec
occurrences[workspace/markoccurrence/php53/testClassMembersOccurrences3.pdtt](org.eclipse.php.core.tests.markoccurrence.MarkOccurrenceTests)  Time elapsed: 0.027 sec
occurrences[workspace/markoccurrence/php53/testClassNameOccurrences1.pdtt](org.eclipse.php.core.tests.markoccurrence.MarkOccurrenceTests)  Time elapsed: 0.008 sec
occurrences[workspace/markoccurrence/php53/testFunctionOccurrences1.pdtt](org.eclipse.php.core.tests.markoccurrence.MarkOccurrenceTests)  Time elapsed: 0.003 sec
occurrences[workspace/markoccurrence/php53/testGlobalConstantOccurrences1.pdtt](org.eclipse.php.core.tests.markoccurrence.MarkOccurrenceTests)  Time elapsed: 0.004 sec
occurrences[workspace/markoccurrence/php53/testGlobalConstantOccurrences2.pdtt](org.eclipse.php.core.tests.markoccurrence.MarkOccurrenceTests)  Time elapsed: 0.004 sec
occurrences[workspace/markoccurrence/php53/testGlobalVariableOccurrences1.pdtt](org.eclipse.php.core.tests.markoccurrence.MarkOccurrenceTests)  Time elapsed: 0.002 sec
occurrences[workspace/markoccurrence/php53/testGlobalVariableOccurrences3.pdtt](org.eclipse.php.core.tests.markoccurrence.MarkOccurrenceTests)  Time elapsed: 0.002 sec
occurrences[workspace/markoccurrence/php53/testLocalVariableOccurrences1.pdtt](org.eclipse.php.core.tests.markoccurrence.MarkOccurrenceTests)  Time elapsed: 0.002 sec
occurrences[workspace/markoccurrence/php53/testLocalVariableOccurrences2.pdtt](org.eclipse.php.core.tests.markoccurrence.MarkOccurrenceTests)  Time elapsed: 0.003 sec
occurrences[workspace/markoccurrence/php54/testTraitMembersOccurrences1.pdtt](org.eclipse.php.core.tests.markoccurrence.MarkOccurrenceTests)  Time elapsed: 0.017 sec
occurrences[workspace/markoccurrence/php54/testTraitMembersOccurrences2.pdtt](org.eclipse.php.core.tests.markoccurrence.MarkOccurrenceTests)  Time elapsed: 0.014 sec
occurrences[workspace/markoccurrence/php54/testTraitMembersOccurrences3.pdtt](org.eclipse.php.core.tests.markoccurrence.MarkOccurrenceTests)  Time elapsed: 0.015 sec
occurrences[workspace/markoccurrence/php54/testTraitMembersOccurrences4.pdtt](org.eclipse.php.core.tests.markoccurrence.MarkOccurrenceTests)  Time elapsed: 0.013 sec
occurrences[workspace/markoccurrence/php54/testTraitMembersOccurrences5.pdtt](org.eclipse.php.core.tests.markoccurrence.MarkOccurrenceTests)  Time elapsed: 0.015 sec
occurrences[workspace/markoccurrence/php54/testTraitMembersOccurrences6.pdtt](org.eclipse.php.core.tests.markoccurrence.MarkOccurrenceTests)  Time elapsed: 0.012 sec
occurrences[workspace/markoccurrence/php54/testTraitMembersOccurrences7.pdtt](org.eclipse.php.core.tests.markoccurrence.MarkOccurrenceTests)  Time elapsed: 0.012 sec
occurrences[workspace/markoccurrence/php54/testTraitMembersOccurrences8.pdtt](org.eclipse.php.core.tests.markoccurrence.MarkOccurrenceTests)  Time elapsed: 0.012 sec
occurrences[workspace/markoccurrence/php56/testVariadicParameter01.pdtt](org.eclipse.php.core.tests.markoccurrence.MarkOccurrenceTests)  Time elapsed: 0.002 sec
occurrences[workspace/markoccurrence/php71/multipleCatch01.pdtt](org.eclipse.php.core.tests.markoccurrence.MarkOccurrenceTests)  Time elapsed: 0.004 sec
simpleXml(org.eclipse.php.core.tests.searchEngine.PHP5LanguageModelTest)  Time elapsed: 0.047 sec
sockets(org.eclipse.php.core.tests.searchEngine.PHP5LanguageModelTest)  Time elapsed: 0.001 sec
mime_magic(org.eclipse.php.core.tests.searchEngine.PHP5LanguageModelTest)  Time elapsed: 0 sec
bcmath(org.eclipse.php.core.tests.searchEngine.PHP5LanguageModelTest)  Time elapsed: 0.001 sec
reflection(org.eclipse.php.core.tests.searchEngine.PHP5LanguageModelTest)  Time elapsed: 0 sec
filter(org.eclipse.php.core.tests.searchEngine.PHP5LanguageModelTest)  Time elapsed: 0 sec
openssl(org.eclipse.php.core.tests.searchEngine.PHP5LanguageModelTest)  Time elapsed: 0.001 sec
mcrypt(org.eclipse.php.core.tests.searchEngine.PHP5LanguageModelTest)  Time elapsed: 0 sec
mysqli(org.eclipse.php.core.tests.searchEngine.PHP5LanguageModelTest)  Time elapsed: 0 sec
Ibm_db2(org.eclipse.php.core.tests.searchEngine.PHP5LanguageModelTest)  Time elapsed: 0 sec
sqlite(org.eclipse.php.core.tests.searchEngine.PHP5LanguageModelTest)  Time elapsed: 0 sec
xmlreader(org.eclipse.php.core.tests.searchEngine.PHP5LanguageModelTest)  Time elapsed: 0.001 sec
xmlwriter(org.eclipse.php.core.tests.searchEngine.PHP5LanguageModelTest)  Time elapsed: 0 sec
calendar(org.eclipse.php.core.tests.searchEngine.PHP5LanguageModelTest)  Time elapsed: 0 sec
gettext(org.eclipse.php.core.tests.searchEngine.PHP5LanguageModelTest)  Time elapsed: 0 sec
gd(org.eclipse.php.core.tests.searchEngine.PHP5LanguageModelTest)  Time elapsed: 0 sec
bz2(org.eclipse.php.core.tests.searchEngine.PHP5LanguageModelTest)  Time elapsed: 0 sec
dom(org.eclipse.php.core.tests.searchEngine.PHP5LanguageModelTest)  Time elapsed: 0.001 sec
ftp(org.eclipse.php.core.tests.searchEngine.PHP5LanguageModelTest)  Time elapsed: 0 sec
pdo(org.eclipse.php.core.tests.searchEngine.PHP5LanguageModelTest)  Time elapsed: 0 sec
spl(org.eclipse.php.core.tests.searchEngine.PHP5LanguageModelTest)  Time elapsed: 0.001 sec
xml(org.eclipse.php.core.tests.searchEngine.PHP5LanguageModelTest)  Time elapsed: 0 sec
xsl(org.eclipse.php.core.tests.searchEngine.PHP5LanguageModelTest)  Time elapsed: 0 sec
zip(org.eclipse.php.core.tests.searchEngine.PHP5LanguageModelTest)  Time elapsed: 0 sec
Imap(org.eclipse.php.core.tests.searchEngine.PHP5LanguageModelTest)  Time elapsed: 0.001 sec
Intl(org.eclipse.php.core.tests.searchEngine.PHP5LanguageModelTest)  Time elapsed: 0 sec
curl(org.eclipse.php.core.tests.searchEngine.PHP5LanguageModelTest)  Time elapsed: 0 sec
date(org.eclipse.php.core.tests.searchEngine.PHP5LanguageModelTest)  Time elapsed: 0 sec
exif(org.eclipse.php.core.tests.searchEngine.PHP5LanguageModelTest)  Time elapsed: 0.001 sec
hash(org.eclipse.php.core.tests.searchEngine.PHP5LanguageModelTest)  Time elapsed: 0 sec
json(org.eclipse.php.core.tests.searchEngine.PHP5LanguageModelTest)  Time elapsed: 0 sec
ldap(org.eclipse.php.core.tests.searchEngine.PHP5LanguageModelTest)  Time elapsed: 0 sec
oci8(org.eclipse.php.core.tests.searchEngine.PHP5LanguageModelTest)  Time elapsed: 0.001 sec
pcre(org.eclipse.php.core.tests.searchEngine.PHP5LanguageModelTest)  Time elapsed: 0 sec
soap(org.eclipse.php.core.tests.searchEngine.PHP5LanguageModelTest)  Time elapsed: 0 sec
tidy(org.eclipse.php.core.tests.searchEngine.PHP5LanguageModelTest)  Time elapsed: 0 sec
zlib(org.eclipse.php.core.tests.searchEngine.PHP5LanguageModelTest)  Time elapsed: 0 sec
Iconv(org.eclipse.php.core.tests.searchEngine.PHP5LanguageModelTest)  Time elapsed: 0.001 sec
ctype(org.eclipse.php.core.tests.searchEngine.PHP5LanguageModelTest)  Time elapsed: 0 sec
mhash(org.eclipse.php.core.tests.searchEngine.PHP5LanguageModelTest)  Time elapsed: 0 sec
mysql(org.eclipse.php.core.tests.searchEngine.PHP5LanguageModelTest)  Time elapsed: 0 sec
pgsql(org.eclipse.php.core.tests.searchEngine.PHP5LanguageModelTest)  Time elapsed: 0 sec
posix(org.eclipse.php.core.tests.searchEngine.PHP5LanguageModelTest)  Time elapsed: 0 sec
tokenizer(org.eclipse.php.core.tests.searchEngine.PHP5LanguageModelTest)  Time elapsed: 0 sec
standard(org.eclipse.php.core.tests.searchEngine.PHP5LanguageModelTest)  Time elapsed: 0.001 sec
session(org.eclipse.php.core.tests.searchEngine.PHP5LanguageModelTest)  Time elapsed: 0 sec
simpleXml(org.eclipse.php.core.tests.searchEngine.PHP53LanguageModelTest)  Time elapsed: 0.005 sec
sockets(org.eclipse.php.core.tests.searchEngine.PHP53LanguageModelTest)  Time elapsed: 0 sec
mime_magic(org.eclipse.php.core.tests.searchEngine.PHP53LanguageModelTest)  Time elapsed: 0.001 sec
bcmath(org.eclipse.php.core.tests.searchEngine.PHP53LanguageModelTest)  Time elapsed: 0 sec
reflection(org.eclipse.php.core.tests.searchEngine.PHP53LanguageModelTest)  Time elapsed: 0 sec
filter(org.eclipse.php.core.tests.searchEngine.PHP53LanguageModelTest)  Time elapsed: 0.001 sec
openssl(org.eclipse.php.core.tests.searchEngine.PHP53LanguageModelTest)  Time elapsed: 0 sec
mcrypt(org.eclipse.php.core.tests.searchEngine.PHP53LanguageModelTest)  Time elapsed: 0.001 sec
mysqli(org.eclipse.php.core.tests.searchEngine.PHP53LanguageModelTest)  Time elapsed: 0 sec
sqlite(org.eclipse.php.core.tests.searchEngine.PHP53LanguageModelTest)  Time elapsed: 0 sec
xmlreader(org.eclipse.php.core.tests.searchEngine.PHP53LanguageModelTest)  Time elapsed: 0 sec
xmlwriter(org.eclipse.php.core.tests.searchEngine.PHP53LanguageModelTest)  Time elapsed: 0.001 sec
calendar(org.eclipse.php.core.tests.searchEngine.PHP53LanguageModelTest)  Time elapsed: 0 sec
gettext(org.eclipse.php.core.tests.searchEngine.PHP53LanguageModelTest)  Time elapsed: 0 sec
gd(org.eclipse.php.core.tests.searchEngine.PHP53LanguageModelTest)  Time elapsed: 0.001 sec
bz2(org.eclipse.php.core.tests.searchEngine.PHP53LanguageModelTest)  Time elapsed: 0 sec
dom(org.eclipse.php.core.tests.searchEngine.PHP53LanguageModelTest)  Time elapsed: 0 sec
ftp(org.eclipse.php.core.tests.searchEngine.PHP53LanguageModelTest)  Time elapsed: 0 sec
pdo(org.eclipse.php.core.tests.searchEngine.PHP53LanguageModelTest)  Time elapsed: 0.001 sec
spl(org.eclipse.php.core.tests.searchEngine.PHP53LanguageModelTest)  Time elapsed: 0 sec
xml(org.eclipse.php.core.tests.searchEngine.PHP53LanguageModelTest)  Time elapsed: 0 sec
xsl(org.eclipse.php.core.tests.searchEngine.PHP53LanguageModelTest)  Time elapsed: 0.001 sec
zip(org.eclipse.php.core.tests.searchEngine.PHP53LanguageModelTest)  Time elapsed: 0 sec
curl(org.eclipse.php.core.tests.searchEngine.PHP53LanguageModelTest)  Time elapsed: 0 sec
date(org.eclipse.php.core.tests.searchEngine.PHP53LanguageModelTest)  Time elapsed: 0.001 sec
exif(org.eclipse.php.core.tests.searchEngine.PHP53LanguageModelTest)  Time elapsed: 0 sec
hash(org.eclipse.php.core.tests.searchEngine.PHP53LanguageModelTest)  Time elapsed: 0 sec
imap(org.eclipse.php.core.tests.searchEngine.PHP53LanguageModelTest)  Time elapsed: 0 sec
intl(org.eclipse.php.core.tests.searchEngine.PHP53LanguageModelTest)  Time elapsed: 0.001 sec
json(org.eclipse.php.core.tests.searchEngine.PHP53LanguageModelTest)  Time elapsed: 0 sec
ldap(org.eclipse.php.core.tests.searchEngine.PHP53LanguageModelTest)  Time elapsed: 0 sec
oci8(org.eclipse.php.core.tests.searchEngine.PHP53LanguageModelTest)  Time elapsed: 0 sec
pcre(org.eclipse.php.core.tests.searchEngine.PHP53LanguageModelTest)  Time elapsed: 0.001 sec
soap(org.eclipse.php.core.tests.searchEngine.PHP53LanguageModelTest)  Time elapsed: 0 sec
tidy(org.eclipse.php.core.tests.searchEngine.PHP53LanguageModelTest)  Time elapsed: 0 sec
zlib(org.eclipse.php.core.tests.searchEngine.PHP53LanguageModelTest)  Time elapsed: 0 sec
ctype(org.eclipse.php.core.tests.searchEngine.PHP53LanguageModelTest)  Time elapsed: 0.001 sec
iconv(org.eclipse.php.core.tests.searchEngine.PHP53LanguageModelTest)  Time elapsed: 0 sec
mhash(org.eclipse.php.core.tests.searchEngine.PHP53LanguageModelTest)  Time elapsed: 0 sec
mysql(org.eclipse.php.core.tests.searchEngine.PHP53LanguageModelTest)  Time elapsed: 0.001 sec
pgsql(org.eclipse.php.core.tests.searchEngine.PHP53LanguageModelTest)  Time elapsed: 0 sec
posix(org.eclipse.php.core.tests.searchEngine.PHP53LanguageModelTest)  Time elapsed: 0 sec
tokenizer(org.eclipse.php.core.tests.searchEngine.PHP53LanguageModelTest)  Time elapsed: 0.001 sec
standard(org.eclipse.php.core.tests.searchEngine.PHP53LanguageModelTest)  Time elapsed: 0 sec
ibm_db2(org.eclipse.php.core.tests.searchEngine.PHP53LanguageModelTest)  Time elapsed: 0 sec
session(org.eclipse.php.core.tests.searchEngine.PHP53LanguageModelTest)  Time elapsed: 0.001 sec
search[workspace/searchEngine/php5/searchClassField1.pdtt](org.eclipse.php.core.tests.searchEngine.SearchFieldTests)  Time elapsed: 0.033 sec
suggestStaticObjectOperator(org.eclipse.php.core.tests.text.PHPTextSequenceUtilitiesTests)  Time elapsed: 0 sec
ignoreInternalCall(org.eclipse.php.core.tests.text.PHPTextSequenceUtilitiesTests)  Time elapsed: 0 sec
singleArgument(org.eclipse.php.core.tests.text.PHPTextSequenceUtilitiesTests)  Time elapsed: 0 sec
singleArgumentIgnoreParenthesis(org.eclipse.php.core.tests.text.PHPTextSequenceUtilitiesTests)  Time elapsed: 0 sec
suggestObjectOperator(org.eclipse.php.core.tests.text.PHPTextSequenceUtilitiesTests)  Time elapsed: 0.001 sec
nestedCall(org.eclipse.php.core.tests.text.PHPTextSequenceUtilitiesTests)  Time elapsed: 0 sec
multiArgumentIgnore(org.eclipse.php.core.tests.text.PHPTextSequenceUtilitiesTests)  Time elapsed: 0 sec
multiArgumentIgnore2(org.eclipse.php.core.tests.text.PHPTextSequenceUtilitiesTests)  Time elapsed: 0 sec
ignoreObjecOperator(org.eclipse.php.core.tests.text.PHPTextSequenceUtilitiesTests)  Time elapsed: 0 sec
singleArgumentDoubleQuote(org.eclipse.php.core.tests.text.PHPTextSequenceUtilitiesTests)  Time elapsed: 0 sec
singleArgumentIgnore(org.eclipse.php.core.tests.text.PHPTextSequenceUtilitiesTests)  Time elapsed: 0 sec
emptyArgumentList(org.eclipse.php.core.tests.text.PHPTextSequenceUtilitiesTests)  Time elapsed: 0 sec

Results :

Failed tests: 
  CodeAssistTests.assist:159->compareProposals:302 
EXPECTED COMPLETIONS LIST:
-----------------------------
method(foo)

ACTUAL COMPLETIONS LIST:
-----------------------------

  CodeAssistTests.assist:159->compareProposals:302 
EXPECTED COMPLETIONS LIST:
-----------------------------
method(foo)
method(goo)

ACTUAL COMPLETIONS LIST:
-----------------------------
method(foo)
method(goo)
method(foo)

  CodeAssistTests.assist:159->compareProposals:302 
EXPECTED COMPLETIONS LIST:
-----------------------------
method(foo)
method(goo)

ACTUAL COMPLETIONS LIST:
-----------------------------
method(foo)
method(goo)
method(foo)
method(goo)
method(foo)

  CodeAssistTests.assist:159->compareProposals:302 
EXPECTED COMPLETIONS LIST:
-----------------------------
field($x)
field($y)
field($z)

ACTUAL COMPLETIONS LIST:
-----------------------------
field($x)
field($y)
field($z)
method(foo)
method(goo)
method(foo)
method(goo)
method(foo)
method(foo)

  CodeAssistTests.assist:159->compareProposals:302 
EXPECTED COMPLETIONS LIST:
-----------------------------
field($x)
field($y)
field($z)

ACTUAL COMPLETIONS LIST:
-----------------------------
field($x)
field($y)
field($z)
method(foo)
method(goo)
method(foo)
method(goo)
method(foo)
method(foo)
method(foo)

  CodeAssistTests.assist:159->compareProposals:302 
EXPECTED COMPLETIONS LIST:
-----------------------------
field($a)
field($b)
field($c)
method(foo)

ACTUAL COMPLETIONS LIST:
-----------------------------
field($a)
field($b)
field($c)
method(foo)
method(goo)
method(foo)
method(goo)
method(foo)
method(foo)
method(foo)
method(foo)

  CodeAssistTests.assist:159->compareProposals:302 
EXPECTED COMPLETIONS LIST:
-----------------------------
field($b)
method(foo)

ACTUAL COMPLETIONS LIST:
-----------------------------
field($a)
field($b)
field($c)
method(foo)
method(goo)
method(foo)
method(goo)
method(foo)
method(foo)
method(foo)
method(foo)
method(foo)

  CodeAssistTests.assist:159->compareProposals:302 
EXPECTED COMPLETIONS LIST:
-----------------------------
field($staticDefaultField)
field($staticPublicField)
field(CONSTANT_FIELD)
method(defaultNonStaticFunction)
method(defaultStaticFunction)
method(publicNonStaticFunction)
method(publicStaticFunction)




ACTUAL COMPLETIONS LIST:
-----------------------------
field($staticPublicField)
field($staticDefaultField)
field(CONSTANT_FIELD)
method(foo)
method(goo)
method(foo)
method(goo)
method(foo)
method(foo)
method(foo)
method(foo)
method(foo)
method(publicStaticFunction)
method(defaultStaticFunction)
method(publicNonStaticFunction)
method(defaultNonStaticFunction)

  CodeAssistTests.assist:159->compareProposals:302 
EXPECTED COMPLETIONS LIST:
-----------------------------
field($staticDefaultField)
field($staticPrivateField)
field($staticProtectedField)
field($staticPublicField)
field(CONSTANT_FIELD)
method(defaultNonStaticFunction)
method(defaultStaticFunction)
method(privateNonStaticFunction)
method(privateStaticFunction)
method(protectedNonStaticFunction)
method(protectedStaticFunction)
method(publicNonStaticFunction)
method(publicStaticFunction)

ACTUAL COMPLETIONS LIST:
-----------------------------

  CodeAssistTests.assist:159->compareProposals:302 
EXPECTED COMPLETIONS LIST:
-----------------------------
field($staticDefaultField)
field($staticPrivateField)
field($staticProtectedField)
field($staticPublicField)
field(CONSTANT_FIELD)
method(defaultNonStaticFunction)
method(defaultStaticFunction)
method(privateNonStaticFunction)
method(privateStaticFunction)
method(protectedNonStaticFunction)
method(protectedStaticFunction)
method(publicNonStaticFunction)
method(publicStaticFunction)

ACTUAL COMPLETIONS LIST:
-----------------------------

  CodeAssistTests.assist:159->compareProposals:302 
EXPECTED COMPLETIONS LIST:
-----------------------------
method(Foo)   

ACTUAL COMPLETIONS LIST:
-----------------------------
field($publicField)
field($defalutField)
field($a)
field($b)
field($c)
method(foo)
method(foo)
method(publicStaticFunction)
method(defaultStaticFunction)
method(publicNonStaticFunction)
method(defaultNonStaticFunction)
method(publicStaticFunction)
method(defaultStaticFunction)
method(publicNonStaticFunction)
method(defaultNonStaticFunction)
method(publicStaticFunction)
method(defaultStaticFunction)
method(publicNonStaticFunction)
method(defaultNonStaticFunction)
method(foo)
method(foo)
method(foo)
method(goo)
method(foo)
method(goo)
method(foo)
method(Foo)

  CodeAssistTests.assist:159->compareProposals:302 
EXPECTED COMPLETIONS LIST:
-----------------------------
method(testA)
method(testB)

ACTUAL COMPLETIONS LIST:
-----------------------------
field($staticPublicField)
field($staticDefaultField)
field($publicField)
field($defalutField)
field($staticProtectedField)
field($protectedField)
field($staticPrivateField)
field($privateField)
field($a)
field($b)
field($c)
method(foo)
method(foo)
method(publicStaticFunction)
method(defaultStaticFunction)
method(publicNonStaticFunction)
method(defaultNonStaticFunction)
method(protectedStaticFunction)
method(protectedNonStaticFunction)
method(privateStaticFunction)
method(privateNonStaticFunction)
method(publicStaticFunction)
method(defaultStaticFunction)
method(publicNonStaticFunction)
method(defaultNonStaticFunction)
method(protectedStaticFunction)
method(protectedNonStaticFunction)
method(privateStaticFunction)
method(privateNonStaticFunction)
method(publicStaticFunction)
method(defaultStaticFunction)
method(publicNonStaticFunction)
method(defaultNonStaticFunction)
method(protectedStaticFunction)
method(protectedNonStaticFunction)
method(privateStaticFunction)
method(privateNonStaticFunction)
method(foo)
method(foo)
method(foo)
method(goo)
method(foo)
method(goo)
method(foo)
method(Foo)
method(testA)
method(testB)

  CodeAssistTests.assist:159->compareProposals:302 
EXPECTED COMPLETIONS LIST:
-----------------------------
method(testA)
method(testB)

ACTUAL COMPLETIONS LIST:
-----------------------------
field($staticPublicField)
field($staticDefaultField)
field($publicField)
field($defalutField)
field($staticProtectedField)
field($protectedField)
field($staticPrivateField)
field($privateField)
field($a)
field($b)
field($c)
method(foo)
method(foo)
method(publicStaticFunction)
method(defaultStaticFunction)
method(publicNonStaticFunction)
method(defaultNonStaticFunction)
method(protectedStaticFunction)
method(protectedNonStaticFunction)
method(privateStaticFunction)
method(privateNonStaticFunction)
method(publicStaticFunction)
method(defaultStaticFunction)
method(publicNonStaticFunction)
method(defaultNonStaticFunction)
method(protectedStaticFunction)
method(protectedNonStaticFunction)
method(privateStaticFunction)
method(privateNonStaticFunction)
method(publicStaticFunction)
method(defaultStaticFunction)
method(publicNonStaticFunction)
method(defaultNonStaticFunction)
method(protectedStaticFunction)
method(protectedNonStaticFunction)
method(privateStaticFunction)
method(privateNonStaticFunction)
method(foo)
method(foo)
method(foo)
method(goo)
method(foo)
method(goo)
method(foo)
method(Foo)
method(testA)
method(testB)
method(testA)
method(testB)

  CodeAssistTests.assist:159->compareProposals:302 
EXPECTED COMPLETIONS LIST:
-----------------------------
type(BadFunctionCallException)
type(BadMethodCallException)

ACTUAL COMPLETIONS LIST:
-----------------------------
type(B)
type(B)
type(BadFunctionCallException)
type(BadMethodCallException)

  CodeAssistTests.assist:159->compareProposals:302 
EXPECTED COMPLETIONS LIST:
-----------------------------
method(b)
method(c)

ACTUAL COMPLETIONS LIST:
-----------------------------
field($staticPublicField)
field($staticDefaultField)
field($publicField)
field($defalutField)
field($a)
field($b)
field($c)
method(foo)
method(foo)
method(publicStaticFunction)
method(defaultStaticFunction)
method(publicNonStaticFunction)
method(defaultNonStaticFunction)
method(publicStaticFunction)
method(defaultStaticFunction)
method(publicNonStaticFunction)
method(defaultNonStaticFunction)
method(publicStaticFunction)
method(defaultStaticFunction)
method(publicNonStaticFunction)
method(defaultNonStaticFunction)
method(foo)
method(foo)
method(foo)
method(goo)
method(foo)
method(goo)
method(foo)
method(Foo)
method(testA)
method(testB)
method(testA)
method(testB)
method(b)
method(c)

  CodeAssistTests.assist:159->compareProposals:302 
EXPECTED COMPLETIONS LIST:
-----------------------------
type(testClass)
type(testInterface)

ACTUAL COMPLETIONS LIST:
-----------------------------
type(TestException)
type(TestException)
type(testInterface)
type(testClass)


Tests run: 8737, Failures: 16, Errors: 0, Skipped: 0

[INFO] ------------------------------------------------------------------------
[INFO] Reactor Summary:
[INFO] 
[INFO] PHP Development Tools (PDT) ....................... SUCCESS [0.122s]
[INFO] plugins ........................................... SUCCESS [0.047s]
[INFO] org.eclipse.php.help .............................. SUCCESS [34.299s]
[INFO] org.eclipse.php.core.parser ....................... SUCCESS [6.483s]
[INFO] org.eclipse.php.core .............................. SUCCESS [36.225s]
[INFO] org.eclipse.php.server.core ....................... SUCCESS [0.402s]
[INFO] org.eclipse.php.ui ................................ SUCCESS [5.111s]
[INFO] org.eclipse.php.debug.daemon ...................... SUCCESS [0.276s]
[INFO] org.eclipse.php.debug.core ........................ SUCCESS [1.501s]
[INFO] org.eclipse.php.debug.ui .......................... SUCCESS [1.360s]
[INFO] org.eclipse.php.formatter.core .................... SUCCESS [0.511s]
[INFO] org.eclipse.php.formatter.ui ...................... SUCCESS [0.576s]
[INFO] org.eclipse.php.mylyn.ui .......................... SUCCESS [0.403s]
[INFO] org.eclipse.php.refactoring.core .................. SUCCESS [0.759s]
[INFO] org.eclipse.php.refactoring.ui .................... SUCCESS [0.476s]
[INFO] org.eclipse.php.server.ui ......................... SUCCESS [0.476s]
[INFO] org.eclipse.php.astview ........................... SUCCESS [0.391s]
[INFO] org.eclipse.php.composer.api ...................... SUCCESS [0.482s]
[INFO] org.eclipse.php.composer.core ..................... SUCCESS [0.375s]
[INFO] org.eclipse.php.composer.ui ....................... SUCCESS [0.734s]
[INFO] org.eclipse.php.ui.importer ....................... SUCCESS [0.211s]
[INFO] tests ............................................. SUCCESS [0.048s]
[INFO] org.eclipse.php.core.tests ........................ FAILURE [16:12.892s]
[INFO] org.eclipse.php.core.performance.tests ............ SKIPPED
[INFO] org.eclipse.php.formatter.core.tests .............. SKIPPED
[INFO] org.eclipse.php.refactoring.core.tests ............ SKIPPED
[INFO] org.eclipse.php.ui.tests .......................... SKIPPED
[INFO] org.eclipse.php.composer.api.tests ................ SKIPPED
[INFO] org.eclipse.php.composer.tests .................... SKIPPED
[INFO] features .......................................... SKIPPED
[INFO] org.eclipse.php ................................... SKIPPED
[INFO] org.eclipse.php.composer .......................... SKIPPED
[INFO] org.eclipse.php.mylyn ............................. SKIPPED
[INFO] org.eclipse.php.source ............................ SKIPPED
[INFO] org.eclipse.php.test .............................. SKIPPED
[INFO] org.eclipse.php.sdk ............................... SKIPPED
[INFO] org.eclipse.php.repository ........................ SKIPPED
[INFO] ------------------------------------------------------------------------
[INFO] BUILD FAILURE
[INFO] ------------------------------------------------------------------------
[INFO] Total time: 20:52.860s
[INFO] Finished at: Thu Apr 06 09:15:26 EDT 2017
[INFO] Final Memory: 355M/9741M
[INFO] ------------------------------------------------------------------------
[INFO] o.h.m.e.h.MavenExecutionResultHandler - Build failed with exception(s)
[INFO] o.h.m.e.h.MavenExecutionResultHandler - [1] org.apache.maven.lifecycle.LifecycleExecutionException: Failed to execute goal org.eclipse.tycho:tycho-surefire-plugin:1.0.0:test (default-test) on project org.eclipse.php.core.tests: There are test failures.

Please refer to /jobs/genie.pdt/pdt-gerrit/workspace/tests/org.eclipse.php.core.tests/target/surefire-reports for the individual test results.
[DEBUG] Closing connection to remote
[ERROR] Failed to execute goal org.eclipse.tycho:tycho-surefire-plugin:1.0.0:test (default-test) on project org.eclipse.php.core.tests: There are test failures.
[ERROR] 
[ERROR] Please refer to /jobs/genie.pdt/pdt-gerrit/workspace/tests/org.eclipse.php.core.tests/target/surefire-reports for the individual test results.
[ERROR] -> [Help 1]
[ERROR] 
[ERROR] To see the full stack trace of the errors, re-run Maven with the -e switch.
[ERROR] Re-run Maven using the -X switch to enable full debug logging.
[ERROR] 
[ERROR] For more information about the errors and possible solutions, please read the following articles:
[ERROR] [Help 1] http://cwiki.apache.org/confluence/display/MAVEN/MojoFailureException
[ERROR] 
[ERROR] After correcting the problems, you can resume the build with the command
[ERROR]   mvn <goals> -rf :org.eclipse.php.core.tests
[DEBUG] Waiting for process to finish
[DEBUG] Result: 1
Terminating xvnc.
Recording test results
Archiving artifacts
Finished: FAILURE